##TITLE=1H_TG-2243-B
 DMSO, 8 sc, 
 2.06.2021
##JCAMPDX= 6.0         $$ Bruker NMR JCAMP-DX V2.0
##DATA TYPE= NMR SPECTRUM
##DATA CLASS= NTUPLES
##ORIGIN= UXNMR, Bruker Analytische Messtechnik GmbH
##OWNER= root
$$ XWIN-NMR		Version 3.5
$$ Wed Jun  2 12:04:11 2021 Russian Standard Time (UT+4h)  she@DPX200
##.OBSERVE FREQUENCY= 200.131506
##.OBSERVE NUCLEUS= ^1H
##.ACQUISITION MODE= SIMULTANEOUS
##.ACQUISITION SCHEME= undefined
##.AVERAGES= 8
##.DIGITISER RES= 18
##SPECTROMETER/DATA SYSTEM= spect
##.PULSE SEQUENCE= zg30
##.SOLVENT NAME= DMSO
##.SHIFT REFERENCE= (INTERNAL, DMSO, 0, 15.9958)
##AUDIT TRAIL= $$ (NUMBER, WHEN, WHO, WHERE, WHAT)
$$ ##TITLE= Audit trail, XWIN-NMR		Version 3.5
$$ ##JCAMPDX= 5.01
$$ ##ORIGIN= Bruker BioSpin GmbH
$$ ##OWNER= she
$$ F:/spectra/data/she/nmr/H-F/1/pdata/1/auditp.txt
$$ ##AUDIT TRAIL=  $$ (NUMBER, WHEN, WHO, WHERE, WHAT)
(   1,<2021-06-02 12:02:43.32 +0400>,<she>,<DPX200>,
      <created by zg, POWCHK disabled, PULCHK disabled
       configuration hash MD5:
       00 E9 B6 7A A2 85 ED C7 34 08 36 98 17 FE 4E 26
       data hash MD5: 16K
       4D C8 2D 59 B2 98 BA 10 3A DF E8 62 BE BB 83 04>)
(   2,<2021-06-02 12:03:24.93 +0400>,<she>,<DPX200>,
      <Start of raw data processing
       efp BC_mod = 2 LB = 0.24 FT_mod = 6 PKNL = 1 PHC0 = -11484.34 PHC1 = 13.40099 SI = 16K 
       data hash MD5: 16K
       7B 92 DA 3E CA 9D D2 EA E5 1F C1 45 33 12 1E 2B>)
(   3,<2021-06-02 12:03:37.37 +0400>,<she>,<DPX200>,
      <pk PHC0 = -4.552545 PHC1 = 5.8 
       data hash MD5: 16K
       F6 0B BB 5A A7 A5 07 BE 84 94 06 FD B9 E1 2D D8>)
(   4,<2021-06-02 12:03:40.35 +0400>,<she>,<DPX200>,
      <abs ABSG = 5 
       data hash MD5: 16K
       CB 3F 05 DD 7A BA FF F8 72 C2 6B 66 2A 45 42 1E>)
$$ ##END=
$$ 
$$ hash MD5
$$ AE 53 24 5D 04 7C 68 4C 52 A0 5B 41 D5 30 96 BA
##$RELAX= 
##$RELAX= 
##$RELAX= 
##$RELAX= 
##$RELAX= 
##$RELAX= 
$$ Bruker specific parameters
$$ --------------------------
##$DU= <F:/spectra>
##$EXPNO= 1
##$NAME= <H-F>
##$PROCNO= 1
##$TYPE= <nmr>
##$USER= <she>
##$AMP= (0..31)
100 100 100 100 100 100 100 100 100 100 100 100 100 100 100 100 100 100 
100 100 100 100 100 100 100 100 100 100 100 100 100 100 
##$AQSEQ= 0
##$AQ_mod= 1
##$AUNM= <au_zg>
##$AUTOPOS= <>
##$BF1= 200.13
##$BF2= 200.13
##$BF3= 200.13
##$BF4= 200.13
##$BF5= 200.13
##$BF6= 200.13
##$BF7= 200.13
##$BF8= 200.13
##$BYTORDA= 1
##$CFDGTYP= 0
##$CFRGTYP= 5
##$CHEMSTR= <none>
##$CNST= (0..31)
1 1 145 1 1 1 1 1 1 1 1 1 1 1 1 1 1 1 1 1 1 1 1 1 1 1 1 1 1 1 1 1 
##$CPDPRG= <>
##$CPDPRG1= <>
##$CPDPRG2= <>
##$CPDPRG3= <>
##$CPDPRG4= <mlev>
##$CPDPRG5= <mlev>
##$CPDPRG6= <mlev>
##$CPDPRG7= <mlev>
##$CPDPRG8= <mlev>
##$CPDPRGB= <>
##$CPDPRGT= <>
##$D= (0..31)
0 1.2 0 0 0 0 0 0 0 0.06 0 0.03 0 0 0 0 0.0002 0 0 0 0 0 0 0 0 0 0 0 0 
0 0 0 
##$DATE= 1622620962
##$DBL= (0..7)
120 120 120 120 120 120 120 120 
##$DBP= (0..7)
150 150 150 150 150 150 150 150 
##$DBP07= 0
##$DBPNAM0= <>
##$DBPNAM1= <>
##$DBPNAM2= <>
##$DBPNAM3= <>
##$DBPNAM4= <>
$$ [...]
##$SUBNAM3= <"">
##$SUBNAM4= <"">
##$SUBNAM5= <"">
##$SUBNAM6= <"">
##$SUBNAM7= <"">
##$SUBNAM8= <"">
##$SUBNAM9= <"">
##$SW= 16.9725357007746
##$SWIBOX= (0..15)
0 0 2 0 0 0 0 0 0 0 0 0 0 0 0 0 
##$SW_h= 3396.73913043478
##$TD= 16384
##$TD0= 1
##$TE= 0
##$TE2= 300
##$TE3= 300
##$TEG= 300
##$TL= (0..7)
0 120 120 120 120 120 120 120 
##$TP= (0..7)
150 150 150 150 150 150 150 150 
##$TP07= 0
##$TPNAME0= <>
##$TPNAME1= <>
##$TPNAME2= <>
##$TPNAME3= <>
##$TPNAME4= <>
##$TPNAME5= <>
##$TPNAME6= <>
##$TPNAME7= <>
##$TPOAL= (0..7)
0.5 0.5 0.5 0.5 0.5 0.5 0.5 0.5 
##$TPOFFS= (0..7)
0 0 0 0 0 0 0 0 
##$TUNHIN= 0
##$TUNHOUT= 0
##$TUNXOUT= 0
##$USERA1= <user>
##$USERA2= <user>
##$USERA3= <user>
##$USERA4= <user>
##$USERA5= <user>
##$V9= 5
##$VALIST= <valist>
##$VCLIST= <CCCCCCCCCCCCCCC>
##$VD= 0
##$VDLIST= <DDDDDDDDDDDDDDD>
##$VPLIST= <PPPPPPPPPPPPPPP>
##$VTLIST= <TTTTTTTTTTTTTTT>
##$WBST= 1024
##$WBSW= 4
##$XGAIN= (0..3)
0 0 0 0 
##$XL= 0
##$YL= 0
##$YMAX_a= 124796
##$YMIN_a= -61956
##$ZGOPTNS= <>
##$ZL1= 120
##$ZL2= 120
##$ZL3= 120
##$ZL4= 120
##$ABSF1= 15.99578
##$ABSF2= -0.9768839
##$ABSG= 5
##$ABSL= 3
##$ALPHA= 0
##$AQORDER= 0
##$ASSFAC= 0
##$ASSFACI= 0
##$ASSFACX= 0
##$ASSWID= 0
##$AUNMP= <proc_1d>
##$AZFE= 0.1
##$AZFW= 0.1
##$BCFW= 0
##$BC_mod= 2
##$BYTORDP= 0
##$COROFFS= 0
##$CY= -3
##$DATMOD= 1
##$DC= 0
##$DFILT= <>
##$DTYPP= 0
##$F1P= 0
##$F2P= 0
##$FCOR= 1
##$FTSIZE= 16384
##$FT_mod= 6
##$GAMMA= 0
##$GB= 0
##$INTBC= 1
##$INTSCL= 1.334414e-10
##$ISEN= 128
##$LB= 0.24
##$LEV0= 0
##$LPBIN= 0
##$MAXI= 10000
##$MC2= 0
##$MEAN= 0
##$ME_mod= 0
##$MI= 1.114404
##$NCOEF= 0
##$NC_proc= -9
##$NLEV= 6
##$NOISF1= 3.799351
##$NOISF2= 2.8
##$NSP= 0
##$NTH_PI= 0
##$NZP= 0
##$OFFSET= 15.99578
##$PC= 1
##$PHC0= -11488.89
##$PHC1= 19.20099
##$PH_mod= 1
##$PKNL= yes
##$PPARMOD= 0
##$PSCAL= 0
##$PSIGN= 0
##$REVERSE= no
##$SF= 200.130003133296
##$SI= 16384
##$SIGF1= 3
##$SIGF2= 2
##$SINO= 5.538805
##$SIOLD= 16384
##$SREGLST= <1H.CDCl3>
##$SSB= 0
##$STSI= 16384
##$STSR= 0
##$SW_p= 3396.73913043479
##$SYMM= 0
##$S_DEV= 0
##$TDeff= 16384
##$TDoff= 0
##$TI= <>
##$TILT= no
##$TM1= 0
##$TM2= 0
##$TOPLEV= 0
##$USERP1= <user>
##$USERP2= <user>
##$USERP3= <user>
##$USERP4= <user>
##$USERP5= <user>
##$WDW= 1
##$XDIM= 16384
##$YMAX_p= 311375758
##$YMIN_p= -4664021
$$ End of Bruker specific parameters
$$ ---------------------------------
##NTUPLES= NMR SPECTRUM
##VAR_NAME=  FREQUENCY,     SPECTRUM/REAL,   SPECTRUM/IMAG
##SYMBOL=    X,             R,               I
##VAR_TYPE=  INDEPENDENT,   DEPENDENT,       DEPENDENT
##VAR_FORM=  AFFN,          ASDF,            ASDF
##VAR_DIM=   16384,         16384,           16384
##UNITS=     HZ,            ARBITRARY UNITS, ARBITRARY UNITS
##FACTOR=    0.207333158178282, 1,           1
##FIRST=     3201.23549974834, 0,            0
##LAST=      -195.503630686447, 0,           0
##MIN=       -195.503630686447, -4664021,    0
##MAX=       3201.23549974834, 311375758,    0
$$ Real data points
##PAGE= N=1
##DATA TABLE= (X++(R..R)), XYDATA
$$ [...]
6934G737432k39411n60017P54943k31808K71557k2912n91027K55944J82162N8644
$$ 7737432 7498021 6938004 7692947 7461139 7732696 7709784 7118757 7374701 7556863 7615507
6924G615507L8287j726561n44433n45999o06451K65584J341462J506849j365716
$$ 7615507 7653794 5927233 5382800 4836801 4230350 4495934 5837396 7344245 5978529
6915E978529O25944O12860j66103j389671j065935L207484l02177n60454p51802
$$ 5978529 6604473 7217333 7051230 5661559 4595624 7803108 7500931 6940477 6188675
6906F188675k326288K470887n84821l47633j114522j122451M22165m57354j204672
$$ 6188675 3862387 6333274 5748453 5400820 4286298 3163847 3586012 3128658 1923986
6897A923986J729417M03951K34032o32120n9545k58978p71034p00623P24732J316780
$$ 1923986 3653403 4057354 4291386 3659266 3599721 3340743 2569709 1869086 2593818 3910598
6887C910598j421606j88249k07506r1596l58677J27802l15792P58913N2097N83917
$$ 3910598 2488992 2300743 2093237 2001641 1642964 1770766 1454974 2213887 2265984 2849901
6877B849901o62038r67877O38683p3325k64360j52354m05790M94146j10679p75029
$$ 2849901 2187863 1219986 1858669 1785344 1520984 1368630 962840 1456986 1346307 571278
6867E71278L56476Q39917M43961j423578j80665M48226J395199j071220j559165
$$ 571278 927754 1767671 2211632 788054 607389 1055615 2450814 1379594 -179571
6858a79571R24789K27260J030467J03918k86645l49697J290090j667213j94743
$$ -179571 745218 972478 2002945 2106863 1820218 1470521 2760611 1093398 898655
6849H98655J026959J055806r40607q23293p43054J393814L31015R2462J060724
$$ 898655 1925614 2981420 2040813 1217520 474466 1868280 2199295 2291757 3352481
6840C352481j411807K42546r90252o93648J773198J205002n25148m17699k98037
$$ 3352481 1940674 2183220 1192968 499320 2272518 3477520 2952372 2534673 2236636
6831B236636J59401j198276m10502O66391J267578l9052j676451n18429k91516
$$ 2236636 2396037 1197761 787259 1453650 2721228 2682176 1005725 487296 195780
6822A95780N26732M39276L25948J278800n31811j179634q21512j141348J905406
$$ 195780 722512 1161788 1487736 2766536 2234725 1055091 233579 -907769 997637
6813I97637J6037n27060n31060q9836J25648L49401J641613j646322p8925M78724
$$ 997637 1013674 486614 -44446 -134282 -8634 340767 1982380 336058 257133 735857
6803G35857l17455n71008j086635J092392J660605p97207r61827j284127M21155
$$ 735857 418402 -152606 -1239241 -146849 1513756 716549 -245278 -1529405 -1108250
6794a108250L58728L1944P02740J18240Q9312M92808j569221r58291K206287R69362
$$ -1108250 -749522 -717578 -14838 103402 192714 685522 -883699 -1841990 364297 1333659
6784A333659p06589l06842q1172K34320p4740l50964K80967j93631l24744m90352
$$ 1333659 627070 320228 239056 473376 398636 47672 328639 135008 -189736 -680088
6774f80088m34587J06686j42078J235815n54247M00608j84752n07048j1307L3499
$$ -680088 -1114675 -1007989 -1150067 85748 -468499 -67891 -252643 -759691 -770998 -737499
6764g37499J237520j88287j124884J098142n87069M85289L94061n74516l00838
$$ -737499 500021 311734 -813150 284992 -302077 183212 577273 2757 -298081
6755b98081r20965J7527N91101J080519l65756J119079j488408k39326K01491
$$ -298081 -1219046 -1201519 -610418 470101 104345 1223424 -264984 -504310 -302819
6746c02819j0947Q95843Q6116j473483l06381r04272J27428J295860Q52384M2515
$$ -302819 -313766 582077 668193 -805290 -1111671 -2015943 -1888515 -592655 259729 302244
6736C02244m74402R18429o92514J286856j080023m69511q75950M19274j30683
$$ 302244 -172158 746271 53757 1340613 260590 -208921 -1084871 -665597 -796280
6727g96280p71844J957846j87805L53504L24917q66755j39455R53937N65279J26473
$$ -796280 -1568124 389722 201917 555421 880338 13583 -125872 828065 1393344 1519817
6717A519817K04311j46434j460990m20626L13646J400474O18739m00089r55702
$$ 1519817 1724128 1577694 116704 -303922 9724 1410198 2028937 1628848 673146
6708F73146M68235o36508m21293j10300P61671J035648j993165n1177N7096L80023
$$ 673146 1141381 504873 83580 -26720 734951 1770599 -222566 -273743 -216647 163376
6698A63376L74050L01022N06673K69146j627009P2458J104873P3612L76093o77427
$$ 163376 537426 838448 1345121 1614267 -12742 59716 1164589 1238201 1614294 936867
6688I36867m86456L37001o48944k711488J077226K363576J298660J070073j381120
$$ 936867 450411 787412 138468 -2573020 -1495794 867782 2166442 3236515 1855395
6679A855395j169933L24884k74616M90099n80781J334404n49362k224069p35478
$$ 1855395 685462 1010346 735730 1225829 645048 1979452 1430090 -793979 -1529457
6670a529457J011767j64173J144037R67588o95640M17831j020969k82160K53562
$$ -1529457 -517690 -681863 462174 1429762 734122 1151953 130984 -151176 102386
6661A02386J239528k6700k08367j860911J680560J273502p23821j071877n18274
$$ 102386 1341914 1315214 1106847 -754064 926496 2199998 1476177 404300 -113974
6652a13974J643176J85051m88204p41674Q09875o91985M26176k72625m2896L23750
$$ -113974 1529202 1714253 1226049 484375 1294250 602265 1028441 755816 712920 1036670
6642A036670q49120n98559k81405J891508q2864j299043n20528N81125J921756
$$ 1036670 187550 -411009 -692414 1199094 1116230 -182813 -703341 -122216 1799540
6633A799540J033676j512337O27339N22679j19813p08055j049032J61245M35265
$$ 1799540 2833216 1320879 1948218 2470897 2351084 1643029 593997 755242 1190507
6624A190507j168486o36091J096907M68807m89970m57420O42157M66718K97116
$$ 1190507 22021 -614070 482837 951644 461674 4254 646411 1113129 1410245
6615A410245j020611j031648m25790J332731o62604m16640p56219L22944J360322
$$ 1410245 389634 -642014 -1067804 264927 -397677 -814317 -1570536 -1247592 112730
6606A12730M28258n73909O95801J362657o62777N8627j27085Q20946l68652r86475
$$ 112730 540988 -32921 662880 2025537 1362760 1421387 1294302 2115248 1746596 760121
6596G60121q82586L25775J99390K76453m31819m53286j22220K25620K86526J601928
$$ 760121 -122465 203310 402700 679153 247334 -205952 -328172 -102552 183974 1785902
6586A785902O15988M07102k329753r80651Q47761r2424J622822p43954m665P20551
$$ 1785902 2401890 2808992 479239 -501412 346349 253925 1876747 1132793 1128128 1848679
6576A848679j180012q97613J617007J486833q23673J0831n26138o66465P84482
$$ 1848679 668667 -228946 1388061 2874894 2051221 2062052 1535914 869449 1653931
6567A653931m73845N86200M81381L38550j02415p64044j405045R46178Q94397
$$ 1653931 1180086 1766286 2247667 2586217 2483802 1719758 314713 1260891 2155288
6558B155288K69215j275483k50003m20011K74085Q40800J140556P72k190508K90654
$$ 2155288 2424503 1149020 899017 479006 753091 1593891 2734447 2735219 544711 835365
6548H35365J044907J72436L75952l47131R16478k38719j489062o8945j45206Q784
$$ 835365 1880272 2052708 2428660 2081529 2998007 2759288 1270226 1201281 1056075 1064859
6538A064859J467190K20713j85068k90424q01580L89314J421992P68168K2067
$$ 1064859 2532049 2752762 2567694 2277270 1475690 1865004 3286996 4055164 4077231
6529D077231n85940r69398L87304J15298l62898k63220J070724r43135N91492
$$ 4077231 3491291 2521893 2909197 3024495 2661597 2398377 3469101 2525966 3117458
6520C117458j517947K223856m82237N93126L68774j435139L03580J06318Q94076
$$ 3117458 1599511 3823367 3341130 3934256 4303030 2867891 3171471 3277789 4171865
6511D171865j474804m71479Q74677N51402P71595m67099m62067M09300j008855
$$ 4171865 2697061 2225582 3100259 3651661 4423256 3956157 3494090 3903390 2894535
6502B894535L75601N24651n53602n94982p33569J033428n80395q89441J557545
$$ 2894535 3270136 3794787 3241185 2646203 1912634 2946062 2365667 1476226 3033771
6493C033771R51212L28612O23457j246929j659829P04731L56014j67331J137946
$$ 3033771 3984983 4313595 4937052 3690123 2030294 2735025 3091039 2923708 4061654
6484D061654O00337m96863l07402j356170N56248N66563J590136r2202j391385
$$ 4061654 4661991 4165128 3857726 2501556 3057804 3624367 5214503 5122301 3730916
6475C730916j66938Q09568n92163K81659P66521n4800Q92915N2471j835605k60756
$$ 3730916 3563978 4373546 3781383 4063042 4829563 4774763 5667678 5720149 3884544 3623788
6465C623788Q03964O14933Q98368o12596j056331J286390o7550k4144k34410j236436
$$ 3623788 4427752 5042685 5941053 5328457 4272126 5558516 5490966 5466822 5232412 3995976
6455C995976J222058O37866N5723P12094j252131o4108M52210K71441K62603L38243
$$ 3995976 5218034 5855900 5911623 6623717 5371586 5307478 5759688 6031129 6293732 6631975
6445F631975Q16677J38408J63673l57780K31758m51020J58734J209499J54028
$$ 6631975 7448652 7587060 7750733 7392953 7624711 7173691 7332425 8541924 8695952
6436H695952p66992m27277J60502Q87931L76730R70143R59643o45635P79151K33236
$$ 8695952 7928960 7501683 7662185 8550116 8926846 9896989 10856632 10210997 10990148 11223384
6426A1223384M87566p22455M96774m62160j70118M78959q54937J300862K02417
$$ 11223384 11710950 10988495 11485269 11023109 10852991 11331950 10477013 11777875 11980292
6417A1980292Q45511Q24188M79874o92400J084276k08380P16070L49781j571847
$$ 11980292 12825803 13649991 14129865 13437465 14521741 14313361 15029431 15379212 13807365
6408A3807365J600240K10458r84648R15633l8439J153344P92508n63332L46181
$$ 13807365 15407605 15618063 14633415 15549048 15510609 16663953 17456461 16893129 17239310
6399A7239310P10210J60332k57643m92144J480307K248638q19911q53920m08776
$$ 17239310 17949520 18109852 17852209 17360065 18840372 21089010 20269099 19415179 19006403
6390A9006403J682554M76763J188786K35520m02255J330823n61807N72424P12627
$$ 19006403 20688957 21165720 22354506 22590026 22187771 23518594 22956787 23529211 24241838
6381B4241838M85807P38276j26288n92166J895509J014061J80634m10717J290153
$$ 24241838 24727645 25465921 25339633 24747467 26642976 27657037 27837671 27426954 28717107
6372B8717107K518114q71o68890J58656Q04135N19296Q2656J117387K131134O99649
$$ 28717107 31235221 31234350 30565460 30724116 31528251 32047547 32130203 33247590 35378724 36078373
6362C6078373m03978L35368J334080J735231N40493K11481J490410Q29505L67943
$$ 36078373 35674395 36009763 37343843 39079074 39619567 39831048 41321458 42150963 42518906
6353D2518906j93375k61525L040945L537340k56164o90988J628254J63853j102173
$$ 42518906 42325531 42064006 45104951 48642291 48386127 47695139 49323393 49487246 48385073
6344D8385073M64799K185802K641526J252144k091851N38648L22333J16895P76503
$$ 48385073 48849872 51035674 53677200 54929344 52837493 53376141 53698474 53815369 54591872
6335E4591872J456826K51841o92068L22745j600990N55109M84132J480637n55704
$$ 54591872 56048698 56300539 55608471 55931216 54330226 54885335 55369467 56850104 56294400
6326E6294400n24376l12041j23114p19444o48864J288169J085301j102372l141445
$$ 56294400 55770024 55457983 55334869 54615425 53966561 55254730 56340031 55237659 52096214
6317E2096214k019957j61329j42560j30578M14538p2517L40108k521689k625818
$$ 52096214 50076257 49914928 49772368 49641790 50056328 49983811 50323919 47802230 45176412
6308D5176412P2898N90142M4348m27046j275601k258671k47504j993727j4239
$$ 45176412 45249310 45839452 45883800 45456754 44181153 41922482 41674978 39681251 39667012
6299C9667012O28746j232944j486307k099722N32699J71900p83578o16372j731352
$$ 39667012 40295758 39062814 37576507 35476785 36009484 36181384 35397806 34781434 33050082
6290C3050082K16963k53890P44907j538757n29466K52945k050027j373593R13929
$$ 33050082 33267045 33013155 33758062 32219305 31689839 31942784 29892757 28519164 29433093
6281B9433093P43185l66151p25815o51446j286682Q00137J222572o14218q07751
$$ 29433093 30176278 29810127 29084312 28432866 27146184 27946321 29168893 28554675 27746924
6272B7746924j913858K0506q59443M65255J164728m8969n29832r05264p15151
$$ 27746924 25833066 25853572 24994129 25459384 26624112 26575143 26045311 25140047 24424896
6263B4424896m5299j056559M77923O71383p7894j16653j713370l10915j75542
$$ 24424896 24379597 23323038 23800961 24472344 24394450 24277797 22564427 22253512 22077970
6254B2077970O58070J212582N06143r92724j55168k06946p42017L08265l81367
$$ 22077970 22736040 23948622 24454765 23462041 23306873 23099927 22357910 22666175 22284808
6245B2284808M20743m93453j08533P1046j089594K65335R80052r30430J032939
$$ 22284808 22705551 22212098 22103565 22174611 21085017 21350352 22330404 21399974 22432913
6236B2432913j36236N99081j403537K61918n42148L34978m56263m63028J440826
$$ 22432913 22296677 22895758 21492221 21754139 21211991 21546969 21090706 20627678 22068504
6227B2068504M3324O45831j0371M1795Q51171K68863m31963j060761J189430R88625
$$ 22068504 22111828 22757659 22747288 22789083 23640254 23909117 23477154 22416393 23605823 24594448
6217B4594448p17851q64123q9973J639619O26346q28552p68950P60078l46681
$$ 24594448 23876597 23012474 22922501 24562120 25188466 24359914 23590964 24351042 24004361
6208B4004361n17515N24479L35380M68310M85212k250437l11354J111721L16847
$$ 24004361 23486846 24011325 24346705 24815015 25300227 23049790 22738436 23850157 24167004
6199B4167004n24155j12450O7073k109959r71267j357865J270383L337987K49302
$$ 24167004 23642849 23530399 23597472 21487513 20516246 19158381 20428764 23766751 24016053
6190B4016053j149901j436319p94265m22573O59195k1478J51587j53513j515255
$$ 24016053 22866152 21429833 20635568 20212995 20872190 20850712 21002299 20848786 19333531
6181A9333531k084477M53918Q3971l2012q8699l75381K72916m12605j676653j4974
$$ 19333531 17249054 17702972 17786943 17754931 17666232 17290851 17563767 17151162 15474509 15459535
6171A5459535J293612K4879K57771k356285p63536k99226r1273R58975m08953
$$ 15459535 16753147 16778026 17035797 14679512 13915976 13616750 13525477 14484452 14075499
6162A4075499J335072j52248j588490j170319r0843N25040K76802j772124o38526
$$ 14075499 15410571 15258323 13669833 12499514 12408671 12933711 13210513 11438389 10799863
6153A0799863M81960J03620j126575L1268J441135j0816j719176l13285k27863
$$ 10799863 11281823 11385443 10258868 10290136 11731271 11720455 10001279 9687994 9460131
6144I460131L21731J38567j143881l2310k95157K01961l70347j054461M84467
$$ 9460131 9781862 9920429 8776548 8744238 8449081 8651042 8280695 7226234 7710701
6135G710701O91186q09448p49428J428171P77558k321933j592062J146449j81302
$$ 7710701 8401887 7592439 6843011 8271182 9048740 6726807 5134745 6281194 6099892
6126F099892j54225O9088J124121o22105m55339j978188o66751O79514J903133
$$ 6099892 5945667 6014755 7138876 6516771 6061432 4083244 3416493 4096007 5999140
6117E999140L98358j263098j410004j011472J089454l62030Q00291R70872J17066
$$ 5999140 6397498 5134400 3724396 2712924 3802378 3440348 4240639 5211511 5328577
6108E328577k473557r61985k42080J657813J013187L05138q15656j131307n66250
$$ 5328577 2855020 1893035 1650955 3308768 4321955 4627093 3811437 2680130 2113880
6099B113880k25314j56574J317802P52549j118004l12973m85132J5639o79002
$$ 2113880 1888566 1731992 3049794 3802343 2684339 2371366 1886234 1901873 1222871
6090A222871j166113K328712K135882K78732k920646j550462M44343O17315k92493
$$ 1222871 56758 2385470 4521352 4800084 1879438 328976 773319 1390634 1098141
6081A098141M95857L29467j320419q86957N56413N91684Q28632L03409j50202
$$ 1098141 1593998 1923465 603046 -283911 272502 864186 1692818 1996227 1846025
6072A846025q80661r63590K73262O12875O79878P95721o29945j050591l57266
$$ 1846025 965364 1774 275036 887911 1567789 2363510 1733565 682974 325708
6063C25708k69154p72503J088276J172011J059104J12568j004335j115234m06790
$$ 325708 56554 -715949 372327 1544338 2603442 2716010 1711675 596441 189651
6054A89651L4005J132738j74575q52940K21302p32399J49858M44135J339486q51809
$$ 189651 223656 1356394 1181819 328879 550181 -182218 -32360 411775 1751261 899452
6044H99452l11240r62806R7348m7371Q28195O27250K8182j060187N921L00699
$$ 899452 588212 -374594 -277246 -324617 503578 1130828 1159010 98823 104744 405443
6034D05443j466443N58823j31579o51836q8268L6160K161338J098404j571253
$$ 405443 -1061000 -502177 -633756 -1285592 -1373860 -1337700 823638 1922042 350789
6025C50789k16343O74105L21541m12398J43910k40697n82106K58820q5090J129783
$$ 350789 134446 808551 1130092 717694 861604 620907 38801 297621 212531 1342314
6015A342314Q2071m58728j155738l23177m17223m98757P18301J111956K50696
$$ 1342314 1424385 965657 -190081 -513258 -930481 -1429238 -710937 401019 651715
6006F51715J107785j220048j509645N27452J31059J181621l5434P2993p74721
$$ 651715 1759500 539452 -970193 -442741 -311682 869939 834505 907498 132777
5997A32777n82421n76814j222260J841274J201542m8876j582937j819567R12666
$$ 132777 -449644 -1026458 -2248718 -407444 794098 745222 -837715 -2657282 -1744616
5988a744616Q17550O03438J152354j08548k67580p74539q23481K33206O39739
$$ -1744616 -927066 -323628 828726 720178 452598 -321941 -1145422 -912216 -272477
5979b72477J123675l9385j56576j484921j36961L07801J82444J041646j5913j574680
$$ -272477 851198 811813 655237 -829684 -966645 -658844 -476400 565246 549333 -1025347
5969a025347j108861R08734J447651K66747r69266P79191O07976K37374l59644
$$ -1025347 -2134208 -1225474 222177 488924 -480342 298849 906825 1144199 784555
5960G84555n77024K5963R97393O06261j763590n26519N51157J504471n17815j665588
$$ 784555 207531 233494 1230887 1837148 73558 -452961 98196 1602667 1084852 -580736
5950e80736J406706k61274l26885j135392p92125K102182R35931j018500p32116
$$ -580736 825970 564696 237811 -897581 -1689706 412476 1348407 329907 -402209
5941d02209L47311m67576K35468j147951N74041J047910l27800K76334k95889
$$ -402209 -54898 -522474 -287006 -1434957 -860916 186994 -140806 135528 -160361
5932a60361P54605M41994j720581p42922k13452Q36210n89684m20891J15408R74745
$$ -160361 594244 1036238 -684343 -1427265 -1640717 -804507 -1394191 -1815082 -1699674 -724929
5922g24929m4685m03126M28614j56921M65033Q29643m67594l03821Q03142l59842
$$ -724929 -769614 -1172740 -744126 -901047 -436014 393629 -73965 -377786 425356 65514
5912F5514j538687J08236J472304Q9834J88801j518471M76625k6882j199446L84329
$$ 65514 -1473173 -1364937 107367 197201 386002 -1132469 -655844 -682726 -1882172 -1497843
5902a497843O80839Q86811Q73322k104409k32160J352120n43531K77097N24432
$$ -1497843 -817004 69807 943129 -1161280 -1393440 -41320 -584851 -307754 216678
5893B16678j05516Q33634n40600k126372J993255J111559o77455j889707L47234
$$ 216678 111162 944796 404196 -1722176 271079 1382638 705183 -1184524 -837290
5884h37290K405768J167490j099498r61979n44194M18477j694646m68306J109287
$$ -837290 1568478 2735968 1636470 674491 130297 548774 -1145872 -1614178 -504891
5875e04891J222570O59922n47086N14223o70023L82696j554140p77065J866654
$$ -504891 717679 1377601 830515 1344738 674715 1057411 -496729 -1273794 592860
5866E92860N65174j195165k95458m60192L68304L94672m33163j539216N31434
$$ 592860 1158034 -37131 -332589 -792781 -424477 -29805 -462968 -2002184 -1470750
5857a470750R78256J183457j859723M33175R03773j011020L10194J94251O98894
$$ -1470750 -492494 690963 -1168760 -735585 168188 -842832 -532638 -338387 360507
5848C60507M68699q89995p89547L06384P00024k94980K22059Q74428R78205k64361
$$ 360507 829206 -60789 -850336 -543952 156072 -138908 83151 957579 1935784 1671423
5838A671423j332941o39795N34731J67680q36846j72598M27128K93522q36901
$$ 1671423 338482 -301313 233418 401098 -435748 -608346 -181218 112304 -724597
5829g24597j433134K189931J990760q82194q2433j082796O19013o42659l96344
$$ -724597 -2157731 32200 2022960 1140766 1058333 -24463 594550 -48109 -444453
5820d44453J077015j4103j79404k62778j051430Q44700L07184R80534j387342
$$ -444453 632562 618459 439055 176277 -875153 -30453 276731 1257265 -130077
5811a30077j326720L07695O47013J025422p37505Q98002j98543k20705K75413
$$ -130077 -1456797 -1149102 -502089 523333 -214172 683830 485287 264582 539995
5802E39995j024228O15027l47503j68126J586228j14118m20135m61341q67471
$$ 539995 -484233 130794 -216709 -384835 1201393 1087275 667140 205799 -661672
5793f61672O7685J482962k16940j269486k49373J82411M16880p26769l90305J690652
$$ -661672 -593987 888975 672035 -597451 -846824 -664413 -247533 -974302 -1364607 326045
5783C26045O54341m58448r63220L95964J54043J416523j031193o83681J014632
$$ 326045 980386 521938 -441282 -45318 108725 1525248 494055 -189626 825006
5774H25006j326523l80974l65300J220534M11797N40425j289052j103365J327090
$$ 825006 -501517 -882491 -1247791 -27257 384540 924965 -364087 -1467452 -140362
5765a40362n63157l45094q48283P54461K184044q41945m53149k82016J446022
$$ -140362 -703519 -1048613 -1896896 -1142435 1041609 199664 -253485 -535501 910521
5756I10521k96927j347932l77265J421521O77814j675970r52573J5590N55394
$$ 910521 613594 -734338 -1111603 309918 987732 -688238 -1640811 -1625221 -1069827
5747a069827N83187K29369M02096r1698P07760k54298j481094N2969J359220n24568
$$ -1069827 -486640 -257271 144825 53127 760887 506589 -974505 -921536 437684 -86884
5737h6884j601740J116213J114258J34795j836942k22545J602589k7489K77025
$$ -86884 -1688624 -572411 541847 676642 -1160300 -1382845 219744 192255 469280
5728D69280n96431j182582m73473L6513J46635J794720R38293J19345k757293
$$ 469280 -127151 -1309733 -1783206 -1746693 -1600058 194662 1132955 1252300 -1504993
5719a504993m84552m56352J756537j43791q62343J242798o08209j67173j161923
$$ -1504993 -1989545 -2445897 -689360 -833151 -1695494 -452696 -1060905 -1228078 -2390001
5710b390001P36803J281189J245625k135733p78102P45008J197031L15042k94793
$$ -2390001 -1653198 -372009 873616 -1262117 -2040219 -1295211 -98180 216862 -77931
5701g7931k36591M09228j201767p61596J144127j9603J112462j595511K35419
$$ -77931 -314522 94706 -1107061 -1868657 -724530 -744133 368329 -1227182 -991763
5692i91763J29996O14523Q2944j400959J524115o47747K80632j926031J148838
$$ -991763 -861767 -247244 -164300 -1565259 -41144 -688891 -408259 -2334290 -1185452
5683a185452J239907j136170m00029n28675N57366l16907k33470J541347p57182
$$ -1185452 54455 -1081715 -1481744 -2010419 -1453053 -1769960 -2003430 -462083 -1219265
5674a219265N39458J2254o90802J74867P81548q7579p30075J561782j35991r76665
$$ -1219265 -679807 -667553 -1358355 -1183488 -401940 -489519 -1219594 342188 206197 -770468
5664g70468R84152m92523J007974Q97019q87592j413476m88566M13423J135072
$$ -770468 213684 -278839 729135 1626154 738562 -674914 -1163480 -750057 385015
5655C85015O4300p85331J14084K80657j758391l21954J217200J75686Q58872j334150
$$ 385015 449315 -336016 -221932 58725 -1699666 -2021620 -804420 -628734 230138 -1104012
5645a104012Q17555J641292j211405n03914l91814J261706o17635r04901J66850
$$ -1104012 -286457 1354835 143430 -360484 -752298 509408 -108227 -1013128 -846278
5636h46278J08948J138248k46330N50776m35708j79198l81388j977331J233567
$$ -846278 -737330 400918 154588 705364 269656 90458 -290930 -2268261 -1034694
5627a034694P43530M75200l27055m18487Q15459o57580O32825p30699K62292K5938
$$ -1034694 -291164 184036 -143019 -561506 253953 -403627 229198 -501501 -239209 -213271
5617b13271j339858m22192o89984J583413J347078r76361p62384m34355J351636
$$ -213271 -1553129 -1975321 -2665305 -1081892 265186 -711175 -1473559 -1907914 -556278
5608e56278k45605P55536k97905J73054L38521l28588J89423j72501L35375q13277
$$ -556278 -801883 -46347 -344252 -171198 167323 -161265 28158 -144343 191032 -622245
5598f22245m34311p79383K4655N81676r21155j94264J032939o00589j751616N15611
$$ -622245 -1056556 -1835939 -1811284 -1229608 -2150763 -2345027 -1312088 -1912677 -3664293 -3148682
5588c148682J106312J527192k030626j98073O69619J077487k4246K90566O59199
$$ -3148682 -2042370 -515178 -2545804 -2743877 -2074258 -996771 -1021017 -730451 -71252
5579g1252j004628O79701j602276j881134P90324J699701N06634k85607k67340
$$ -71252 -1075880 -396179 -1998455 -3879589 -3089265 -1389564 -882930 -1168537 -1435877
5570a435877j00536o74536J317808n13547R41298j145145o2145l72724j46974
$$ -1435877 -1536413 -2210949 -893141 -1406688 -465390 -1610535 -1672680 -2045404 -2192378
5561b192378P75331p22677J040041k96455N94974j91206l86918N11052J114157
$$ -2192378 -1417047 -2139724 -1099683 -1396138 -801164 -992370 -1379288 -868236 245921
5552B45921l42651n48920j217690N20691n58645Q77316K68337L23925K86469P05054
$$ 245921 -96730 -645650 -1863340 -1342649 -1901294 -1023978 -755641 -431716 -145247 559807
5542E59807q77553r70180M84112O91632l86105J30809P64865j039023M23588j85393
$$ 559807 -317746 -1287926 -803814 -112182 -498287 -367478 397387 -641636 -218048 -403441
5532d03441j10731J872998p68565j338214K30208j53890k99109R32801J2936q15193
$$ -403441 -514172 1358826 590261 -747953 -517745 -671635 -970744 -37943 -25007 -840200
5522h40200Q70019j103199n78865J252384r92933Q95155K75702k28065J89914
$$ -840200 29819 -1073380 -1652245 -399861 -1392794 -497639 -221937 -450002 -260088
5513b60088k02899j220066r45842J856357O65423k60880j094065j54722K63143
$$ -260088 -462987 -1683053 -2628895 -772538 -107115 -367995 -1462060 -1616782 -1353639
5504a353639L34740l54922q9519k85918j92559j204105O44385j170444K225097
$$ -1353639 -1018899 -1373821 -1463340 -1749258 -1941817 -3145922 -2501537 -3671981 -1446884
5495a446884M72181k157911Q1406n77364P01521o69890J082101j80204N51590
$$ -1446884 -974703 -3132614 -3051208 -3628572 -2927051 -3596941 -2514840 -2695044 -2143454
5486b143454n75777j545341J455800J319245J46707k08527j197218N73496P32488
$$ -2143454 -2719231 -4264572 -2808772 -1489527 -1342820 -1551347 -2748565 -2175069 -1442581
5477a442581K19303L09465m85787J083576j713279O13462j232010O15157J317755
$$ -1442581 -1223278 -913813 -1399600 -316024 -2029303 -1415841 -2647851 -2032694 -714939
5468g14939K1043l61485o69840J150440K62289k132604J083915R64826P11441
$$ -714939 -693896 -1055381 -1725221 -574781 -312492 -2445096 -1361181 -396355 315086
5459C15086j334049k90074J232211j202042N38382j076698K91805O7925J096545
$$ 315086 -1018963 -1309037 -76826 -1278868 -740486 -1817184 -1525379 -1457454 -360909
5450c60909M76071j368468N95846K26168Q78412m63745o89573j54962k57634m5127
$$ -360909 115162 -1253306 -657460 -431292 447120 -16625 -706198 -861160 -1118794 -1163921
5440a163921L72785j54638M48225m71288Q21989j556581J524190k04331K15681
$$ -1163921 -791136 -945774 -497549 -968837 -146848 -1703429 -179239 -383570 -167889
5431a67889l16079m63249R43088j464524J270693j259903j63164K127507k094663
$$ -167889 -483968 -947217 -4129 -1468653 -197960 -1457863 -1621027 506480 -1588183
5422a588183J465002q91193j009693L11679K12768k65126k8304J907124J45825
$$ -1588183 -123181 -1014374 -2024067 -1712388 -1499620 -1764746 -1793050 114074 259899
5413B59899M6191j320467J65634q91990J079980p99694K23159j204477n62652
$$ 259899 306090 -1014377 -848743 -1740733 -660753 -1460447 -1237288 -2441765 -3004417
5404c004417m27329J607605P28587k96295N53402K71053j630840p47864Q51589
$$ -3004417 -3431746 -1824141 -1095554 -1391849 -838447 -567394 -2198234 -2946098 -2094509
5395b094509R0438j49799J52198R66507q06399j059363N44041M41047J336488
$$ -2094509 -2004071 -2153870 -2001672 -1035165 -1841564 -2900927 -2356886 -1915839 -579351
5386e79351o46369N94442m70943k83288j399182J66042J015619O93493o74443
$$ -579351 -1225720 -631278 -1102221 -1385509 -2784691 -2618649 -1603030 -909537 -1583980
5377a583980J164361k12800p5661j075019Q90566J904144p23830k58925j533382
$$ -1583980 -419619 -632419 -708080 -1783099 -892533 1011611 287781 28856 -1504526
5368a504526R16321j74511k29633j9746J00315K69794j51901k23204M200l58887
$$ -1504526 -588205 -762716 -992349 -1012095 -911780 -641986 -793887 -1017091 -1012891 -1371778
5358a371778R1439J307398R13868m01239j223890R9626q10110J267058o67738
$$ -1371778 -1280339 27059 940927 539688 -684202 -584576 -1394686 -127628 -795366
5349g95366L78747o90675M93213m69946O5078O97062j018810Q4363k24387Q95185
$$ -795366 -416619 -1107294 -614081 -1084027 -1018949 -321887 -1340697 -1256334 -1480721 -585536
5339e85536j585818j040285P69568O63193Q98362n49187P46082L02790k116620
$$ -585536 -2171354 -3211639 -2442071 -1778878 -880516 -1429703 -683621 -380831 -2497451
5330b497451J432945l92204K019834J7605p11156p47617l60490l72946M02192
$$ -2497451 -1064506 -1456710 563124 580729 -130427 -878044 -1238534 -1611480 -1209288
5321a209288K090476R50820q00211l71498r03737r18883J27664J355330n8690
$$ -1209288 881188 1832008 1031797 660299 -243438 -1162321 -1034657 320673 261983
5312B61983j286924J017107l91773q60783n79703N24530J717163P86704p20728
$$ 261983 -1024941 -7834 -399607 -1260390 -1840093 -1315563 401600 1188304 467576
5303D67576r32152J95232p19820P10387o86642m22889J769955K44662j001102
$$ 467576 -464576 -269344 -989164 -278777 -965419 -1388308 381647 626309 -374793
5294c74793J011102r28185R90032m7742n3609j271095R82172J96910j930856P78684
$$ -374793 636309 -291876 698156 650414 596805 -674290 307882 504792 -1426064 -647380
5284f47380J455934k00892j537931q2240j47993P9629r19607l4037J037263m91249
$$ -647380 808554 607662 -930269 -1012509 -1160502 -1080873 -2000480 -2034517 -997254 -1488503
5274a488503k32273n04611R59895J384209q9419j233469J67910M38922o65159
$$ -1488503 -1720776 -2225387 -1265492 118717 29298 -1204171 -1036261 -597339 -1262498
5265a262498o84890j19746J174561J313226N60013m03537j707825R74749m27455
$$ -1262498 -1947388 -2067134 -892573 420653 980666 577129 -1130696 -155947 -583402
5256e83402j1349k59265p97927R04439o03476j68473r59330J621780J0299N01695
$$ -583402 -594751 -854016 -1651943 -747504 -1350980 -1519453 -2478783 -857003 -846704 -345009
5246c45009l47127J284738l82736j497626r91089L8823J009083J319819j013544
$$ -345009 -692136 592602 209866 -1287760 -2278849 -2240026 -1230943 88876 -924668
5237i24668r30368R89007j56244m43594K11657J915387Q26526R620l29172j205074
$$ -924668 -1855036 -866029 -1022273 -1465867 -1254210 661177 1487703 1497323 1168151 -36923
5227c6923j406797j95658J251207m04428J306604o7693k1623m82788m74517N75413
$$ -36923 -1443720 -1639378 -388171 -792599 514005 446312 424689 -58099 -532616 42797
5217D2797J191786n28091m65679n04115J074019m65736p82459J86536q45708J319054
$$ 42797 1234583 706492 240813 -263302 810717 344981 -437478 -250942 -1096650 222404
5207B22404K5663m59088J29912J46933K70932j9732N31845L72264n33296n25411
$$ 222404 248067 -211021 -81109 65824 336756 317024 848869 1221133 687837 162426
5197A62426j466808J283351k13655j74658j93387J074630K92771q47806l41440
$$ 162426 -1304382 -21031 -234686 -409344 -602731 471899 764670 -83136 -424576
5188d24576J24062j241283J058751p35021l77493N59539k22560L73489j287305
$$ -424576 -300514 -1541797 -483046 -1218067 -1595560 -1036021 -1258581 -885092 -2172397
5179b172397k06435J327943j76125j343246R63241J252754l71806m45299R1764
$$ -2172397 -2378832 -1050889 -1227014 -2570260 -1607019 -354265 -726071 -1171370 -1079606
5170a079606J090523J776913l22427j218870j28562p94678N89820L00357N04639
$$ -1079606 10917 1787830 1465403 246533 117971 -676707 -86887 213470 718109
5161G18109K89378j142669j255638q19481J468393J042954j86967L5799j089441
$$ 718109 1007487 -135182 -1390820 -2210301 -741908 301046 114079 149878 -939563
5152i39563j27775J62085P35527N65949q18292K21189M31074j394034p1602R58650
$$ -939563 -1067338 -905253 -169726 396223 -422069 -200880 230194 -1163840 -1235442 -276792
5142b76792r10864J861292j86574j70803k54518K01892N86641Q60529j036629
$$ -276792 -1187656 673636 487062 316259 61741 263633 850274 1710803 674174
5133F74174N47406q0535j647801k07025j302425N32856Q97396M92408m66465j102315
$$ 674174 1221580 1141045 -506756 -713781 -2016206 -1483350 -585954 -93546 -560011 -1662326
5123a662326P26358J279078O20618j381220P96673K41115r03386K57739K86125
$$ -1662326 -935968 343110 963728 -417492 379181 620296 -283090 -25351 260774
5114B60774J04582Q004j626096Q60895K41550k95037J67856j88658N98784J038124
$$ 260774 365356 373360 -1252736 -391841 -150291 -445328 -277472 -466130 132654 1170778
5104A170778r18668m92649K6308J167986l99744o43541m69168Q54902P80318n39950
$$ 1170778 252110 -240539 -214231 953755 554011 -89530 -558698 296204 1076522 536572
5094E36572j259232P12544J204341j858401p25498J889347P87560p82379p30710
$$ 536572 -722660 -10116 1194225 -664176 -1389674 499673 1287233 504854 -225856
5085b25856j09988k33919m84601J68179J03789K235288o70773O5995j372980l03090
$$ -225856 -335844 -569763 -1054364 -886185 -782396 1452892 782119 848114 -524866 -827956
5075h27956J118938n01187j051459J206810J580610m56234j230401j388290J186183
$$ -827956 290982 -210205 -1261664 -54854 1525756 1069522 -160879 -1549169 -362986
5066c62986J439830j085216j358019R98414J646167m27472J153569j566534J009330
$$ -362986 1076844 -8372 -1366391 -367977 1278190 850718 2004287 437753 1447083
5057A447083J356920o11605j784468n09336N00438m5789k92818J241617P76753
$$ 1447083 2804003 2192398 407930 -101406 399032 353243 60425 1302042 2078795
5048B078795j48152q90858q41790J431207J242606q96627j415409o06115J392340
$$ 2078795 1930643 1039785 197995 1629202 2871808 1975181 559772 -46343 1345997
5039A345997l22799p67836k51287N94316o24289j68807J500469Q59906l62699
$$ 1345997 1023198 255362 4075 598391 -25898 -194705 1305764 2165670 1802971
5030A802971p78902j222651m44921O9473J350663J64822M48346j69487r75438
$$ 1802971 1024069 -198582 -643503 -574030 776633 941455 1389801 1220314 244876
5021B44876J8957l9518j02410j49200O55430L71200M15200p99358k19091p04206
$$ 244876 263833 224315 121905 -27295 628135 999335 1414535 615177 396086 -308120
5011c08120L42070J287755p14725j184648m67145j96499J84502K75977M57342
$$ -308120 33950 1321705 606980 -577668 -1044813 -1241312 -1056810 -780833 -323491
5002c23491N30939j7962q55244O1424M66812P12843O69185l10105j173664O16942
$$ -323491 207448 189486 -665758 -604334 -137522 575321 1244506 934401 -239263 377679
4992C77679k27070j55860K98508J793920p94186q34914l37862o38384O72997O8730
$$ 377679 150609 -5251 293257 2087177 1292991 458077 120215 -518169 154828 223558
4982B23558L1775k94415J15923m21308M9696J087464M22905l3285l32266j471037
$$ 223558 255333 -39082 76841 -344467 -294771 792693 1215598 1182313 850047 -620990
4972f20990K97614J531019l30757M38620j264067M5487J279966L6883j185042
$$ -620990 -323376 1207643 876886 1315506 51439 96926 1376892 1413775 228733
4963B28733R60363M56583o97047n3272K38513J6434l47716l3929M86920K78722
$$ 228733 1189096 1645679 948632 895360 1133873 1150307 802591 768662 1255582 1534304
4953A534304p77189q6870m74289Q33616P35502l65901n33534J182476K32662q79856
$$ 1534304 757115 670245 195956 1029572 1765074 1399173 865639 2048115 2280777 1400921
4943A400921n88557r8656J096267J27251O12435j166766p48713J456618o25219
$$ 1400921 812364 713708 1809975 1937226 2549661 1382895 634182 2090800 1465581
4934A465581k43547N39585j902716L92521k18465M07139J13063J375345o10868
$$ 1465581 1222034 1761619 -141097 251424 32959 440098 553161 1928506 1317638
4925A317638k138585n35943L08863M57640K985P57992J235628j750680n33894
$$ 1317638 -820947 -1356890 -1048027 -590387 -587402 170590 1406218 -344462 -878356
4916h78356j74499m57734J300229Q67772j03103r31988J019403k019664K64535
$$ -878356 -1052855 -1510589 -210360 657412 554309 -377679 641724 -1377940 -1113405
4907a113405j64358J077502J043361k057584k70378n41556n62948K179826P23578
$$ -1113405 -1277763 -200261 843100 -1214484 -1484862 -2026418 -2589366 -409540 314038
4898C14038l63328m86175K96736M15725j215412K12202R24388R60914j625138
$$ 314038 -49290 -535465 -238729 176996 -1038416 -826214 98174 1059088 -566050
4889e66050m36747J304264J20032J25274p73791m77487O27154R6697l08086R47319
$$ -566050 -1002797 301467 421499 546773 -227018 -704505 -77351 19346 -288740 658579
4879F58579P33058J669126j665993k782049J536365J611870L16295N02944l68908
$$ 658579 1391637 3060763 1394770 -1387279 149086 1760956 2077251 2580195 2211287
4870B211287j731024l22232q96475O37531J259395l11026l78751l4781j565438
$$ 2211287 480263 158031 -738444 -100913 1158482 847456 468705 433924 -1131514
4861a131514J456133J587306j13113J00212K13285Q1864j339867p40571J697195
$$ -1131514 324619 1911925 1798812 1899024 2112309 2194173 854306 113735 1810930
4852A810930J619597j361350r40670p25769O29442N950j15415J269255J177481
$$ 1810930 3430527 2069177 1128507 402738 1032180 1038130 922715 2191970 3369451
4843C369451m57492j329619j131672j5889K037563n85998k921644J827996J78097
$$ 3369451 2911959 1582340 450668 434779 2472342 1886344 -1035300 792696 970793
4834I70793o47978j029643p9126K021814l24713r05624l75917J724841l62869
$$ 970793 322815 -706828 -785954 1235860 911147 5523 -370394 1354447 991578
4825I91578j412932J179549M22831j4928j578051J72259M61431l73870N28060
$$ 991578 -421354 758195 1181026 1166098 -411953 -239694 221737 -152133 375927
4816C75927P13548r36576M67312o383l06041N06873j36310j92100N47150j477272
$$ 375927 1089475 152899 620211 613828 307787 814660 678350 486250 1033400 -443872
4806d43872J941568P04896m12423q15761J015657l09275N44414r18669L5136J34042
$$ -443872 1497696 2202592 1790169 974408 1990065 1680790 2225204 1306535 1341671 1475713
4796A475713m77772k62124j222315R41748M04180j53353o98427J897613O96964
$$ 1475713 997941 735817 -486498 455250 859430 706077 7650 1905263 2602227
4787B602227r82805r50792Q12313o00603L41649l01308O26987l40393j059122
$$ 2602227 1619422 668630 1480943 880340 1221989 920681 1547668 1207275 148153
4778A48153m69575J95720Q27805N03003r68202m92444N15884P90568Q05102l57014
$$ 148153 -321422 -125702 702103 1205106 236904 -255540 260344 1050912 1856014 1499000
4768A499000q09081J240147N51256k584209j81104K877423q94953r07884j261785
$$ 1499000 689919 1930066 2481322 -102887 -283991 2593432 1698479 790595 -471190
4759d71190j044279O97965Q83820M71388J168570M43624P15536j073317j134335
$$ -471190 -1515469 -817504 66316 537704 1706274 2149898 2865434 1792117 657782
4750F57782j71761P96675j139491N67992K82950p62263J0571j000910J064200
$$ 657782 486021 1282696 143205 711197 994147 231884 242455 -758455 305745
4741C05745R05277k59439J294266k84898p7548l99550p0377L84434j141897o74678
$$ 305745 1211022 951583 2245849 1960951 1883403 1483853 1413476 1797910 656013 -18665
4731a8665j088J68706K85701M36532P50990K69733o02055j563780R93259J336423
$$ -18665 -19753 148953 434654 871186 1622176 1891909 1289854 -273926 719333 2055756
4721B055756l99643o9554l22018J76646l69127L6113j061696K91991J993160j986722
$$ 2055756 1656113 1586559 1264541 1441187 1072060 1108173 46477 338468 2331628 344906
4711C44906J54850Q32481J06406N65091j65416J668027r86974m87771J140302
$$ 344906 499756 1332237 1438643 2003734 1838318 3506345 2519371 2031600 3171902
4702C171902l42360j368808p36491K18060O30519M55802q48718J346192O67843
$$ 3171902 2829542 1460734 724243 942303 1572822 2028624 1179906 2526098 3193941
4693C193941j800653q71466j87162J206161J43860L27076M11083j56341k81216
$$ 3193941 1393288 521822 334660 1540821 1684681 2011757 2422840 2266499 1985283
4684A985283o22594Q19081O20472m92256n94492j94628K292K18434m86657m39856
$$ 1985283 1362689 2181770 2802242 2309986 1715494 1520866 1523158 1741592 1254935 815079
4674H15079J479158N68121k17517j004618k60304k33373O48951K04645k32973
$$ 815079 2294237 2862358 2644841 1640223 1379919 1146546 1795497 2000142 1767169
4665A767169n05045P4393o20932q7948R4476N87729M06505o09533l55917J279337
$$ 1767169 1262124 1336517 715585 627637 722113 1309842 1716347 1106814 750897 2030234
4655B030234J277920o36871J52353J70639n41874n2648j08516P48341j25751R9068
$$ 2030234 3308154 2671283 2823636 2994275 2452401 2399753 2291237 3039578 2913827 3012895
4645C012895j864990L02812K99786J68633J079573k14329M45795J105760j208718
$$ 3012895 1147905 1450717 1750503 1919136 2998709 2784380 3230175 4335935 3127217
4636C127217r56321p06952J5867L24529p05109J261721o71780o90792J004938
$$ 3127217 2170896 1463944 1479811 1804340 1099231 2360952 1689172 998380 2003318
4627B003318J63700J75842M54963j903031p42298J302558J635154J778696J412541
$$ 2003318 2167018 2342860 2797823 894792 152494 1455052 3090206 4868902 6281443
4618F281443j387969j795601j080765j7078j26704L38423J541759k5142j585747
$$ 6281443 4893474 3097873 2017108 2000030 1873326 2211749 3753508 3728366 2142619
4609B142619K43931L00579j63732J98256J016386j39767o21755Q3193j725791
$$ 2142619 2386550 2687129 2523397 2721653 3738039 3598272 2976517 3059710 1333919
4600A333919R25754R30874O47141N3949k79496n99807m89393M19771m96647P36521
$$ 1333919 2259673 3190547 3837688 3891637 3612141 3012334 2522941 2942712 2446065 3182586
4590C182586j65669o21102j74300P22601k93787k83357m48947K372563P29607
$$ 3182586 3016917 2395815 2221515 2944116 2650329 2366972 1918025 4290588 5020195
4581E020195j535303j60996j303294J325075K64000j113360m3585l59946j42956
$$ 5020195 3484892 3323896 2020602 3345677 3609677 2496317 2452732 2092786 1949830
4572A949830L85538j136446Q25047J410765m79463m41219p861j9052M11731k34165
$$ 1949830 2335368 1198922 2023969 3434734 2955271 2514052 2506191 2487139 2898870 2664705
4562B664705L60175q24920P70443R9837r87468O52428J011765J439100k516922
$$ 2664705 3024880 2199960 2970403 3070240 2082772 2735200 3746965 5186065 2669143
4553B669143R31937J531704N87315k82537o96573k006347J227960r88403L57836
$$ 2669143 3601080 5132784 5720099 5437562 4740989 2734642 3962602 2974199 3332035
4544C332035J194820P81723M37639q29716j456473j438878J971192j754882J513086
$$ 3332035 4526855 5308578 5746217 4916501 3460028 2021150 3992342 2237460 3750546
4535C750546o51797J344622O14650o90288p88956Q66902J412609r54370j857757
$$ 3750546 3098749 4443371 5058021 4367733 3578777 4445679 5858288 4903918 3046161
4526C046161L10907N53521n94849J202412M79017J077510j693495P67992m27916
$$ 3046161 3357068 3910589 3315740 4518152 4997169 6074679 4381184 5149176 4721260
4517D721260J150258J751962r82183j239573j194907R4571J204937o42285q0214
$$ 4721260 5871518 7623480 6641297 5401724 4206817 4301388 5506325 4864040 4783826
4508D783826J966798l72032r34122o3782O51871K51880N24624q65701n98055J77278
$$ 4783826 6750624 6378592 5444470 5380688 6032559 6284439 6809063 5943362 5345307 5522585
4498E522585r79750q04218J209481J755064P20468j696170p49598P36948N65378
$$ 5522585 4542835 3738617 4948098 6703162 7423630 5727460 4977862 5714810 6280188
4489F280188J473738r72819Q38030p78767l69878j914660j09574J246277R34456
$$ 6280188 7753926 6781107 7619137 6840370 6470492 4555832 4446258 5692535 6626991
4480F626991q5335j856639o29160J602605J074901p23009m81411J80041J144985
$$ 6626991 6541656 4685017 4055857 5658462 6733363 6010354 5528943 5708984 6853969
4471F853969p76805L5627J103957o65662q260J61245j613294R85049J199657O54243
$$ 6853969 6077164 6112791 7216748 6551086 6542826 6704071 5090777 6075826 7275483 7929726
4461G929726L62053n97692L28865o03645k48288K27386M97211O48810j201623
$$ 7929726 8291779 7694087 8022952 7419307 7171019 7398405 7895616 8544426 7342803
4452G342803r74059Q14740J022381O21051P9493n1798j408215k87094N21124L2318
$$ 7342803 6368744 7183484 8205865 8826916 8906409 8854611 7446396 7159302 7680426 7712744
4442G712744K724229o85434j040154P6134p33772k24356R6412J82723J538535
$$ 7712744 10436973 9751539 8711385 8787519 8053747 7829391 7925803 8108526 9647061
4433I647061O76393L07885j041707Q56218Q25418J033846o07687j13420Q46804
$$ 9647061 10323454 10631339 9589632 10445850 11271268 12305114 11697427 11584007 12430811
4424A2430811j021296p13009o21646K73463K451443M22085j591560r17060R86357
$$ 12430811 11409515 10696506 10074860 10348323 12799766 13221851 11630291 10713231 11699588
4415A1699588n39047J94126N96277J249375m38705q71007m87236p65186J261027
$$ 11699588 11160541 11354667 11950944 13200319 12761614 11890607 11403371 10638185 11899212
4406A1899212J403805N02737l19870P9639j726139J00180K004924k88689P20056
$$ 11899212 13303017 13805754 13485884 13565523 11839384 11939564 13944488 13655799 14375855
4397A4375855J06554o26586o60773L64512m9376n0575O72147J360403O77867j448616
$$ 14375855 14482409 13855823 13195050 13559562 13510186 13459611 14131758 15492161 16170028 14721412
4387A4721412l80620O04687N8164j025987J428571N53234J233273j183982L3218
$$ 14721412 14340792 14945479 15003643 13977656 15406227 15959461 17192734 16008752 16041970
4378A6041970O0155L20624J691107p49997K38458J699056l65413j313561q75013
$$ 16041970 16102125 16422749 18113856 17363859 17602317 19301373 18935960 17622399 16747386
4369A6747386K321818J710797j65328j171692o69693M21877L0837m4708K089252
$$ 16747386 19069204 20780001 20614673 19442981 18773288 19195165 19226002 19181294 21270546
4360B1270546M33850M15625n63123j414101M43034Q10173J212624R00813M80836
$$ 21270546 21704396 22120021 21556898 20142797 20585831 21396004 22608628 23509441 23990277
4351B3990277R98879j121099j104094J003568J620134J111412K49238j306388
$$ 23990277 24989156 23868057 22763963 23767531 25387665 26499077 26748315 25441927
4343B5441927m14946N79831J788445k5925M04889J812426M54381j44258k014641
$$ 25441927 25026981 25606812 27395257 27369332 27774221 29586647 30041028 29896770 27882129
4334B7882129Q11519J345604Q67792Q87578j844399O44377Q16931j58782N59413
$$ 27882129 28693648 30039252 30907044 31794622 29950223 30594600 31411531 31252749 31812162
4325C1812162J133599L502278N56161J42657j569661N07764R58636j54328J309496
$$ 31812162 32945761 36448039 37004200 37146857 35577196 36084960 37043596 36889268 38198764
4316C8198764J461947J55002j76113j829342J571251J712302J228894J770605
$$ 38198764 39660711 39815713 39639600 37810258 39381509 41093811 42322705 44093310
4308D4093310K47266M42985j73803p84883N97861J203480K494963J464710M72574
$$ 44093310 44340576 44783561 44609758 43824875 44422736 45626216 48121179 49585889 50058463
4299E0058463J249252M87057J806685r299Q4049J189757K493206J615590J63853
$$ 50058463 51307715 51794772 53601457 53592158 53676207 54865964 57359170 58974760 59138613
4290E9138613J698489N94743Q01474K049069O97077K108118J245519l97101J404236
$$ 59138613 60837102 61431845 62233319 64282388 64979465 67087583 68333102 67936001 69340237
4281F9340237K741831J944009K249195J551882J414787J494934P53896O5872R90414
$$ 69340237 72082068 74026077 76275272 77827154 79241941 80736875 81490771 81556643 82547057
4272H2547057L046787K283660K350436m5072Q02127L108684J431677L022451K439491
$$ 82547057 85593844 87877504 90227940 90182868 90984995 94093679 95525356 98547807 100987298
4263A00987298J943887L544300K45138O99409J332675K029706K985297J142106
$$ 100987298 102931185 106475485 106720623 107420032 108752707 110782413 113767710 114909816
4255A14909816K946291K227350J123366q07246J269234L652377J487716L491991
$$ 114909816 117856107 120083457 121206823 120399577 121668811 125321188 126808904 130300895
4247A30300895J624981J225032K938920J825785K443510L004164K011147J994519
$$ 130300895 131925876 133150908 136089828 137915613 140359123 143363287 145374434 147368953
4239A47368953J454030K398908L051741K125628L284777J754995L634115L172411
$$ 147368953 148822983 151221891 154273632 156399260 159684037 161439032 165073147 168245558
4231A68245558K271383L008807M144327M302195L595181L554550L379231K107403
$$ 168245558 170516941 173525748 177670075 181972270 185567451 189122001 192501232 194608635
4223A94608635M179174N354627M428117M627624M066510N499095L515814M929090
$$ 194608635 198787809 204142436 208570553 213198177 217264687 222763782 226279596 231208686
4215B31208686M683494M253412N091406M494116M610873M027351M690068N679318
$$ 231208686 235892180 240145592 245236998 249731114 254341987 258369338 263059406 268738724
4207B68738724M347758N300216L680341K584699N322431K422188L861885L704754
$$ 268738724 273086482 278386698 282067039 284651738 289974169 292396357 296258242 299962996
4199B99962996K467716K568342K972167K057227J059561K87749o31692j046714
$$ 299962996 302430712 304999054 307971221 310028448 311088009 311375758 310744066 309697352
4191C09697352O99044j262256j849648j632904l314375j703503n063343k807083
$$ 309697352 310396396 309134140 307284492 305651588 302337213 300633710 295570367 292763284
4183B92763284m179360m062034m444971m241505m333071o138108m616557m207098
$$ 292763284 288583924 284521890 280076919 275835414 271502343 265364235 260747678 256540580
4175B56540580n279676o102995n706497n275216o168726n260289l673759n279806
$$ 256540580 251260904 245157909 239451412 234176196 228007470 222747181 219073422 213793616
4167B13793616m709750n391928o321875m800666m586822n227663l940292l233370
$$ 213793616 209083866 203691938 197370063 192569397 187982575 182754912 178814620 175581250
4159A75581250l187666m432221n229560l773890l484280l370224m352035m321054
$$ 175581250 172393584 167961363 162731803 158957913 155473633 152103409 147751374 143430320
4151A43430320l433580k141301l733325l579514k764556l400429l209030l247915
$$ 143430320 139996740 137855439 134122114 130542600 127778044 124377615 121168585 117920670
4143A17920670l084107n52430j302703m067374k909758k052529j889058j741195
$$ 117920670 114836563 114284133 112981430 108914056 106004298 103951769 102062711 100321516
4135A00321516l016466j920580j618702j900180o91091k519253j913940l439480
$$ 100321516 97305050 95384470 93765768 91865588 91174497 88655244 86741304 83301824
4127H3301824j096942j433215k010906p22326k312748k92354k901798j340971
$$ 83301824 82204882 80771667 78760761 78038435 75725687 75433333 72531535 71190564
4119G1190564n55765k415285N80057j412750j117782p74642k889858k084229n72101
$$ 71190564 70634799 68219514 68799571 67386821 66269039 65494397 62604539 60520310 59948209
4110E9948209l26875k39000n26617j490074j324317j402467j425175j13501j32346
$$ 59948209 59621334 59382334 58855717 57365643 56041326 54638859 53213684 53100183 52967837
4101E2967837N9251r17535l035873j299276J440843j076254J30645k392428j78742
$$ 52967837 53027088 52109553 49073680 47774404 49215247 48138993 48269638 45877210 45698468
4092D5698468j206030j439865m14056l50725J776345l09747r18047k057886K14251
$$ 45698468 44492438 43052573 42638517 42287792 44064137 43754390 42836343 40778457 40992708
4083D0992708K05639o98068p29580o57700j671394P63511j317532M37294J071355
$$ 40992708 41198347 40500279 39770699 39112999 37441605 38205116 36887584 37324878 38396233
4074C8396233j358007k41015n02295K58642J78517J11364n87920m58372j710760
$$ 38396233 37038226 36797211 36294916 36553558 36732075 36843439 36255519 35797147 34086387
4065C4086387k66789O18407p90466J51497P23735n77534j110526j328612q42589
$$ 34086387 33819598 34438005 33647539 33799036 34522771 33945237 32834711 31506099 30663510
4056C0663510Q85425J316055k35749R50236j084539M42308o31733n59670o42186
$$ 30663510 31548935 32864990 32629241 33579477 32494938 32937246 32305513 31745843 31103657
4047C1103657n11998L88268q16093j85861j622159M28170N70912R27312r54591
$$ 31103657 30591659 30979927 30163834 29977973 28355814 28783984 29354896 30282208 29327617
4038B9327617J30898j037942j371151L40013J57933R23762N98930O27494M0064
$$ 29327617 29458515 28420573 27049422 27389435 27547368 28471130 29070060 29697554 29737618
4029B9737618k213945n00737M10876L56865J084803j51859J9598m50349P51407
$$ 29737618 27523673 27022936 27433812 27790677 28875480 28723621 28743219 28292870 29044277
4020B9044277J98103j62475J956012r09989P44674j482646j405484j31557J549528
$$ 29044277 29242380 29079905 31035917 30125928 30870602 29387956 27982472 27850915 29400443
4011B9400443J661556J81190L27326o34086p84294l3598j523675K733633J170417
$$ 29400443 31061999 31243189 31570515 30936429 30152135 30118537 28594862 31328495 32498912
4002C2498912p35119p76011K6212P80552K0310K067938N89734J293458J22027
$$ 32498912 31763793 30987782 31013994 31794546 31814856 33882794 34472528 35765986 35888013
3993C5888013j643084l10217J61692J905903K149545j366138n83485m72849M94077
$$ 35888013 34244929 33934712 34096404 36002307 38151852 36785714 36202229 35729380 36223457
3984C6223457R49234J445963J194757J098751j64233j766133K50345P71965K380133
$$ 36223457 37172691 38618654 39813411 40912162 40747929 38981796 39232141 40004106 42384239
3975D2384239J225695P05130J364222k04176O67049J8046Q67948J810260K031621
$$ 42384239 43609934 44315064 45679286 45475110 46142159 46160205 47028153 48838413 50870034
3966E0870034J107207J429998q79726J062226o97416M77308J442996K060610J662255
$$ 50870034 51977241 53407239 52527513 53589739 52892323 53369631 54812627 56873237 58535492
3957E8535492M84401M77550J52195K481725J245528K150102J955279J897419O36313
$$ 58535492 59019893 59497443 59649638 62131363 63376891 65526993 67482272 69379691 70016004
3948G0016004n00038Q02909L210606L024318P16285K618379P87066o69156j07167
$$ 70016004 69515966 70318875 73529481 76553799 77270084 79888463 80675529 80006373 79899206
3939G9899206J337914J198776M390534R84743R06718M68028J316075K844705P99297
$$ 79899206 81237120 82435896 86826430 87811173 88717891 89185919 90501994 93346699 94145996
3930I4145996J114749K844951M35826l64552R32278j523370J945677J775952K95642
$$ 94145996 95260745 98105696 98541522 98176970 99109248 97585878 99531555 101307507 101603149
3921A01603149l72270M08401k04891P80567o37109j296164Q56456j185163k623785
$$ 101603149 101230879 101639280 101434389 102214956 101577847 100281683 101138139 99952976 97329191
3912I7329191j011706q67035J33689m83105n56960j907446k015909j380115k439869
$$ 97329191 96317485 95450450 95584139 95101034 94544074 92636628 90620719 89240604 86800735
3903H6800735k407644k83369r25355k299916j146368k049279j732828R7635j581742
$$ 86800735 84393091 84109722 83184367 80884451 79738083 77688804 75955976 76053611 74471869
3894G4471869k672673j397828k070286j440607j508661j061918j05014k739783
$$ 74471869 71799196 70401368 68331082 66890475 65381814 64319896 64214882 61475099
3886F1475099k461239p44828l95610p40915o04108k620332j454039R58749r34532
$$ 61475099 59013860 58269032 57873422 57132507 56528399 53908067 52454028 53412777 52478245
3877E2478245j405603p52806k198006m86237j450513o59135j374065M79818j478947
$$ 52478245 51072642 50319836 48121830 47635593 46185080 45525945 44151880 44631698 43152751
3868D3152751j324856j489713l91539l74023j455421K27658o06716j018888j219825
$$ 43152751 41827895 40338182 39946643 39572620 38117199 38344857 37738141 36719253 35499428
3859C5499428j664045j239434N75513m04584k69986j052639l24230j341332r12622
$$ 35499428 33835383 32595949 33171462 32766878 32496892 31444253 31120023 29778691 28866069
3850B8866069P6460r8544R98901j685373n36323n40593J01237Q56213j872253
$$ 28866069 28942529 28843985 29842886 28157513 27621190 27080597 27181834 28038047 26165794
3841B6165794P76074k08721j232871r1801m02938p30290r5871n05889P25393q5066
$$ 26165794 26941868 26733147 25500276 25408475 25005537 24275247 24179376 23673487 24398880 24313814
3831B4313814m48625k527596k04574k80957P93276K16721j002222l64363r27900
$$ 24313814 23865189 21337593 21133019 20852062 21645338 21862059 20859837 20495474 19567574
3822A9567574K87071J485979k54606l14099K9951j142995j142741o26101J218485
$$ 19567574 19854645 21340624 21086018 20771919 20801870 19658875 18516134 17890033 19108518
3813A9108518J61225r87527r20983q17786N77952Q52726N21253o37361j67772
$$ 19108518 19269743 18282216 17361233 16543447 17121399 17974125 18495378 17858017 17690245
3804A7690245L26320J159o56969p88678j543550N41430k6786j29960M88794j561489
$$ 17690245 18016565 18017724 17360755 16572077 15028527 15569957 15543171 15413211 15902005 14340516
3794A4340516R537J142857N44276O05480n93869j199285J030207K8639k81551
$$ 14340516 14350053 15492910 16037186 16642666 16048797 14849512 15879719 15908358 15626807
3785A5626807j079863R8611O27886j117522j159038J76623J143419m91951l236
$$ 15626807 14546944 14645555 15273441 14155919 12996881 13173504 14316923 13824972 13821736
3776A3821736k62359O61418N65311j249999o23999P15456O99553m17023j137642
$$ 13821736 13559377 14220795 14786106 13536107 12912108 13627564 14327117 13910094 12772452
3767A2772452j83369M72572p15305J396215k233983n38121R7022J344228J458046
$$ 12772452 12589083 13061655 12346350 13742565 11508582 10970461 11067483 12411711 13869757
3758A3869757m81093m41757r75502J692K14305R2545L00554n84452N70056j142261
$$ 13869757 13388664 12946907 11971405 11973097 12187402 12279947 12580501 11996049 12566105 11423844
3748A1423844o49855J159986p59600M27615R44228O22302p23377q70702n78857
$$ 11423844 10773989 11933975 11174375 11601990 12546218 13168520 12445143 11574441 10995584
3739A0995584K21415J115602K48110p71622k95978l04596k08071N19417j106895
$$ 10995584 11216999 12332601 12580711 11809089 11513111 11208515 11000444 11519861 10412966
3730A0412966J550910L52837j420372j015617m7853J005763m12508q25271K349081
$$ 10412966 11963876 12316713 10896341 9880724 9832871 10838634 10426126 9600855 11949936
3721A1949936q08579k71793m15092p31766L54509R1118J485599l81075l82567
$$ 11949936 11141357 10869564 10454472 9722706 10077215 10168333 11653932 11272857 10890290
3712A0890290j164469l39729O63350J55413P25413j31719J93478M65596k028568
$$ 10890290 9725821 9386092 10049442 10204855 10930268 10798549 10992027 11457623 9429055
3703I429055N23563J63318N38391l55397j87145O09983M77961k051591q19456
$$ 9429055 9952618 10115936 10654327 10298930 10111785 10721768 11199729 9148138 8328682
3694H328682p42155J252771P3303J49591N85365j43299Q6555n61166n09967o75548
$$ 8328682 7586527 8839298 8912601 9062192 9647557 9504258 9590813 9029647 8519680 7844132
3684G844132Q6598L60964m61629N39307m0270m54624Q2393L22370N72460J014859
$$ 7844132 7930730 8291694 7830065 8369372 8329102 7874478 7956871 8279241 8851701 9866560
3674I866560k299850j62145M49419J23122k61217M05119J70942o94806j467543
$$ 9866560 7566710 7404565 7853984 7977106 7715889 8121008 8291950 7597144 6129601
3665F129601o30709J051552J776199L22639q69911j229598k109768J134540l86009
$$ 6129601 5498892 6550444 8326643 8649282 7779371 6549773 4440005 5574545 5188536
3656E188536J591832J703710P53342n68183k276117l88383K19564M15287P31887
$$ 5188536 6780368 8484078 9237420 8669237 6393120 6004737 6224301 6639588 7371475
3647G371475o43961Q50986q18612k03582j143904K712197J186518j595812o70187
$$ 7371475 6727514 7578500 6759888 6556306 5412402 8124599 9311117 7715305 7045118
3638G045118k057953O32354J343379J89338M79269m18792j402549j011285Q77578
$$ 7045118 4987165 5619519 6962898 7152236 7631505 7212713 5810164 4798879 5676457
3629E676457Q77137K190965O11629j010059l75460r49117n2054n1608q21097J875221
$$ 5676457 6553594 8744559 9356188 8346129 7970669 7021552 6969498 6917890 6096793 7972014
3619G972014o85583l12704p86488R96659K33232O9874j5000O93813K28641j688431
$$ 7972014 7286431 6973727 6187239 7183898 7417130 7487004 7472004 8165817 8394458 6706027
3609F706027l41006Q93420N73154r69250K8414N39508Q75915m6971Q02889m2986
$$ 6706027 6365021 7258441 7831595 6862345 6890759 7430267 8306182 8259211 9062100 9019114
3599I019114k15890p00124M2858l63451K99818J774904n59529l78215j72683j56160
$$ 9019114 8803224 8103100 8145958 7782507 8082325 9857229 9297700 8919485 8746802 8590642
3589H590642J71471L47624M75106p49822j11603o01897m97420J356439J6509M4777
$$ 8590642 8762113 9109737 9584843 8835021 8723418 8121521 7624101 8980540 8997049 9041826
3579I041826L1442M17125m47615l06327J193139q38563J809537r17874j817407
$$ 9041826 9073268 9490393 9042778 8736451 9929590 9091027 10900564 9982690 8165283
3570H165283O24179J293469R86077k8977l53908O63210r23591j61806o17816k31553
$$ 8165283 8789462 10082931 11069008 11040031 10686123 11349333 10425742 10263936 9646120 9414567
3560I414567J284494P39852r21370j534443P97722j3249k49377M14925J443572
$$ 9414567 10699061 11438913 10517543 8983100 9780822 9767573 9518196 9933121 11376693
3551A1376693K82220j366199o55560l76433J552546n23026J394209Q34672M93345
$$ 11376693 11658913 10292714 9637154 9260721 10813267 10290241 11684450 12519122 13012467
3542A3012467l06837j649633N49071J28589M86587R53998m2864o79560j306503
$$ 13012467 12705630 11055997 11605068 11733657 12220244 13174242 13131378 12451818 11145315
3533A1145315J211257n92393P69492j55741O24863j52852k220221J107081J246901
$$ 11145315 12356572 11764179 12533671 12377930 13002793 12849941 10629720 11736801 12983702
3524A2983702N05711j87407J96254Q43060N98510p37418n31914J231376k60895
$$ 12983702 13489413 13302006 13498260 14341320 14939830 14202412 13670498 14901874 14640979
3515A4640979q29985p34184J031270J504593K01619J3798L6973O92680Q73096
$$ 14640979 13810994 13076810 14108080 15612673 15814292 15828090 15865063 16557743 17430839
3506A7430839L99505j075625O37142K83030p22776n62474O73816P09445J819857
$$ 17430839 17830344 16754719 17391861 17674891 16952115 16389641 17063457 17772902 19592759
3497A9592759n99079j454166J049968j67553p10246J721514m72454J766943j02287
$$ 19592759 18993680 17539514 18589482 18421929 17711683 19433197 18960743 20727686 20625399
3488B0625399p74124l95952O35278J372700M14841J089781K91621j607431Q39595
$$ 20625399 19851275 19455323 20090601 21463301 21878142 22967923 23259544 21652113 22491708
3479B2491708O98254J316635P3776J146411n58458l42918q49710o16995J430008
$$ 22491708 23189962 24506597 24580373 25726784 25168326 24825408 23975698 23358703 24788711
3470B4788711J119532J843818J9940k79861n36769O48235J028213J279597K929009
$$ 24788711 25908243 27752061 27772001 27492140 26955371 27603606 28631819 29911416 32840425
3461C2840425L9859j387186R30223o25574P03094J053532J137195J247407l81004
$$ 32840425 32880284 31493098 32423321 31797747 32500841 33554373 34691568 35938975 35557971
3452C5557971j67114L3632J662770J922838K438237K67214M93982J433874j28881
$$ 35557971 35390857 35424489 37087259 39010097 41448334 41715548 42209530 43643404 43514523
3443D3514523J572031N81489J856358J192917r704J66846J10035J012968K514376
$$ 43514523 45086554 45668043 47524401 48717318 48707614 48874460 48984495 49997463 52511839
3434E2511839J115878J875654O37158K564931k18594J913781J481206O22839K064717
$$ 52511839 53627717 55503371 56140529 58705460 58486866 60400647 61881853 62504692 64569409
3425F4569409R30154J631055K500594K327639J268797J22791K059724K383179
$$ 64569409 65499563 67130618 69631212 71958851 73227648 73350439 75410163 77793342
3417G7793342J242012J649155K022620L356386J921395J716343O47287K978461
$$ 77793342 79035354 80684509 82707129 86063515 87984910 89701253 90348540 93327001
3409I3327001K910707K659799L423721K731615L196685K122433K892458L202129
$$ 93327001 96237708 98897507 102321228 105052843 108249528 110371961 113264419 116466548
3401A16466548L553131L827123M504924K723344K335574K664126M410848M421124
$$ 116466548 120019679 123846802 128351726 131075070 133410644 136074770 140485618 144906742
3393A44906742N341321M349382K896283L640042L712567N676652O028453M500681
$$ 144906742 150248063 154597445 157493728 161133770 164846337 170522989 176551442 181052123
3385A81052123L188367M093215L699996M071670M606189L549083N164049M764977
$$ 181052123 184240490 188333705 192033701 196105371 200711560 204260643 209424692 214189669
3377B14189669K325954M384717K309807L306658L417160L983611K120441J392625
$$ 214189669 216515623 220900340 223210147 226516805 229933965 233917576 236038017 237430642
3369B37430642J322950K460344K582994Q42086J294399J064220Q20651j431890
$$ 237430642 238753592 241213936 243796930 244639016 245933415 246997635 247818286 246386396
3361B46386396j080106j84720n78344j329783j942890j541474k626237l130641
$$ 246386396 245306290 245121570 244543226 243213443 241270553 239729079 237102842 233972201
3353B33972201l178097k187646k903227l083936m287645l376767l596226m581359
$$ 233972201 230794104 228606458 225703231 222619295 218331650 214954883 211358657 206777298
3345B06777298m632442l496756l583795n175147o135727m201469l413893m396998
$$ 206777298 202144856 198648100 195064305 189889158 183753431 179551962 176138069 171741071
3337A71741071m382887m513839l578915l998797l764377l415985n136011m374593
$$ 171741071 167358184 162844345 159265430 155266633 151502256 148086271 142950260 138575667
3329A38575667l082183m488410l195697l222944k532761k320312l902627l840551
$$ 138575667 135493484 131005074 127809377 124586433 122053672 119733360 115830733 111990182
3321A11990182k928174k712776j673899k452660k570829k658037m443373j339875
$$ 111990182 109062008 106349232 104675333 102222673 99651844 96993807 92550434 91210559
3313I1210559k953397j592971k490388j499478k537313m131455p44961k166504
$$ 91210559 88257162 86664191 84173803 82674325 80137012 76005557 75260596 73094092
3305G3094092j484636j018201j867842o08276k078961k953388j316347j174982
$$ 73094092 71609456 70591255 68723413 68115137 66036176 63082788 61766441 60591459
3297F0591459k29506o22874k111598l827642q99609n93632m49971R60293L0794
$$ 60591459 60361953 59739079 57627481 53799839 52900230 52306598 51856627 52816920 52847714
3288E2847714k033595l016342j563226j04708m90898M62717k003914k155439j295053
$$ 52847714 50814119 47797777 46234551 46129843 45638945 46101662 44097748 41942309 40647256
3279D0647256M21278j188076q49769k79060k26171o90141j79850j686038m71394
$$ 40647256 41068534 39880458 39030689 38751629 38525458 37835317 37655467 35969429 35498035
3270C5498035j700680p24111O07635m59348j095795j452636k041345k13616K26323
$$ 35498035 33797355 33073244 33680879 33221531 32125736 30673100 28631755 28418139 28644462
3261B8644462M20960N79234p55602k03048k207255l010535J543991J970532k66300
$$ 28644462 29065422 29644656 28889054 28686006 26478751 23468216 25012207 26982739 26716439
3252B6716439j199208j390674j62644k29394j60691m08811L94678L90513j588623
$$ 26716439 25517231 24126557 23963913 23734519 23573828 23165017 23559695 23950208 22361585
3243B2361585k251798n7828l72830J728859l58479j336807j06363j296498q86739
$$ 22361585 20109787 20051959 19679129 21407988 21049509 19712702 19606339 18309841 17423102
3234A7423102j04629R08129J484276k005974k25540K49514p49507k41500o3899
$$ 17423102 17318473 18226602 19710878 17704904 17479364 17728878 16979371 16737871 16673972
3225A6673972P60745q05467L1317p63210p93048L70713l88075J406468j896486
$$ 16673972 17434717 16629250 16660567 15897357 15104309 15475022 15086947 16493415 14596929
3216A4596929m67802J73033l43262r69252p13967J044848o4945O44718j233257
$$ 14596929 14129127 14302160 13958898 12989646 12275679 13320527 13255582 13900300 12667043
3207A2667043n92338P38612j027211O86760q27518J9604O48383j198232p94748
$$ 12667043 12074705 12813317 11786106 12472866 11645348 11664952 12313335 11115103 10320355
3198A0320355N90072J051973o2197j383727N43348J250232k7699j653937p30469
$$ 10320355 10910427 11962400 11900203 10516476 11059824 12310056 12282357 10628420 9897951
3189I897951O98577M1048k40002J07678m361N38981j126474n27540O34264J77442
$$ 9897951 10596528 10637576 10397574 10505252 10500891 11039872 9913398 9385858 10020122 10197564
3179A0197564N29302o47387n93362R26064L11890r1090r64079j887030J393306
$$ 10197564 10726866 10079479 9486117 10412181 10724071 10632981 9668902 7781872 9175178
3170I175178M68051j974883p59551R12341N41028O3043n82993K45896O64250Q20086
$$ 9175178 9643229 7668346 6908795 7821136 8362164 8425207 7842214 8088110 8752360 9572446
3160I572446n07051k53481m12164M19389j60321j204330J201652K62765j279266
$$ 9572446 9065395 8811914 8399750 8819139 8658818 7454488 8656140 8918905 7639639
3151G639639r52608J86752J180642j195808r19536Q63402j027219P42725p75891
$$ 7639639 6687031 6873783 8054425 6858617 5939081 6802483 5775264 6517989 5742098
3142E742098J54525r3146J284174j43164k111265q17399J357978J150901j443312
$$ 5742098 5896623 5803477 7087651 6944487 4833222 4015823 5373801 6524702 5081390
3133E081390k10443J051065M91979j195338p8445p44501J671692o81913k51117
$$ 5081390 4870947 5922012 6413991 5218653 5140208 4395707 6067399 5385486 5134369
3124E134369n1795J042977M15746j804080j463949J611136J646811j108863k183993
$$ 5134369 5082574 6125551 6541297 4737217 3273268 4884404 6531215 5422352 3238359
3115C238359N07667K049427n03860n75759j180169M17620K06475o87591N89513
$$ 3238359 3746026 5795453 5291593 4715834 3535665 3953285 4159760 3472169 4061682
3106D061682n30856L56221L19979p27015P21922q7435r79762p18907p32215J634457
$$ 4061682 3530826 3887047 4207026 3480011 4201933 4114498 3134736 2415829 1683614 3318071
3096C318071L60934R35321q72260j045118p74766k76111K112172p42498J706501
$$ 3318071 3679005 4614326 3742066 2696948 1922182 1646071 3758243 3015745 4722246
3087D722246J349695k016350o15523m51675m30630k79106k65378K45705P74345
$$ 4722246 6071941 4055591 3440068 2988393 2557763 2278657 2013279 2258984 3033329
3078C033329N35593q63680k15975N99673J229708j55444j045095J118572K53915
$$ 3033329 3568922 2705242 2489267 3088940 4318648 4163204 3118109 4236681 4490596
3069D490596j352343j568858M93773L22595R13604j568136l96142K126904o97442
$$ 4490596 3138253 1569395 2063168 2385763 3299367 1731231 1335089 3461993 2764551
3060B764551R71432m33389Q71471J01564q24797r60062K54393j80561P20966N84789
$$ 2764551 3735983 3302594 4174065 4275629 3450832 2490770 2745163 2564602 3285568 3870357
3050C870357N05203N18974n02282p55117L21898q4220j0061J020010j612401J264828
$$ 3870357 4375560 4894534 4392252 3637135 3959033 3874813 3864752 4884762 3272361 4537189
3040D537189K75523m63001P08684r28386P57340J63191p81465p00651O98686k39733
$$ 4537189 4812712 4349711 5058395 4130009 4887349 5050540 4269075 3568424 4267110 4027377
3030D027377N71043K53845k72706L98340r19295o58811J5886J76737r53489l35857
$$ 4027377 4598420 4852265 4579559 4977899 4058604 3399793 3415679 3592416 2638927 2303070
3020B303070m60598J957814L33544n72252J075580l3887q63640m71632r72612
$$ 2303070 1842472 3800286 4133830 3561578 4637158 4603271 3739631 3267999 2295387
3011B295387n32194P87886N2378O97263j164939m85585r405k29940j3141P48198
$$ 2295387 1763193 2551079 2603457 3300720 2135781 1650196 1640791 1410851 1397710 2145908
3001B145908J094741n24040K69752j774623J108989J647033r48936j96514M23673
$$ 2145908 3240649 2716609 2986361 1211738 2320727 3967760 3018824 2822310 3245983
2992C245983j085727J70194j273584J522650O25689J64790n42569n25247r1198
$$ 3245983 2160256 2330450 1056866 2579516 3205205 3369995 2827426 2302179 2210981
2983B210981j190215J369709j43803K247048n11542j734577o14044l66811J144082
$$ 2210981 1020766 2390475 2246672 4493720 3982178 2247601 1633557 1266746 2410828
2974B410828P43117p02904P61814k45591j214595r41529J383338P17675P53958
$$ 2410828 3153945 2451041 3212855 2967264 1752669 811140 2194478 2912153 3666111
2965C666111O28528j191187J19053j191619o8697p0753L71559J028222O65476
$$ 3666111 4294639 3103452 3222505 2030886 1962189 1891436 2262995 3291217 3956693
2956C956693J93592k159541p992N48565J52867m65202l94644k62003P78752N0487
$$ 3956693 4150285 1990744 1982752 2531317 2684184 2218982 1824338 1562335 2341087 2391574
2946B391574K44043N97154o9927r02936m21255q13651O76395J40232M30718R39962
$$ 2391574 2635617 3232771 3162844 2259908 1838653 1025002 1701397 1841629 2272347 3212309
2936C212309j554700M85057l41026r57351J695021q42406J056125k09896j103420
$$ 3212309 1657609 2142666 1801640 844289 2539310 1696904 2753029 2543133 1439713
2927A439713r80442j30557K024822n72535n36103j245522Q46787j85993l41145
$$ 1439713 459271 328714 2353536 1781001 1244898 -624 846163 660170 319025
2918C19025J781749J015082j123539p06107k149798N28515J452191n05365J316040
$$ 319025 2100774 3115856 1992317 1286210 -863588 -335073 1117118 611753 1927793
2909A927793j613509P43546R26569q37739o10320P50078J475474p88617j260745
$$ 1927793 314284 1057830 1984399 1146660 536340 1286418 2761892 1973275 712530
2900G12530j075339Q70936o67653L09555K12852Q65970k50492O53238q66214j101525
$$ 712530 -362809 508127 -159526 150029 362881 1228851 978359 1631597 765383 -336142
2890c36142J456957N26540n62592O71171l0271l71519r67206p13710O94802L10591
$$ -336142 1120815 1647355 1084763 1755934 1725663 1354144 386938 -326772 368030 678621
2880F78621r54584j69167K487023J84852r91503j872989J077795K39148P71367
$$ 678621 -275963 -445130 2041893 2226745 1235242 -637747 440048 679196 1450563
2871A450563J095846j326518m83778L88446n34056J152092J40767k50319o71222
$$ 1450563 2546409 1219891 736113 1124559 590503 1742595 1883362 1633043 961821
2862I61821j774786O07481J13147O63964o90183M39778M62168j8343j241367M23525
$$ 961821 -812965 -205484 -92337 571627 -118556 321222 783390 765047 -476320 -52795
2852e2795M91902L41626M21282n59509k63779j585924K91438k98328J547390M58051
$$ -52795 439107 780733 1202015 642506 378727 -1207197 -915759 -1214087 333303 791354
2842G91354p75732j131369j380549P68316M32752J297654n62355J353825J87145
$$ 791354 15622 -1115747 -2496296 -1727980 -1295228 2426 -559929 793896 981041
2833I81041q02023o79096J739621K35384o79525j344187q21802J059290n86429
$$ 981041 179018 -500078 1239543 1474927 795402 -548785 -1370587 -311297 -897726
2824h97726M13559k9740P06522Q62872j070244J00507P36763N61111j164117j61301
$$ -897726 -484167 -513907 192615 1055487 -14757 85750 822513 1383624 219507 58206
2814E8206K79550J88670M19788j071048r11615L99845K86261K05200J65095M1790
$$ 58206 337756 526426 946214 -124834 -1036449 -636604 -350343 -145143 19952 61742
2804F1742l88750j259300J74939J207177R98338n04195j647379l06183J575358
$$ 61742 -327008 -1586308 -1411369 -204192 794146 289951 -1357428 -1663611 -88253
2795h8253N63844q55653O28475J101409J07715j86194k579199j7717M59288J120072
$$ -88253 475591 -380062 248413 1349822 1457537 1271343 -1307856 -1325573 -866285 253787
2785B53787k00746L89880j78588m90237m8566k32436O44784L50665O71866j64220
$$ 253787 53041 442921 264333 -225904 -274470 -506906 137878 488543 1160409 996189
2775I96189r55604j31487j473781J88425J602787J398336q39511k9593m84759
$$ 996189 40585 -90902 -1564683 -1376258 226529 1624865 785354 755761 271002
2766B71002J24505j035339n48646j70332J497161L56401l88557M45047j419540
$$ 271002 395507 -639832 -1188478 -1358810 138351 494752 106195 551242 -868298
2757h68298J48035M60598J443571j638001n11435J144497J07805k75930J381272
$$ -868298 -720263 -259665 1183906 -454095 -965530 178967 286772 10842 1392114
2748A392114m23007o77766J380869m02840n19318j608893J090573j41576O79533
$$ 1392114 969107 291341 1672210 1269370 750052 -858841 231732 90156 769689
2739G69689m68785n16o17632N88597k12066L49469K639273r48578j428198q25560
$$ 769689 300904 300388 -317244 271353 59287 408756 3048029 2099451 671253 -154307
2729a54307k09210o38532J692384J37556K03411r07655j099050O6947j61618K077262
$$ -154307 -363517 -1002049 690335 827891 1031302 123647 -975403 -908456 -1070074 1007188
2719A007188J529173p72724j71274p71431j065543j162422r73670J521360O93166
$$ 1007188 2536361 1763637 1592363 820932 -244611 -1407033 -2380703 -859343 -166177
2710a66177R33830J84424j610647J618933O68571R840m93579q91988j15213q57884
$$ -166177 767653 952077 -658570 960363 1628934 1638774 1145195 253207 137994 -719890
2700g19890j132038O36179J094004J054394j63303j49187r7994Q74267j416940
$$ -719890 -1851928 -1215749 -121745 932649 769346 620159 522165 1396432 -20508
2691b0508j54937q20705M24546P59637j21030K89009o4530p449l65552O74529
$$ -20508 -175445 -996150 -571604 188033 67003 356012 291482 284033 -81519 593010
2681E93010N60903k36062q7515q42006r43574n22561N89138P60877L73231K32969
$$ 593010 1153913 917851 830336 -11670 -955244 -1477805 -888667 -127790 245441 478410
2671D78410k77104j857384p05078Q9181K139813K233221P13658j46139k947051
$$ 478410 201306 -1656078 -2361156 -2271975 -132162 2101059 2814717 2668578 -278473
2662b78473p36902m43505J834931K251817j83752j546180l182164K23403r9774
$$ -278473 -1015375 -1458880 376051 2627868 2444116 897936 -2284228 -2060825 -2160599
2653b160599J063316J502162N05092j213011j145293r75198j89449J524486J814938
$$ -2160599 -1097283 404879 909971 -303040 -1448333 -2423531 -2612980 -1088494 726444
2644G26444N62300o67342j115881n62097n16568j054239K640631M24994J34981
$$ 726444 1288744 621402 -494479 -1056576 -1573144 -2627383 13248 438242 573223
2635E73223j117896p59801r34880J560581J654161j457872Q06943P5379m93769
$$ 573223 -544673 -1304474 -2239354 -678773 975388 -482484 324459 399838 -93931
2626i3931j646552N89481J375192r8141J149215n06060r37717o20892q39857K45812
$$ -93931 -1740483 -1151002 224190 126049 1275264 769204 -168513 -789405 -1629262 -1383450
2616a383450K124374J184719j055322L1719K8245n34808j003682J3268J085864
$$ -1383450 740924 1925643 870321 902040 930285 395477 -608205 -594937 490927
2607D90927Q89131p54659m53276J196052j737027k0602N35348o61985L24583J64889
$$ 490927 1380058 625399 172123 1368175 -368852 -389454 145894 -516091 -191508 -26619
2597b6619j611147N36158p18391N09823P51884P31576Q16288j175973q70696k29722
$$ -26619 -1637766 -1101608 -1819999 -1310176 -558292 173284 989572 -186401 -1057097 -1286819
2587a286819j330523K879127J80790p67537j41613R71176m74143k151935n69382
$$ -1286819 -2617342 261785 442575 -324962 -466575 504601 30458 -2121477 -2690859
2578b690859J392239l69009m59886O89260p62370n3755k3406K24392l99217J959827
$$ -2690859 -1298620 -1667629 -2127515 -1438255 -2200625 -2254380 -2277786 -2053394 -2452611 -492784
2568d92784L77031p5546k151580L8235L16335J71716J738193J18116M15262j854097
$$ -492784 -115753 -191299 -2342879 -2304644 -1988309 -1816593 -78400 39716 454978 -1399119
2558a399119r86268j607521J565608K373658N08545P0431l126325L13844J341883
$$ -1399119 -2385387 -3992908 -2427300 -53642 454903 525334 -2600991 -2287147 -945264
2549i45264J21928J069969M92611r20541j207216j308572R30269J044366J233697
$$ -945264 -823336 246633 739244 -181297 -1388513 -2697085 -1766816 -722450 511247
2540E11247O11715l20725j058607J00058q61022m80269O11396J892144N93751
$$ 511247 1122962 802237 -256370 -156312 -1017334 -1497603 -886207 1005937 1599688
2531A599688j783373j300417o34994J144338J487619j182812j208737M6469R17532
$$ 1599688 -183685 -1484102 -2119096 -974758 512861 -669951 -1878688 -1832219 -914687
2522i14687J49660k60925K42973J225970q34604o9943R04413l7326j22290m60862
$$ -914687 -765027 -1025952 -782979 442991 -391613 -461556 442857 405531 283241 -177621
2512a77621n47749J234352L60799m85698J98792j51473j744976K69633J154600
$$ -177621 -725370 508982 869781 384083 582875 431402 -1313574 -1043941 110659
2503A10659p94648Q35198P52268o71240r01831k37238j010099K037654N22127
$$ 110659 -683989 151209 903477 232237 -669594 -906832 -1916931 120723 642850
2494F42850q92384q9406o05488N36756j71400J037093O54410m73222N60943j525824
$$ 642850 -249534 -338940 -944428 -407672 -579072 458021 1112431 639209 1200152 -325672
2484c25672j653346M99039J187986L77390K67193L39184m50711n85255m82319
$$ -325672 -1979018 -1479979 -291993 85397 352590 691774 241063 -344192 -826511
2475h26511k65169J12592K92880j93457L07759M39837j55554l24714J56868j14662
$$ -826511 -1091680 -979088 -686208 -879665 -571906 -132069 -287623 -612337 -455469 -570131
2465e70131J219782m40465l67281l99194r02660Q16940L19492J212554R02842
$$ -570131 649651 209186 -158095 -557289 -1459949 -643009 -323517 889037 1791879
2456A791879j549989j456210j105402Q07789R55907m18497P1385m96627P31850
$$ 1791879 241890 -1214320 -2319722 -1511933 -556026 -974523 -903138 -1399765 -667915
2447f67915j467665K53754R96444N72182k82667j38637L1351r13269j65045J78235
$$ -667915 -2135580 -1881826 -885382 -313200 -595867 -734504 -703153 -1616422 -1781467 -1603232
2437a603232J285939J179783q61890n94388j120458J101903P56766O44960J97793
$$ -1603232 -317293 862490 600 -593788 -1714246 -612343 144423 789383 987176
2428I87176Q2471p74218j18179n97841L05575J041988L43070j922389l74388j85858
$$ 987176 1069647 295429 177250 -420591 -115016 926972 1270042 -652347 -1026735 -1212593
2418a212593L46748J433046J5950O08280l37500l57032l86416K83738n1599J78657
$$ -1212593 -865845 567201 583151 1191431 853931 496899 110483 394221 342622 521279
2408E21279L41170R16343j382923n55145o73213J562585K69017P7704j701748
$$ 521279 862449 1778792 395869 -159276 -832489 730096 999113 1076817 -624931
2399f24931L84786O4461o54524j15828N89657N33321k94267K79852L24797P69669
$$ -624931 -240145 -175684 -830208 -946036 -356379 176942 -117325 162527 487324 1256993
2389A256993k4592p68704p01058J241377J19551k369916j84335J568218m66615
$$ 1256993 1232401 463697 -237361 1004016 1123567 -1246349 -1430684 137534 -329081
2380c29081k61038r88422M53256R71468N64464j036052n25193J933863m81608
$$ -329081 -590119 -1578541 -1125285 -153817 410647 -625405 -1150598 783265 301657
2371C01657N90342m83034j355745J272792n74396j692323N97294Q59989M95152
$$ 301657 891999 408965 -946780 326012 -248384 -1940707 -1343413 -483424 11728
2362A1728o72164j40097o73993k6676O30754j00437J897971j402033p34217j013851
$$ 11728 -660436 -800533 -1474526 -1501202 -870448 -970885 927086 -474947 -1209164 -2223015
2352b223015J52582J025712J528794K71797J83239j735520l20458N86369q74025
$$ -2223015 -2070433 -1044721 484073 755870 939109 -796411 -1116869 -530500 -1404525
2343a404525J710696J094770o86629n61359j195081M68381Q89543j85710Q57646
$$ -1404525 306171 1400941 714312 152953 -1042128 -573747 315796 130086 987732
2334I87732O59388j199640j022105J688495q05871R01490j714600p8707j50619
$$ 987732 1647120 447480 -574625 1113870 307999 1209489 -505111 -583818 -734437
2325g34437m79083J078157o26045J360465O54066n64732r74141R27256n26959
$$ -734437 -1213520 -135363 -761408 599057 1253123 688391 -285750 641506 114547
2316A14547j263220r3283R29460n48720K54833m76488n05746l08596R93182J486351
$$ 114547 -1148673 -1241956 -312496 -861216 -606383 -1082871 -1588617 -1897213 -904031 582320
2306E82320j302972P27327l84518r91379o14651L63682J073439j83008P50041
$$ 582320 -720652 6675 -377843 -1369222 -1983873 -1620191 -546752 -729760 20281
2297B0281N43507k81844k56447j083220l11626n00240P98354O01711l74940j444351
$$ 20281 563788 281944 25497 -1057723 -1369349 -1869589 -1071235 -469524 -844464 -2288815
2287b288815N61956J082899N04016m8445q10318L78061p24222k91678J852678
$$ -2288815 -1726859 -643960 -139944 -188389 -998707 -620646 -1344868 -1636546 216132
2278B16132Q77272j692674M18799j540822P47265M86082n37336J967684O45894
$$ 216132 1093404 -599270 -180471 -1721293 -974028 -487946 -1025282 942402 1588296
2269A588296N16345j841030Q84859k70527Q47412r26451j24040J505553k46989
$$ 1588296 2104641 263611 1148470 877943 1725355 798904 674864 2180417 1933428
2260A933428N49363o00774P05914L89929j684831o83049o44888L16712m75638
$$ 1933428 2482791 1882017 2587931 2977860 1293029 609980 -34908 281804 -193834
2251a93834j197969J351712o37161J877721j160777j012412J211820Q1395R79237
$$ -193834 -1391803 -40091 -677252 1200469 39692 -972720 239100 320495 1299732
2242A299732j154508R14669j159075j212628l63458O71920J019361L08386M87902
$$ 1299732 145224 1059893 -99182 -1311810 -1675268 -1003348 16013 324399 812301
2233H12301P41747j272759o36761n74139k6192K66545k45695L05550m86626J37811
$$ 812301 1554048 281289 -355472 -929611 -955803 -689258 -934953 -629403 -1116029 -978218
2223i78218J055435o55264k19925l50683M19477J222160r45101j372434k74778
$$ -978218 77217 -578047 -797972 -1148655 -729178 492982 -452119 -1824553 -2099331
2214b099331M84149K10880J971919p29264P77187k38312M5400J252115l89940
$$ -2099331 -1615182 -1404302 567617 -161647 615540 377228 422628 1674743 1284803
2205A284803j425663l49122n29214M46844j360866N73490l6398q4927R07617O24059
$$ 1284803 -140860 -489982 -1019196 -572352 -1933218 -1359728 -1396126 -1481053 -573436 50623
2195E0623j270552q96470J130781J02807R89766R70350Q29868p2094k910976J142583
$$ 50623 -1219929 -2116399 -985618 -882811 106955 1077305 1907173 1835079 -1075897 66686
2185F6686O88557K7600n27516J6839N06722q61068j22891l9367J888078O26019
$$ 66686 755243 782843 255327 272166 778888 -82180 -205071 -244438 1643640 2269659
2175B269659j455672K27912p55526O10162j0604j392717J490550J131867k30861
$$ 2269659 813987 1041899 286373 896535 885931 -506786 983764 2115631 1884770
2166A884770o04177j81564J365417l33332l30009r20464J30962Q15851p78780
$$ 1884770 1280593 1099029 2464446 2131114 1801105 880641 1011603 1827454 1048674
2157A048674J102904k148659O15925j81163q44129J192061M67499K13965j21713
$$ 1048674 2151578 2919 618844 437681 -406448 785613 1253112 1467077 1345364
2148A345364J16738J121584P6390k344063m86691J09785Q42824n05747j455455
$$ 1345364 1462102 2583686 2660076 316013 -170678 -60893 781931 276184 -1179271
2139a179271M50857J558382J27740j229121J599604o29659R6593K13883j165833
$$ -1179271 -728414 829968 957708 -271413 1328191 698532 795125 1009008 -156825
2130a56825j613026J471879l69525M34255j167790J28959L19801O5178k50066
$$ -156825 -1769851 -297972 -667497 -233242 -1401032 -1272073 -952272 -887094 -1137160
2121a137160K72479p1649k96357K94721J60655L80579m8419j323185r27717J659468
$$ -1137160 -864681 -936330 -1232687 -937966 -777311 -396732 -445151 -1768336 -2696053 -1036585
2111a036585J250762P1750k70638J680593O53086k101493k58230K81015M22388
$$ -1036585 214177 285927 15289 1695882 2348968 247475 -10755 270260 692648
2102F92648j318556j027124q1861J217136q40156L22037K5898o41893J555455
$$ 692648 -625908 -1653032 -1734893 -517757 -1357913 -1035876 -1009978 -1651871 -96416
2093i6416k83358j232012J033400Q29268K84841j662931l10209K548804L70659
$$ -96416 -379774 -1611786 -578386 250882 535723 -1127208 -1437417 1111387 1482046
2084A482046j118423o41809J794604k31254P05651j521984k56579J182174l88477
$$ 1482046 363623 -278186 1516418 1285164 1990815 468831 212252 1394426 1005949
2075A005949m90006j150728P71209Q19576j168018j552675M74841L401272o51156
$$ 1005949 515943 -634785 136424 956000 -212018 -1764693 -1289852 2111420 1460264
2066A460264q8289j734899R63137p67723j887754K056436K689262N32541j928968
$$ 1460264 1371975 -362924 600213 -167510 -2055264 1172 2690434 3222975 1294007
2057A294007k136207k23533J371637P71515K70773J33829Q40025j342771j776623
$$ 1294007 -842200 -1065733 305904 1077419 1348192 1482021 2322046 979275 -797348
2048g97348r08746J46950K271779q37011l73147j090883L58326Q39322r10358
$$ -797348 -1706094 -1559144 712635 -124376 -497523 -1588406 -1230080 -390758 -1301116
2039a301116Q41797K015325K05208j526185j125459J178469m0651P85064o00992
$$ -1301116 -459319 1556006 1761214 235029 -890430 288039 247388 1032452 431460
2030D31460j004629j91095J53288r59144l63182J619884L60813j312988j00112
$$ 431460 -573169 -764264 -610976 -1570120 -1933302 -313418 47395 -1265593 -1365705
2021a365705J017362O91730q15803q01854R63809J621504l75534j573707R3876
$$ -1365705 -348343 343387 -472416 -1274270 -310461 1311043 935509 -638198 -544322
2012e44322K86347R08968m74111L8597J678462p91617m95034o61018L48161K75165
$$ -544322 -257975 650993 176882 215479 1893941 1102324 607290 -53728 294433 569598
2002E69598l37869J46923j48719J006585j261087j53396m24180M50177K14154
$$ 569598 231729 378652 229933 1236518 -24569 -177965 -602145 -151968 62186
1993F2186l86044J146561M64086j563458p58969m21542J248943J62519N08576
$$ 62186 -323858 822703 1286789 -276669 -1035638 -1457180 -208237 -45718 462858
1984D62858p4891o64884N86179l47220r63503J256846M66780O37810j623304j85348
$$ 462858 387967 -276917 309262 -37958 -1001461 255385 722165 1359975 -263329 -448677
1974d48677N62181J467242Q6341m24790P47462o50723l15785j028500r36496J877203
$$ -448677 113504 1580746 1667087 1242297 1989759 1339036 1023251 -5249 -941745 935458
1964I35458P95009k483632o51001J248493J19257j184019M01438J736780N63947
$$ 935458 1730467 -753165 -1404166 -155673 -36416 -1220435 -818997 917783 1481730
1955A481730q09746k486074P29052P68248l9310K64279n70715l77953O82060k48442
$$ 1481730 671984 -1814090 -1085038 -316790 -356100 -91821 -662536 -1040489 -358429 -606871
1945f06871k14571m61321J541344L74016o63042N35281l70116l46971K71979J222144
$$ -606871 -821442 -1282763 258581 632597 -30445 504836 134720 -212251 59728 1281872
1935A281872Q18773p53600k197839R9791N32164N30626m04606K2905O25519N40552
$$ 1281872 2100645 1347045 -850794 -751003 -218839 311787 -92819 -69914 555605 1096157
1925A096157o58192m9383k75235J053530o05744j067693l75913p07181J137766
$$ 1096157 437965 388582 113347 1166877 561133 -506560 -882473 -1589654 -451888
1916d51888K86211J451140J244684N2321k019589j503778J266975J345102L1676
$$ -451888 -165677 1285463 2530147 2582468 562879 -940899 326076 1671178 1702854
1907A702854M63132j37838j295172j02080L25238M33129J11460L69146k293891
$$ 1702854 2165986 2028148 732976 630896 956134 1389263 1500723 1869869 -424022
1898d24022n40025n19010O69751J451186J158597k87895j416562r23946j15569
$$ -424022 -964047 -1483057 -813306 637880 1796477 1508582 92020 -831926 -947495
1889i47495j68729M44879O68168M51830j483090m55971J397368j30691Q93830
$$ -947495 -1116224 -671345 -3177 448653 -1034437 -1490408 -93040 -223731 670099
1880F70099p37694O45221M69264j873356m86081J716622J359163p86052p73869
$$ 670099 -67595 577626 1046890 -826466 -1312547 404075 1763238 977186 203317
1871B03317r86068n66019m0092k28599M55076J206400m92978R71633n31658M55855
$$ 203317 -782751 -1348770 -1388862 -1617461 -1162385 44015 -448963 522670 -8988 446867
1861D46867j170560K73695k61507n84243J401189k24621R5495n53416k77939l90531
$$ 446867 -723693 -449998 -711505 -1295748 105441 -119180 -23685 -577101 -855040 -1245571
1851a245571J04296r0546Q18785R33917O00891j094601j146604r69971J371926
$$ -1245571 -1141275 -1231821 -413036 520881 1121772 27171 -1119433 -2089404 -717478
1842g17478Q30684r17997o47615k34408k41326k41500j64019K789941J225049
$$ -717478 113206 -804791 -1452406 -1686814 -1928140 -2169640 -2333659 456282 1681331
1833A681331l09065p20268j044107p13368J004996J426096K48185p34962j520766
$$ 1681331 1372266 651998 -392109 -1105477 -100481 1325615 1573800 838838 -681928
1824f81928N75983j151605L12905K444800P09047j051950j079212l45290j137213
$$ -681928 -105945 -1257550 -944645 1500155 2209202 1157252 78040 -267250 -1404463
1815a404463J287420J962864Q26740j40612j910918j248240R795p03508J167138
$$ -1404463 -117043 1845821 2672561 2531949 621031 -627209 -617414 -1320922 -153784
1806a53784j57317N70832O5983o14790m62329r69807J593681M59132l8192k810522
$$ -153784 -311101 259731 325714 -289076 -751405 -1721212 -127531 331601 293409 -2517113
1796b517113M24084K08793N20426R31839r32360J305985P59165j307016j472639
$$ -2517113 -2093029 -1884236 -1363810 -431971 -1364331 -58346 700819 -606197 -2078836
1787b078836J474904J240000N29679j050407n99263r874j68133n08495j92919
$$ -2078836 -603932 636068 1165747 115340 -483923 -493797 -661930 -1170425 -1363344
1778a363344O54855j8224j62898o10160J122921R16357k15842m37819M84179m1560
$$ -1363344 -708489 -726713 -889611 -1499771 -376850 539507 323665 -114154 370025 328465
1768C28465q72141k54371m37147o6980K032435P94131j162182o85450N46398o63323
$$ 328465 -543676 -798047 -1235194 -1302174 730261 1524392 362210 -323240 223158 -440165
1758d40165j240338J448438R45229l73892p69595O15674P47148O68611m81353
$$ -440165 -1680503 -232065 713164 339272 -430323 185351 932499 1601110 1119757
1749A119757Q6076o04646o18653J195190j823612P7920R88388P0853m97324q77401
$$ 1119757 1205833 601187 -17466 1177724 -645888 -567968 420420 491273 -6051 -883452
1739h83452M56639P17005k82622J83189L360222j884700j941999P40686j013573
$$ -883452 -426813 290192 7570 190759 3550981 1666281 -275718 464968 -548605
1730e48605J7298N65740k94019J305j049816n04789L23167j4421P15908o19580
$$ -548605 -531307 34433 -259586 -258281 -1308097 -1812886 -1489719 -1504140 -788232 -1407812
1720a407812J016669o3976L35991O12992q16227m03204j229746J284963J9230
$$ -1407812 -391143 -455119 -119128 493864 -322363 -725567 -1955313 -670350 -651120
1711f51120n64521J275220O55569p46373N0841m09119L21327j23725j21528k38819
$$ -651120 -1215641 59579 715148 -31225 19616 -389503 -68176 -191901 -313429 -552248
1701e52248K37806m85527l59451l46636m04398J515854J10844k73571K3066m66985
$$ -552248 -314442 -799969 -1159420 -1506056 -1910454 -394600 -283756 -557327 -534261 -1001246
1691a001246J128914J630326j292887R00309j132134j348383K54060N22551k27923
$$ -1001246 127668 1757994 465107 1365416 233282 -1115101 -861041 -338490 -566413
1682e66413J255147m10039j786272J159326j097194p4491K148927J052484o38945
$$ -566413 688734 278695 -1507577 -348251 -1445445 -1519936 628991 1681475 1042530
1673A042530k396890k12063O76036J077362R03376M38143L30116q78919o77575
$$ 1042530 -1354360 -1566423 -890387 186975 1090351 1528494 1858610 979691 302116
1664C02116m46353k5980O13550m87517K1778N9890J54108n00280J47806j060303
$$ 302116 -144237 -170217 443333 -44184 -22406 37484 191592 -308688 -160882 -1221185
1654a221185o88741J119465o96150J1813O0746J396791p83616N64054O23354r26589
$$ -1221185 -1909926 -790461 -1486611 -1474798 -1414052 -17261 -800877 -236823 386531 -540058
1644e40058r79457k67292N70927n11856K96926J28351j41029k74176J574096l6777
$$ -540058 -1519515 -1786807 -1215880 -1727736 -1430810 -1302459 -1443488 -1717664 -143568 -180345
1634a80345p16020j015149P09103M3068n79064N02993Q27058K0994j315014j402527
$$ -180345 -896365 -1911514 -1202411 -1159343 -1738407 -1235414 -408356 -387362 -1702376 -3104903
1624c104903J023616J189420j843570R21558K38546M3341q74145j081034J917298
$$ -3104903 -2081287 -891867 -2735437 -1813879 -1575333 -1531992 -2406137 -3487171 -1569873
1615a569873Q07137N24706N22954q77622n28857J672007p98831q95562K63517
$$ -1569873 -762736 -238030 284924 -592698 -1121555 550452 -248379 -1143941 -880424
1606h80424P49246m66280o32210M40736J299047l95017l02016J72188N7163r3618
$$ -880424 -131178 -597458 -1229668 -788932 510115 115098 -186918 -14730 42433 -51185
1596e1185j018781O54388M78275Q31912o48122L48784j125554L05659L36397J129788
$$ -51185 -1069966 -415578 62697 894609 246487 595271 -530283 -224624 111773 1241561
1586A241561l61975L57346J132714o01039o23152j165542J109827K99323N11228
$$ 1241561 879586 1236932 2369646 1768607 1145455 -20087 1089740 1389063 1900291
1577A900291P52216k046680r30445j157170Q32767J338689k0473k85763J30617
$$ 1900291 2652507 605827 -324618 -1481788 -649021 689668 669195 383432 514049
1568E14049r55717r23045k92502o96747J432990P68743j243923M05224j560735
$$ 514049 -441668 -1364713 -1657215 -2353962 -920972 -152229 -1396152 -990928 -2551663
1559b551663L54717J037006M52717J30774l13505K92084k532117J92378j96701
$$ -2551663 -2196946 -1159940 -707223 -576449 -889954 -597870 -3129987 -2937609 -3134310
1550c134310J837772J022057j519330j78203j301963P1435N90909J283116J069235
$$ -3134310 -1296538 -274481 -1793811 -1972014 -3273977 -3202542 -2611633 -1328517 -259282
1541b59282j67517l6212j102601o21780k60158L86465J200585J456716r5607L2692
$$ -259282 -426799 -463011 -1565612 -2187392 -2447550 -2061085 -860500 596216 500609 533301
1531E33301p65160j13665j066437Q22216J028608j376569J626474r93505r0638
$$ 533301 -231859 -345524 -1411961 -589745 438863 -937706 688768 -304737 -395375
1522c95375j086234n83204K804630J33400k037822O63084J171892n23985p34945
$$ -395375 -1481609 -2064813 739817 873217 -1164605 -501521 670371 146386 -588559
1513e88559J011582l56146L37733L00490j308643J301251k003774K72253K16755
$$ -588559 423023 66877 404610 705100 -603543 697708 -1306066 -1033813 -817058
1504h17058L60658J266848m54251p06793K9036N41229L40269L72385J93718j503572
$$ -817058 -456400 810448 356197 -350596 -321560 219669 559938 932323 1126041 -377531
1494c77531N91568l13822j524376P43324m46485K299552L02037j349959q42396
$$ -377531 214037 -99785 -1624161 -880837 -1327322 972230 1274267 -75692 -918088
1485i18088m20345L4100M47009m09081j65393J902011p99199m27023j790977J114786
$$ -918088 -1338433 -1304333 -857324 -1266405 -1431798 470213 -328986 -756009 -2546986 -1432200
1475a432200J898878k01120k570450k50245J34671P64350P68492Q9833M61775
$$ -1432200 466678 265558 -2304892 -2555137 -2420466 -1656116 -887624 -797791 -336016
1466c36016o3753k10707q03054n28379N6530J213754j34390n37933n66976O77096
$$ -336016 -399769 -610476 -1413530 -1941909 -1885379 -671625 -806015 -1343948 -1910924 -1233828
$$ [...]
##END NTUPLES=NMR SPECTRUM
##END=
