##TITLE=1H_TG-2241
 CDCl3, 8 sc, 
 2.4.2019
##JCAMPDX= 6.0         $$ Bruker NMR JCAMP-DX V2.0
##DATA TYPE= NMR FID
##DATA CLASS= NTUPLES
##ORIGIN= UXNMR, Bruker Analytische Messtechnik GmbH
##OWNER= root
$$ XWIN-NMR		Version 3.5
$$ Wed Apr  3 14:14:50 2019 Russian Standard Time (UT+4h)  she@DPX200
##.OBSERVE FREQUENCY= 200.1316
##.OBSERVE NUCLEUS= ^1H
##.DELAY= (6, 6)
##.ACQUISITION MODE= SIMULTANEOUS
##.ACQUISITION SCHEME= undefined
##.AVERAGES= 8
##.DIGITISER RES= 18
##SPECTROMETER/DATA SYSTEM= spect
##.PULSE SEQUENCE= zg30
##.SOLVENT NAME= DMSO
##.SHIFT REFERENCE= (INTERNAL, DMSO, 0, 15.7039)
##AUDIT TRAIL= $$ (NUMBER, WHEN, WHO, WHERE, WHAT)
$$ ##TITLE= Audit trail, XWIN-NMR		Version 3.5
$$ ##JCAMPDX= 5.01
$$ ##ORIGIN= Bruker BioSpin GmbH
$$ ##OWNER= she
$$ F:/spectra/data/she/nmr/H-F/1/audita.txt
$$ ##AUDIT TRAIL=  $$ (NUMBER, WHEN, WHO, WHERE, WHAT)
(   1,<2019-04-03 14:11:54.42 +0400>,<she>,<DPX200>,
      <created by zg, POWCHK disabled, PULCHK disabled
       configuration hash MD5:
       00 E9 B6 7A A2 85 ED C7 34 08 36 98 17 FE 4E 26
       data hash MD5: 16K
       66 4E 6F C5 5D 28 AC 4C 33 DC D5 9D 3E B0 83 E8>)
$$ ##END=
$$ 
$$ hash MD5
$$ 6F 78 5E 1F 4E A8 9F ED 32 31 B1 32 86 8C 4C 86
##$RELAX= 
##$RELAX= 
##$RELAX= 
##$RELAX= 
##$RELAX= 
##$RELAX= 
$$ Bruker specific parameters
$$ --------------------------
##$DU= <F:/spectra>
##$EXPNO= 1
##$NAME= <H-F>
##$PROCNO= 1
##$TYPE= <nmr>
##$USER= <she>
##$AMP= (0..31)
100 100 100 100 100 100 100 100 100 100 100 100 100 100 100 100 100 100 
100 100 100 100 100 100 100 100 100 100 100 100 100 100 
##$AQSEQ= 0
##$AQ_mod= 1
##$AUNM= <au_zg>
##$AUTOPOS= <>
##$BF1= 200.13
##$BF2= 200.13
##$BF3= 200.13
##$BF4= 200.13
##$BF5= 200.13
##$BF6= 200.13
##$BF7= 200.13
##$BF8= 200.13
##$BYTORDA= 1
##$CFDGTYP= 0
##$CFRGTYP= 5
##$CHEMSTR= <none>
##$CNST= (0..31)
1 1 145 1 1 1 1 1 1 1 1 1 1 1 1 1 1 1 1 1 1 1 1 1 1 1 1 1 1 1 1 1 
##$CPDPRG= <>
##$CPDPRG1= <>
##$CPDPRG2= <>
##$CPDPRG3= <>
##$CPDPRG4= <mlev>
##$CPDPRG5= <mlev>
##$CPDPRG6= <mlev>
##$CPDPRG7= <mlev>
##$CPDPRG8= <mlev>
##$CPDPRGB= <>
##$CPDPRGT= <>
##$D= (0..31)
0 1.2 0 0 0 0 0 0 0 0 0 0.03 0 0 0 0 0 0 0 0 0 0 0 0 0 0 0 0 0 0 0 0 
##$DATE= 1554286313
##$DBL= (0..7)
120 120 120 120 120 120 120 120 
##$DBP= (0..7)
150 150 150 150 150 150 150 150 
##$DBP07= 0
##$DBPNAM0= <>
##$DBPNAM1= <>
##$DBPNAM2= <>
##$DBPNAM3= <>
##$DBPNAM4= <>
##$DBPNAM5= <>
##$DBPNAM6= <>
##$DBPNAM7= <>
##$DBPOAL= (0..7)
0.5 0.5 0.5 0.5 0.5 0.5 0.5 0.5 
##$DBPOFFS= (0..7)
0 0 0 0 0 0 0 0 
##$DE= 6
##$DECBNUC= <off>
##$DECIM= 24
##$DECNUC= <off>
##$DECSTAT= 4
##$DIGMOD= 1
##$DIGTYP= 9
##$DL= (0..7)
0 120 120 120 120 120 120 120 
##$DP= (0..7)
150 150 150 150 150 150 150 150 
##$DP07= 0
##$DPNAME0= <>
##$DPNAME1= <>
##$DPNAME2= <>
##$DPNAME3= <>
##$DPNAME4= <>
##$DPNAME5= <>
##$DPNAME6= <>
##$DPNAME7= <>
##$DPOAL= (0..7)
0.5 0.5 0.5 0.5 0.5 0.5 0.5 0.5 
##$DPOFFS= (0..7)
0 0 0 0 0 0 0 0 
##$DQDMODE= 0
##$DR= 18
##$DS= 0
##$DSLIST= <SSSSSSSSSSSSSSS>
##$DSPFIRM= 0
$$ [...]
##$SUBNAM2= <"">
##$SUBNAM3= <"">
##$SUBNAM4= <"">
##$SUBNAM5= <"">
##$SUBNAM6= <"">
##$SUBNAM7= <"">
##$SUBNAM8= <"">
##$SUBNAM9= <"">
##$SW= 24.9336934301222
##$SWIBOX= (0..15)
0 0 2 0 0 0 0 0 0 0 0 0 0 0 0 0 
##$SW_h= 4990.01996007984
##$TD= 16384
##$TD0= 1
##$TE= 0
##$TE2= 300
##$TE3= 300
##$TEG= 300
##$TL= (0..7)
0 120 120 120 120 120 120 120 
##$TP= (0..7)
150 150 150 150 150 150 150 150 
##$TP07= 0
##$TPNAME0= <>
##$TPNAME1= <>
##$TPNAME2= <>
##$TPNAME3= <>
##$TPNAME4= <>
##$TPNAME5= <>
##$TPNAME6= <>
##$TPNAME7= <>
##$TPOAL= (0..7)
0.5 0.5 0.5 0.5 0.5 0.5 0.5 0.5 
##$TPOFFS= (0..7)
0 0 0 0 0 0 0 0 
##$TUNHIN= 0
##$TUNHOUT= 0
##$TUNXOUT= 0
##$USERA1= <user>
##$USERA2= <user>
##$USERA3= <user>
##$USERA4= <user>
##$USERA5= <user>
##$V9= 5
##$VALIST= <valist>
##$VCLIST= <CCCCCCCCCCCCCCC>
##$VD= 0
##$VDLIST= <DDDDDDDDDDDDDDD>
##$VPLIST= <PPPPPPPPPPPPPPP>
##$VTLIST= <TTTTTTTTTTTTTTT>
##$WBST= 1024
##$WBSW= 4
##$XGAIN= (0..3)
0 0 0 0 
##$XL= 0
##$YL= 0
##$YMAX_a= 349515
##$YMIN_a= -275282
##$ZGOPTNS= <>
##$ZL1= 120
##$ZL2= 120
##$ZL3= 120
##$ZL4= 120
##$ABSF1= 10
##$ABSF2= 0
##$ABSG= 5
##$ABSL= 3
##$ALPHA= 0
##$AQORDER= 0
##$ASSFAC= 0
##$ASSFACI= 0
##$ASSFACX= 0
##$ASSWID= 0
##$AUNMP= <proc_1d>
##$AZFE= 0.1
##$AZFW= 0.1
##$BCFW= 1
##$BC_mod= 2
##$BYTORDP= 1
##$COROFFS= 0
##$CY= 11.3945322036743
##$DATMOD= 1
##$DC= 2
##$DFILT= <>
##$DTYPP= 0
##$F1P= 18.9103706918063
##$F2P= -1.10871071338519
##$FCOR= 0.5
##$FTSIZE= 0
##$FT_mod= 4
##$GAMMA= 1
##$GB= 0.15
##$INTBC= 1
##$INTSCL= 1
##$ISEN= 128
##$LB= 0.24
##$LEV0= 0
##$LPBIN= 0
##$MAXI= 10000
##$MC2= 0
##$MEAN= 0
##$ME_mod= 0
##$MI= 1.114404
##$NCOEF= 0
##$NC_proc= 0
##$NLEV= 6
##$NOISF1= 3.799351
##$NOISF2= 2.8
##$NSP= 1
##$NTH_PI= 0
##$NZP= 0
##$OFFSET= 15.70392
##$PC= 1
##$PHC0= -9017.853
##$PHC1= 22.80025
##$PH_mod= 1
##$PKNL= yes
##$PPARMOD= 0
##$PSCAL= 0
##$PSIGN= 0
##$REVERSE= no
##$SF= 200.130013532006
##$SI= 16384
##$SIGF1= 3
##$SIGF2= 2
##$SINO= 400
##$SIOLD= 16384
##$SREGLST= <1H.CDCl3>
##$SSB= 0
##$STSI= 0
##$STSR= 0
##$SW_p= 3612.71676300578
##$SYMM= 0
##$S_DEV= 0
##$TDeff= 0
##$TDoff= 0
##$TI= <>
##$TILT= no
##$TM1= 0
##$TM2= 0
##$TOPLEV= 0
##$USERP1= <user>
##$USERP2= <user>
##$USERP3= <user>
##$USERP4= <user>
##$USERP5= <user>
##$WDW= 1
##$XDIM= 8192
##$YMAX_p= 0
##$YMIN_p= 0
$$ End of Bruker specific parameters
$$ ---------------------------------
##NTUPLES= NMR FID
##VAR_NAME=  TIME,          FID/REAL,        FID/IMAG
##SYMBOL=    X,             R,               I
##VAR_TYPE=  INDEPENDENT,   DEPENDENT,       DEPENDENT
##VAR_FORM=  AFFN,          ASDF,            ASDF
##VAR_DIM=   8192,          8192,            8192
##UNITS=     SECONDS,       ARBITRARY UNITS, ARBITRARY UNITS
##FACTOR=    0.0002004,     1,               1
##FIRST=     0,             0,               0
##LAST=      1.6414764,     0,               0
##MIN=       0,             -275282,         0
##MAX=       1.6414764,     349515,          0
$$ Real data points
##PAGE= N=1
##DATA TABLE= (X++(R..R)), XYDATA
0@%%%%qJ6j6J6k4L2l2M0n6P2q8J04j28J59j83K16k56K96l44M00m64N31o03O88
28C68p84Q86r98J123j262J413j577J756j956K177k416K678k968L288l640M028
44B116m461M947n493O110o817P637q594R731j1118J2847j5066J8042k2264K8766
58A6383m0176O5913k20340K9892M76152k32389l20335J32293L00544j80638k48167
69b20868J55477K61727j62548k32028J31576K40590r3541j76879N1403R7911r2176
80c9356m1213J43311O1429j67304q1189J47712R2332j22241p4668Q3896K5365
91B8074q4385K9264J20567k7703j35558N769R5915k6862o4888Q5082P6205j26262
103b4782r5874J64889J27705j91519j76612J80327K06452j44075j88807J46700
$$ y = [0, 0, 0, 0, 0, -8, 8, -8, 8, -16, 16, -16, 24, -32, 40, -48, 56, -72, 87, -96, 120, -136, 160, -184, 216, -248, 283, -320, 368, -416, 470, -528, 595, -667, 746, -831, 925, -1031, 1146, -1270, 1408, -1560, 1728, -1912, 2116, -2345, 2602, -2891, 3219, -3598, 4039, -4555, 5176, -5942, 6905, -8161, 9881, -12383, 16383, -23793, 42120, -178220, -148328, 327824, 95435, -224900, -92607, 207937, 27299, -220868, -65391, 196336, 33788, -198240, -66664, 173926, 80385, -96494, -45091, 52820, -39356, -80569, 62742, 124171, -43133, -124322, 23390, 115722, -6519, -81187, 2709, 28074, -56311, -27047, 93520, 65817, -69741, -63972, 31943, 5081, -59807, 25275, 101480, -24782, -120656, 44233, 171938, -19581, -196193, -15866, 190586, 46511, -142296, 4404]
113D404J81926j67717k10019J59057K31785j29533k28009J03308K12403p8048
123G9557j85694N5200J40312o3994j16092P8434J14568p5582j08796O4485Q9485
134G1883o5108p8718N8404O4783m7403l8654N7505L0302o9164m2184N5508L8900
146C6054l5988j2150L6668p010l7382K4645L3723n5965n3392O9138P9808n7547
158B0602q3942N1020P4348o9068q4889P8804R8951q0221j11645P5000J26209n4048
170D1121j29843K3149J06285j5164q0373L3707Q2016m0393r0188L1286R0386j4194
182C7795q0431l743O0824J7451k6974k104J1811k5037k9431K3578M3888K096k8689
195A034j8496k95J4132K1184m06l4149k5146K5677M3632p14l2237m760J1613j9689
$$ y = [4404, 186330, 18613, -191406, -32349, 199436, 69903, -158106, -54798, 157605, 79557, -106137, -50937, 89375, 25381, -90711, -12277, 102291, 26709, -82087, -17602, 71883, 6775, -71943, -13539, 51244, 3841, -34813, 22692, 52994, -16170, -58354, -2846, 36054, 66, -12084, 24584, 17574, -19808, 4837, 38560, -17405, -70797, -1659, 78149, 20602, -63340, -12320, 62028, -7040, -91929, -13125, 85826, 5605, -106040, -31040, 95169, 41121, -88722, -65573, 40712, 25548, -54825, -21118, 60898, 20505, -69683, -38397, 51989, 37795, -42636, -46379, 14445, 31896, 4922, 2818, 14629, -10408, -39839, -16261, 27627, 29723, 1034, -17462, -17757, -3625, 17559, 17153, -16996, -42142, -16465, 27167, 26453, -5784, -10544, 1069, -18620]
209a8620j5384M4014M3126m0036o3213K2347P1940K613o1232j5828L9588N871
221A5186k8079J9267M5988k2340o8524l103O5977K7078m7010l5914K6731K9984
233B5241j5900j7869J6073P366l1499k2067L2795M8794n994n6205k5919L8670
245f514L7436j8003l3078P054K6374k278j9624R605K7707j2683m6661m136N2870
258A8069L0985l4758m2939J1250L8333J45l2700m453K5815j241k7914O031L8522
271B5145P26m9610k2818M1543L5485k7712l3667K2680K9609k3452k9117K4911
283f277L2340k6017m1806K4321N9174p318o4016r623N7425J7518n0275k0652M7946
296A2740K7731m4321l4472M1564M1574m0717n4527K8474O0548r909n5471n273
$$ y = [-18620, -34004, 10010, 53136, 13100, -50113, -27766, 44174, 46787, -14445, -30273, 9315, 15186, -12893, 6374, 52362, 30022, -38502, -41605, 24372, 51450, 4440, -31474, -4743, 25241, 9341, -8528, 7545, 14911, -16588, -38655, -5860, 42934, 36940, -19265, -45184, -6514, 30922, 12919, -20159, -13105, 13269, 10991, -8633, 972, 28679, 15996, -30665, -34801, 18069, 49054, 14296, -28643, -17393, 20940, 21085, -11615, -16068, 9747, 8506, -19408, -13377, 25145, 25871, -23739, -46557, -5014, 30471, 2759, -30908, -8228, 21381, -2071, -31188, -6277, 26063, 46, -41760, -17439, 41735, 34417, -29599, -39222, 18203, 35721, -14554, -35206, 12740, 40471, -3850, -38322, 3242, 44816, 4099, -50428, -21954, 38594, 28685, -26786, -32059]
308c2059M4395J2062l7289j7628L0268J9582k4547j9413K3829K6928j7390l7348
320b8610K717M2182J5123l5116k1363K9837K3412k5654k2786K5790K4173l0567
332h62l2040L5474M8825k9374o2034J2842N9736k812n3611j508M9952K338n3069
345b6143n769N9231J3484o6263l0680O0425M7168m0595m9131K3117M2150j6002
357A0992l5847J7022L7637j5390m1386Q921M5779P432m0346k5786K2852L2449
369B4329m681k6097k070J8366j686k1911N80K9954O016l9953k2013M2207L8773
382D1814l4283m8223K0185M3144j5382l6659K0777M1616k3591n2861J9368O4243
394D0148o750o6300p889N9291J9357m4334j8687L6692J4651l9410j7993M2909
$$ y = [-32059, 12336, 24398, -12891, -30519, -251, 19331, -5216, -24629, -800, 26128, 8738, -28610, -25893, 16289, 31412, -3704, -25067, 4770, 28182, 2528, -20258, 5532, 29705, -862, -32902, 2572, 51397, 22023, -40011, -27169, 32567, 29755, -23856, -25364, 24588, 26926, -26143, -31912, 27319, 40803, -25460, -56140, 4285, 51453, 10858, -38273, -15156, 26994, 10992, -24855, -7833, 29804, 14414, -26972, -18051, 27728, 35160, -5186, -30972, -8120, 24329, 19648, -6449, -8519, 9847, 8161, -13750, -13170, 16784, 22800, -17153, -39166, 3041, 41814, 7531, -40692, -20507, 22637, 7255, -29404, -8627, 32989, 9398, -43463, -24095, 40148, 33398, -32902, -40791, 18500, 37857, -6477, -25164, 11528, 26179, -13231, -31224, 11685]
406A1685K8279l8188l8162K4229L9879q916l5517m395K4425P077j7377m359J7769
419F429N272k1107j5458J6925K7013m659l2429p126L3511J7763k8400k1505K4279
432E08K1970k4062k2719K9653L2481l0265m3302K5042M9676j7483n1123R241M7987
445B7604l610m4284N06M2190j00m6034n697M6621J3818m2034k1098L2554K4394
458B4830k2787k5187J4893K4123r254k1176Q228K2282m195k3374l560K2293J4269
471B1385j5835k0902Q965K4701j494k4647n160K1485P462k2047j0173K5879J5620
484B5239l0598k5810K8417L2715k3678l7931J5693L8540r179l6746O622L6332
496A9616p278l9462N740M4433K375m3122j1095L7688J8680k8611k0608K2008J9821
$$ y = [11685, 39964, 1776, -36386, -12157, 27722, 18806, -16711, -21106, 3319, 10396, -6981, -11340, 6429, 11701, -9406, -24864, -7939, 19074, 14415, -18014, -25140, 8371, 26134, -2266, -23771, 508, 22478, -1584, -24303, 5350, 37831, 7566, -35736, -10694, 38982, 21499, -29624, -20383, 27604, 23994, -20290, -19784, 22406, 22306, -23728, -29425, 17196, 31014, -11020, -32118, 436, 24830, 2043, -23144, -8251, 15872, 6618, -14558, -6330, 15952, 11757, -11617, -15177, 7116, 21385, 5550, -15352, -6387, 18314, 16820, -7827, -12987, 8498, 15960, -6087, -16260, 9619, 25239, -5359, -31169, -2752, 29963, 6285, -31646, -15953, 22587, 13408, -23338, -16716, 19616, 12338, -27124, -21384, 23049, 25424, -17698, -28793, 8895, 27575, -1036, -21644, 364, 20185]
509B0185j8534j7798J8730J9886j6836k5937P753K8424L655k5724j3101J8201
521a096J5435j2544j5097Q036J3659q328j7447P435K5641q35l1481r822L0422
534C978J9443k2935k2715J7140K4012j3570k3610J5574K8028j6553l4754J2928
546a3034M1170k812m1006p510L5090J2218k9952j3039K7246J1919k8694j4642
558b3046K8241K0037k4970k7650J5126L0107m945k6931m55K2336J644j9724k104
571a2334K0466O450k0253j2648J9208K1468j2495k5261M524K4253J873k0361m667
584i777J8943O655k0472j1035K1773J6423k2137k4024J6828K8490r489l0642J865
597a6599K8862R97k8868k472L0309M801l1531r289L1481J5791k7710k1529K2555
$$ y = [20185, 1651, -16147, 2583, 22469, 5633, -20304, -12551, 15873, 19528, -6196, -19297, -1096, 14339, 1795, -13302, -5266, 8393, 65, -17382, -9947, 15694, 14859, -16622, -26444, 3978, 23421, 486, -22229, -5089, 18923, 5353, -18257, -2683, 25345, 8792, -25962, -13034, 28136, 25324, -15682, -23192, 11898, 24116, -5836, -18875, 8371, 20290, -8404, -23046, 5195, 25232, 262, -27388, -12262, 17845, 12900, -14031, -14486, 7850, 9494, -10230, -12334, 8132, 14582, -5671, -18319, 889, 22357, 9862, -15399, -10875, 13378, 15251, -5110, -9777, 9166, 15821, -4651, -15686, 6087, 22510, 373, -23651, -6823, 21667, 12178, -18464, -16599, 12263, 13260, -15608, -18080, 12229, 17030, -14501, -23790, 7691, 23482, -4228, -25757, -3202]
610c202K5555j5631k4484J2453K3613r909k3432P040K4809j915k5804m597K5245
623I741J0833k2396j6241J6087J6902j1361j7574P426J8021n197k0930J377K3033
636I721L107k3935r114K1975J5579j6496j9332J1791K1451q099k1688P386K4300
649A6646m668k6131P76K8313O065k8377j2913K5771J7579k1633j8880J7969J7932
662A8449j6986j9791J4373K2524j1247k6520N036K7778J170k6056o771K1128R333
675A2420j6777j0120J5789J2820j5065j6695J3895K1873q534k3451K052K3009
687A1216N101j9330q720J6409J0117j5707j1823J6091J5221j5127k0608R622K3913
700A6375l452k5708l422K3676O559k1584p881J9996Q853k0581j2664K0217J8519
$$ y = [-3202, 22353, 6722, -17762, -5309, 18304, 8395, -15037, -7997, 16812, 14897, -10907, -15504, 9741, 20574, -1822, -18063, -1976, 14926, 3565, -14009, -6583, 11438, 6241, -14689, -13312, 9721, 12828, -11107, -20221, 1754, 17333, 837, -18495, -6704, 14747, 6648, -15040, -7654, 16646, 11978, -14153, -13377, 14936, 21001, -7376, -20289, 5482, 23061, 1428, -17452, 517, 18449, 1463, -18328, -3955, 18569, 7322, -19198, -14162, 13616, 14786, -11270, -18041, 3087, 12420, -4357, -14477, 1312, 14132, -933, -17628, -3733, 18140, 9606, -13845, -11793, 11216, 16317, -3013, -11733, 4676, 14793, -914, -12737, 3354, 18575, 3448, -17160, -7538, 16375, 12923, -12785, -16207, 7469, 14028, -7556, -15437, 4559, 13412, -7169, -19833, 384, 18903]
713A8903j6635k2899J2155K4846o286k2781K836K0883j12j9413j448K0810N547
726A6406k1551j0902J9665J5517j5155j8226R030J7910n013j8015J966J7780j130
739H282j9751j968K0462O475j9375j2192J5250J6227j0432j7831P221J8629m559
752F438j8263L330J9881O6k1020m267K1885J0491j9924j4314J6946J6333j3491
765D091j7169J0355J7497q307j9462N269K1182k147k3316k888K1822O777j9191
778e487j0399J5582J2413j2761j4147J0880J6175q903j7586O558J9751j633j9369
791h926l179J8462P987j5890j0040J4115J1885j2247j3065J0349J4785p993j7839
804a1596L768J9579M42k0255m975J8086P008j6272r384J3977J0968j2911j3839
$$ y = [18903, 2268, -20631, -8476, 16370, 10084, -12697, -9861, 11022, 10910, -8503, -9951, 10859, 16406, -5145, -16047, 3618, 19135, 3980, -14246, -5216, 12694, 7681, -10334, -8368, 9412, 8282, -11469, -13437, 7025, 13500, -5875, -18067, -2817, 13410, 2978, -14853, -7632, 10997, 6438, -11825, -8495, 11386, 11452, -9568, -13835, 8050, 18541, -1383, -15697, 1249, 17582, 4091, -13078, -2723, 14774, 6467, -12995, -7726, 13456, 11309, -12007, -14895, 6927, 13704, -5487, -15886, -304, 12109, -652, -14799, -3919, 12256, 3353, -14233, -7675, 12076, 10443, -8926, -12105, 6357, 14344, -1546, -11586, 2529, 14414, 2167, -10898, -549, 14236, 6243, -11596, -7828, 11751, 12193, -8062, -13037, 5049, 12057, -4215, -13599, 378, 11346, -1565, -15404]
817a5404J1765J7042r295j9492N563K0492m61j8702k912J7383O120j5834p591
830a1326J5924J0139j5084j2720J3139J5866r067j8082L929J7798k69j7244k482
843i479J5966L495j5917o279J4964R224j3908j3740J0808J6635o981j7394L613
856h993J6798j000j5463o74J5872L811j5968o693J6379J1052j4059j3701J0666
869a973J5234o597j5175L537J5283j908j6451l10J7186K711j7685o975J5589J0181
883A2647j3010j3083R233J3898p076j4397N729J5045l868j5766J038J6567L511
896A0468j5620p156J4341J0649j1534j1359R623J2190p492j3058N760J4940l127
909H625j6726l47J6945L348j6283o609J3609Q055j1499j0286R344J1632q414j3882
$$ y = [-15404, -3639, 13403, 4108, -15384, -9821, 10671, 10210, -8492, -11404, 5979, 12099, -3735, -11326, 4598, 14737, -347, -13067, 72, 15938, 6871, -11211, -7282, 10516, 10247, -6997, -9479, 6487, 9982, -5935, -12214, 2750, 11974, -1934, -15674, -4866, 11769, 4788, -12606, -8993, 7805, 6805, -8658, -9332, 6540, 10351, -5617, -12310, 4069, 15121, 1062, -12639, -1973, 13261, 6664, -8511, -4974, 10309, 8401, -8050, -8360, 8826, 11537, -6148, -13123, 2466, 12647, -363, -13446, -4213, 9685, 2609, -11788, -6059, 8986, 5118, -10648, -9610, 6957, 10468, -5152, -12308, 2033, 12682, 1148, -10211, -588, 11602, 4110, -8948, -3188, 11752, 8625, -8101, -8448, 8497, 11845, -4438, -11047, 2562, 10617, -882, -11168, -1824, 9808, 1394, -12488]
923a2488O336J5541l522j6217O6J5888L803j4414o330J3492Q708j1939r591J1340
937F73J1497r158j3089O694J4828l076j5384l51J5097K723j4282m879J2410O178
951I881j1578q773R796J1119q608j3787N765J4783l198j4820K51J3967K384j2883
965e701m203J2755O516j2034q274J1498J0891q746j2129N866J3393k413j3384
978e965j56J3467J903j3411l676J3004N458j2497q680J0356J0873q508j2961N605
992e188J3179l715j3118J570J2638M09j2634k885J2962O038j1963q592J0840J0741
1006A0282p810j1220N783J2045l286j2292J591J3448L79j3979k781J3471N324
1019A0955j2038p966R154R387p563j0764N453J1199m629j2152K525J2512L2j2804
$$ y = [-12488, -6152, 9389, 5867, -10350, -10284, 5604, 9407, -5007, -11337, 2155, 10863, -1076, -10667, 673, 12170, 3012, -10077, -3383, 11445, 8369, -7015, -7366, 7731, 10454, -3828, -8707, 3703, 9881, -1697, -10470, -674, 10445, 1837, -11950, -6185, 8598, 5400, -9420, -9169, 4798, 7182, -5701, -9904, 2851, 9367, -2667, -10941, 557, 11448, 2702, -9427, -3561, 9832, 7419, -5965, -6121, 7346, 9249, -4162, -7838, 5166, 10624, -1873, -10553, -197, 10676, 2168, -10793, -5188, 7991, 4276, -8842, -7272, 5366, 5775, -6859, -9744, 3218, 9256, -2707, -11299, -459, 10282, 2472, -8748, -2965, 9080, 5794, -6498, -4907, 8541, 8920, -5059, -7840, 5631, 10955, -1083, -9049, 105, 9492, 1929, -8835, -3382, 7817, 3188, -8964, -6439, 6073, 6105, -6699]
1033f699l280J2031O295j0627p869R417R107p566r380O596J0731m366j1663K268
1047e005J3060O56j2847k990J1823M841j0301o460Q437P770p694r771O048J1147
1061H714m856j2717K168J2600K16j2239k842J1103M834j0351o197R863P867q740
1075e77q894P338J0597m374j1203K023J2019N77j1505k120J1112L644j0271n259
1089f893R242P034q164r372O107J0596m524j1607K174J0963m87j0813j674J0096
1103B678L436j0015n420R572P355q194q649O613R895l863j0148J999J0949O5j0650
1118d377j292J0983L045j0484m671R484O644p905q645N886R519m550j0260K687
1132c936R889j485j0277o21R843K588r846n072R119O795p744p831O188Q683m214
$$ y = [-6699, -9979, 2052, 8347, -2280, -10149, -732, 8375, 809, -8571, -1975, 8756, 4390, -7273, -5005, 8055, 8711, -4136, -7126, 4697, 9538, -763, -7223, 1214, 8984, 1290, -8481, -2433, 8714, 3858, -8859, -6691, 5909, 6125, -6114, -8956, 2147, 6981, -3370, -9567, 296, 8163, -577, -9471, -2133, 8464, 4090, -7113, -5090, 6929, 7506, -3999, -6119, 4993, 8637, -1634, -6893, 2349, 9383, 1219, -8153, -2046, 8550, 4026, -7581, -5407, 5556, 5069, -5744, -7418, 2678, 6114, -3901, -9321, 251, 7606, -588, -9237, -2624, 7271, 3408, -6740, -4741, 6208, 6273, -4377, -5669, 5314, 8359, -2125, -6796, 2688, 9332, 1427, -7218, -1332, 8187, 3637, -6623, -3936, 5953, 4468, -5809, -6430, 3413, 6001, -3845, -8917, 202, 6997, -747, -8578, -2390, 6293, 2079]
1147B079q783K819R831q21j0209n27J0713K885j0020m486Q833O165p044p534N602
1162d97Q345m637r486L128R780j909j0431n47R770K743r498m990Q382O093p428
1177a182o985O447P705m962q388L484R604j166r883n16J0083K621q890l550Q049
1192B471M919o787o125N768P543m766q856L100R316j656r621n81Q661K101q400
1207b913l846P605M861p406o172O417P280m970q121L210Q834r35q808m22R079
1222C693K010q468k771Q187M460p117n762O132P314m558q541L116Q752j864q799
1237d216J37Q203J038q501k848P781M307p579n893O338O731m899p407L191P903
1252D286j482p999L34Q620J191q339k255Q198M029o794n179N804O547m339p330
$$ y = [2079, -6704, -3885, 5946, 5125, -5084, -5611, 5102, 7987, -2033, -6519, 2314, 8479, 1435, -6099, -497, 7848, 3211, -6275, -3147, 6633, 4724, -5707, -6254, 3516, 6259, -3239, -8229, 153, 6246, -1182, -8167, -1720, 5985, 1023, -7365, -3881, 5723, 4557, -5326, -5842, 4241, 6862, -2028, -5578, 2471, 7390, 603, -5522, 246, 7789, 3023, -5833, -2733, 6583, 4927, -4694, -5275, 3386, 5487, -2913, -6759, 846, 5707, -1699, -7871, -1454, 5826, 856, -7265, -4055, 4779, 3844, -4964, -5386, 3693, 5703, -2765, -5536, 2651, 7111, -6, -5768, 364, 7678, 3120, -5421, -2305, 6447, 4583, -4216, -4079, 4124, 5162, -3339, -6187, 1594, 5901, -1678, -7571, -1233, 5498, 599, -6808, -3617, 4286, 2804, -5195, -4861, 3759, 4950, -3389, -5644, 2554, 6583, -211, -5390, 414, 6961, 2622, -4708]
1267d708L258P628k153p910O12P763O78p902k789P228L968o817n556N672O066
1282E038m710o717L334P195k012p705P39Q322R72q193j955P818L676o570m399
1297e167N649N703m334o492L677P238k626p640J151P627L58p608k264O915L264
1312E451o601m727N698N135n072o058L825O542k359p275Q15P623Q14p404j779
1327e372P170K972o042l786N606N171m348o080L626P176k408p494J208P307K05
1342D911p145j643O441K624o330m122N810M602n327n699L855O127k557o630R64
1357d119O843K40o825j031O773K234o081l074N627M576m246n534L622O336k332
1372C009o412J466O549l58o445r55O174K110o095l705N437M415m911n458L518
$$ y = [-4708, -1450, 6178, 4025, -3885, -3273, 4490, 5168, -2734, -5523, 1705, 5673, -1144, -6700, -1028, 5038, 328, -6389, -3055, 4140, 2128, -5577, -4838, 3484, 4456, -3737, -5692, 2126, 5802, -768, -5167, 482, 6185, 1851, -4641, -964, 6274, 3648, -3992, -2841, 4786, 5144, -2464, -4728, 2187, 5451, -1150, -5877, -179, 4956, -116, -6174, -2349, 4193, 1834, -5441, -4626, 2997, 3811, -3593, -5372, 1798, 4770, -1272, -5058, 548, 5719, 1371, -4709, -1083, 6093, 3685, -3809, -2601, 4706, 4911, -2234, -3877, 2564, 5188, -1142, -5264, 546, 5148, -179, -5878, -2023, 4104, 1547, -5083, -4119, 2724, 2964, -3861, -4892, 1881, 4115, -1966, -5040, 587, 5163, 917, -4617, -995, 5341, 3009, -3403, -1937, 4612, 4254, -2191, -3146, 3028, 5138, -957, -4662, 775, 5190, 279, -5179, -1661]
1387a661N625k597o105J104O462j38o682r82O810J999o208k866N646M191m336
1402B62m856L741N799k601o027J997O229p20o215m48N986J777n764l201N110L935
1418E004m690m771L603M853k817n626J432N900n60o149p63O153J788n708k480
1433d831N064L661m136m144L548N220k542n573J911O185o97n946l84N757J673
1448D766n455k861N081L399m741m343L953M599l225n385J722N529p93n945m36
1463d135N803J193n521j935M979K957m242l621L681M795k582n287K124N717q70
1478C056n404p1N436J227n137k179M935L003m616l979L831M267l087m970J666
1493b022N015q39n358l89N424Q23n373j755N031K676m380l380L632M411k695m754
$$ y = [-1661, 3964, 1367, -4738, -3634, 2828, 2690, -3992, -4974, 1836, 3835, -2373, -5239, 407, 4598, 262, -4594, -853, 4946, 2345, -3682, -1685, 4544, 3824, -2391, -2839, 3147, 4924, -840, -4041, 1069, 5004, 314, -4457, -854, 3999, 1182, -4444, -3012, 2888, 2328, -3821, -4584, 1569, 3357, -2351, -4831, 233, 3894, -242, -4386, -838, 4382, 1840, -3733, -1822, 4363, 3666, -2280, -2664, 3093, 4766, -689, -3550, 1531, 4930, 189, -4154, -201, 4398, 1173, -4212, -2490, 3039, 2246, -3699, -4135, 1668, 2861, -2660, -4595, 384, 3341, -901, -4522, -841, 3954, 1372, -3915, -1791, 3926, 3056, -2348, -2419, 3017, 4244, -893, -3072, 1863, 4866, 250, -3729, 102, 4369, 1282, -3688, -2022, 2993, 2154, -3204, -3593, 1831, 2654, -2719, -4474, 557, 3233, -1147, -4527, -895, 3516, 821, -3933]
1509c933K228N260j243m987N98N089O19m797j614M705K666m368l394L540L827
1524D196k981m407J895M495j298n007L8N056O39n291j603M829K250m157k983L492
1540h37L838k689m288K295M904j319m911P95N061N72m741j369M590K421m166l081
1556b925L721L482l167m143K327M163j446m968M10M887K12m947j181M362J715
1571B502l950k578L361L358k758l783K197M523j418m533P45M857L11m220j137
1586b523M285K130l956k700L721L199l212l610K270L889j547m395L97M389K35
1601B572m668j133M243J558m123k257L322L013k812l664K326M237j534m315J082
1616b153M404K5m076o40M187J772l896k231L700K911l099l379K367L646j547m081
$$ y = [-3933, -1705, 3555, 2312, -2675, -2077, 3012, 3631, -1166, -2780, 1925, 4591, 223, -3171, 369, 4196, 1215, -3192, -1297, 3198, 1900, -3107, -3069, 1987, 2626, -2665, -4268, 561, 2811, -1346, -4329, -837, 3001, 312, -3976, -1681, 3223, 1904, -3007, -2212, 2849, 3421, -1320, -2689, 1901, 4322, 156, -2925, 796, 4278, 1111, -3032, -705, 3458, 2012, -2956, -2546, 2341, 2553, -2394, -3575, 787, 2502, -1448, -4026, -665, 2693, -65, -3848, -1651, 2872, 1454, -3079, -2334, 2523, 2834, -1386, -2523, 1762, 3892, -64, -2764, 957, 4156, 944, -2666, -396, 3493, 1946, -2449, -2052, 2337, 2572, -2096, -3229, 1014, 2572, -1551, -3808, -486, 2527, -285, -3949, -1623, 2614, 1080, -3235, -2153, 2251, 2276, -1800, -2440, 1747, 3519, -377, -2608, 1092, 4003, 904, -2475, -108, 3538, 1991, -2090]
1632b090N74M042j11m397p76M166J104l980k089L343K587k852l241K209L768j604
1648F53l914J116M145k68l850l46M009J430l484k138L519K787k916k978K303L296
1664C364j597l681P74L876k88m191n75L934Q97l761j866L218K138k770k840K095
1680a273L397j722l657J164L973m03l725k68L820J182l351j655L303K411k694
1695E02k824K590L056j846l300J032L565l67l857m88L716P96l703j513L049J844
1711B252k729k673K144L124j810l536J259L637n05l573j9L482R59l199j294L176
1727F95K176k753k426K516L009j878l049J155L252m05l622j27L439N43l486j246
1743b207K895J682k818k338K112K708j729l264J229L221o09l391K17L260O98l051
$$ y = [-2090, -1516, 2526, 2415, -1982, -2758, 1408, 2512, -1468, -3557, -214, 2373, -479, -3720, -1511, 2257, 653, -3261, -2145, 2000, 1732, -2118, -2464, 1545, 2975, -509, -2647, 872, 3659, 743, -2235, 68, 3364, 1767, -1914, -1140, 2736, 2448, -1743, -2318, 1616, 2513, -1248, -3114, 104, 2242, -528, -3368, -1273, 2124, 402, -3255, -2091, 1882, 1479, -2246, -2514, 1306, 2488, -863, -2518, 785, 3196, 502, -2322, 268, 3324, 1478, -1822, -790, 2775, 2408, -1449, -1937, 1779, 2575, -1128, -2641, 408, 2252, -477, -3150, -1006, 2118, 308, -3228, -1969, 1668, 1163, -2410, -2429, 1053, 2012, -1187, -2481, 695, 2871, 118, -2308, 208, 3217, 1339, -1710, -555, 2697, 2292, -1330, -1457, 1982, 2525, -961, -2207, 688, 2370, -448, -2786, -674, 2034, 305, -2959, -1730, 1491, 882, -2509, -2292, 968, 1666, -1385]
1759a385j155L168J882k640k220K519K644j775k715J300K926m64l243o9L306M05
1775B484l297j060K850J480k787k106J982K518j838k963J283L030r49l146L94
1790b125L093L88k961q79K897J691k467j972K407K397j778k467J429K854o70k950
1806a113M9L188L91l245q96K860J181k617j805J951K128j828k675J204K782r46
1822F09k911K93K805L68k812q60K766J451k397j673K260K178j685k261J415K682
1838B228o85k656J85K925L02k927o81K648J007k519j532J948J863j736k517J258
1854h89K436q71k812L79K609J02k589o45K518J173k331j524K387J937j777k012
1870a909J434K450p51k468M32K658K43k661n58K502R77k408j408J940J696j687
$$ y = [-1385, -2540, 628, 2510, -130, -2350, 169, 2813, 1038, -1677, -377, 2549, 2085, -1158, -1227, 2079, 2484, -813, -1873, 977, 2457, -330, -2436, -454, 2064, 226, -2737, -1454, 1576, 627, -2519, -2125, 968, 1356, -1605, -2484, 413, 2104, -363, -2335, 72, 2469, 691, -1776, -347, 2507, 1837, -1113, -1064, 2124, 2515, -730, -1626, 1234, 2415, -202, -2007, -56, 2072, 244, -2431, -1227, 1555, 609, -2302, -2009, 796, 1164, -1648, -2508, 258, 1709, -688, -2361, -101, 2077, 392, -1869, -454, 2228, 1543, -1113, -928, 1997, 2299, -628, -1309, 1339, 2346, -173, -1705, 243, 2106, 370, -2147, -889, 1547, 676, -2136, -1757, 852, 954, -1635, -2280, 238, 1411, -920, -2444, -57, 1880, 103, -1909, -475, 1975, 1224, -1244, -812, 1846, 2089, -572, -1130, 1372, 2349, -59, -1467, 473, 2169, 482]
1886D82k273J199K307r89k661M54K433j33k452m60K301J011k200j363K028J873
1902A557j689j858J342K306p24k257M49K543J00k405m05K427Q34k166j259J797
1918E92J535j600k012J190K095j014k439M78K251k24k358l72K180Q42k103j323
1934b282J943J633j618j719J389K042p66k115O22K369Rk235k77K305P04k039r70
1951a005J776J348j564j784J183J912j065k202M79K076k31k253l21J966O67j978
1967i96j118J839J338j544j562J320J868p83j938O28K164l6k042j58K195O29j881
1984g7q83J780J131j402j565J146J645q95j954M04K001l31k022l45J840M97j854
2001h84r90J647J171j485j468J310J706r11j706O37J955p9j884j09K038N60j781
$$ y = [482, -1791, -592, 1715, 726, -1935, -1481, 952, 819, -1633, -2093, 208, 1219, -981, -2344, -316, 1557, -132, -1990, -648, 1658, 934, -1323, -874, 1669, 1769, -636, -1041, 1386, 2220, 54, -1205, 592, 2127, 527, -1485, -295, 1800, 786, -1653, -1175, 1076, 852, -1506, -1878, 302, 1144, -959, -2282, -339, 1294, -324, -2043, -654, 1388, 622, -1493, -871, 1498, 1507, -728, -1005, 1300, 2004, -35, -1005, 771, 2119, 555, -1229, -46, 1866, 801, -1401, -922, 1154, 923, -1330, -1651, 315, 982, -996, -2114, -275, 1063, -481, -2043, -723, 1145, 362, -1576, -948, 1216, 1180, -862, -1020, 1175, 1804, -77, -960, 820, 1951, 549, -1016, 130, 1775, 880, -1074, -670, 1331, 1000, -1022, -1367, 473, 970, -884, -1874, -227, 944, -541, -2009, -699, 1007, 96, -1610, -973, 982, 903, -981, -1090, 948, 1508, -273]
2018b73p45J739J113j398j336J110J598r28j853O10J828m56j919j32J683L89j798
2035g68q90J607J028j442j445J273J563r49j582N69J747l5j750o2J938N34j729
2052c93n65J551J059j265j192J057J468q07j669N55J679m21j788l6J528L29j661
2069e71p33J274J036j472j224J155J321r31j467N61J616j67j593m9J776M93j630
2086f05m55J553R33j209j012J054J341p44j488N31J572l62j685J1J512J94j491
2103c50p10J260Q54j316j230J007J271r13j378N15J546k10j504l2J593L39j410
2120f68m78J456Q86j203q93J041J270o74j325M44J593l37j519k2J414K00j422
2137b37n85J162O93j174j130R55J075q78j290M99J344k59j392mJ507K73j294n00
$$ y = [-273, -1018, 721, 1834, 436, -900, 210, 1808, 880, -973, -363, 1465, 1009, -910, -1042, 641, 1030, -768, -1658, -51, 977, -465, -1910, -637, 926, -23, -1605, -1036, 711, 676, -1074, -1136, 802, 1336, -393, -958, 593, 1652, 387, -805, 252, 1720, 913, -756, -201, 1478, 1057, -731, -767, 761, 1090, -571, -1304, -30, 1006, -466, -1690, -535, 786, -145, -1612, -1051, 565, 398, -1195, -1244, 532, 1025, -605, -1060, 493, 1426, 217, -795, 259, 1600, 856, -632, -101, 1471, 1109, -576, -565, 947, 1141, -350, -1060, 200, 1054, -262, -1492, -485, 786, -127, -1505, -990, 556, 346, -1158, -1190, 403, 742, -668, -1146, 310, 1196, -7, -900, 141, 1411, 737, -588, -144, 1449, 1112, -407, -429, 985, 1185, -237, -822, 340, 1033, -141, -1271, -316, 759, -119, -1409, -910, 434, 175, -1217, -1221, 286, 559, -735, -1235]
2155a235J357P85j054q05R98J182o46j206M99J397j89j469J31J325J89j409m45
2172e95J129P25j290r49Q57R88p67j272M83J165k58j337K9J267L19j289m31J275
2190D9O81j050o80Q60J097n66j018M45J294j32j327J27J155J42j106m92J081O25
2208A185r71j025Q12Q91p61j155M45J049l12j181K9J140J96j158l72J113O39r93
2226d29o26Q98R21n82q80M52J187j47j118R5J201J18j017m35J024M71q19q10O58
2245A62Q06p86r79M32R73l17j122o2R93J93j029l79J004N50q98n82P46Q61m92
2264G4q93M28J127j80j001J46J074K56r62l59R23N01q02p75O77Q03o36r59L66
2283a92Q13k84j047rR64Q9r45m63R00N57q57n97P13P69m79p99L80J078j46r07
$$ y = [-1235, 122, 907, -147, -952, 46, 1228, 582, -624, -125, 1272, 1083, -386, -255, 1070, 1259, -150, -595, 534, 1259, -31, -980, -123, 865, 98, -1174, -691, 474, 216, -1121, -1092, 175, 494, -795, -1226, 49, 730, -320, -1000, -140, 957, 391, -627, -182, 1112, 980, -347, -220, 935, 1077, -29, -521, 560, 1185, 214, -811, 1, 892, 131, -1024, -579, 470, 158, -1023, -994, 146, 342, -816, -1188, -75, 564, -429, -1055, -157, 764, 182, -698, -246, 941, 794, -324, -229, 972, 1090, 73, -362, 662, 1133, 314, -496, 162, 968, 182, -797, -365, 608, 291, -831, -893, 100, 293, -736, -1115, -111, 439, -459, -1041, -295, 566, 74, -819, -391, 736, 556, -445, -299, 775, 1031, 69, -290, 633, 1134, 332, -443, 234, 1037, 401, -558, -192, 621, 337, -710, -719, 245, 334, -611, -1074, -174, 383, -474, -1071, -358, 411, -68, -867, -487, 591, 445, -462]
2303d62P1J021J97q08l68R47M59p50o17N62P57n44q23K63Q25k93r38J8P27J32
2323C76r03m16Q24M10p49n32M55Q35m40p06L34Q87r5q55R2J020J15p80k24P81
2343D29N22o18n48M91P23m64q51L77O76j48q23j44P35J10q29m04P44L11o11o33
2363i55N35O06l64p24L28P51J3p94j8R22J86o41k58O95M69m36n68M24P63m06p07
2384a79K00P62j41q12j16O91J79p57l87N59L64p08m77M53N86m11n70J02P39Mp69
2405f88K1Q51J45n79j60N50N18n17m07M72O40k61o83K58N65m9o71j85O62K34p47
2426c1m07N63L98o20n83L84N26m23n85J51O63K7p55%O73K46o49j94N44O24m84
2447F8m17L80O22j75o33K04N80l3n63j01N18K45o16l70M45M21n08n51K27M61j95
$$ y = [-462, -391, 630, 827, 19, -349, 598, 1057, 307, -310, 252, 1009, 465, -358, -95, 730, 437, -501, -483, 244, 376, -527, -943, -119, 291, -458, -990, -535, 300, -140, -846, -512, 375, 280, -575, -483, 537, 652, -128, -352, 429, 951, 333, -215, 276, 999, 535, -316, 61, 737, 589, -234, -378, 357, 467, -362, -766, -22, 289, -322, -955, -420, 186, -178, -902, -574, 177, 190, -604, -622, 300, 486, -155, -413, 282, 751, 315, -253, 171, 934, 528, -179, 21, 783, 642, -170, -286, 405, 584, -173, -560, -1, 363, -345, -822, -369, 217, -194, -764, -662, 77, 81, -688, -667, 184, 329, -250, -410, 140, 658, 141, -266, 206, 846, 585, -98, 160, 725, 676, 5, -180, 482, 716, -31, -438, 125, 523, -97, -680, -296, 230, -193, -778, -627, 36, 63, -692, -692, -19, 227, -422, -616, -72, 552, 68, -349, 31, 653, 478, -155, 49, 629, 596, 33, -68, 450, 695, 79, -291, 154, 575, 67, -484, -257, 204, 9]
2468Io61P0O18Lo15j36O10K74n64k49N15M22l03m00L39N97p4o48J82O85R0o97
2490F7j13N61J79m41m94M79M10m59o10K71M77k04o71N8M64J11n93k50N21M09n34
2511c62m12N07M06k07m87L65N23o2m97R8O15J03n68n5M33L35m44m58L48M94l16
2532C59o39K06N05k07n23j09N71l0n28k51N10K85n44l44M41M23k42m65K63N91
2552B72r8n06k8O66K14n07j97N01L71l17m86L63M41l23n43J69N24k02n91o2N49
2573B10J4n43l15L99M33n57l22L50L57j86m16J25N63O5n75N2N79J93m98j99N39
2594B68L79l34m86L93M80j77o54J54N47n3o51o6M91J57n67l97L88L90m57n16L56
2615c55M66k08n25O2N85O4m92j05N54K62m74j88M53M38k97n24L22N55r7n23N2
$$ y = [9, -652, -582, 36, 39, -576, -712, -102, 172, -392, -641, -126, 296, -7, -407, -68, 529, 455, -193, -11, 674, 764, 67, -46, 515, 694, 253, -241, 238, 648, 189, -421, -150, 327, 123, -548, -490, -26, 85, -508, -758, -237, 172, -362, -774, -267, 139, -68, -555, -190, 333, 271, -226, -128, 487, 590, 22, -33, 400, 735, 291, -167, 181, 675, 359, -280, -74, 431, 224, -299, -408, 163, 133, -395, -646, -136, 149, -395, -739, -298, 125, -117, -582, -319, 272, 174, -332, -360, 306, 520, 13, -184, 317, 688, 371, -115, 248, 689, 366, -177, -8, 516, 314, -277, -339, 210, 224, -319, -634, -235, 198, -359, -681, -331, 26, -160, -576, -451, 112, 177, -398, -346, 233, 426, -72, -271, 268, 647, 313, -173, 220, 700, 523, -131, 23, 570, 517, -134, -200, 291, 448, -119, -516, -128, 262, -195, -711, -355, 111, -97, -622, -560, 25, 89, -403, -508, 46, 308, -166, -354, 99, 537, 240, -284, 38, 593, 496, -27, 25]
2636B5N47J1n55k16M43K36m96l82K66N17m12o34K68N15j71n48mN69O3m50j75N40
2658d3L70n21k95M13N57k72l93R6O46m8o10Q7N85Q9n92k48M52L81n44n18M15L98
2680D05k99n61J03N65j75o23J7N05K14n92l10O75K61m21m10M87N31k52n25K39
2700a66O80l7n76q9P06J10n17k80N66K70m49m49L06M93k92o47Q5O00j05o64j12
2721e67N76J49n44l42N45M20n12m29M51N58k68m92J70O63Q5p48l2P61K11n87l78
2742c10O16L89m47m12K25N47k69o52J33O56j81p15j69O43K29o63l48N15N29m46
2762a30o37L96P04k81o55K33P31J9o34p7P24K30n42l69N87M37m90n22L89O38l01
2783D50p02P2P35l4q44j69O39K36n71n44N38N33n97n06L81O75k38p87K53O81P6
$$ y = [25, 572, 583, 28, -188, 255, 491, -5, -387, -121, 396, -16, -650, -382, 133, -38, -586, -590, -21, 42, -408, -583, -43, 327, -194, -489, -76, 481, 209, -184, -88, 558, 510, -100, -13, 572, 661, 69, -179, 273, 654, 110, -408, 7, 405, 106, -455, -352, 213, 38, -585, -568, -63, 151, -441, -751, -76, 185, -236, -646, -159, 372, 120, -405, -166, 514, 477, -99, -188, 518, 628, 111, -169, 397, 667, 218, -231, 75, 568, 276, -371, -286, 314, 209, -455, -567, 9, 158, -386, -728, -183, 237, -275, -704, -253, 305, 37, -455, -285, 378, 463, -285, -317, 444, 655, 68, -310, 306, 695, 248, -164, 61, 608, 339, -313, -180, 476, 295, -420, -589, 54, 283, -380, -728, -213, 316, -130, -767, -371, 333, 52, -603, -370, 361, 380, -254, -331, 393, 623, 81, -288, 299, 736, 246, -276, 113, 751, 450, -252, -180, 555, 521, -323, -492, 147, 383, -188, -732, -194, 339, -258, -764, -383, 292, 54, -733, -480, 201, 277]
2804B77o80n0O75L41n63l73N79M99m76n67M10O27k11p83J75O66jq00j98P54K12
2825E13p51m79O34M97m90p39L76P52k36p04O4Q04J6o55k09Q11L52o61l58O55N69
2846G61m72o77M62O62j74q33J18Q43nr15j50P02L69q06n28O14M79m97p17L40P36
2867C12k09r02K20P92P4q09j85Q57L25o77m45O53O77m80o89M71P11j64p91P1Q28
2888F40M7q50k26Q41K99p78n84O81N22n22p96L70P48k08r21J39Q18P2q32j78Q25
2909A07L33o79m61O89O31m45p88N52Q13k43p90M8Q85P1r02j86Q30L06p45n57O54
2930A23O19n98q16L62P95l28r38J42Q80O2q68k51Q47M08p22n12O92P74o99o73
2950g01M93R13k38r39J43R28J82j000j89Q92M39r01n35O67O70n74q74M18Q65l37
$$ y = [277, -403, -453, 222, 563, 0, -373, 206, 705, 229, -338, 72, 699, 488, -295, -120, 546, 545, -255, -453, 301, 513, -238, -717, -83, 414, -76, -815, -439, 313, 77, -627, -563, 241, 257, -398, -607, 204, 556, -105, -463, 192, 761, 289, -388, 74, 736, 562, -271, -153, 690, 685, -230, -380, 322, 691, -115, -643, -29, 450, -47, -764, -424, 312, 103, -799, -579, 213, 287, -522, -707, 150, 475, -202, -647, 6, 683, 203, -486, -15, 696, 532, -259, -188, 640, 687, -163, -389, 452, 751, -27, -611, 70, 592, 70, -726, -356, 392, 184, -737, -598, 220, 292, -540, -718, 107, 440, -239, -700, -11, 620, 175, -613, -61, 752, 509, -281, -233, 652, 723, -179, -365, 465, 771, 26, -531, 123, 742, 144, -672, -310, 485, 157, -781, -639, 241, 303, -565, -816, 31, 439, -283, -795, -103, 671, -28, -701, -208, 705, 467, -472, -329, 599, 781, -219, -408, 484, 923, 22, -513, 154, 824, 250, -624, -206, 659, 322]
2970C22r91R0Q81P3j003j71Q72M77q66o07Q00P29o20q24N49J011l47r50J07J110
2990F42N9r66k19J000M12q67n70O85Q10o61r32M10R71l87j058J17R86Jj046j82
3010g95R10L62p70o59P95P43o64p96N90R05k65r88J75J011J62j010j75J001L41
3029H73q36o09P90P14o03r38M72R54l47j074J59R87k6j107k37J052L70r68o11
3048i85P62Q26o85q73N47J049l92j048J93J191Lr98k21J153M24j053n31Q02Q79
3067A043p10r62N54J037m51j057N3J208j20j057k56R99L75r76o53Q84Q45q23r84
3086a051O18J084m33j109K38J242K9j153j85J162M30r53o65R47P61o83r78O40
3104e9J049l87j222J88J196r2j175k25J066L86j026o71R17P87q29r92O39J056
$$ y = [322, -669, -579, 302, 375, -628, -799, 73, 550, -316, -923, -123, 606, -14, -838, -289, 722, 375, -575, -468, 642, 701, -265, -484, 516, 928, 61, -509, 176, 986, 325, -607, -197, 774, 387, -671, -554, 432, 433, -613, -795, 115, 477, -293, -952, -157, 586, -78, -874, -284, 621, 356, -632, -457, 554, 716, -294, -469, 532, 873, 37, -572, 218, 932, 329, -609, -137, 817, 470, -604, -445, 542, 516, -591, -828, 224, 594, -374, -985, -223, 603, -82, -955, -408, 641, 249, -799, -606, 585, 588, -410, -631, 522, 946, -107, -638, 164, 1043, 333, -629, -75, 962, 511, -546, -493, 715, 595, -462, -718, 281, 656, -320, -973, -89, 756, -67, -1051, -433, 651, 218, -891, -653, 589, 618, -535, -720, 442, 872, -81, -746, 201, 962, 279, -699, -59, 990, 603, -619, -431, 765, 673, -502, -727, 339, 725, -301, -972, -55, 732, -97, -1089, -450, 606]
3122F06m94j026J68J230O2j177j97J175N44j095o11J006Q39p90r73O49J126m65
3140E77j138J44J260j11j205j86J151L28j103o37R34Q35r46r04N62J142m87j145
3158i29K48J210O7j325j63J235M17j099o00J112Q30q53j032Q21J104m76j227K20
3176d40J409j99j164k57J190L59j123o69R02R14r93j050P78J070n19j180K78J219
3194E25M3j318j81J280M10j066o00J016Q92r16q92P13J133m52j269L04J297j8
3212I01j368j39J250L82j225o16R72Q34r72j044P33J099n36j249L13J259j02j247
3230g55k35J305M67j303m99J090Q19q89r51Q19J117n50j244M21J286n9j313j88
3248f62J362K94j164o69J079Q55r70j184Q63J170o36j296L16J283j34j288k52
$$ y = [606, 112, -914, -746, 484, 546, -631, -828, 347, 891, -204, -815, 191, 1030, 240, -733, -84, 1042, 577, -561, -417, 843, 732, -473, -659, 492, 820, -283, -920, 14, 849, -97, -1001, -439, 703, 216, -929, -681, 529, 596, -729, -892, 343, 760, -339, -939, 173, 1003, 150, -882, -61, 1043, 567, -660, -440, 969, 770, -394, -651, 539, 898, -225, -894, 8, 922, -71, -1121, -343, 727, 208, -972, -694, 525, 568, -750, -931, 349, 759, -307, -907, 109, 1001, 85, -807, -94, 1039, 587, -682, -378, 919, 901, -467, -606, 644, 1026, -199, -815, 157, 991, 19, -1025, -292, 807, 271, -978, -665, 594, 492, -755, -990, 315, 782, -521, -1020, 70, 889, 0, -951, -132, 985, 435, -809, -388, 898, 839, -474, -662, 700, 994, -170, -839, 240, 1095, 125, -1059, -196, 974, 338, -958, -642, 641, 507, -781, -1033]
3265a033J414M25j287o13J195Q22j005r52P99J203n44j261M12J357Jj516r0J431
3283G58K80j242o50J173P57r75j116Q82J111o50j339M10J296j63j385j42J433
3300D38L26j326o85J298Q13j047r23Q61J149n21j345M90J387o2j530p4J447L78
3318A074j279o41J177Q81j101j019Q37J249p84j387M68J381j81j477p4J336M03
3335H63j409o92J386Q01j196r73J005J154o39j332M82J450j52j469l5J560J98
3352A002j320n92J354Q00j111j105R66J204q20j334N06J384k51j533p7J518K07
3369G98j413o23J378Q36j213r86R23J254o98j313N06J456j73j490m4J470L99j431
3387c64o27J470P93j180j043R35J248p38j414N13J411k99j502l7J436K45j407
$$ y = [-1033, 381, 806, -481, -1094, 101, 923, -82, -1034, -235, 968, 424, -837, -425, 932, 933, -583, -673, 758, 1038, -204, -854, 319, 1076, 101, -1015, -133, 978, 328, -1011, -601, 695, 532, -853, -995, 438, 764, -562, -1247, 51, 864, -183, -1106, -245, 904, 383, -962, -472, 915, 853, -677, -751, 696, 1074, -205, -846, 331, 1212, 111, -908, -71, 1178, 394, -993, -525, 856, 675, -802, -876, 460, 863, -546, -1238, 148, 949, -247, -1220, -215, 939, 300, -1032, -550, 900, 748, -721, -756, 804, 1002, -318, -910, 444, 1244, 133, -972, -6, 1198, 378, -956, -450, 934, 683, -850, -927, 591, 798, -615, -1238, 140, 976, -237, -1223, -300, 954, 256, -1057, -551, 905, 732, -758, -802, 668, 1067, -364, -991, 479, 1272, 92, -951, -16, 1232, 494, -920, -407, 1004, 705, -797, -834, 602, 847, -560]
3404e60n60J282R05j373r82J090J092p03j370N57J480j61j550k1J610K28j458
3421d94n11J416Q14j168j124J130J225r29j315O06J473m05j473o3J566K18j514
3438e48o42J489P59j298j037J056J214q62j344N90J518k39j590M8J592K83j581
3455e92m03J479Q01j311r92J093J211q24j465O91J511l74j643K4J588K56j637
3472e87n00J468P63j445j053J180J215r27j362N63J626m18j523L2J662K16j616
3489g06l32J439P08j235q92J075J246r28j405O62J607m56j635J33J659J28j597
3506e29n17J494P36j429j074J269J159r80j355O29J461l48j568J2J770J47j619
3523g42l58J537O69j349q74J184J217r64j365P18J534m63j614J27J641J98j688
$$ y = [-560, -1120, 162, 1067, -306, -1288, -198, 894, 191, -1179, -622, 858, 697, -853, -874, 736, 964, -494, -1005, 411, 1225, 57, -1067, 63, 1288, 359, -956, -350, 1123, 718, -755, -818, 748, 966, -548, -1190, 299, 1058, -240, -1277, -221, 993, 131, -1213, -623, 895, 656, -934, -886, 706, 989, -592, -995, 484, 1285, -26, -1018, 75, 1286, 462, -1003, -312, 1199, 825, -818, -794, 794, 1050, -587, -1087, 381, 1144, -301, -1354, -174, 1041, 114, -1248, -685, 941, 523, -1000, -968, 694, 910, -706, -1038, 401, 1109, -126, -1018, 57, 1303, 375, -1030, -368, 1239, 783, -852, -719, 940, 1068, -529, -1046, 448, 1184, -245, -1319, -50, 1109, 129, -1226, -597, 864, 516, -1052, -1040, 730, 877, -742, -1100, 437, 1106, -243, -1117, 67, 1284, 320, -1045, -327, 1207, 744, -870, -743, 898, 1096, -592]
3540e92l98J457Q05j534j014J264J154j031j355P15J501m99j525O9J690J99j747
3557h41l66J547P75j403q91J217J206r15j438P38J589n06j641K90J691K6j591
3574e13m21J535O62j500r65J257J195j106j360P82J475n26j692K34J739L7j637
3591h04m49J666O67j470r09J284J261j023j406R25J500o14j578L28J693Mj639
3608e64m15J552O85j493r36J320J190j209j369Q85J452n50j660K99J583J25j785
3625h90l65J731N76j449q62J342J169j105j358R17J515o10j601L51J728q6j619
3642f16l45J689N90j521r60J347J203j270j339R63J368o00j609K62J706j4j707
3659h53l87J699O38j566q40J388J035j050j308Q29J620o53j690M92J655J8j690
$$ y = [-592, -990, 467, 1272, -262, -1276, -12, 1142, 111, -1244, -529, 972, 473, -1052, -983, 707, 906, -841, -1207, 340, 1115, -288, -1179, 38, 1244, 329, -1109, -371, 1218, 712, -929, -639, 1052, 1078, -513, -934, 601, 1263, -237, -1202, 55, 1250, 144, -1216, -434, 1041, 515, -1177, -943, 796, 833, -804, -1253, 413, 1080, -390, -1299, -15, 1246, 223, -1183, -258, 1242, 628, -950, -622, 1071, 1075, -564, -979, 573, 1258, -235, -1171, 149, 1339, 130, -1239, -354, 1098, 548, -1112, -813, 770, 895, -890, -1255, 476, 1052, -397, -1259, 83, 1252, 147, -1211, -294, 1221, 611, -990, -639, 1089, 1003, -616, -961, 728, 1318, -203, -1163, 184, 1387, 117, -1222, -259, 1109, 509, -1100, -838, 868, 854, -853, -1240, 459, 1097, -469, -1309, 79, 1114, 64, -1244, -415, 1205, 552, -1138, -646, 1009, 1027, -663]
3676f63k91J608O15j523r10J416J203j319j378R41J559p35j639L37J646mj795
3693i32j87J663N25j620p80J454J031j160j308R36J552o75j681M61J754j0j837
3710h14j01J700N06j600q29J455J058j287j286R85J563q10j673M39J686j73j775
3727i56k27J747N84j710q49J475J104j281j279R95J595p74j612N38J765k51j711
3744h47j88J695O48j680p94J528J087j346j300J070J515q15j611M89J665j93j795
3761h72k00J736M44j690p83J573R35j284j274J055J547q44j647N89J728k09j711
3778i07q3J695N25j688p73J584J074j339j355J157J477q60j602M42J761k12j782
3795h86j72J785M05j724o92J473J035j370j277J123J500r36j543N49J727j82j797
$$ y = [-663, -954, 654, 1269, -254, -1164, 252, 1455, 136, -1242, -301, 1258, 523, -1116, -779, 867, 863, -932, -1119, 544, 1069, -551, -1331, 123, 1154, -6, -1314, -378, 1174, 499, -1182, -721, 1033, 1023, -814, -915, 785, 1291, -309, -1138, 317, 1375, 88, -1198, -213, 1350, 540, -1133, -694, 992, 819, -956, -1183, 564, 1148, -562, -1411, 64, 1168, -113, -1392, -397, 1198, 424, -1188, -650, 1115, 864, -847, -1035, 660, 1308, -372, -1166, 362, 1449, 103, -1197, -127, 1388, 573, -1038, -549, 1116, 923, -872, -1072, 664, 1108, -582, -1365, 208, 1143, -141, -1415, -360, 1187, 343, -1304, -715, 1013, 804, -907, -990, 705, 1230, -458, -1231, 353, 1427, 88, -1267, -110, 1367, 507, -1095, -653, 1108, 896, -886, -1058, 727, 1132, -592, -1284, 189, 1224, -146, -1423, -300, 1200, 264, -1279, -730, 997, 815, -982]
3812i82m8J778L97j557p77J565R66j271j265J201J370r25j593N94J684k94j713
3829h70o0J725M27j821o64J643P80j316j175J062J425q48j720P11J770l86j745
3846a062J0J761L79j610p09J590R97j483j118J256J322r00j489N99J616k53j787
3863h81pJ795K75j743o88J606Q93j375j270J225J365r67j556O37J776m62j731
3880a108N9J794K89j705n70J653Q96j422j191J268J457j046j523O91J680l80j711
3897h69%J763L18j814n20J549Q96j557j141J255J318r10j603O00J788l72j840
3914a139R6J848K30j736n80J560R78j443j125J276J410j017j559Q17J628m80j711
3931i47N2J835K87j769o17J664Q94j592j030J171J350j007j578O70J673l63j867
$$ y = [-982, -1030, 748, 1145, -412, -1189, 376, 1342, 71, -1194, 7, 1377, 452, -1141, -547, 1137, 843, -870, -930, 795, 1222, -599, -1263, 380, 1160, -156, -1331, -269, 1156, 308, -1412, -701, 1069, 683, -1062, -1052, 709, 1088, -522, -1231, 359, 1356, -127, -1245, 11, 1333, 433, -1056, -457, 1159, 906, -881, -888, 907, 1182, -561, -1249, 357, 1250, -125, -1395, -170, 1195, 228, -1328, -691, 1085, 623, -1108, -1049, 745, 1034, -671, -1241, 412, 1308, -114, -1305, -37, 1420, 374, -1149, -458, 1222, 842, -869, -869, 894, 1212, -602, -1122, 427, 1323, -234, -1375, -120, 1198, 288, -1315, -715, 1073, 701, -1139, -1043, 805, 1035, -701, -1281, 279, 1257, -186, -1311, -35, 1375, 358, -1201, -384, 1244, 764, -947, -895, 940, 1227, -542, -1159, 505, 1399, -193, -1223, -52, 1298, 291, -1287, -617, 1056, 693, -1174]
3948a174J41J898O2j547o49J625R69j558j216J460J325j042j584Q60J635m44j692
3965i31O1J795K49j761n78J694P70j524j024J190J361j061j478P53J570m47j821
3982a182K38J791J36j776m77J652P77j462j102J319J424j136j516Q45J756n45
3998G42j662J27J680K42j711n68J694Q42j624j001J315J251j071j494P31J670
4014A163m85j794K18J749J02j830l95J627Q36j478j169J328J343j087j461Q61
4030d72J630n02j654K13J706K05j726n02J688P94j571j021J346J234j112j506
4046a250P92J724o06j703J57J805J03j817m42J740P36j567j039J342J343j192
4062A26j468Q94J683o84j564K48J688J47j745m22J681Q25j626j000J413J168j103
$$ y = [-1174, -1033, 865, 927, -620, -1269, 356, 1325, -233, -1449, 11, 1336, 294, -1290, -430, 1205, 761, -931, -870, 925, 1174, -587, -1165, 529, 1299, -225, -1249, -59, 1302, 241, -1237, -484, 1086, 639, -1182, -944, 847, 983, -793, -1270, 382, 1159, -303, -1405, -86, 1338, 202, -1314, -469, 1287, 742, -920, -793, 887, 1129, -582, -1150, 544, 1386, -238, -1239, 76, 1327, 256, -1238, -507, 1163, 678, -1116, -898, 851, 953, -877, -1272, 355, 1191, -287, -1456, -128, 1215, 128, -1333, -472, 1158, 656, -998, -785, 921, 1126, -600, -1102, 586, 1380, -191, -1212, 134, 1368, 256, -1250, -458, 1266, 660, -1043, -886, 919, 1022, -795, -1237, 503, 1239, -328, -1367, -25, 1318, 126, -1342, -448, 1235, 551, -1013, -765, 923, 1070, -675, -1097, 584, 1409, -217, -1217, 196, 1364, 261]
4079B61j440Q21J552n32j781L03J821m5j797l29J727N13j558r00J359J261j190
4096D6j457R96J543n83j590K88J696P8j769l48J755N59j519r24J436J184j149
4113B42j306P87J518n56j789L81J726Lj790k85J666M93j519r24J424J151j196
4130B6j414R43J634o54j629L33J703l5j640l31J673O59j628q51J511J029j220
4147A09j282R67J511p23j619K86J731m7j782j70J618M83j539q66J351J147j176
4164aj420J017J565o94j693L99J724Mj703k29J616O50j600q23J450J095j263j234
4182a140R60J483o68j574K64J766j50j772k25J672N33j563p42J257J111j188j392
4199a368R82J630p67j665N32J550j01j699k10J728N53j613p88J488J076j275j229
$$ y = [261, -1179, -358, 1194, 662, -1119, -816, 1005, 960, -837, -1166, 561, 1074, -484, -1384, -25, 1236, 46, -1411, -415, 1128, 545, -1045, -757, 939, 1017, -752, -1100, 655, 1214, -305, -1229, 207, 1391, 242, -1064, -277, 1241, 685, -1104, -723, 1003, 1006, -784, -1069, 597, 1090, -429, -1353, 71, 1222, 26, -1388, -445, 1189, 535, -1094, -761, 942, 907, -733, -1064, 609, 1268, -360, -1211, 300, 1329, 109, -1173, -206, 1305, 582, -1037, -751, 980, 933, -849, -1019, 599, 1082, -457, -1323, 28, 1175, -1, -1421, -404, 1161, 467, -1226, -827, 897, 901, -802, -1031, 585, 1235, -365, -1188, 262, 1357, 94, -1140, -180, 1303, 635, -939, -675, 1091, 941, -831, -1056, 616, 1149, -414, -1156, 101, 1212, 24, -1368, -386, 1244, 477, -1188, -656, 894, 793, -906, -1116, 612, 1165, -448, -1236, 252, 1328, 53, -1176]
4216a176R82J462p03j643L60J727l0j752k47J715M43j541q28J407J015j178j275
4233a262R76J477p53j627M16J700j79j622j67J688M59j549p66J472J062j248j286
4250a209J046J419o88j600M22J682j71j702j04J662L82j588p41J440R40j187j231
4267a228R28J461q36j560N39J655k63j614j55J660M88j605o76J459Q84j150j203
4284a216J064J360p81j527N79J585j82j677j17J757K37j497p06J426R15j234j202
4301a216J000J434q66j510N40J590k69j585j13J579M77j577q07J554R77j309j075
4318a176J124J255q43j454N40J623k87j633J7J615L34j622o08J453Q72j233j153
4335a176J004J366q64j554O35J523k67j564p9J637L22j578o39J511Q89j349j046
$$ y = [-1176, -194, 1268, 565, -1078, -718, 1009, 979, -773, -1020, 695, 1138, -403, -1231, 176, 1191, 13, -1262, -286, 1191, 438, -1189, -773, 927, 748, -874, -1041, 647, 1106, -443, -1209, 263, 1325, 77, -1209, -163, 1256, 568, -1032, -610, 1072, 901, -801, -905, 757, 1139, -449, -1190, 250, 1190, 3, -1228, -300, 1161, 325, -1235, -696, 959, 696, -918, -1073, 587, 1075, -530, -1206, 253, 1137, -13, -1216, -152, 1208, 427, -1100, -521, 1064, 882, -795, -912, 845, 1082, -415, -1121, 305, 1220, -14, -1216, -216, 1218, 352, -1158, -618, 972, 703, -882, -995, 584, 1061, -516, -1323, 231, 1208, -101, -1176, -52, 1203, 360, -1094, -554, 1069, 782, -851, -834, 781, 1115, -507, -1115, 338, 1210, -23, -1176, -172, 1194, 330, -1224, -589, 934, 667, -897, -976, 661, 983, -595, -1234, 277, 1166, -183, -1229]
4352a229J098J305r04j378O11J550k64j624K2J641K92j641n15J506P00j203j093
4369a126J102J269r00j475O25J584m64j577Q3J561K44j505n99J457Q43j327j059
4386a264J190J235q38j399N22J559k88j582Q5J554K59j629l98J409P63j237j061
4403a120J047J296r08j445N80J568l65j546R9J449K51j515n48J400Q46j316j011
4420a238J182J174r13j258N38J481k80j580P7J620K44j564n11J483P09j221j062
4437a119J130J137p78j479O69J532m57j523K0J544J22j386n61J483P56j382r87
4454a279J220J146r68j270P00J446l49j467L5J584J22j544l19J328P64j294q66
4471a011J016J220r01j421O69J521m89j553J94J510J47j500m50J364P35j296r57
$$ y = [-1229, -131, 1174, 270, -1108, -497, 1053, 789, -835, -813, 828, 1120, -521, -1036, 470, 1170, -33, -1126, -24, 1245, 345, -1130, -505, 1079, 615, -962, -879, 682, 926, -579, -1178, 279, 1122, -205, -1264, -74, 1161, 323, -1076, -554, 1005, 717, -865, -780, 774, 1033, -596, -994, 415, 1178, -59, -1120, -73, 1223, 315, -1130, -550, 1018, 653, -893, -794, 655, 906, -609, -1157, 243, 1089, -227, -1238, -56, 1118, 205, -1053, -515, 966, 686, -894, -817, 803, 1047, -517, -1028, 455, 1164, -57, -1119, 11, 1148, 370, -1109, -440, 1092, 635, -888, -868, 676, 798, -588, -1149, 334, 1090, -292, -1279, -59, 1087, 119, -1151, -451, 995, 646, -821, -786, 798, 920, -624, -943, 385, 1149, -145, -1011, 5, 1225, 324, -1097, -428, 1093, 604, -949, -755, 755, 902, -598, -1048, 316, 1051, -245, -1202]
4488a202J201J107j001j234P89J276l51j448Q3J547J46j547k67J452N24j260q75
4505a060J084J121r54j209P09J379n07j513K38J547L9j561k44J290O88j340q68
4522a161J196R86r66j105O21J394m76j461K24J480J18j514l23J450O04j394o75
4539a002J105J022r17j225P67J389n99j413L25J384M9j457m14J402O43j312q83
4556a136J192R77r77j178P74J257m07j384J49J497L9j462l07J438N33j308p48
4573a051J068J020q79j213P96J262n27j342K90J336jj387k85J380N38j284p93
4590a072J170Q81r60j155Q14J287n61j391L49J373M1j523j97J434M54j272o37
4607i65J134Q97r28j082P81J254n82j383L67J406r8j312k39J274M45j233p40J119
$$ y = [-1202, -1, 1106, 105, -1129, -340, 936, 585, -863, -780, 767, 913, -634, -901, 551, 1075, -185, -1060, 24, 1145, 191, -1018, -309, 1070, 563, -950, -712, 835, 874, -687, -931, 359, 1047, -293, -1161, 35, 1021, 55, -1050, -429, 965, 489, -972, -748, 732, 850, -664, -987, 463, 1067, -327, -1002, 103, 1125, 208, -1017, -250, 1139, 540, -873, -548, 836, 885, -572, -986, 416, 1059, -253, -1136, 56, 1033, 56, -1122, -348, 909, 502, -882, -733, 764, 803, -659, -966, 472, 1005, -303, -1051, 17, 1037, 158, -1055, -259, 1003, 476, -866, -576, 760, 759, -628, -913, 467, 1005, -279, -1072, 98, 979, 19, -1136, -322, 965, 404, -987, -638, 735, 776, -747, -944, 490, 944, -328, -965, 169, 1066, 138, -944, -163, 1091, 509, -874, -507, 899, 801, -511, -750, 524, 969, -264, -1004, 115]
4625A15R36j083j011P49J253o04j266K91J368m5j475j49J389L58j210o02J054
4642F8R82r63j046P20J229n53j371M10J371j14j373j20J313L61j200o96J135Q89
4660A042j034j007Q19J141o05j247L10J282l3j396j45J364M11j336m88J072Q25
4677I75r91q69O99J168m86j394M45J298j79j361K4J199L53j250n07J019Q68r46
4695F5j087Q38J058n98j161L16J309j36j306j08J268L99j317m81J131P18r47r43
4713i82Q51J042n39j227L91J280j67j305M0J216K81j243n38J160Q04j041j034
4730a011Q75J097o68j174M14J191q9j397l4J293L04j277n20J264O65r62r41Q31
4748a39J061o27j198M72J301k61j265o0J255K94j219m22J125O27r27r00Q20J006
$$ y = [115, 1051, -32, -1043, -294, 959, 355, -911, -620, 748, 703, -772, -921, 468, 826, -384, -986, 68, 1050, 87, -959, -239, 990, 437, -934, -524, 847, 733, -640, -760, 553, 914, -286, -982, 153, 1042, 8, -999, -180, 961, 356, -891, -581, 701, 668, -728, -873, 491, 902, -434, -922, 150, 975, -16, -885, -186, 982, 496, -898, -453, 845, 666, -695, -671, 528, 881, -369, -876, 143, 1011, 65, -1022, -184, 874, 276, -885, -569, 740, 604, -702, -810, 458, 857, -460, -941, 190, 908, -39, -982, -131, 911, 372, -855, -464, 816, 649, -656, -616, 600, 881, -362, -900, 260, 1064, 23, -1011, -136, 961, 293, -881, -467, 724, 635, -762, -796, 497, 801, -476, -996, 268, 933, -29, -970, -139, 922, 295, -903, -431, 870, 609, -656, -716, 539, 833, -386, -808, 317, 944, 17, -883, -63, 943]
4766I43p15j071L94J234k19j268m4J208L06j269m25J158O09r22p78P17J085n98
4784C45j161L73J268l22j180O5J111K98j134m22J060O56r66q94Q56J018p50j004
4802g83M09J141k53j197n0J244K91j330l69J151N35r51q05Q59R44o19j127N35
4820c75J200k91j276J30J190J06j099m11J201N28q95q17Q01R96q41r42M96J029
4838G30k63j121j9J281J69j201l85J108N39j026p05Q06R15o09j038M71J123l01
4856D74j233K39J153P2j104l74J104N36r40p95Q81Q72o45j057N31J037l03j121
4874f73Q4J126J89j152l68J071M69r55o35Q14P85o30j033N15J121l48j132J75
4892e77J115Q4j055l47J076N00q74p28Q52Q26o90r30N39J054l67j096J15J114
$$ y = [943, 228, -843, -449, 785, 566, -702, -746, 462, 768, -501, -926, 232, 841, -81, -859, -142, 943, 345, -816, -443, 825, 503, -677, -612, 499, 797, -337, -759, 301, 957, -9, -903, -47, 971, 221, -783, -374, 767, 514, -683, -733, 511, 802, -528, -897, 254, 789, -162, -967, -108, 836, 217, -910, -375, 825, 534, -742, -612, 578, 684, -415, -826, 375, 903, 8, -809, -8, 988, 147, -795, -299, 730, 467, -654, -673, 608, 777, -424, -809, 299, 838, -188, -893, -87, 828, 219, -819, -348, 775, 474, -759, -520, 633, 705, -399, -773, 331, 867, -73, -868, 13, 885, 240, -817, -286, 751, 448, -673, -589, 537, 726, -426, -794, 277, 746, -209, -844, -30, 755, 125, -908, -393, 728, 380, -752, -577, 538, 622, -433, -780, 296, 796, -78, -806, 46, 872, 182, -748, -209, 845, 478, -618, -503, 611]
4910F11R7j142l29J077N35j019o95Q86P64n69j002M76J007k82j167K07J073J01
4928F29j131k45J059M72q91p04Q75P99p78q71N75J055m57j004J45R65K01j199
4946e05k68J057M58r68o02Q87O77o76q22M75J012l19j150K55J084q8r88k13R32
4965B38N08r36n08O80Q85o74r75O68Q71l95r30J17J018P6j128j27Q86M88r51n77
4985g66Q33O59o63q27N40R21m49r98K27J094q0j001j50R50M55r49n51P64P69o91
5005H7q91N72R83m79q54J95R40L0j035k18J057L50r49n10Q54O28p05q52N40J010
5025G53m62r37K20R96r5r82j16R48L32r22m25P24P22p55p66O64Q72m95q76K97
5045c03Q86K4j029j44R64L42r72m20Q64M72o68p15N33Q28m06q91J59R75n6j019
$$ y = [611, 708, -434, -763, 314, 849, -170, -865, 21, 785, 216, -786, -310, 697, 415, -752, -545, 528, 629, -502, -747, 312, 784, -107, -811, 64, 863, 85, -786, -211, 844, 387, -617, -472, 493, 694, -505, -773, 284, 742, -226, -828, 59, 736, 60, -762, -287, 725, 406, -744, -489, 595, 507, -481, -694, 238, 746, -190, -698, -18, 867, 193, -782, -114, 757, 362, -568, -451, 567, 643, -485, -612, 274, 762, -189, -766, 67, 726, 63, -764, -224, 697, 248, -750, -523, 571, 491, -510, -660, 290, 745, -204, -755, 9, 778, 87, -804, -232, 751, 272, -582, -387, 553, 583, -452, -670, 387, 737, -212, -722, 132, 760, 55, -797, -257, 753, 291, -646, -426, 570, 475, -507, -623, 325, 657, -265, -690, 34, 756, 1, -765, -101, 771, 276, -600, -303, 583, 607, -422, -566, 398, 740, -232, -652, 212, 684, 16, -699, -166, 662, 256, -635, -476, 499, 443, -576]
5065e76p5R72K17q12m71Q20O10o69p19N94Q26m08r62L35Q70l5r26j26R01L46r39
5086b27m92R41M44o53o83N71P75m12q68K05R67j47r93M2R40J43p55m63P55N78
5106F68o66p38O31Q28n76p66K45R04n7q69n3Q41K25q00m22P64N58p22o51N04P76
5127F24m01p87J93R24j73r76L2Q84K48q14m06P23N98o84o98N89P62l48q76K91
5147b95Q02p0q53o3Q48K75q36m33Q00N24o48o51M76P65l66q15J95Q92j26r48P4
5168d53P97J30p75l21P49M65n89o04N09Q17n81p39K86P36oq30p0Q41K26q31l33
5189e76P91M40o86n34N07O59l39p98K05Q32j05q77MQ07K18q51k95P06N20o48p24
5210g44N84P35m24p20K53Q28j15p51n9P98J62p42l62P25M26n74n29M96P10m70
$$ y = [-576, -651, 321, 538, -274, -745, 75, 685, 16, -703, -109, 717, 309, -653, -318, 552, 517, -409, -535, 366, 712, -227, -719, 222, 666, 13, -670, -99, 676, 264, -604, -399, 568, 421, -572, -530, 410, 553, -202, -665, 90, 668, 2, -736, -105, 723, 147, -619, -374, 530, 473, -396, -449, 392, 617, -183, -605, 159, 717, -5, -656, -152, 624, 223, -564, -371, 553, 380, -596, -564, 320, 568, -246, -652, 71, 669, -15, -713, -124, 638, 290, -586, -295, 507, 437, -416, -479, 369, 644, -192, -625, 175, 699, 51, -600, -124, 641, 275, -540, -345, 547, 421, -527, -453, 344, 474, -301, -622, 127, 592, 3, -601, -92, 725, 144, -595, -309, 427, 421, -409, -479, 362, 588, -243, -576, 215, 655, -31, -565, -58, 601, 262, -536, -331, 501, 396, -481, -477, 330, 548, -303, -598, 108, 628, -20, -744, -160, 575, 151, -569, -316, 512, 397, -354, -413, 385, 547, -195, -557, 168, 594, 20, -509, -13, 697, 227]
5230B27o75J80Q25j89q04J6P51J54p70k49O66M18n37o44N46O37m36o90K89P80
5250D95j05q23k7P66K32p23l33P01L67n45n87O07N07l00p19K25P61n1r24M8P89
5271C61R7p59k38P18L40n73n29M24P14m13o67K79P40k74o72P0P07J23o91k34O19
5292A42L81o20m57N37N67m12o43K86O98q9q15Q5P28L0o73k05O77K87n69n40N82
5313b3M81l59o49L73P03k35o80O3O14O9n62l06O56L58o21m64N79N29l87n68K63
5334a66O21j49o99P3P30O2p45j72O47K19m98l94M51N12l88o26L47N60q0p35J13
5355c17O43R4o53k73P16K67n74m28N66M29l40n62K98N96j50p18Q8O93Oo37j65
5376d21O60K14n16m38M69N02l21o51L14N96k70n34M7O74L1p32m9N36L84n91l67
$$ y = [227, -448, -268, 557, 368, -436, -420, 331, 485, -285, -534, 132, 550, 13, -631, -85, 552, 116, -574, -285, 495, 390, -433, -460, 306, 538, -185, -518, 183, 550, 5, -582, 25, 532, 232, -487, -262, 499, 448, -476, -428, 361, 458, -301, -539, 179, 519, -54, -583, -159, 555, 142, -525, -246, 494, 220, -452, -382, 325, 448, -243, -477, 142, 523, -97, -554, -17, 550, 138, -505, -219, 479, 390, -425, -340, 388, 418, -255, -460, 217, 504, -65, -605, -23, 458, 99, -550, -177, 526, 291, -389, -326, 288, 357, -205, -511, 145, 503, -118, -582, -3, 526, 139, -429, -166, 455, 306, -393, -320, 410, 472, -273, -445, 202, 421, -77, -471, -20, 492, 104, -522, -175, 385, 305, -430, -317, 326, 420, -233, -506, 210, 477, -97, -525, 41, 470, 130, -432, -134, 462, 312, -406, -318, 375, 381, -256, -421, 239, 453, -63, -501, -32, 470, 149, -502, -188, 408, 138, -396, -349, 325, 356, -376, -425, 111, 495, -96, -463]
5397d63M64N12l80n97L08O08j36o66RP16O1o54j92O08K58o36k51M69L96l36n01
5418d03J65O94j81p53J29O87l9n78j87N97K63n16l87N09M24l81m80K48N27j04
5438B34o00Q0O22K2n94r4M94L01n47l68M24N30l79o14L37N69j98n97J08N49K9
5459C08n13j71M81L34n50l90N22M11l48m73K59N07j01n70N3N51M4n43j84N93K33
5480D53n41l94N23M06m14m30K68N49j73o03P1N69j4n26j70N77K32n01l59M58M33
5501D14m40l73K83M62j03n49Q5N52N9o34m5N20J12l62l37L95L54l11n23L40N11
5522D10k18m89N1N89p7m69j69N00K72m93l03M05M11m12m00K82M43j39n33P9N93
5543C33m1n07j46M86K88n21k53L83L53l69l63L00M09k34m51J27M94k8m69r5L97
$$ y = [-463, 1, 513, 133, -464, -156, 452, 316, -350, -341, 375, 436, -218, -410, 198, 456, -180, -431, 38, 434, 98, -403, -238, 456, 275, -478, -349, 338, 299, -279, -466, 131, 394, -122, -509, 0, 424, 43, -437, -189, 338, 234, -366, -286, 336, 358, -236, -330, 164, 465, -82, -450, -26, 504, 125, -489, -152, 417, 219, -378, -270, 279, 308, -205, -376, 105, 439, -111, -501, 21, 432, 84, -389, -130, 377, 276, -294, -241, 310, 354, -189, -373, 220, 453, -88, -482, 41, 447, 33, -397, -129, 420, 247, -356, -285, 284, 270, -256, -426, 151, 383, -118, -477, -19, 414, -26, -399, -116, 346, 243, -306, -221, 331, 390, -244, -289, 231, 343, -19, -356, 39, 393, 82, -441, -101, 410, 192, -297, -246, 343, 266, -203, -372, 128, 400, -93, -396, 9, 420, 8, -392, -110, 333, 194, -339, -260, 333, 292, -215, -361, 125, 413, -108, -361, 22, 375, 6, -357, -57, 352, 118, -333, -206, 288, 260, -209, -304, 93]
5564I3K11m15l32M76L10l45k93K08M48j93m70N6N33nn54K1M30K20m48l52N13L17
5586D29l37m85L09L91q3n01R0M81p6m41p4M40J95m33l19M26L27l64l96L12M25
5607C16k01m45J72L93J9m57j27N24J63m76j99M30K94l28l83K19M02j82l91J57
5627a00L85k6m46q1M02K05m04k54L61K37k87k70K72L26j36m68J01M30Jm28j07
5648b87L99K12l96k66L38L15l20k35J66L69j52m25J23M63o3m53ML13J70l56k40
5669c21L06K88k67l75L11L12j46l34K8L54K8m40p8M85L7l98j08L08K81k70k64
5690b63K04L26q3m23Q1M40qm97j7M08J25l76j49L69J11k79k90K90L71k44l33J26
5712a11L58n9l48j34M19J84m08k10L09K07j52l75J84M50j55l89J10L79j7m38l2
$$ y = [93, 304, -111, -443, 33, 343, -2, -295, -87, 361, 168, -302, -246, 287, 282, -272, -251, 179, 399, -49, -401, 112, 429, 92, -393, -84, 307, 224, -277, -187, 294, 218, -223, -297, 143, 338, -95, -414, 12, 339, -25, -421, -109, 316, 115, -330, -158, 235, 254, -203, -330, 194, 357, -119, -318, 112, 406, 78, -305, -86, 316, 134, -257, -100, 285, 259, -187, -268, 134, 339, -65, -319, 42, 279, -8, -278, -6, 320, 184, -284, -183, 247, 248, -180, -287, 112, 324, -72, -338, 0, 315, -5, -240, -74, 295, 143, -282, -159, 304, 241, -212, -208, 105, 275, -81, -321, -15, 273, 6, -369, -58, 254, 108, -226, -198, 156, 184, -256, -334, 151, 188, -210, -318, -10, 271, 1, -263, -59, 267, 184, -239, -158, 282, 274, -223, -240, 168, 293, -83, -232, 137, 248, -31, -321, -31, 340, 96, -237, -111, 247, 188, -160, -294, 125, 309, -99, -309, 0, 207, 55, -320, -136, 314, 159, -230, -120, 259, 242, -196, -228]
5733b28L59O2l29k00L67K60l62l07L63L23k21l42R6L43jl58m0L78L8k83j89L65
5755I4J78k69k00K54J94j59l23J00L73n7l56J1L36K6k74j48K89J77k62k33K20
5776b9L10k11l48K17L11r7l70k6L94M8l63j17L43J29k73j75K26K45q8l61N8L90
5798B13k5l82L1L63J0l60p6L13J30k40k16J71L35j94l03J74K86j39l07L6L31J01
5820B52l65j42L53J47k70k17J93K52j46k54K4M39p0l71N7L52k5k87j75L53J44
5841B44k82k33K95K19r8m20J90L10q1l18J3K40J23l48p9K86J55k33k15J69K78
5862B15j77k64J29L48j58k68J6L10J8k34k7J36J63k05j64J94K55k27k91K11K10
5883A90m4k91k7L14O1k54j29K39J41k17k40K79J90j71k26J03K86j11k76O7K68
$$ y = [-228, 131, 193, -136, -336, 31, 291, -71, -378, -15, 308, 87, -255, -159, 184, 183, -175, -215, 163, 201, -82, -271, 94, 272, 3, -197, 57, 251, 92, -231, -131, 242, 185, -171, -160, 176, 202, -72, -220, 69, 246, -16, -249, -29, 281, 70, -278, -61, 250, 153, -217, -243, 151, 199, -164, -281, 62, 191, -82, -257, -31, 214, 126, -235, -177, 213, 188, -194, -163, 200, 210, -150, -226, 87, 217, -23, -239, -68, 267, 73, -230, -56, 230, 91, -216, -180, 151, 252, -113, -255, 98, 245, -25, -242, -49, 203, 57, -197, -173, 266, 196, -175, -118, 234, 209, -78, -253, 100, 244, -38, -271, 24, 243, 145, -275, -85, 225, 144, -174, -161, 79, 202, -146, -225, 61, 216, -17, -232, -63, 215, 38, -226, -97, 251, 93, -175, -159, 151, 169, -65, -92, 44, 207, 2, -162, 32, 287, 60, -231, -20, 190, 146, -145, -172, 142, 203, -51, -180, 59, 200, -17, -257, 22, 212, 41, -185, -82, 204, 93, -183, -116, 152]
5904A52lk46j13L26P1k26j60J46L04j36l61J97K26m0l08M6K32J05k85j37K69J17
5926A76k46k25K07K44j11k45R2K48J8l13L4K76mk52p8K34J62j45k99K20K31k13
5948A1j86J18K24rk74j0K53M3j98k02L37J28k85j75K36K06j99k00O7K93q9k12
5970a23L0J94O6k62p9K34R3j63j74K03J67j56k32J10K62q8k41M0K35M5k52r7K05
5993A7J12j98j14J56J80j24j95Q5K21M1l09m1L10Pl07L2K13P6j47j65J57J37r1
6016E3k08N9L32j16k69Q8J89M4k51p1K39N6j33j32O7K01q1k66J31K36j24k44N
6039a95K42Qj99j7K19Q8j56j53J17J92j26j66P7K02n4j95L9J79K1j89r6J52J97
6062A87j88j67J52K11j29j55K4J66m1k33P9J68O8j99m9J72J05k49n4J78J37j59
$$ y = [152, 149, -97, -210, 116, 187, -39, -199, -53, 251, 115, -246, -49, 177, 137, -171, -125, 107, 212, -73, -210, 59, 176, -70, -295, -88, 156, 45, -200, -108, 140, 158, -155, -121, 155, 151, -101, -179, 55, 217, 72, -227, -7, 224, 11, -175, -57, 167, 158, -116, -126, 127, 170, -28, -230, 107, 235, -50, -225, 11, 217, 18, -182, -115, 178, 89, -123, -93, 101, 167, -95, -174, 60, 153, -10, -184, 19, 186, 30, -202, -92, 170, 82, -159, -119, 116, 161, -91, -188, 17, 129, -69, -183, -27, 153, 29, -166, -81, 140, 181, -128, -169, 141, 148, -159, -127, 86, 162, 15, -150, 7, 144, 53, -155, -96, 236, 120, -149, -61, 128, 172, -79, -150, 89, 145, 12, -120, -53, 148, 67, -199, -68, 168, 44, -200, -195, 47, 55, -144, -161, 58, 146, -10, -163, -46, 146, 20, -146, -69, 133, 79, -116, -77, 102, 123, -66, -162, -10, 187, -1, -168, -16, 195, 66, -89, -65, 101, 60, -173, -94, 74, 142, -57, -106, 66, 171, -78, -132, 46, 183, 24]
6084B4k05J73J74p1k15O7K02n3j72m7J39J08j67r0J03R1r1j40J51J58m7k61M7
6107a22J81kj44m9J96J14j99q2J19J50j63j26J27J55n9k79J00J92K7j61j09J48
6129A4J15j05j41J61J50j62j88J49J69r0k01L7K07L9k33k4J49O9j37o3Q7J65j70
6152cj21P0J90q3k39J05J67J4j88p7J94J35j87r5J31P3m0k06J44J00k3k10L7J62
6176E0l0j03j8J73K8j31j03J41P7p6j40P0K26j12j45O2J52%j64o7J70J05j38j62
6200a35K02J08j32j68J30J26r8j18M4Q5P5j27o7J39M9j90n2J14P6j2j71L8K54
6223A70p6k21P7J25l0j82P0J11O2j59k8Q8J16r5j57J30J16l3j97M4J74l2j65l4
6247a26J56P0j66k8J27J6k3j23M2J33m0j81N8J51l6q5k8J57k6j06r5J58O5n9q5
$$ y = [24, -181, -8, 166, 95, -120, -53, 149, 96, -76, -123, 16, 124, -43, -133, -30, 61, -30, -170, -19, 139, 92, -169, -122, 59, 57, -87, -136, 60, 174, -25, -107, 12, 162, -1, -127, 0, 155, 96, -183, -83, 109, 136, -25, -134, 14, 129, 24, -117, 44, 194, 32, -156, -7, 162, 72, -129, -92, 115, 154, -79, -103, 46, 115, -22, -85, 2, 167, -3, -124, -54, 136, 53, -186, -81, 86, 100, -88, -165, 29, 164, -23, -118, 13, 86, 46, -160, -16, 84, 61, -149, -112, 50, 20, -83, -101, 72, 100, -31, -134, 7, 84, 8, -132, -62, 164, 52, -93, -31, 121, 121, -43, -110, 60, 165, 27, -135, 67, 175, 43, -125, 5, 131, 33, -85, -41, 44, 119, -8, -75, 64, 113, -77, -129, -15, 61, 49, -122, -84, 170, 94, -127, -50, 75, 45, -137, -67, 44, 106, -53, -81, 7, 123, 28, -129, 1, 117, 84, -113, -69, 105, 73, -92, -126, 30, 100, -66, -94, 33, 49, 26, -97, -55, 78, 38, -143, -85, 66, 30, -55, -83, 74, 48, -58, -153, 5, 70, 11, -74]
6272g4J10P6n6j48l4J99L0j98K4J16O7j46n0N2J46j13j38Q5J14m8j37N4J81l6
6296G6j11q5J53Q9j67m7R0J77j31q7j2J89j09p8JJ51l3j41RJ80oj43o8J70Oo1
6322A2j15M8J35j8j72qJ48J6j03J0M4R5j54j05J29J52r7j58J69Q8m5j03n3K05
6346A20l5j58j8J32O4j33j30J89J00j15j17M5J61l8j68K2J27j3r7j9J11R4j20
6369Dj39J79N9n3j12P9J47j47j06M8J49L7j77l4J04Ln1l8J13M0j00o6N6R2q2l2
6395b7l7J23k6p8o2J23M7m0j57J46J35j20j38N6R8m6m8j8J17n6J4j71K35O7j58
6420b1q1R6Q5m0r0J6J56r8n8j9P4J9o1m2J62n4r0rJ14J11j46j21P1J66j28j16
6446a04J20K8Rq9OO6O2r6j41J41L6J8j41M9J27j7j51M0Q7or7o4J68J3j10l5J55
$$ y = [-74, 36, 112, 56, -92, -126, 73, 103, -95, -71, 45, 112, -34, -84, -32, 114, 1, -137, -52, 62, 14, -123, -69, 112, 76, -35, -120, 33, 122, -45, -92, -2, 175, 44, -43, -55, 134, 25, -53, -52, 99, 66, -75, -66, 114, 108, -35, -103, 67, 73, 12, -103, -55, 80, 62, -110, -118, 30, 46, -57, -47, -3, 92, -62, -167, -38, 114, 17, -141, 28, 116, 71, -32, -85, 120, 85, -73, -91, 41, 105, -28, -158, 31, 131, 16, -101, -56, 105, 67, -101, -79, 48, 35, -62, -81, 30, 124, 4, -135, 44, 103, 50, -62, 17, 164, 17, -89, -41, 108, 145, -32, -66, 38, 41, -10, -48, 65, 105, 5, -61, -5, 87, 5, -27, -64, 59, 33, -45, -107, 16, 63, 23, -134, 12, 147, 27, -111, -55, 43, -3, -51, -69, 48, -8, 6, -165, 70, 137, -21, -102, -6, 79, 39, -51, -35, 121, 23, -35, -54, 20, 39, -22, -64, 98, 44, -46, -55, 59, 170, 24, -97, -26, 140, 12, -104, 16, 44, 53, -36, -30, 36, 98, 2, -139, 2, 38, 56, -85, -36, 91, 74, -77, -37, 50, 44, -53, -117, 51, 64, -46, -81, 74]
6473G4Po1j54J43J00j17o6R3Q1j13k9QJ02k0j08L4%J88j43j00N1M2M9j05QP1K
6500C7k8p3J11L2j60L1j0J63m5j15J6J36q8m9%O5K5j25mJ44k8n3nK6P1r7m7J7
6528e3J70j34m9j9J18m6m6L8M5Q1j67M2L2L7p9l6L5Q0j5j24P2J04oj09l3L3J45
6555A16q9r2R8J01p4j14Q3N4m6p0l5J44m7j31N3P3M0n5k4M4mm4l2k2J94pk11R9
6583BK3K5q0n7J27J9j34mL3R4j3j23N9N3J2p8o9J36O1j84Q7J29o4j61j0J40Pk2
6611Hj00Q4N0l9m0MJ31qr1K5K3L3q0m7L5R7j48P1M6O1m0j57J7J67p0o8K9J9J0
6640B2l3m9P0P8kj66N5J16j01Kr1J48o3n1l8J54k8k7p6O7M2k7m6M2K8K8q6o9J68
6669F7Nq2n4Q2M8o5K3lK8m2l2O4N9o9o8n1J27L9q1n3J06J7l2q0R3J7k0j32J19
$$ y = [74, 81, 20, -134, 9, 109, -8, -74, 19, 100, -13, -42, -34, 68, 48, -60, -26, -26, 162, 19, -81, -30, 12, 61, -44, -36, 35, 37, 9, -64, 47, 79, -81, -50, -60, 103, 58, -57, -41, 95, 7, -42, -42, 23, 48, -77, -81, 63, 35, -18, -23, 3, 74, -23, -70, -53, 117, -17, -66, -85, 33, -13, -59, -21, 24, 105, -62, -20, 12, 49, -30, -66, -31, 49, 34, -90, -18, 86, 80, -29, -62, -29, 116, 27, -65, 33, 134, 60, -54, 29, 83, 37, -33, -68, 76, 29, -102, -49, 24, 64, 9, -15, 29, 25, -19, -51, -73, 121, 114, -97, 2, 25, 50, -30, -87, 40, 59, -75, -79, -46, 48, 35, -88, -29, 24, 36, -42, -111, 25, 86, -98, -11, 118, 54, -107, -117, 23, 30, 8, -92, -8, 42, 3, -37, -33, 98, 90, -1, 24, 47, 80, 0, -47, -12, 85, -63, 8, 54, 115, 75, -82, -65, 102, 32, -36, -7, 12, 22, -11, -60, 10, 88, 86, -80, -25, 91, -10, -8, -99, 49, -14, -65, -103, 51, 23, -4, -80, -13, 29, 2, -44, -2, 26, 54, -32, -101, 67, 72, -10, -64, 18, 66, 1, 24, 21, 49, 7, -25, 39, 98, 29, -39, -90, 37, 76, -5, -58, 48, 65, 33, -47, 46, 63, 43, -89, 30]
6698C0J3n5MJ9Q8j01n3K6O0N0k1j71J37M9j48J8K9M7n9l1P6K4K4r8l4J63o0m7
6726b1l7M3R4o6o4Q4J3n3n2O2O6k8l9LP2l4q2j9N8M2M6p2l9O5ql0l0R9Mj29j0
6757f2O0L9m3m2N3L2q3l3J8Q2j7r9P1K8K4j0r7J16K9q3l6N7R0j37J0p2J27O0j55
6786g3j5J48rj32L3J8R3n6r8R7J9q1m0J39N3l8m0p7R1j1m1L8RN5j16J6k6O8j7
6815Gk7M2J4L2q6lO7or1O2%j3m5o3O4l8O4m9L9R6j00K4J8J6pj09K7J05Pk1l1n
6847a0K9j9n8O7pJ9pjM5qp1m8N9P1n5l3o9J59M1k33Q7J24q1K0lk8O0n0n4P3M4
6878F3r3j2O4Q3j44J7nO1n1k5J2P9m2n7l1O5Q5j07KJ2P0j16JJ7O8L9p4lO1K0j15
6909e6L3O9%l7m3N1L5l5o7J08L2q8M3n7J30k7j49O6M0oj01mL5N8j7j05J57lm6
$$ y = [30, 43, -12, -8, 11, 99, -2, -55, -29, 31, 81, 60, -111, 26, 75, -73, -55, -26, 21, -38, -69, 7, 31, 55, -43, -77, 86, 26, -21, -58, -15, 79, 13, -51, 33, 46, -7, -59, 3, 69, 41, 2, 5, 77, 43, -39, -58, 0, 42, 88, 16, -23, 42, 34, 4, -26, 73, 77, -52, -62, -2, 37, -6, -48, 5, 37, -46, -79, -61, 21, 4, -95, -24, 4, 28, 18, -79, 37, 66, -17, -53, 4, 94, -43, -33, -105, 22, 82, -73, -88, 60, 51, -81, -48, -30, 63, 7, -91, 6, 25, -56, -96, 43, 96, 58, 18, -59, 32, 21, -20, 18, 27, 82, -34, -18, -44, 24, 7, -20, 22, 36, 68, -18, -21, 46, 40, -51, 11, 11, -2, -47, -110, -46, -84, -20, -69, -30, 66, -34, -10, 8, 24, 17, -92, -65, 40, 47, 26, -5, -10, 19, 0, -58, 9, 2, 21, 14, 13, 58, 50, -21, -69, -10, 61, 6, -27, -96, 63, 104, -129, -42, 82, 1, 21, 18, -10, 50, 0, -54, 19, 63, -30, -42, 22, 105, -39, -22, -27, 34, -17, -42, -30, 49, 7, -50, -81, -16, 69, -38, -36, -24, 46, -70, -69, -52, 16, 55, -19, -22, 39, 59, -56, -23, 46, 46, 9, -34, 17, 52, 17, -50, 58, 90, 2, 45, -12, 118, 91, -58, 8, 48, 42, -59, -63, -28, 30, 13, -92, 65, 62, 16]
6938A6l9o2J38p1J0o2O3K6o9r7J29P2q5J3k7Q4l8Po1P6ro4PM4L4L4j35N7J23j16
6968bMk3J15o0j08P6N8J1j02O2M1%p2j1J5k%p7M6Q8N0j11n3J02M4j07m9J13jk9
6998A8q8R2K3m8m1l4J41j02p2P1J06m1j5p4J07mo2r4R1O6o0q3J07L4o1k1L0N2
7026C8K3p0n8O7N9q8m3P6J4lj23P2M2L3p4JN2pq5O2M7M1j28k9J37m6J6l4M8jN
7057D4j09J2J37j9j61P7P3N5j62K5J9R3j57j2P7L7l4q6K5P9M4o3l8P1QLj44J52
7085D6j0n7o6L6J01k2j05L6R2p3jp3N0P9o5n0P4J09p2p7N1O0J3j59N2R9M0j17
7113io3OJ53j03j5O7M4p5n0J7O8l0r1Q7O8k1q9m0J20O7j07q6Q5j1j4n6O1L3Ro4
7143c9L6P4k4j12L3L0M3q0l1J25nM0j42P3RK1j02L4P2ol6J4J9K9j0j36Q7O9l1
$$ y = [16, -23, -85, 53, -18, -8, -70, -7, 19, -50, -147, -18, 54, -31, -18, -45, 39, 1, 8, -53, 23, 14, -50, -43, 1, 35, 69, -66, -9, 114, -2, 2, -21, 94, 34, -74, 2, 60, 71, -31, 31, 72, 72, 0, -11, 4, 2, 2, -75, -29, 59, 109, -2, -55, 47, 91, -16, -65, 48, 47, 18, -70, 22, 45, -3, -44, -78, 63, -39, -111, -40, 66, 25, 10, -64, 43, 39, -23, -117, -26, 40, -20, -103, 4, 38, -23, -44, -14, 38, 61, -9, -67, 0, 59, -29, -72, 4, 18, 15, -108, -36, 6, 39, -35, -34, 18, 11, -74, -12, 35, 76, -52, -81, 56, 10, 26, -8, 40, 39, 44, -65, -53, 84, 65, -96, -19, 54, 109, -53, -28, -9, 84, -73, -85, -8, 29, -5, -91, -66, 13, 57, -6, -44, 27, 35, 38, -106, 46, 36, -21, -87, -51, 50, 28, -77, -41, 51, -22, -23, -96, -46, 33, -32, -82, -8, 101, 29, -48, 3, 63, 76, -83, -31, 68, 108, -9, -72, -66, 87, -16, -31, 36, 80, 5, -45, -28, 40, 10, -81, 6, 74, 53, -36, -76, 44, 111, 4, -82, 3, -8, -22, -78, -17, 16, 25, -39, -3, 71, 47, -65, -32, -2, 41, -39, -70, 55, 50, 90, -52, 21, 30, 51, -51, -17, 55, 49, 13, 27, 46, 75, 65, -71, 16, 85, 54]
7172E4o6O3j4%k7k0O9o2j8n2O8J07j06j00J14L0o0m6N0K2mo6k2M6Q9r7n2J50n6
7201fj7l7L0Q0n0l3O4L7k6p9J6K1L8q7j2K9R1m3l6J4M2l3n2O2L8o4j6pR6J9j31
7232e2J6R6L1n1r8R3O2q8l0P2j2qj11L0J01Kl2k5L4O7r1j05J14R7j29m6J22l2
7260B7k2o7K4M7M5j09L8O2M5j65K4M9K9m3r2Q8N3K2o0K0N5l8o7K7L5P8o7j31P6
7289a7J04n0n6J7N1j0o3KQ7Lj32k4J59l7p7o4O5J45q8m7n0J20M9j34J9O0L6j18
7317e0l2R7M9p8l6K8M9l4p4O0QL9m6q7J35j9k8o5J45Oj07k6L2Q7m3l5L3R1l5j05
7347d1pJ53l0p1K4J2l1O2j61R2J21j74m2M2J06q8N1m3M8Lq1k0J08K3m2n1PQ0r9
7376d9j8J04P1n8r8kN2P6j44QQ5J3n3k8O2N9p6j57M5J75n2j01P5M4Kp6o0K52q5
$$ y = [54, -12, 51, 37, 37, 10, -10, 59, -3, -21, -73, -5, 102, -4, -104, 10, 40, -20, -66, -16, 6, 2, -64, -86, -40, 49, -48, -100, 50, -6, -23, -60, -30, 50, 0, -33, 31, 68, 42, -37, -21, 0, 38, -49, -61, -32, 59, 16, -20, -6, 36, 3, -49, 13, 51, -13, -29, -36, 60, 79, -52, -36, 60, 91, 40, -58, 35, 97, 9, -21, 51, 39, 31, -80, -50, 51, 53, 21, -4, 30, 97, 6, -99, 15, 112, -17, -63, 59, 27, 5, -62, -38, 9, 54, -55, -17, 45, 90, -75, -51, -2, 27, -16, -108, -20, 33, 55, -5, 15, 70, 32, -35, -8, 27, 105, 38, -93, -17, 87, 37, -19, -2, 49, 39, -24, -22, 65, 68, -64, -88, 71, 34, -43, -107, -42, 103, 15, -32, -82, 38, 87, -47, -28, 32, 68, -50, -82, 15, 64, -14, -50, -22, 27, -7, -81, -21, -13, 26, -20, -107, 28, 9, -19, -84, 61, 67, -40, -66, -34, 53, 10, -25, 8, 99, 64, -41, -48, 105, 75, 4, 28, 40, 9, 71, -90, 2, 123, -51, -93, -51, 55, -33, 18, -25, 23, 26, -55, -75, 33, 56, 14, -37, -30, 50, -49, -67, 37, 108, 50, -48, -50, 2, 78, -66, -58, 27, 40, -13, -41, 21, 80, 4, -153, -108, 67, 15, -86, -11, 33, 35, -41, -101, 151, 66]
7405F6k2j41J24P1j24n1J43M7k3j82J50jom1j18J62Nl7j8M8O4m8n6k6M8J8q9O8
7433C1qM1l9j08J02N9j30j4O7Jo3K5J1K2L4j02O1RN1j40Q1O4K2o6n0M6N6o8k5
7462c0M9Nrj16P2M3N9j41N4J02k9l3o3M4R9p5q9R1M1j4j39L2O8N2j04L7M8K0q0
7491fj43J42J13p2j08J7Q8M1j11lR0l4n8m5J01R0j13p5P4N4n5o1L6O6q2J5RN1
7519B1O6k01J6J03P1o6j30J44N6j3j67J13J4k3o3L1M7N4j24J7N3M6k7o4K7R1n2
7546D0j13Q7J7M6q0J0M5Pj87J2J53m1M3j09N1P8r6oN6N8r7j06J26l7J07k03R2
7573d7K3O8j02m4N8J62q4j60J06R5k8j19rJ13l9o2mJ19J0m8q0Q7M1o0K3j15J88
7600I2o1q7N4J07p9qk2O8P4j75m0J24K8r1n8J2J56p5o1JQ3J1j02J7R3j3o1K2J8
$$ y = [66, 44, -97, 27, 98, -26, -77, 66, 113, 90, -92, 58, 57, 51, 10, -108, 54, 59, 22, 4, 52, 116, 68, 12, -14, 34, 52, -37, 31, 23, 64, 25, -83, 19, 78, -52, -66, 1, 2, -61, -36, -25, -3, 31, -71, -10, -1, 50, -90, -9, 55, 77, 11, -39, 7, 63, -5, -30, 19, 24, 15, -101, -29, 14, 73, -68, -14, 88, 59, 26, -37, 7, 106, 31, -58, 33, 74, 60, -79, -47, 21, 73, -31, 6, 54, 74, -6, -149, -7, 106, 34, -74, -57, 31, 72, -39, -42, 48, 14, -44, -89, 12, 102, -11, -86, -12, 42, -13, -74, -38, 28, -54, -39, -30, 21, 87, -114, -98, 5, 76, 10, -120, 24, 80, 67, -100, 13, 27, 4, -59, -28, 19, 73, -51, -34, 19, 65, 38, -26, 1, 92, 40, -73, 14, 31, 77, -3, 7, 52, 59, -128, -116, 37, -4, 39, -70, -19, 59, -37, -43, 13, 71, -26, -132, -6, -43, 64, -139, -47, -24, 44, -58, -102, -44, 118, 34, -126, -20, 75, 47, -72, -81, 32, -7, -69, -73, 46, 56, 8, -72, 15, 56, -4, 19, -96, 92, 31, -56, -2, 105, 26, 18, -4, 64, 138, -37, -77, 47, 75, -16, -74, -62, 94, 19, -42, -41, 42, 53, -49, -32, 61, 48, -13, 9, 27]
7629B7K0j38N3l5J15J0j92Q8J37q7k0nQ9M5j00r5J52J2o1o6K3J62j06j37O2J32
7655H5j4j54O7Q3L8r0j00J29nk9j48J39R7j08j5jP6m5m9MQ5M3n6j00Q8O9j19j10
7683a40J61O2p4j35L5J32o9m5LJ05k1q9J3R2l5j4p3J06O5n1j23P8L7Q3j94M6Q2
7710C7N6j17k8O3J00j25o7P5R1K3j77NJ59n7j08k4J76p3n9j7Q0Q3j16o6L2J13
7736E9k1l3r8J90p6ro9J31l9q8k6K6J19q5m3%J58j46l6P6Q7o0m8J3Q4rq1j8P0
7765B8O7q1r8J07R8r5r5Q7M0j4r0OR5j3q8o3J34O7j25MM3Q9l9p9l0J59m7j25K9
7794b9K5P1j04k4R8O5j14j36J92J9q2k1L1O9m0p3J2N8N4j34l1J33Mj04k3N2J22
7821I0k5r3k8Q4j0j09N2P6Mo9l4J7J00j1j10J22O1j01j25Q2J04l5m9m8J21Oq5
$$ y = [27, 47, -91, -38, -73, 42, 52, -140, -52, 85, -2, -22, -27, 62, 107, 7, -88, 64, 76, 15, -51, -28, 134, 28, -109, -47, 85, 71, -83, -16, 67, 105, 15, -85, 44, 39, 10, -138, 1, 98, -10, -25, -26, 50, 5, -44, -40, 45, 88, 32, -68, 20, 89, -30, -140, 21, 83, 9, -126, -91, 41, -28, -73, -70, 35, 14, -75, -62, 30, -5, -19, -92, 14, 79, 28, -95, -17, 20, 103, -91, -45, 37, 93, -24, -52, 11, 111, -14, -81, -6, 85, 108, -69, -64, 95, 38, -70, -94, 82, 9, -50, -67, 13, 96, -20, -86, -54, 59, 38, 5, -93, 97, 21, 12, -57, 74, 35, -53, -79, -53, 66, -19, -62, -62, 96, -50, -86, -10, 77, 17, -31, -18, 66, 57, -24, -42, 28, 95, 14, -84, 23, 121, 26, -69, 18, 58, 44, -46, -40, 55, 42, -46, -109, 25, 92, -33, -29, 14, 103, 64, -15, -45, 114, 67, -58, -29, -4, 67, -37, -61, 37, 102, -12, -148, 44, 63, -19, -40, -9, 60, 20, -53, -41, 17, 71, -63, -94, 39, 43, -61, -84, -32, 90, 65, -28, -56, 28, 18, -91, -39, 37, 41, -28, -62, -45, 55, 44, -66, 56, 117, 16, -109, -27, 77, 42, -7, -55, 66, 72, -13]
7848a3o1J02M7j07k8J33ql3q9OR6l7r4R1RMq6n0J40L1q0m7N2J04j52j6P7L0M4
7877F5j00p4R3O5q1n3J11J00j31nJ1R0k6j33k4J61J8j27K9P4kj59L0Q5P2q8o5
7904f4J18P8j24o1N2Q6o8n8qJ32Kj57o2J78J5j14l3P3J90j26j54Q8N1k3q5m9J46
7931B3jn2n5J05K0o7j04J48O1p1p3L2J15o3q6KJ47M0j55q5J87J7q9j05J35P9j39
7958c4k0O5Q9l0j91R0J57j48p7N2J11Mn1r3J10L4j6j07O1P8m0j07k3J43j9r6l0
7985h8J19Q3j24p7J26Q6j13r3LJ67m3j48N6J21l0j48l2J67n9L8j18J13R8j21q0
8010i7L5J05N4k44M0K17lj46%R5Kn8r9J07J00r2r5J24J7r0k6j7J21J3j11jR2P2
8038A15j86NJ30Ml0j71J28J20j05l9qQ6%r9k0J17N6j38n2N5J40j15j14J22Q5q5
$$ y = [-13, -74, 28, 75, -32, -60, 73, 65, 32, -57, -51, 45, 8, -86, 5, 14, 18, -68, -118, 22, 53, -27, -74, -22, 82, -70, -86, -9, 21, 65, -35, -109, -16, 49, -32, -85, 26, 126, -5, -10, 1, 91, 65, -68, -92, 69, 87, -40, -11, 63, 61, -98, -68, 17, 89, 1, -64, 54, 132, 8, -53, -1, 85, 17, -41, -49, 83, 85, -72, -134, 44, 59, -55, -88, -15, 175, 49, -105, -17, 34, 11, -74, -123, 23, 22, -30, -85, 20, 40, -27, -131, 17, 78, 7, -66, -34, 81, 18, -68, -66, 81, 121, -34, -119, 68, 85, -4, -109, 26, 105, -34, -54, 11, 100, 70, -121, -31, 126, -22, -99, -47, 64, 68, 17, -76, 34, 68, 52, -55, 6, 84, 44, -63, -86, 57, 38, -58, -88, 31, 114, -10, -87, 39, 125, 12, -81, -78, 89, 46, -102, -46, 75, 45, -103, -135, 32, -27, 11, -107, 6, 104, -17, -97, -62, 43, 97, -147, -107, 110, 107, -39, -39, 56, 58, 0, -99, 8, 108, 16, -79, 45, 62, -28, -54, -71, 50, 63, -48, -49, 43, 115, -71, -66, 64, 68, 38, -133, -5, 115, 10, -29, -37, 49, 49, -50, -70, 47, 103, -35, -87, -32, 108, -7, -121, 1, 86, 1]
8064Aj51M9K02j06o1j0J55J4j49K7M3R0j40J8OJ01n5l1q0J55j5j40l9J43R2k15
8090i6M2J18J5k5j36J03J03j41o4M7J06Oj55K7R7M4j00q2J59j3r5p3Q2J08k9j19
8116g1k9J54M0j91nK21n6j29o4J39R3j04j18J29J19j40k9K9J20k8j90N3J69o9
8140D3m1q6J52L9o2p6K5J82j08j85O7J04Kj65M9J00R0j50o8Q2J12r3j37J04P5
8165E5L1j64M4J5R9r9n4J20qr9pJ30k1n8j11J03J12l4j42L0J47m4j67N4J34o
$$ y = [1, -150, -101, 101, -5, -66, -76, 79, 93, -56, -29, 14, 104, -36, -18, -12, 89, 34, 3, -77, 78, 63, -77, -116, 27, 119, -96, -54, 64, 79, 54, -82, 21, 124, -17, -81, -34, 72, 78, -77, -50, 47, 91, -9, -91, 68, 55, -40, -113, -31, 77, 48, -71, -100, 54, 94, -97, -102, 119, 63, -66, -130, 9, 102, -2, -120, 9, 128, -12, -41, -12, 108, 80, -110, -57, 112, 43, 2, -84, 68, 107, 45, -31, -6, 176, 68, -117, -50, 54, 56, -109, -60, 40, 130, -20, -88, -6, 106, 13, -124, -20, 55, 86, -78, -34, -19, 80, -19, -73, 47, 39, -60, -67, 63, 42, -16, -127, -24, 88, 54, -88, -58, 89, 45, -122, -68, 66, 60]
8191F0
$$ Imaginary data points
##PAGE= N=2
##DATA TABLE= (X++(I..I)), XYDATA
0@%%%%%%%%%%%%%%%%%%%%%JlMoQqQj0J6k1K3k6L2l7M1m6N3o1O6p4Q4r3J03j13
45e9J23j35J46j51J56j62J59j42J09m3r7L82j001K574p893N2940L02609k36384
63A13131l88413J82983L20981j52459k77087J56672K45729j59396k35776J63259
73c0376K46895j17066k26864N3209J30728o1053n0349J30856N0672j66024q3677
84a23049J49582Q5441j31646p7507J10452N6017q2956k803R4112l5538j28753
95h6648K3080J25191r912q1682M8180O3285j05514p8885J52319J11709j84906
106b3783j58580J84938J95143j57860j95178J44181J80472j63260k00253J63010
116c1170K23654j41309k27625J18134K19135r6603k07452O1344J64892n1232j19289
$$ y = [0, 0, 0, 0, 0, 0, 0, 0, 0, 0, 0, 0, 0, 0, 0, 0, 0, 0, 0, 0, 0, 0, 1, -2, 2, -4, 4, -4, 4, -6, 10, -11, 12, -14, 18, -19, 22, -24, 29, -32, 34, -40, 44, -49, 54, -59, 64, -71, 75, -76, 80, -82, 77, -65, 44, 1, -96, 286, -715, 1859, -6034, 46906, 349515, 113131, -275282, -92299, 228682, 76223, -200864, -44192, 201537, 42141, -193635, -30376, 216519, 99453, -127411, -74202, 56526, -4527, -54876, 75980, 126652, -39372, -123049, 26533, 111974, -19672, -97179, 13273, 69290, -13666, -16469, 77643, 42105, -86648, -63568, 61623, 51711, -29971, 18209, 81494, -24020, -102905, 49414, 161123, -23783, -182363, 2575, 197718, 39858, -155320, -11139, 169333, 6073, -194180, -31170, 192484, 51175, -176450, -58316, 160819, 64216, -143236, -81892, 83000, 31768, -87521]
127h7521P4660J12067q4205j18225O7886J01877n9518p8983O4706P1414n5145
138I013n4458N0053L3512o2041l3822O4447M1038m7545k8288L5420L879l5744
150b4536J5060L2199m3459m3611O5468O9579o2356q3112N1415P6482o1093p8716
162h6680P6603R4975p7145j03358P8589J17228o8690j31323L9671J23945j1921
173E1894q9459K2858P6472m1371q7115L8411R3620k1488q6114M363P0842J1648
185D4561m4228j2543J6080j2482j9002K7219L8084j2305l9098j1479J5483J8481
197H771J1194r949l0370j1250L4323L8908j2015m1120o660J9903n158q762L5802
210B3617K9607m4616n5370L1150O8285j0283o8619j0921N1651J4089l1709N617
$$ y = [-87521, -12861, 99206, 15001, -103224, -35338, 66539, 7021, -71962, -7256, 64158, 9013, -45445, 4608, 38120, -23921, -57743, 6704, 47742, 197, -28091, 7329, 11208, -24536, -9476, 22723, -20736, -64347, 1121, 70700, 8344, -74768, -23353, 53129, -7964, -86680, -10077, 84898, 7753, -95605, -17016, 100212, 31522, -99801, -60130, 63815, 51894, -37565, -14707, 61765, 20394, -66721, -28310, 65310, 43822, -42292, -37929, 32913, 44561, 333, -12210, 3870, -8612, -27614, -395, 37689, 25384, -13714, -25193, -9710, 8771, 19965, 10016, -20354, -31604, 2719, 41627, 29612, -11508, -18168, 1735, -3423, -12185, 23617, 53224, 8608, -46762, -15612, 52673, 42390, -26229, -37150, 14501, 28590, -3119, 2498]
222B498L2534k5997n9440J1819P0762J6263n8220l4557L5605L4243j9671k4127
234a8288J3895J0303k3874j1825L5711L6805k1112n5436j1014M9165L4258k7718
246A0870l6204J2017L0434l048k2273M547K0746j3309l7117P125N2867J7762m6845
259b428m0594K1135M1057m092l5141k915K9003K270k5860M033L2128m711m5103
272c1218j0717M8170L1602l3750l5412K4596L2085k2251k8639K4361L0096k5386
284C537l5568K7022N1306j6838o3600k323O1031J4299n3456j8936M8770K3653
296C8897m6702l1756M2126L7222m1738m7595L6229N9044j9494n9480J095M9950
308A7798R656l9912j4354L4463J9559k6637j9086K4299K2454k1626l2142J1215
$$ y = [2498, 35032, 9035, -50405, -38586, 32176, 48439, -9781, -44338, -8733, 25510, 5839, -18288, -4393, 5910, -17964, -29789, 5922, 42727, 21615, -33821, -44835, 4330, 38588, 10870, -25334, -13317, 17117, 14069, -8204, -3657, 17089, 3780, -33337, -26212, 26655, 44417, -2428, -43022, -21887, 19170, 15078, -20063, -22978, 6025, 8295, -17565, -13532, 18596, 13885, -31218, -41935, 6235, 37837, 4087, -31325, -6729, 25356, 3105, -25534, -1173, 28923, 3537, -32031, -5009, 46297, 29459, -34141, -36464, 24567, 38866, -14590, -33526, 15244, 38897, -7805, -39561, 2565, 39787, -1951, -49546, -13317, 45727, 26233, -33247, -32152, 17798, 27454, -12458, -26812, 7651, 27210, 573, -18513, 5786, 28240, 6614, -25528, -14313]
320a4313M1374O997l9311j9426L2027K2544k7790k3757K4436K2486k8052k7171
332b9956L3603L9774l4579n7301K0817O2158o841n6750N1N1068J833n0880l386
345c0389N5947Q988o3048k0805O5717M0233n1406n0077L0912M6318j7965l7919
357b3494J6374L5983j6938l9458J2881M3689k157m5098j7638L2353L0750j3099
369A4148l0482o63K1084K64j9220J744K5335J759l5078j2976M2634L1098l9284
382C63m4853K7383M7195j5664l8689J7781L7957k2828m6571K2891N9399j3517
394C0847o6477o04O4052J4496n2239k0689L8804J6082l7325j5273M1684K2418
406C5776m2045l4114L1644L9786j6613l8644J267L0481P277j9598n510J6998M068
$$ y = [-14313, 27061, 34058, -5253, -24679, 7348, 29892, 2102, -21655, 2781, 25267, -2785, -29956, 3647, 43421, 8842, -48459, -27642, 34516, 27675, -29075, -29024, 22044, 23877, -27003, -30389, 25558, 34546, -28502, -49307, 16410, 56643, 5237, -44840, -13928, 32390, 14425, -23494, -7120, 28863, 11925, -27533, -14652, 29037, 26880, -18218, -35856, -3503, 27247, 14148, -16334, -16997, 4087, 4351, -14869, -13125, 12210, 13969, -21109, -34085, 8549, 39647, 363, -44490, -17107, 30088, 14424, -24265, -6484, 31473, 8645, -37926, -15035, 44364, 30847, -35630, -36234, 27818, 42314, -9925, -30614, 8190, 24272, -13053, -28326, 13358, 35776, -6269, -40383, -8739, 31047, 14434, -24210, -22943, 7538, 14815, -4783, -10293, 6705, 10773]
419A0773j9710r345K0589K1866j0897l0159j010L3895J3133l1290k0334K5929
431C440K1894k3457k1830K6407K6518l1249l8455K8002M7048k1783n1283J2994
443b1754M9532o361m6400J409M2558m94m3677j928M7181R922m4840j7629L7611
456E130K3317k7305k4870J8879K5320j1237k2228Q751K1388o935k3108O27K3403
469A1132Q883j9711j8275J2129K2928n597k5394k462K2702O368k1479q780K3418
482E862J2089k8615k0585L0304K9849k6248l5571K0092L8943j1880l7531P650
494a5641L6339o506l6963P489M2532k078m4480o900M0843J5279l3284k0456K4889
507A063K0363j9830j8739J8156J7887j8814k3193J2838K7594k263k7728r119K2264
$$ y = [10773, -8937, -18282, 2307, 24173, 13276, -16883, -17893, 16002, 29135, -2155, -22489, 3440, 25334, 1877, -19953, 6454, 32972, 1723, -36732, -8730, 38318, 16535, -34748, -21754, 27778, 21417, -24983, -23574, 18984, 18490, -25187, -27115, 20066, 29988, -14852, -32481, 5130, 28447, 1142, -23728, -4849, 20471, 9234, -12994, -4243, 17145, 10210, -12898, -12271, 11132, 20015, 304, -17971, -5842, 17086, 11489, -13905, -16367, 6335, 12703, -8776, -17556, 5862, 17951, -10664, -31249, -945, 28904, 2656, -32915, -12823, 26120, 14240, -23291, -15641, 20698, 14192, -22771, -15282, 27250, 25172, -19308, -26208, 14635, 29914, -3370, -23826, 1063, 21426, 1596, -17143, 1013, 18900, 86, -23107, -10269, 17325, 15062, -12666, -21785, 479]
520D79J4920j4994j5434J0050J4266p750j4426Q554K1579m547k9077l947L2406
533A2079J5523k6855k1637J9779K3620j4858k3721J4095K5198j6608l1312J5391
545i306L8257q665m2374l125L7954J0415l2434j3192K8059J2308k7753j2810K8750
558F084J7067k7283k3885K0727K9977r488k8731J767K4770J694k0404j397K0088
571A0986L828k0447r247K0186J7093j6485k4191Q267K5220j109k2477l985J8878
584F517N127j9756q898K1087J3349k2517k0234K0017K6648j3244l0046N433K9930
597A3413K89k8322j414K9671L722l0759o436L2023J2564k9863j8744K5416K4191
610B5751j8940k5415J3568K3878j1252k3500Q403K3764m893k5734j559K5548P592
$$ y = [479, 15399, 405, -15029, -4979, 9287, 1537, -12889, -4335, 17244, 12697, -16380, -20327, 12079, 27602, 747, -20890, -1111, 22509, 7651, -16070, -1975, 23223, 6615, -24697, -9306, 28951, 20286, -22088, -25213, 12741, 23156, -9278, -22470, 5589, 17897, -9856, -22666, 6084, 23151, -4132, -28017, -7290, 22687, 13199, -15532, -13765, 11005, 12699, -7705, -9102, 10986, 14814, -5633, -14880, 5306, 22399, 5914, -18277, -10010, 15210, 14101, -8376, -12361, 6517, 11644, -8112, -17010, 4077, 17426, -5091, -25325, -5308, 21340, 8096, -21950, -16517, 13413, 13702, -14620, -16034, 13637, 17359, -13400, -19836, 12187, 24751, -5112, -23856, 1560, 25751, 6811, -18604, -5036, 18842, 7590, -15910, -7507, 16257, 11364, -14370, -15929, 9619, 17211]
623A7211k4421j4011J9317J6926j3580j7198R223J7629o179j9222L646K2443R70
636A2754k3429n539K3669J2660j9272j7724J4076K0823r562k1424P621K2828o183
649A1298k5362K782K7166K209k8961r913K7128J5399k3945j8872J9442J8216j7409
662h22j8645J5733K0949j3026k4533Q491K7679j809k6983m097K4056Q661j8381
675b727r445J6092J1270j5353j4504J4932J9528j1620k2990N269K3596J511k1596
688f037p588J7289R407j6117j0914J5742J3021j6205j8080J2702K2397o708k5144
701a6235l37K5078N562k2345p226K0739Q393j9946j0152K0872J5840j8739k0842
714a9338J4750K4360q918k4102M358K1798j395j9992q19J9781K940k1661q371
$$ y = [17211, -7210, -21221, -1904, 15022, 1442, -15756, -6533, 11096, 4917, -14305, -10659, 11784, 12754, -10675, -16214, 7455, 20115, 843, -16881, -2805, 18018, 8456, -12968, -5347, 17481, 11298, -14064, -11282, 15884, 18093, -10868, -20781, 6347, 21746, -2199, -21071, -1629, 16587, -822, -19467, -3734, 17215, 4189, -20344, -11853, 15826, 14017, -12966, -17063, 6993, 15654, -2727, -12172, 3920, 15190, -163, -14667, 265, 19793, 8173, -14817, -9548, 14048, 15559, -6037, -13625, 3664, 13071, -3046, -13960, 1782, 14803, -1402, -19482, -6780, 15617, 8909, -16235, -16572, 8506, 14068, -8277, -15503, 5236, 13629, -6317, -16469, 4403, 20243, 1504, -19338, -4588, 19772, 10854, -13248, -8890, 12908, 11513, -8479, -9298, 10483, 13423, -8238, -16609]
727a6609K0785J3223j7851j7285J1869J8101o860j8191L277J7705j468j8520n4
740a1878K0528M138j9969r139J7725J4761j2663j6987Q851J8476n643j8248M166
753e882J8953j938k0389k034K1445P299k1413j2892J8289J5417j5397j7056J1755
766c843J6990r494j8420O707K0211l967k2473k94K3079N171k0562q576J7634J1667
780A3830j3894j3112J1979J5383r738j6699Q048J8907m190j9787q32J9034N622
793A4551j7322r379J4751J0969j3441j2649J1112J3524r434j6504N856J8822j891
806H965k0256k976J9347O310j7118q071J5180J0295j3245j2015J2523J5603j0438
819D104j8344P869K0464k850j9586j392J8075M606j6703o873J5729Q599j5813
$$ y = [-16609, 4176, 17399, -452, -17737, -5868, 12233, 5373, -12818, -9541, 8164, 6696, -11824, -11878, 8650, 12788, -7181, -16320, 1405, 16166, 3503, -13484, -4633, 13843, 8200, -10048, -5882, 13071, 11133, -9256, -11290, 10155, 17454, -3959, -16851, 1438, 16855, 1458, -15598, -3843, 13147, 3653, -14767, -8060, 12151, 8184, -14289, -14583, 8496, 13667, -6895, -15471, 2163, 13830, -64, -13176, -1197, 14186, 4448, -12251, -4203, 14704, 10514, -9273, -10105, 8929, 14551, -2771, -12150, 2601, 13570, 129, -12520, -1408, 12116, 2682, -13822, -7966, 10856, 8965, -11291, -14267, 5080, 11390, -5728, -13799, 1381, 11676, -1569, -13584, -1061, 14542, 4104, -14240, -6371, 14093, 11243, -8343, -9735, 8340, 12946, -3757, -10630, 5099, 13698, -2115]
832b115j1488J4166J4116j1528j7327O290J7928k096j7783j333J6516K944j5839
845g549m640J5579P666j4364j1283J2701J5538q736j7104N450J7356j966j5863
858g215L82J5633K162j5939n155J6271Q782j5539j2679J2414J4538q849j5494
871a0688M773J4872k896j5941O81J6782J324j7708m842J6946Q714j4298j1670
884a3951J1078J3821p837j3932O565J4768m649j5196K789J6394J327j6095n394
897a0312J5104Q999j3041j1183J0434J1639q607j2727O438J3748m723j6220J294
910i157J6865J657j6897n092J4952P337j2420r184J0434J0961q750j2619P722
923d191J4984m904j5736K014J6383K103j5118n048J4066P569j2688r105J1758
$$ y = [-2115, -13603, 563, 14679, 3151, -14176, -7886, 10042, 7946, -9837, -11170, 5346, 8290, -7549, -12189, 3390, 11056, -3308, -14591, -1890, 13648, 4912, -12192, -6742, 10614, 8648, -7215, -6833, 8800, 10962, -4977, -10132, 6139, 14921, -618, -13297, -883, 13655, 4806, -10688, -5915, 8957, 6061, -9880, -9199, 7583, 8907, -8801, -13643, 3303, 12017, -2281, -13951, -2873, 10948, 3111, -10821, -4256, 10512, 5863, -9333, -6544, 9850, 11177, -4918, -10312, 4792, 13791, 750, -10433, 1, 11640, 3033, -9694, -3256, 10492, 5769, -10451, -9157, 7708, 9365, -7532, -12624, 2328, 9665, -2755, -11939, -1505, 9456, 706, -11913, -4191, 10793, 5889, -9847, -7833, 8550, 10653, -4465, -9513, 4553, 12122, -566, -9671, 2087]
936B087J0350j0611j2342P980J3780n083j5490J099J5182J515j4891m114J3283
949B745N442j1982p458J0793R819r143j2396P321J4614m317j4726J869J4725J236
963H542j3237l097J2858N482j2431p253J1870R626j0223j1703P270J2673m175
976F202j3660Q38J3283R23j3706k852J2999M364j2819p133J1533R798r531j2016
990a1777P104J3251m435j3131K803J3097m35j2412j377J2996M628j2525p291J1600
1004B096R739r193j1099O662J1660m571j2254K333J2602q75j4009j720J3758L816
1018H945j2975o837J0604Q628q295j0211O450J1038m988j1597L742J2558j184
1031E878j2591j455J2726N087j1302p063J0205Q595q428r126P137J0005n596j1245
$$ y = [2087, 12437, 1826, -10516, -2536, 11244, 6161, -9329, -8230, 6952, 8467, -6424, -10538, 2745, 8187, -3795, -11253, -460, 9359, 216, -12180, -4859, 9755, 5438, -9288, -7419, 7306, 8542, -4695, -7792, 5066, 10548, -1883, -9136, 2734, 12360, 2137, -9566, -2296, 10377, 6202, -7458, -6620, 6663, 7586, -6120, -8972, 4027, 8391, -4428, -11561, -28, 9770, 239, -11777, -4673, 8578, 4143, -8988, -6185, 6912, 6477, -5935, -7312, 5684, 10312, -2213, -9504, 2096, 11835, 2642, -8457, -1795, 9865, 5294, -6960, -4627, 7975, 7100, -6909, -8629, 5129, 8945, -4030, -10867, -263, 8365, 70, -10141, -3691, 7347, 2359, -9238, -5496, 7062, 5878, -6713, -8168, 4558, 9645, -1657, -8720, 1485, 10080, 1652, -7474, -337, 9668, 4072, -7173]
1045g173L268J2261q80j3232k072J2265L751j1147n901R200O946q137q785O787
1059b849J0433n483j1964L665J2856q69j2317j428J1828M050j0577n313J0323
1072B355P079r248q209Q218R760n846j1030L216J1617p66j1907j569J1243K663
1086G576j0953m380R541N949q898q311P023J0010n437j1206L331J1386j189j0839
1100f397m10J0494K739r891m324J0065O609q894p913P603R442n222r908K820J0529
1115G342q95j0862q68J0898J858j0934l990R926N531q883p868O792R029n333r987
1130h244L554J0053k074r970M28J0137J844r860l746R632O268q346p232P166Q358
1145G968n080q612L597R398j817j0052J57J0359J599j0501l828R366N141q118
$$ y = [-7173, -3905, 8356, 7476, -5756, -7828, 4437, 8188, -2959, -8860, 340, 7286, -851, -9636, -2849, 7584, 2101, -9863, -6198, 6658, 5789, -6528, -7956, 3872, 7922, -2655, -7968, 2355, 9434, 186, -8023, 195, 9955, 4109, -6921, -3705, 7912, 7146, -4761, -6330, 4913, 7576, -3377, -7757, 1784, 7733, -1165, -9476, -2453, 7557, 2120, -9086, -5755, 5631, 4442, -6397, -6807, 3687, 6426, -3465, -7789, 2276, 8885, -9, -7922, -319, 9123, 3901, -6007, -3187, 7342, 6447, -4415, -5283, 5615, 7473, -3461, -7451, 2475, 8006, -877, -8745, -1953, 7076, 1743, -8244, -4690, 5363, 3289, -6681, -6253, 3884, 5728, -4132, -7878, 1754, 8022, -324, -7556, -390, 7968, 2888, -5724, -2127, 7271, 5454, -4598, -4441, 5918, 7517, -2984, -6812, 2554, 7695, -423]
1159d23p022O174P802n224r045L862R562k647j0248P92J0207J784r722l716R072
1174A208N706p711o398P032P474n542p911M327R182k333r740K95J0044J585r613
1189b395l229Q354M200p548n642O185O669n399q456L870R103k581r593M77R099
1204C114J413q498k930Q140M503p474n462P152O856n577p546M251Q612j901q778
1219d125K84R013J217q820k364Q345L452p832n166O491O508n559q142L738Q566
1234E606k587q979Q88Q507L48q320j996Q190L762p770m939P059O527n562o891
1249f157M156P767k143p820R53Q451M75q503j613Q232L115p578m746O225N816
1264F630n182p058L557P405k768q056J368P783j12p993j705P595L422p081m797
$$ y = [-423, -7445, -1271, 6531, 1307, -7738, -3876, 5686, 3039, -7209, -6417, 3790, 5574, -4148, -7864, 1208, 6914, -797, -7195, -163, 7311, 1769, -6142, -1815, 7367, 5034, -4706, -4411, 5633, 7218, -2395, -5624, 2730, 6930, -618, -6260, -75, 6594, 1195, -7261, -3391, 5712, 3131, -6462, -5985, 3114, 4527, -3971, -6901, 1239, 5742, -1732, -7194, -42, 6814, 1237, -6309, -2058, 6554, 4653, -4125, -3841, 5172, 6389, -2431, -4795, 3550, 7002, -830, -5996, 495, 7003, 1444, -6698, -2960, 5606, 3019, -5960, -5072, 3435, 3783, -4537, -6533, 1657, 5419, -2351, -7290, -231, 6296, 734, -6157, -2001, 5766, 3623, -4197, -3244, 5207, 5682, -2821, -4434, 3798, 6913, -665, -5411, 814, 6630, 1448, -5610, -2053, 5352, 2584, -5472, -4104, 3679, 3567, -4426, -6131, 1464, 4886, -2195, -6992]
1279f992O338O028n105o316M124P066k419p363J506Q147K66q147j478Q008K893
1294F556p224m111O123M990n134o231L868O844l380p574J809P534n59p755j353
1309e597P160K779o636m093O139M970n302n544M532O509l089o737J727P635J52
1324D605p483j221P394K475o509l408N775M357m957n660L933O565l144p518J624
1339c172P313n67p428r81O653K172o576l302N935M444n525n129M588O119l111
1354A433o298J840O898k96o666n03O881J694o334k527N905L808n057n036L944
1369c14N911k973o647J788O432j080o588m40O167J532o292k979N668M115n278
1384i78m928M232N682l085n830K034O356n44o355l83O981J595o479k391O077L647
$$ y = [-6992, -654, 5374, 269, -6047, -1923, 5143, 2724, -4639, -3133, 5014, 5280, -2867, -4345, 3663, 6556, -668, -4779, 1344, 6334, 1200, -5031, -1163, 5681, 2301, -5273, -3464, 4070, 3511, -4244, -5597, 1563, 4342, -2294, -6387, -248, 4722, -580, -6124, -1592, 4917, 1828, -4909, -3182, 4453, 4605, -2878, -4099, 3295, 5770, -739, -4147, 1628, 5985, 1028, -4632, -699, 5866, 2722, -4796, -3172, 4141, 3574, -3854, -4835, 1818, 3990, -2586, -5888, 47, 4491, -1034, -6163, -1575, 4544, 1433, -4865, -3025, 3873, 3577, -3089, -3592, 3289, 4983, -1351, -3878, 2027, 5835, 778, -4258, -314, 5597, 2624, -4023, -2235, 4197, 3117, -3471, -3911, 2256, 3788, -2504, -5483, 185, 4300, -978, -5906, -1674, 4008, 923, -4907, -2873, 3483, 2939, -3416, -3799, 3182, 4777, -1702, -4093, 1984, 5631]
1400E631m982m590L996N357l160o055K308O042j543o328j9O051R87n968k680N463
1416E10L433m963m342M147M760l204n219K273N802q50n962k0O342J404n864k119
1432c872N608L146m526l841L842M713k939n562K247N766j392o175M3N712R51n650
1448a929k320M995L132n117l834M302M366l557n037K594N488j226n730K49O047
1463B423R21n496j556N428K446m448l147M058M252l182m974K392N384j443n684
1478b626L28N374M12n285j822M907K438m813l641M200M035l578m553K299N034
1493B709j201n276L65N509O99n304j223N380K252m600k961M172M034l146m522
1508c113K497M931j641n229Q92N009r8n008j190M570K156m692l206L850L608l377
$$ y = [5631, 649, -3941, 55, 5412, 2252, -3803, -1495, 4547, 3004, -3324, -3343, 2708, 3695, -2273, -4953, 510, 3943, -1020, -5362, -1215, 3545, 341, -4878, -2605, 3197, 2347, -3615, -3635, 2707, 4111, -1753, -3872, 1736, 4882, 356, -3485, 357, 5070, 2131, -3431, -1184, 4582, 3190, -2985, -2942, 2770, 3721, -1929, -4249, 746, 3878, -1239, -5073, -771, 3595, 38, -4999, -2405, 3083, 1857, -3873, -3624, 2423, 3344, -2152, -3708, 1720, 4166, -282, -3429, 629, 4881, 1699, -3275, -883, 4501, 3058, -2626, -2298, 3076, 3488, -1797, -3619, 1288, 3726, -1087, -4728, -528, 3507, -71, -4624, -2325, 2709, 1508, -3768, -3403, 2106, 2805, -2499, -3722, 1658, 3910, -690, -3651, 521, 4555, 1409, -3113, -616, 4315, 2674, -2555, -1663, 3346, 3248, -1760, -2950, 1620, 3776, -916, -4122, -272, 3336, -41]
1524d1m214K363M408j521m787O41N077M62n236r16N132K075m462k519L966L599
1540D027l040m090K645M684j829m939J171M893j78m888j133M597J801m461k865
1555c605L894L134l518l886K669M039j957m604R39M929o7m917n93M781J514m076
1571a324k104L810L044k915l516K566M269j783m423J098M709k81m524p95M178
1586B009J586m292k370L724K842l529l579K671L706k079m201R03M397j20m489
1601b821o04M465J383m126j767L753K817l035l314K754M123j923m103J239M502
1616C343n62m213l28M112J040l981k041L685K487l510l334K705L444k107l917
1631c177R61M095m27m265l68M315R84m074j570L817K399l011k904K586L707j746
$$ y = [-41, -4255, -1892, 2516, 995, -3792, -3151, 1926, 2388, -2848, -3764, 1368, 3443, -1019, -3538, 428, 4027, 987, -3103, -458, 4226, 2397, -2542, -1371, 3522, 3344, -1544, -2677, 1920, 3721, -740, -3605, 289, 3423, -95, -3981, -1312, 2727, 770, -3834, -2895, 2034, 1967, -2950, -3543, 1238, 2752, -1324, -3428, 382, 3426, 511, -3005, -439, 3830, 2047, -2376, -1278, 3431, 3150, -1374, -2169, 2009, 3595, -697, -3067, 657, 3499, -30, -3609, -938, 2768, 689, -3512, -2609, 1788, 1668, -2821, -3425, 1040, 2423, -1703, -3470, 283, 3100, 65, -3249, -495, 3628, 1705, -2398, -1159, 3343, 2781, -1432, -1760, 2352, 3392, -589, -2630, 1055, 3542, 32, -3302, -597, 2847, 740, -3177, -2216, 1879, 1452, -2813, -3181, 1134, 2118, -1956, -3526, 291, 2690, -321, -3225, -639, 3068, 1322]
1647A322l866J540L985o14l884o7L954R25l734j883L479K316l227l096K614L120
1663B884k129l608J115L697o36m030k39M142P11l885j417L516K130k857k502K456
1679f52L313j807l496J635L898q60l662J62L843O74l586j496L405K014l225k619
1695b459K635K823k252l374J404L371p37l913n8L704N93l798j086L390J761k938
1711i34k223K544L028j965l227J648L682p22l615L99L538N42l347j119L221J802
1727C252l053k355K671K599k282l028J276L144q67l554M1L487K89l571q92L172
1743C29J513k969j897K450K565j849k917J535L362q48l236N60L394L55l112r13
1759a678L128J595k910k064K574K393k179k785J462K790r93l235J84L144J90l378
$$ y = [1322, -2544, -1004, 2981, 2367, -1517, -1584, 2370, 3295, -439, -2322, 1157, 3473, 246, -2850, -236, 2884, 755, -2853, -1738, 1959, 1323, -2707, -2946, 1196, 1907, -1978, -3395, 121, 2251, -606, -3108, -652, 2661, 854, -2642, -1007, 2891, 2031, -1631, -1469, 2374, 3048, -538, -2034, 1371, 3385, 160, -2459, 176, 2999, 747, -2627, -1223, 2148, 1411, -2502, -2560, 1144, 1737, -2061, -3147, 243, 2004, -934, -3157, -613, 2415, 450, -2777, -1129, 2553, 1831, -1784, -1385, 2153, 2695, -652, -1771, 1450, 3252, 199, -2156, 515, 3114, 832, -2196, -920, 2224, 1357, -2197, -2156, 1331, 1620, -1951, -2843, 329, 1842, -1127, -3024, -574, 1991, 142, -2775, -1240, 2122, 1274, -1962, -1402, 1992, 2347, -765, -1678, 1450, 3045, 135, -1929, 645, 3038, 859, -1926, -464, 2326, 1333, -1902, -1718, 1426, 1616, -1762]
1775a762q46L057J211k795j864K414K431j970k666J612L084r32l070P32L206O2
1791A904k878o63L072J305k699j755K464K128k083k437J479K590j100l005L67
1806a311K934j4l171p41K963R23k681j606K324J904j843k365J512K752r37k814
1822b171O99L022%k690m47K777J203k458j583K339K050j989k281J652K388j140
1838A371k738L24K760q4k992n44K633Q80k611j430K173J741j879k229J501K559
1854A435j034k697P87K816j27k534k01K578J028k392j298K384J744j985j968J670
1870B06K262j185k469N00K442k7k758n12K516O65k574j189J986J672j976j957
1886b398J359K316j086k412O99K600j86k448l9K363R21k179j197K299J634j757
$$ y = [-1762, -2608, 449, 1660, -1135, -2999, -585, 1846, -124, -2790, -1178, 1906, 974, -2096, -1364, 1842, 1904, -974, -1637, 1435, 2740, 41, -1714, 750, 2878, 795, -1642, -163, 2427, 1327, -1678, -1311, 1623, 1609, -1562, -2303, 660, 1583, -1098, -2704, -380, 1524, -319, -2684, -1172, 1580, 643, -2171, -1472, 1550, 1550, -1140, -1587, 1190, 2393, -65, -1648, 691, 2741, 752, -1529, 123, 2511, 1371, -1367, -1043, 1717, 1633, -1359, -1903, 730, 1610, -1001, -2431, -258, 1483, -396, -2625, -1124, 1435, 401, -2296, -1509, 1307, 1180, -1354, -1555, 1023, 2051, -341, -1639, 745, 2489, 504, -1464, 206, 2468, 1283, -1186, -686, 1756, 1729, -1029, -1541, 975, 1640, -934, -2123, -137, 1535, -441, -2398, -1039, 1277, 191, -2221, -1522, 1078, 892, -1556, -1595, 768, 1689, -490, -1687, 612, 2246, 489]
1902D89j798J525K117j109k201N11K323j94k512l86K410N83k428j179K025J276
1918A452j779j757J278K010j062k347Q45K270k93k262RK309P02k060j001K114
1934D28J517j711j608J513J980j098k056O81K259l39k390r2K256M04k298r12J846
1951C80J128j781j582J253J721j032k101O58K189l71k146M2K147N35j915q20K007
1968C12J327j661j414J528J803j099j757P46J988k43k101j17K006M98k194p96
1984a174J806R32j663j501J228J690j145k028O63K060m91k023J04J902M69j887
2000a058o25J765J229j581j256J551J598j043j623Q23J802k85j857j5J987K92
2016A704k082o10J722R21j647j349J238J362j044j846O99J751m26j947R6J823
$$ y = [489, -1309, 216, 2333, 1224, -977, -466, 1857, 1663, -849, -1235, 1175, 1758, -670, -1849, 176, 1452, -327, -2084, -806, 1204, 142, -2205, -1360, 910, 617, -1645, -1636, 673, 1375, -685, -1686, 428, 1945, 234, -1374, 139, 2119, 1021, -1035, -354, 1905, 1566, -824, -916, 1340, 1744, -554, -1466, 380, 1508, -273, -1855, -602, 1119, 87, -2014, -1356, 833, 462, -1684, -1642, 505, 1040, -875, -1695, 312, 1639, -22, -1436, 92, 1895, 796, -961, -215, 1773, 1530, -571, -688, 1318, 1816, -378, -1174, 632, 1564, -99, -1600, -372, 1318, 173, -1855, -1192, 868, 377, -1646, -1542, 360, 829, -1058, -1683, 82, 1311, -270, -1526, 25, 1623, 580, -1043, -220, 1582, 1297, -560, -575, 1412, 1704, -378, -988, 734, 1655, 8, -1341, -103, 1259, 215, -1631, -932, 819, 393, -1554, -1458, 365]
2032C65L17j736o57J741J023j422j241J444J513r97j444P70J790l54j637lJ922
$$ y = [365, 682, -1054, -1711, 30, 1053, -369, -1610, -166, 1347, 350, -1094, -324, 1466, 1112, -525, -528, 1394]
$$ [...]
8191d9
##END NTUPLES=NMR FID
##END=
