##TITLE=1H_TG-2240-3
 CDCl3,8 sc, 
 11.4.2019
##JCAMPDX= 6.0         $$ Bruker NMR JCAMP-DX V2.0
##DATA TYPE= NMR FID
##DATA CLASS= NTUPLES
##ORIGIN= UXNMR, Bruker Analytische Messtechnik GmbH
##OWNER= root
$$ XWIN-NMR		Version 3.5
$$ Thu Apr 11 14:38:43 2019 Russian Standard Time (UT+4h)  she@DPX200
##.OBSERVE FREQUENCY= 200.1315
##.OBSERVE NUCLEUS= ^1H
##.DELAY= (6, 6)
##.ACQUISITION MODE= SIMULTANEOUS
##.ACQUISITION SCHEME= undefined
##.AVERAGES= 8
##.DIGITISER RES= 18
##SPECTROMETER/DATA SYSTEM= spect
##.PULSE SEQUENCE= zg30
##.SOLVENT NAME= CDCl3
##.SHIFT REFERENCE= (INTERNAL, CDCl3, 0, 15.7039)
##AUDIT TRAIL= $$ (NUMBER, WHEN, WHO, WHERE, WHAT)
$$ ##TITLE= Audit trail, XWIN-NMR		Version 3.5
$$ ##JCAMPDX= 5.01
$$ ##ORIGIN= Bruker BioSpin GmbH
$$ ##OWNER= she
$$ F:/spectra/data/she/nmr/H-F/1/audita.txt
$$ ##AUDIT TRAIL=  $$ (NUMBER, WHEN, WHO, WHERE, WHAT)
(   1,<2019-04-11 14:37:32.32 +0400>,<she>,<DPX200>,
      <created by zg, POWCHK disabled, PULCHK disabled
       configuration hash MD5:
       00 E9 B6 7A A2 85 ED C7 34 08 36 98 17 FE 4E 26
       data hash MD5: 16K
       57 10 87 66 50 AE 7B 1E 8C 4A 95 B8 4A C1 E2 75>)
$$ ##END=
$$ 
$$ hash MD5
$$ 61 D9 F2 EF 7A 26 F8 9F 48 B5 3F F6 D2 C4 5A 21
##$RELAX= 
##$RELAX= 
##$RELAX= 
##$RELAX= 
##$RELAX= 
##$RELAX= 
$$ Bruker specific parameters
$$ --------------------------
##$DU= <F:/spectra>
##$EXPNO= 1
##$NAME= <H-F>
##$PROCNO= 1
##$TYPE= <nmr>
##$USER= <she>
##$AMP= (0..31)
100 100 100 100 100 100 100 100 100 100 100 100 100 100 100 100 100 100 
100 100 100 100 100 100 100 100 100 100 100 100 100 100 
##$AQSEQ= 0
##$AQ_mod= 1
##$AUNM= <au_zg>
##$AUTOPOS= <>
##$BF1= 200.13
##$BF2= 200.13
##$BF3= 200.13
##$BF4= 200.13
##$BF5= 200.13
##$BF6= 200.13
##$BF7= 200.13
##$BF8= 200.13
##$BYTORDA= 1
##$CFDGTYP= 0
##$CFRGTYP= 5
##$CHEMSTR= <none>
##$CNST= (0..31)
1 1 145 1 1 1 1 1 1 1 1 1 1 1 1 1 1 1 1 1 1 1 1 1 1 1 1 1 1 1 1 1 
##$CPDPRG= <>
##$CPDPRG1= <>
##$CPDPRG2= <>
##$CPDPRG3= <>
##$CPDPRG4= <mlev>
##$CPDPRG5= <mlev>
##$CPDPRG6= <mlev>
##$CPDPRG7= <mlev>
##$CPDPRG8= <mlev>
##$CPDPRGB= <>
##$CPDPRGT= <>
##$D= (0..31)
0 1.2 0 0 0 0 0 0 0 0 0 0.03 0 0 0 0 0 0 0 0 0 0 0 0 0 0 0 0 0 0 0 0 
##$DATE= 1554979051
##$DBL= (0..7)
120 120 120 120 120 120 120 120 
##$DBP= (0..7)
150 150 150 150 150 150 150 150 
##$DBP07= 0
##$DBPNAM0= <>
##$DBPNAM1= <>
##$DBPNAM2= <>
##$DBPNAM3= <>
##$DBPNAM4= <>
##$DBPNAM5= <>
##$DBPNAM6= <>
##$DBPNAM7= <>
##$DBPOAL= (0..7)
0.5 0.5 0.5 0.5 0.5 0.5 0.5 0.5 
##$DBPOFFS= (0..7)
0 0 0 0 0 0 0 0 
##$DE= 6
##$DECBNUC= <off>
##$DECIM= 24
##$DECNUC= <off>
##$DECSTAT= 4
##$DIGMOD= 1
##$DIGTYP= 9
##$DL= (0..7)
0 120 120 120 120 120 120 120 
##$DP= (0..7)
150 150 150 150 150 150 150 150 
##$DP07= 0
##$DPNAME0= <>
##$DPNAME1= <>
##$DPNAME2= <>
##$DPNAME3= <>
##$DPNAME4= <>
##$DPNAME5= <>
##$DPNAME6= <>
##$DPNAME7= <>
##$DPOAL= (0..7)
0.5 0.5 0.5 0.5 0.5 0.5 0.5 0.5 
##$DPOFFS= (0..7)
0 0 0 0 0 0 0 0 
##$DQDMODE= 0
##$DR= 18
##$DS= 0
##$DSLIST= <SSSSSSSSSSSSSSS>
##$DSPFIRM= 0
$$ [...]
##$SUBNAM2= <"">
##$SUBNAM3= <"">
##$SUBNAM4= <"">
##$SUBNAM5= <"">
##$SUBNAM6= <"">
##$SUBNAM7= <"">
##$SUBNAM8= <"">
##$SUBNAM9= <"">
##$SW= 24.9337058887773
##$SWIBOX= (0..15)
0 0 2 0 0 0 0 0 0 0 0 0 0 0 0 0 
##$SW_h= 4990.01996007984
##$TD= 16384
##$TD0= 1
##$TE= 0
##$TE2= 300
##$TE3= 300
##$TEG= 300
##$TL= (0..7)
0 120 120 120 120 120 120 120 
##$TP= (0..7)
150 150 150 150 150 150 150 150 
##$TP07= 0
##$TPNAME0= <>
##$TPNAME1= <>
##$TPNAME2= <>
##$TPNAME3= <>
##$TPNAME4= <>
##$TPNAME5= <>
##$TPNAME6= <>
##$TPNAME7= <>
##$TPOAL= (0..7)
0.5 0.5 0.5 0.5 0.5 0.5 0.5 0.5 
##$TPOFFS= (0..7)
0 0 0 0 0 0 0 0 
##$TUNHIN= 0
##$TUNHOUT= 0
##$TUNXOUT= 0
##$USERA1= <user>
##$USERA2= <user>
##$USERA3= <user>
##$USERA4= <user>
##$USERA5= <user>
##$V9= 5
##$VALIST= <valist>
##$VCLIST= <CCCCCCCCCCCCCCC>
##$VD= 0
##$VDLIST= <DDDDDDDDDDDDDDD>
##$VPLIST= <PPPPPPPPPPPPPPP>
##$VTLIST= <TTTTTTTTTTTTTTT>
##$WBST= 1024
##$WBSW= 4
##$XGAIN= (0..3)
0 0 0 0 
##$XL= 0
##$YL= 0
##$YMAX_a= 42855
##$YMIN_a= -70756
##$ZGOPTNS= <>
##$ZL1= 120
##$ZL2= 120
##$ZL3= 120
##$ZL4= 120
##$ABSF1= 10
##$ABSF2= 0
##$ABSG= 5
##$ABSL= 3
##$ALPHA= 0
##$AQORDER= 0
##$ASSFAC= 0
##$ASSFACI= 0
##$ASSFACX= 0
##$ASSWID= 0
##$AUNMP= <proc_1d>
##$AZFE= 0.1
##$AZFW= 0.1
##$BCFW= 1
##$BC_mod= 2
##$BYTORDP= 1
##$COROFFS= 0
##$CY= 11.3945322036743
##$DATMOD= 1
##$DC= 2
##$DFILT= <>
##$DTYPP= 0
##$F1P= 18.9103706918063
##$F2P= -1.10871071338519
##$FCOR= 0.5
##$FTSIZE= 0
##$FT_mod= 4
##$GAMMA= 1
##$GB= 0.15
##$INTBC= 1
##$INTSCL= 1
##$ISEN= 128
##$LB= 0.24
##$LEV0= 0
##$LPBIN= 0
##$MAXI= 10000
##$MC2= 0
##$MEAN= 0
##$ME_mod= 0
##$MI= 1.114404
##$NCOEF= 0
##$NC_proc= 0
##$NLEV= 6
##$NOISF1= 3.799351
##$NOISF2= 2.8
##$NSP= 1
##$NTH_PI= 0
##$NZP= 0
##$OFFSET= 15.70392
##$PC= 1
##$PHC0= -8852.932
##$PHC1= 15.20026
##$PH_mod= 1
##$PKNL= yes
##$PPARMOD= 0
##$PSCAL= 0
##$PSIGN= 0
##$REVERSE= no
##$SF= 200.130013532006
##$SI= 16384
##$SIGF1= 3
##$SIGF2= 2
##$SINO= 400
##$SIOLD= 16384
##$SREGLST= <1H.CDCl3>
##$SSB= 0
##$STSI= 0
##$STSR= 0
##$SW_p= 3612.71676300578
##$SYMM= 0
##$S_DEV= 0
##$TDeff= 0
##$TDoff= 0
##$TI= <>
##$TILT= no
##$TM1= 0
##$TM2= 0
##$TOPLEV= 0
##$USERP1= <user>
##$USERP2= <user>
##$USERP3= <user>
##$USERP4= <user>
##$USERP5= <user>
##$WDW= 1
##$XDIM= 8192
##$YMAX_p= 0
##$YMIN_p= 0
$$ End of Bruker specific parameters
$$ ---------------------------------
##NTUPLES= NMR FID
##VAR_NAME=  TIME,          FID/REAL,        FID/IMAG
##SYMBOL=    X,             R,               I
##VAR_TYPE=  INDEPENDENT,   DEPENDENT,       DEPENDENT
##VAR_FORM=  AFFN,          ASDF,            ASDF
##VAR_DIM=   8192,          8192,            8192
##UNITS=     SECONDS,       ARBITRARY UNITS, ARBITRARY UNITS
##FACTOR=    0.0002004,     1,               1
##FIRST=     0,             0,               0
##LAST=      1.6414764,     0,               0
##MIN=       0,             -70756,          0
##MAX=       1.6414764,     42855,           0
$$ Real data points
##PAGE= N=1
##DATA TABLE= (X++(R..R)), XYDATA
0@%%%%%%%%%%Qj6J6j6J6k4L2l3M1m9N7p1Q0q9J04j21J40j60J81k05K31k60K92
33A54l27L67m08M53n04N60o22O88p60Q42r34J035j147J273j415J578j767J985
51A051k248K567k959L463m136N085o536R060j4713N2221j6149n9735N1801N281
65B4053k1488K584J3927j8005O514M360j5066K005K0658k0330j4402J8842p137
78c485k9235K6060K5842k7183r152K7456j6477k3671L1413J5237l5959l412K5932
91C366q095p852K0015l899j3634J4813q44k2347J2974J7963k1737k246K7252j3828
105A901k5115K6102J4549k8123K298K0207k1818j3258K9526R97k3867J4475J5147
118A3021k2340o518J5103n758L74J5530j6911j7396K7730R908k9591P426K9221
$$ y = [0, 0, 0, 0, 0, 0, 0, 0, 0, 0, 0, 8, -8, 8, -8, 8, -16, 16, -17, 24, -25, 32, -39, 41, -48, 56, -65, 75, -85, 96, -109, 122, -138, 154, -173, 194, -214, 239, -265, 295, -327, 361, -399, 443, -491, 544, -603, 670, -745, 833, -934, 1051, -1197, 1370, -1589, 1874, -2262, 2823, -3713, 5347, -9366, 42855, 26706, -33029, 18772, 24053, 2565, 5149, 19076, 1071, 7585, 11945, -3121, -1116, 19542, -788, -15190, 3652, -3485, -32720, -6660, 19182, -8001, -17153, 10303, -6174, -29845, 1568, 16805, -19154, -22566, 3366, -4729, -12581, 7434, 3535, -10099, 4714, 3870, -18477, -5503, 12460, -9277, -11523, 15729, 1901, -23214, 2888, 17437, -10686, -8388, 11819, -9999, -23257, 6269, 7266, -16601, -2126, 13021, -9319, -15837, -734, -6492, -6118, 9412, -7499, -24895, 2835, 12743, -16848, -9422, 19799]
131A9799k1430k0610K5349K630k2472J6345J7712k4576p565K1727l984j0132J4790
144G583l583j7144J2249O484j8147J1644K1484k5201j6059L1674J811l1016J2971
157e250K3713k1077j0729J9802m204j1669J8455L638k0352O244J0184j6158M352
170c051K1146j4395j4453K2012Q30k2833J4053J7487k2277n390K4257j0473k0257
183a3344K0719J2698k0809J263J3421j4127m185J7972o373j2173J5145J71k0431
196a0053J2244J6904j9984n841K2949r929k0726J9035J0879k1920L891J8656j6895
209g90j2012K0993J469j5908R220M381j6922N749J4659j5503l146K1162j0145
222C207k1287J8391J0895k2128K895K0966j6409j4531K0737J928j7909J1133J0046
$$ y = [19799, -1631, -22241, 3108, 5738, -16734, -389, 17323, -7253, -14818, 6909, 2925, -7207, 7583, 4000, -13144, -895, 5589, -12558, -914, 20570, -4631, -20690, 10984, 12795, -18221, -5250, 18463, -2614, -13343, 6459, 2255, -9414, 9041, 12679, -7673, -1429, 8755, -7403, -3051, 18095, 3700, -10753, 11259, 12089, -10744, 3309, 20796, -1481, -6871, 17386, 6913, -13344, 7375, 20073, -736, 527, 13948, -179, -4364, 13608, 7235, -4938, 10207, 10378, -10053, 2191, 19095, -889, -6730, 16219, 6290, -14436, 4599, 15478, -6442, -2551, 16105, -790, -12802, 8191, 9660, -6248, 2972, 7353, -9569, -3820, 10839, -4664, -7810, 13352, 3207, -18080, 311, 11206, -10922, -8027, 12939, -3470, -18001, 2736, 4664, -13245, -2112, 7934]
235G934j8749j865J6164r603o067J7559n231j7953J4295R582k0320L723K0507
248I976j4961j3839K0054J664j9295J2215J4343j8830l785J7428p460j0698J6446
261C258J578j6226Q745Q792j5952K615K0127j2342j4021J8328J101j8781J1403
274a375J5296j8577l930J9892p960j6552J7372P930j7012L586J0336j4216q28
287f038J8432p276j2516J4676R19j8238J0098J5425j7723m801J9897p401j6832
300a1378J6328Q264j7903L296J4684j3652p704J7418k065j2074J2147K676j7976
313g939O724J6064j4115o110J7887o270j6615J5661Q885j9136K076J8474j3100
326B486j1326J6593L53j4086J0525O956j6980J992J4812j1371o620J7209l619
$$ y = [7934, -10815, -12680, 3484, -6119, -12186, 5373, 142, -17811, -3516, 6066, -14254, -10531, 9976, -4985, -18824, 1230, 2894, -16401, -4186, 10157, -8673, -12458, 4970, -2490, -13188, 3258, 4836, -11390, -2645, 6147, -9805, -7190, 12937, 595, -13426, 4902, 6003, -12778, -1375, 13921, -4656, -8586, 11306, 3346, -13206, 4166, 12096, -4916, -1330, 9006, -5210, -6038, 12394, 5118, -7398, 7278, 8197, -10041, 57, 15482, -2241, -7042, 12855, 5454, -11378, 4950, 13214, -4689, -1393, 13291, -361, -8065, 9353, 7288, -4786, 7361, 10037, -7939, -1215, 14849, 734, -5376, 12511, 6241, -10374, 5287, 14172, -4964, -2888, 15586, 2486, -8840, 7753, 8106, -5980, 4545, 11501, -5479, -3487, 11325, -46, -6666, 10543, 6924]
339F924j6883J1065Q680j6701L099J6472j2820j1891J7175J185j6788R360J0896
352I773j5458k712J4269q221q680J6184o95j6160Q709R355j5779J89J7622r346
366i50j2381J5193Q72j7078J0306J3180j5822n228J5522n667j0809J4199K765
379D102j5532O752J0292j4402k237J6706o147j1358J3742J984j7218P994J4703
392I381j4258n249J6511n620j3769J3990O236j5275M327J1701j2946m235J6611
405G405l979j2783J2200N025j5795M443J3064j1774m128J6487n524j5270J2676
418B047Q523j4859K219J3203j1094o700J4675j776j2805J1460O427j5578J521
431b737J3741r260o174J4939l028j4742J0648Q388j4870J177J5127r563r905J3437
$$ y = [6924, -9959, 1106, 9786, -6915, -3816, 12656, -164, -12055, 5120, 6305, -10483, -1123, 9773, -5685, -8397, 5872, -2349, -11029, 5155, 4460, -11700, -2991, 6364, -9415, -9226, 8396, -950, -13331, 1862, 2734, -14344, -4038, 9142, -6680, -11908, 3614, -2053, -12862, 1337, 4102, -11430, -4678, 5614, -8788, -11025, 5681, -466, -11824, 1918, 3902, -13316, -5322, 9381, -4877, -10126, 6385, 765, -13004, 986, 7222, -8053, -3726, 7975, -4971, -9206, 7405, 3426, -9357, 2843, 7868, -7927, -3484, 9580, -2194, -6322, 10165, 4641, -10629, 2047, 10570, -4289, -2070, 11133, 39, -6661, 8014, 6238, -6567, 4893, 11320, -4258, -2737, 11004, 1744, -4430, 10509, 7481, -7261, 3387, 11775, -3095, -1918, 13209, 3646, -6259, 7178]
445G178J68j2634R629P985j5147j00J3535q199q419J4506J16j4750P436Q860j3826
460c662n8J5444q414j1044J2758J493j3767P808R815j3859j838J3786q013j0254
474i805J4347L015j4968N316R521j3369j894J5448o246j1662J2136L117j5014
487a0058N497J1260j1360l572J3208o746j0751J3074M331j4874N162J1314j2833
500f348m822J4958l467j1408J0992M258j5015L590J3162j0328m865J3102l655
513A54j1864J0822N367j3298M150J1922j1720o347J4600j339j1903R723N843j3797
527g687J520J2688q124o269J3501j409j2761Q481O707j1793K302J1739r544p272
541g921J3863j182j2583R337Q376j3409n60J2519p454p590J3769L66j3850P030
$$ y = [7178, 7346, -5288, 4341, 12326, -2821, -2921, 10614, 2415, -6004, 8502, 8618, -6132, 1304, 10164, -3662, -3720, 11724, 3310, -7734, 5024, 6517, -7250, 558, 10373, -3486, -5324, 8462, 449, -9805, 4542, 7557, -7411, -2095, 7426, -5943, -7837, 7611, 1365, -10297, 1839, 4956, -10058, -4561, 6699, -4661, -8233, 4975, -1771, -12522, 552, 4883, -9991, -4829, 6485, -6348, -11170, 3788, 321, -11087, -95, 4163, -10852, -7262, 5900, -4428, -9293, 3809, 154, -11710, -888, 4479, -8819, -4669, 7253, -4467, -10814, 3786, 2447, -9456, 267, 6110, -7687, -6167, 6521, -1603, -7872, 5629, 4220, -8541, -60, 6647, -5146, -2844, 8895, -649, -7921, 5942, 4760, -7823, 1514, 9890, -3519, -4079, 8440, 986, -6604, 7165, 7531, -6319, 711]
555G11Q435j2045j44J2796o920p903J1442j02j2412Q776Q805j3057k050J3446
569I778o983q842J2922J943j3661N972R341j1945k758J3779m457r640R816J538
583F803j1484N815Q820j1359k006J2492o032j0890J2262L787j3226M290J0070
596I342j1144m603J3713k925j1067Q565M830j2274K975R397r119l011J1439m758
610A360j0664J0889M134j3055L395J1105j0578n864J3128j825j1706Q840O434
623E593j2740QJ1315o903n416J0522j758j0336P955N245j1591K417J1544r430
637c575p023J2661q08j1877Q910P768j3372n38J2303o544p675J1710J101j1209
651h168N663O586j0457J348J1558q006p210J2030j52j1552P903Q119j2222r49
$$ y = [711, 9146, -2899, -3043, 9753, 2833, -5070, 6372, 6270, -6142, 2634, 11439, -1618, -3668, 9778, 2795, -6047, 6875, 8818, -4843, 1129, 10470, -1475, -4233, 9546, 5089, -4551, 5265, 6803, -4681, 1134, 9954, -1405, -3411, 9081, 3049, -7841, 4421, 8208, -5018, -728, 9342, -1802, -6405, 7308, 4383, -6684, 1881, 6711, -5563, -2588, 6809, -2310, -5321, 6118, 1360, -9304, 1585, 5719, -7336, -3941, 7164, -3414, -9278, 3850, 2025, -9681, -841, 5593, -7147, -7139, 4176, -2727, -8143, 2379, 621, -9715, -1760, 3485, -8106, -5689, 5855, -3575, -10598, 2063, 1255, -10622, -1712, 6056, -7316, -7854, 4449, -2095, -9770, 1940, 3041, -8168, -2505, 4081, -6376, -5028, 6530, -1476, -8686, 3344, 3192, -8360, -457, 7662, -4560, -5509]
665e509J2710o320r219J1869L358j1945L919Q303r345j701J0840m612p447R889
679D790R73j0925N644R109j0628k114J1857n894q942J1500L429j2505L264J0154
693I712r186m646J0914j964p903P392K842j0985M092R176r643k769J1110m147
707C995r297R944L582j2389L289J0912r764o187J2170r06j0304O832N465j0314
721b972J060R082p220m712J1150k771j0042Q130M261j0839K728J0601r540o628
735g712J2921j121j1995P438P452j1450j221J0204n319n857R535n02j0156O391
749a392N702j0213R97J0080p239o351J1308j509j1297P452Q658j1485l252J2557
763D016m933q177R514K305j0519M448O707q637j158J0059n238o629R361O59j0632
$$ y = [-5509, 7201, 881, -8338, 3531, 6889, -5056, -1137, 7166, -2179, -3880, 6960, 2348, -5099, 4790, 5763, -5162, 482, 9591, -1037, -3151, 8706, 2812, -6130, 5370, 8799, -3706, -442, 9712, 526, -4120, 6794, 4830, -3073, 4319, 7161, -3824, 268, 9444, -199, -2968, 8142, 3995, -5302, 4642, 8224, -4165, -876, 10036, 272, -5915, 6255, 5349, -4955, 1877, 7342, -2972, -1912, 7170, -50, -4762, 6388, 3617, -6425, 1705, 5966, -4873, -2145, 8456, -1084, -7712, 5209, 4088, -7907, -469, 6983, -4467, -5688, 4516, -803, -6660, 2875, 2373, -7783, -1392, 4310, -5903, -4906, 5174, -2065, -8416, 2892, 1383, -9914, -2462, 6196, -5289, -8541, 4016, -917, -9094, 420, 2725, -7794, -3346, 3361, -5276, -6434, 3625, -1613, -8242, 1119, 1778, -8854]
778h854O439Q098j0824j908J1944m818r578R830M433j0585K611Q395p997l058
792e872J0549k932p942P863K913j0065L882Q141q757k045J1150m832r386J0076
806B743N060j1771K171J0228q487m926J0933j600q700P492M239r796J387Q864
820G837p103l397R800k678q955Q619M168j1372K205J0744p917o716J0934P6j0194
835c949O204O141j0166k21R318n591n348R281q23q752N918M608j0130J740J0225
850H455q078o409J0853M72j1141N742P472r937j701R741m705o921Q812J627r305
865e023L711N889q219m68R178n970o072R928J64j1000N620Q182r428l028J0941
880D405m480q488Q912L333j0071K690P921q219k464R330l446o652Q231J197j0422
$$ y = [-8854, -2415, 5683, -5141, -7049, 4895, 77, -9501, 329, 4762, -5823, -3212, 5183, -2814, -5872, 4677, 1745, -6197, 1666, 4579, -5486, -1604, 6537, -2220, -4265, 6885, 2053, -7333, 2743, 7803, -3968, -1797, 8431, -56, -4982, 5951, 4351, -4349, 3143, 7382, -2414, -1027, 7837, 734, -2663, 7137, 4459, -4496, 4123, 8291, -3081, -876, 9868, 1951, -4765, 6169, 6245, -3949, 2255, 8396, -1770, -1991, 7327, 1736, -3612, 5669, 4846, -3906, 2012, 6620, -3510, -1770, 8455, 377, -6032, 4821, 5293, -5848, -106, 7366, -2571, -4272, 5469, 764, -6157, 2655, 4282, -5023, -1312, 4577, -3642, -4110, 5068, -902, -6974, 2954, 3118, -7882, -2262, 5920, -3508, -6536, 4405, -75, -8563, 349, 3682, -6389, -3699, 4222, -3997, -6461, 2869, -577, -7229, 1002, 2199, -8223]
895h223M721Q587r710l005J1553l221r937Q673M488j0190K163Q831p750m369R758
910B369j246q037O686L791r440K878P785p721l375J0957k715r301P719N252j0564
925d962J667R645o549n687J0046o49q668O172N237q983N59Q004n347m520R420
940E385j317q970O466N492r762M10J0513o116o366Q957J195j0279N809P070r257
955g70j591R286m316n712Q125P42q545M572N447r098O4J0122n579p196R087J427
971F065j0205M740P758r635j999J0110l706q224Q034K495q560L262N663p689j808
986c699R534m319p118Q651J919j0448L749Q064q522l038R824l314q487P923M059
1001D778r895J639Q039o867l653Q608k219p170P382K523r678K475Q553p701l754
$$ y = [-8223, -3502, 5085, -4625, -7630, 3923, 702, -9235, -562, 3926, -6264, -4101, 4730, -3020, -7389, 2369, 1123, -6914, -228, 3563, -5877, -2999, 4786, -2935, -6310, 4647, 1932, -7369, 350, 5602, -4962, -3295, 6350, -199, -5886, 4160, 3511, -5157, 1015, 6252, -2731, -2172, 5832, 485, -4035, 5385, 4068, -4902, 1564, 7056, -2706, -2296, 8217, 2101, -4265, 4692, 5887, -4392, 1417, 8487, -770, -2361, 6925, 2609, -3103, 5022, 5764, -2781, 1791, 7238, -1860, -1796, 8326, 2747, -4449, 4638, 6065, -4140, 600, 8358, -1277, -3276, 6834, 3128, -5096, 2938, 5433, -3127, 135, 5798, -1891, -3699, 5835, 1516, -5602, 3049, 4968, -5480, -1731, 6333, -2189, -5227, 4597, 1283, -7204, 719, 4778, -5117, -3478, 4561, -2306, -5959, 2649, 430, -6740, 642, 3165, -6513, -4038, 4515, -3186, -6940]
1016f940R748k099q808P325M345r953J219R112o043n374Q785j77q033N715M376
1031C198q855J263Q372o550m392R364o91r110O502M979r181P86R215n401o525
1046g026R420P87r116M814O064q039o74Q720n525m966Q772O61r393N508O030q807
1062b770o80R528m776o522R349J067r898M420P708q009k462R044l377o502P699
1077C819J623q822M420O432q223j747R297l984o688Q349J481r739M185P452q071
1092b16l098J0208l128p882P179K925q517K516P132p897k302Q632k457p479P121
1107B737K811q867K812P196p276l465R239k354q191O439M341r009J509P324o321
1122a075l953Q867k046p780O373M265r256R53Q108o107m244R260j771q551O605
$$ y = [-6940, 2808, 709, -8099, -774, 3571, -6382, -5163, 3949, -2094, -7468, 1317, 1140, -6893, -1178, 3198, -5657, -4394, 3978, -2572, -6964, 2400, 1709, -7401, -899, 4080, -5101, -4315, 4900, -501, -7026, 2394, 3181, -5935, -1121, 4943, -3096, -3770, 4950, -575, -5541, 3231, 3892, -5501, 7, 6037, -2770, -3450, 6078, 1302, -5220, 4129, 5196, -4702, -282, 7426, -583, -3045, 5999, 2622, -3880, 3819, 5442, -3380, 1040, 7472, -751, -2498, 6799, 2815, -3873, 4476, 5957, -3782, 403, 7855, -216, -3314, 6894, 3766, -4116, 3063, 5988, -2529, -13, 7119, -778, -3080, 5552, 3095, -4384, 2737, 5548, -3319, -507, 6689, -587, -4052, 5187, 2833, -5358, 1081, 5422, -3587, -2078, 5246, -1075, -5028, 3839, 1793, -5987, 386, 4651, -4605, -3652, 4456, -1651, -5895, 3365, 1594, -6957, -352]
1137c52M778r453L64Q938n502n499Q379n48p897N196N401q777k18Q591n190m910
1153f699Q242J82q583N065N324q542k33R000m838o109P906J351q522M367N790
1168C701p822q10Q865m712n598Q084J729q959L930O342p818j039Q813m135o509
1183e938Q009K195r113L495O763p060k018Q603l107o817P538K488q910L242O816
1198F186o833k696Q406k332o660P188K561q709K445P979p411k938Q546j874p400
1213c542O185L897q937K060P704o575m177Q811j166p855O119L739q340J018P642
1228F583n831m603R142j322q069N660M549q504P86P949o117m317Q617q58q479
1243d814N479N109q918K98P837n143m770Q328m0r013N180N373q179n93Q143m554
$$ y = [-352, 4426, -5027, -4663, 4275, -1227, -6726, 1653, 1105, -6792, -1596, 3805, -4972, -5190, 3401, -1789, -6699, 1543, 1725, -6858, -1793, 3531, -5011, -5244, 3756, -1082, -7191, 715, 2066, -6456, -2089, 3701, -4121, -4931, 3934, -778, -6376, 1708, 3437, -5522, -1592, 4750, -3068, -4107, 4706, 571, -5938, 2071, 4266, -4847, -1352, 5411, -1649, -3667, 4936, 1829, -4988, 2550, 5038, -3872, -630, 6186, -647, -3343, 5063, 2731, -3929, 3259, 5820, -2889, -444, 7535, 124, -2814, 5732, 3858, -3542, 2643, 6540, -2397, -337, 7367, 792, -3385, 5426, 4260, -3595, 2524, 6263, -2077, -1059, 6583, 752, -3851, 5291, 3969, -4100, 1560, 6109, -2395, -1609, 6340, 223, -4094, 4523, 3665, -4814, 665, 5774, -3144, -2846, 4991, -152, -4922, 3406, 3366, -5647, -467, 4906, -3273, -3866, 4277, -277]
1259b77n291P697M3q385N038N711q346r10Q137m307n346P388J178q640M233O040
1275C963q203j426Q616l559o002P024J444p773L149O483p734j381Q683l588o567
1290f871P203K525q499K931O395p167k064Q820k511o835O649K792q199K333O811
1305D313o698k182Q421k584p017P028L325r089K327P279o508k836Q195j678p201
1320d905O399L961q438J207P566n617l494P839j523p299O122L785q363J407Q344
1335F991o012m482Q312r59p408N533M500q396K84Q031n064m524P846l0p771M718
1351A569M269p660O99P462n261m808Q179K5p944M219N181p752j58Q036m930n513
1367d387P547J653q418L701M896o832r56P411l744n906P739J000q180L613N679
$$ y = [-277, -5568, 2129, 2172, -6213, -1175, 4536, -3810, -4720, 3417, -890, -6236, 1152, 2330, -6310, -2077, 3963, -4240, -5666, 2950, -609, -6611, 413, 1857, -5916, -2767, 3716, -4018, -5399, 3284, -304, -6871, 332, 2857, -5642, -2711, 3684, -3483, -5547, 3273, 762, -6073, 576, 3368, -4831, -2498, 4313, -2385, -4567, 3854, 1270, -5747, 1281, 4606, -4483, -2156, 5123, -1385, -4221, 3974, 2296, -4905, 1494, 5455, -2983, -1776, 5790, 173, -3321, 4518, 2995, -4304, 1818, 5603, -2760, -1353, 6991, 979, -3503, 4809, 3850, -3558, 1975, 6475, -1921, -1637, 6394, 1330, -3194, 4652, 4622, -3149, 1569, 5838, -1822, -1123, 6339, 1078, -3730, 4449, 4474, -3470, 749, 5930, -1822, -1980, 6056, 1126, -4387, 3160, 4813, -3605, 96, 4992, -1840, -2796, 4615, 871, -5035, 2704, 3704, -4476, -863, 4816]
1382D816o863j713P694l568o288P651J720q514K896O349o670k372P515k466o062
1397e875O862J170p970K916O627o681k867Q586k867o717O708L091q823K918O621
1412C699o569l001Q251j425p157N987K837p586J713O629n895l211Q317j622p037
1427f070N881L349p345J464P096o211l298P945p27p304M998M685p447J62O958
1442D136m331m155P530o28o825M843M169p359O20P116m431m728P780k67p495M985
1458I60M859p376o16P678l808n166O989P37p387M126M889p009p30P873m208n330
1474c519P252J002p857M034N215p425j087Q417l967n763O763K042p612K517N339
1489E351o286j601P688l018o022O652J449p388K827N464o124j848P573l167o490
$$ y = [4816, -2047, -3760, 3934, 366, -5922, 1729, 3449, -5065, -2169, 4180, -2490, -4862, 2653, 187, -5875, 987, 2157, -5813, -2897, 3730, -2951, -5818, 2768, -99, -6816, -108, 2983, -5840, -2922, 3699, -2870, -5871, 2380, 955, -6202, -215, 2622, -4964, -3251, 3378, -2517, -5728, 2589, 967, -6070, -189, 3160, -4185, -2721, 4375, -1836, -5134, 2811, 2084, -5220, -222, 4463, -2984, -2822, 4136, -195, -4350, 3180, 2552, -4273, 570, 4739, -2620, -2000, 5116, 685, -4043, 3737, 3470, -4025, 960, 5819, -1557, -2173, 5505, 1697, -3469, 3520, 4257, -3130, 996, 5885, -1124, -1854, 6019, 1811, -3519, 3733, 4735, -3122, 912, 6127, -1298, -2385, 6032, 2065, -3698, 3065, 5107, -2505, 12, 5351, -935, -2536, 5152, 2134, -3888, 2764, 4213, -3175, -348, 5116, -1008, -2856, 4717, 1550, -4940]
1504d940O758K370p569J823O166n804k674P391k267o367N990K451p556K126N891
1519C789n520k775P452k275o391O044K694p934J435P328n498l799P352o73o905
1534e676M809L902p477J013O567m924l534O984p17o502M569L319o753R23O969
1549C472n062m315P655K17p370M305M533o810j87O776l761m469O750P30p262L903
1565h95M582o406l40O774l973m301P188J88p568M617N178p245r47P501l362m828
1581c837O693J124p087L017N331o223j366O831k797m901O371P10o796L057N551
1596E678o170j996P731k238o574O332K073o923J975O042n846k736P159j966n638
1611c097N542K383o942K182N347n756k040P215k247o037N244L039p363J436N990
$$ y = [-4940, 1818, 4188, -3381, -1558, 4608, -1196, -3870, 3521, 1254, -5113, 877, 3328, -4228, -2102, 3789, -1731, -4506, 2946, 671, -5720, 324, 3018, -4916, -3481, 3847, -1651, -5450, 1902, 1229, -5676, -867, 3035, -4442, -3429, 3138, -1786, -5320, 1664, 947, -5555, -986, 2333, -4420, -3497, 3472, -1590, -5905, 1750, 1967, -5403, -1098, 3435, -3375, -3562, 3214, -547, -5016, 1734, 2464, -4798, -895, 3687, -2719, -3059, 3715, -258, -4559, 2629, 2817, -4751, -134, 5044, -2201, -3148, 4353, 991, -3837, 2856, 3980, -3107, -90, 5241, -982, -2348, 4483, 1686, -3215, 3156, 3866, -2930, 127, 5678, -492, -2488, 5243, 3005, -3569, 2763, 4836, -2087, -112, 5930, 84, -2652, 4507, 2541, -3097, 2445, 4828, -2114, 68, 5415, -341, -2381, 4834, 2587, -3450, 1794, 4833, -2530, -1094, 4896]
1626D896n043l202O862j266o234M705L605o572M77N671m303l230O706j355o273
1641d556M888L316p074M45O778m522l653O469o48o678M757L971p034j2O451l945
1657a047l888O446qo478L958M109o970K77O860m568m456O657O97o870M035M232
1673B986o275r83P291l765m478N759J300o416L015M358o010n40O459l266m496
1688e061O460Q67o610L021N139n973j313O560k373n232N784J932o913K216N437
1703C941n193j606O070j884m623N360J829o793K158N431n204k516O855j751n361
1718c287N301K479o822J654O206n215k663O379j203n802N004K314o012J249N877
1733E459n137l147O785q82o201M652L006o243R86O218m812l571O834o56o181M075
$$ y = [4896, -147, -3349, 3513, 2247, -3987, 718, 4323, -2249, -1772, 3899, -404, -3634, 3072, 1717, -4556, 332, 3648, -3426, -2981, 3797, -725, -4378, 2091, 1443, -5235, -478, 3493, -3541, -3553, 2898, -1047, -4935, 1511, 1503, -4975, -1017, 3092, -3878, -3601, 3259, -1309, -5765, 892, 1589, -5281, -1246, 2986, -3289, -4272, 3019, -746, -5224, 535, 1835, -4581, -1566, 2792, -3218, -3758, 2701, -565, -5061, 1399, 2266, -4344, -1323, 3816, -2157, -3470, 3090, 717, -4515, 1269, 3201, -3712, -1496, 3941, -1252, -2858, 3212, 1328, -3295, 2065, 3894, -2899, -741, 4690, -514, -3030, 3825, 2074, -3287, 2014, 4493, -2329, -675, 5531, 316, -2347, 4032, 2829, -2973, 2031, 4345, -1667, -418, 5459, 322, -2825, 3960, 3078, -3123, 1529, 4535, -1708, -722, 5496, 684, -2887, 3947, 3291, -2890, 1185]
1749A185L263n999L83N466m009l377O156k17o296M087L414o127P7N807l446m073
1765c706O265R7o509L429M177n929o89N916k982m009N695O7n985L380L938n803
1781b648q32O165k783m694N679N07n952L162M787o077j663O768k539n114N367
1796A33J332n545K182M425n125j235N681k096m874N191K103o555K015N168n336
1811b536j682O481j873n351N110K382o038J421N356m501k156N884j369n140M478
1826D66K617n996J175N350m483k222O028j442n218M638K973o444J016N696l833
1841C21l346O128p81n218M032L182o068O01N465l750l031N631k01n554L847L343
1857D601o128L90N982l714l902O002K11n684L096L892n787r0N757l619l954N552
$$ y = [1185, 4448, -1551, -1168, 4298, 289, -3088, 3068, 2851, -3445, 642, 4056, -2071, -1994, 3813, 367, -3706, 2559, 2656, -3853, -424, 3753, -2176, -2865, 3051, 69, -3940, 1755, 1822, -4163, -783, 3155, -2648, -3480, 2685, -98, -4792, 887, 1394, -4558, -1396, 3391, -2686, -4349, 2419, -120, -5234, 133, 1465, -4080, -1898, 2527, -2598, -3833, 1848, -248, -5122, 69, 2172, -4383, -2368, 2800, -2536, -4218, 2263, 390, -4961, 149, 2531, -3507, -2086, 3270, -1231, -3387, 2497, 1128, -4012, 466, 3083, -2913, -1738, 3612, -871, -3093, 2935, 1493, -3725, 913, 3886, -2558, -1542, 4154, 321, -3025, 3103, 2322, -2896, 1136, 4318, -1750, -1149, 4316, 566, -2465, 3166, 2965, -2589, 1258, 4601, -1527, -1137, 4845, 1131, -2771, 3231, 3442, -2242, 854, 4746, -1041, -1131, 4626, 1007, -2947, 2605]
1873B605N06n457K967L662m982j003N610k776l943N166R45n923K416M132m675
1888g50j320N572k717m292N067J114n742K276M395n148j536N820k109m337M839
1903A132J468o171J929M856m701k151N759j358m938M282J800n703J839M889m714
1918a782k185N423j162n023M599J872n621J311N190m703k101N724j274m708L939
1933e01K369n193R08N065m208k338N241n09n287L829K917n267O53M682l354k755
1949c748N541n31n112L543L103m924Q7M875k846l355N447k64m964K895L818n361
1965a796J7M945k626l409N304K04n297K870L616n241j32N491k908l551N131M12
1981C030n204K833L776n140r01N404k246l874M839Q34n053K283L810n037j021
$$ y = [2605, 3111, -2346, 621, 4283, -699, -1702, 3908, 1132, -2811, 2355, 3300, -2623, -207, 3925, -750, -2070, 3502, 785, -3507, 1560, 2674, -3068, -792, 3603, -1545, -3081, 2739, 630, -3707, 1132, 2600, -3571, -1642, 3214, -1487, -3638, 2121, 763, -4175, 107, 1907, -3796, -1957, 2932, -1782, -3967, 1456, 294, -4729, -130, 1742, -3879, -2568, 2622, -2081, -4182, 1542, 268, -4440, -501, 1868, -3325, -2417, 2648, -1560, -3898, 1343, 834, -4453, -624, 2293, -2974, -2321, 2361, -993, -3748, 1793, 1262, -3850, -307, 2796, -2128, -2041, 2834, -12, -3367, 2080, 1816, -3148, -253, 3565, -1796, -1779, 3166, 540, -2869, 2435, 2639, -2658, 212, 3828, -1413, -1545, 3946, 1038, -2513, 2618, 3030, -2174, 659, 4435, -705, -1606, 3798, 1552, -2322, 2517, 3351, -1702, 581, 4391, -646, -1667]
1996a667N900k606l818M359J695n619J904L999m544j374N576k351m186M252K087
2011C607n321J142M623m698j584N214j540m270M370J926n958J003M729l802k081
2026b640N029j529m316L669K483n379P65M966l878k771N163q27m543L674K457
2041B323n400Q64M839l810k727N088K6n172L382K255m967P28M931l668k812M726
2057F06M84n192L487K581n075M31M847l051l276N076M46m933K589L168m548m01
2073b761M747k436l099M905K48m989K689L218m275p27M962k193l730M982Q43n268
2089b884K183L922m371j414N305j855l352M204Q30m867K380L331m073j387N237
2104C189j608m011M360J321m917J685L927m030j862N216j161m336L990J617m869
$$ y = [-1667, 4233, 1627, -2191, 2168, 3863, -1756, 148, 4147, -397, -1771, 3805, 1454, -2732, 1520, 3607, -1714, -572, 4051, -647, -2231, 2983, 1443, -2827, 1543, 3469, -2489, -1486, 3243, -559, -2640, 2389, 860, -3456, 213, 2696, -2683, -1918, 3048, -830, -3601, 1562, 735, -3808, -134, 2323, -3077, -2213, 2626, -1184, -3911, 1177, 1203, -3969, -587, 1668, -3299, -2571, 2360, -1308, -4120, 606, 1090, -4102, -615, 1966, -3109, -2678, 2169, -882, -4158, 918, 1364, -3569, -980, 2188, -2360, -2761, 1986, -450, -3549, 1356, 1604, -3385, -696, 2522, -1753, -2480, 2482, 289, -3441, 1541, 2384, -2884, -701, 3221, -1150, -2564, 2741, 886, -2466, 1738, 2568, -2299, 81, 3412, -661, -2048, 3189, 1581, -2430, 1930, 3251, -1666, 19, 3946, -84, -1946, 3270, 2109, -2227, 1763, 3380, -1489]
2119a489J667L682l846j531M846j023m476L820J937m924J249L609l514j752M957
2134C212j202m556L588K261m664O85L895l123k343N099j028m430L165K683m906
2149a664J77M558l172k482M512o38m374K984K595m416m02M912k697l101M391j7
2165A166m596K932K809m382l41M619k788k876M354K44m554K685K891m617m19M831
2181A958k337l619M796L42m534K141L027l981p88M827k413l097L951Q22m259J799
2197a365L392m025p11M872j928m172M225J573m613J509L665l696j546M592j227
2212E45l735M207J077m451J179L703l089j500L932r35l448L393J659m655J440
2227f78M053l342k384M754q28m112L570K008m419Q92M009l642j766M721m57l983
$$ y = [-1489, 178, 3860, 14, -1517, 3329, 2306, -2170, 1650, 3587, -1337, -88, 3521, 7, -1745, 3212, 2010, -2546, 1042, 3303, -1361, -676, 3219, 96, -2247, 2852, 1824, -2606, 559, 3242, -1664, -1487, 3071, -101, -2583, 1929, 1291, -3083, -99, 2496, -1920, -2322, 2590, -107, -3208, 1183, 1166, -3430, -498, 2311, -2071, -2412, 2207, -581, -3457, 897, 1141, -3413, -728, 2163, -2454, -2873, 1958, -379, -3998, 798, 1140, -3394, -1253, 1774, -2207, -2995, 1832, -581, -3678, 273, 1095, -3164, -1365, 2027, -1998, -2709, 2163, 235, -3937, 288, 1861, -2752, -1243, 2422, -1274, -2820, 1772, 545, -3190, 1017, 2094, -2357, -1178, 2525, -564, -2064, 1868, 933, -2515, 878, 2537, -2118, -678, 3375, 33, -2351, 2403, 1575, -2537, 1033, 3041, -1378, -486, 3523, -119, -1885, 2836, 2379, -1604]
2243a604K717K253m372N78M042l054k234M377m97l917K811K528m112l04L961k623
2259E50k280M433j18m706K776K740m304o0M118k253l141M449L9m605K449L011
2275C098l893j074M626k410l065M409M42m784K128L498m240r63M350j993k804
2290b675L647P09m546K354L019m374o71M301j671l384L563J057m456J769L526
2305B168l783j212M274j555l324L250J479m273J579L053l564j171M667j167l878
2320c457L026J896m441J097L749l226j294L859o14m102L283J888m003M02M063
2335B126l163j433L982p30l904L391K167m592N56M316k797k592M841j231l491
2350b554K792K521m277K90M254k909k189M062k70l547K450K616m186j60M304k572
$$ y = [-1604, 1113, 3366, -1006, -428, 3614, 560, -1674, 2703, 2206, -1711, 1100, 3628, -484, -788, 3173, 550, -1730, 2703, 2585, -2121, 655, 3395, -909, -969, 3149, 896, -2245, 2204, 2243, -2362, 87, 3098, -795, -1869, 2757, 347, -2718, 1691, 2133, -2651, -523, 2975, -1265, -2228, 2122, 129, -2675, 972, 1681, -2865, -511, 2508, -1866, -2537, 1764, 93, -3291, 272, 1329, -3127, -1358, 2168, -1615, -2827, 1447, -108, -3432, -182, 1297, -2976, -1397, 1656, -1908, -3079, 1588, 421, -3457, -431, 1465, -2976, -1879, 1870, -1356, -2650, 1209, 595, -3507, -224, 1664, -2339, -1937, 2126, -1037, -2470, 1512, 782, -3122, 269, 2436, -2156, -1600, 2716, -81, -2673, 2168, 937, -2554, 238, 2759, -1518, -1228, 3026, 117, -2072, 1990, 1720, -1827, 623, 3239, -947, -1107, 3197, 625]
2366F25k648M126M68m282K201K866m147k10M136k319k648L842R43m311J703L047
2382C392l750q19M332j826l262L861Q73m101J771K829l875n85M308k425l027L801
2398A497J264m425J412L172l197j326L885j466l364L507J124m308J587L527l653
2413g64j298M011j330l313L408J331m220R14L745l691j353L726n59l430K784J444
2429A405m044J105L541l212j913M356r56l846L174J811l921M23L700k540k134
2444c051M225p21l756K464K409m031L50L925k725k432M156o6l905K740K223l880
2460b075J72L934k873k152M102J5m253K693K781l556j082M342k238k198L341J87
2476A140l302K158K557l693q30M381j899k976L910P03m050J920L202l852o17L829
$$ y = [625, -2023, 2103, 2571, -1711, 490, 3356, -791, -1001, 3135, 816, -1832, 2010, 2953, -1358, 345, 3392, -358, -1177, 3155, 1329, -1933, 1928, 2801, -1300, 471, 3300, -575, -1160, 3148, 723, -2304, 1497, 2761, -1664, -252, 2920, -277, -1603, 2282, 816, -2548, 959, 2083, -2225, -638, 2889, -764, -2062, 1949, 619, -2694, 714, 2045, -2175, -1261, 2484, -1207, -2560, 1166, 607, -2823, -39, 1405, -2639, -1534, 2007, -1205, -3118, 1238, 282, -3564, -390, 1421, -2500, -2077, 1623, -917, -3051, 1174, 453, -3303, -839, 1570, -2461, -2111, 1814, -911, -3343, 813, 747, -3158, -418, 1805, -2075, -1903, 2031, -842, -2994, 1108, 1123, -3130, -437, 2344, -1212, -2294, 2048, -190, -2388, 953, 1140, -2162, -4, 2553, -1140, -1970, 2411, 512, -2464, 1446, 2149, -1901, 19, 3221, -631, -1248, 2581]
2492B581j395k985L258R01m140K290K591l617j003M305j544l125L509Q95l789
2507a268J305L283l515q56L863j185l427L079J721m323J320L155l293r72L478
2522B365j510k875L255J550m177Q31L300k767j661L855q72l431K980J282l733
2537a608L40L900l107j876L742k24l567K956J572m225N93L683k742k017L837l19
2553I38l531K446K070l978L29L967k871k494L922J81l615J825K155l264Q0L526
2569A686k328k478L936P0l822K102K542l961K3M170k388k647L722L49l800J624
2585a200K958l265r41M122k095k445L552L12l464J438L244l517p16M011j630l034
2601b670L615R88m415J543L604l354j156L904j169l092L307Q95l469R72L391l283
$$ y = [2581, 1186, -1799, 1459, 2360, -1780, 510, 3101, -516, -1519, 2786, 1242, -1883, 1626, 2521, -1268, 37, 3320, -195, -1051, 2812, 1627, -1800, 1279, 3000, -1323, -3, 3152, -141, -1113, 2365, 855, -2020, 1235, 2785, -1392, -561, 2739, -28, -1689, 2166, 1294, -2137, 843, 2125, -1608, -1268, 2632, -475, -2351, 1391, 1167, -2400, 556, 2128, -2097, -1504, 2179, -563, -2580, 1257, 938, -2593, -147, 1923, -2055, -1726, 2241, -630, -3124, 798, 979, -2636, -811, 1344, -1920, -1840, 1686, -642, -3120, 816, 886, -2936, -834, 1708, -2253, -2230, 1940, -448, -3095, 627, 976, -2824, -1200, 1758, -1507, -2448, 1674, -421, -2866, 686, 998, -2466, -1028, 2216, -1301, -2017, 1994, 364, -2670, 945, 1933, -2482, -939, 2665, -689, -1845, 2059, 890, -2202, 1105, 2000, -1469, -497, 2894, -389]
2617c89j104L701j117l113K965J128l410R95L289k892j475L723n26l514K921J544
2633B726l643O72L463l003j418L637q14l294K746J764m193R96L400k874j878L999
2649B286p42l034K077K208l807J95L548k276j970L364m81l327K018K801m290M72
2665i58L532k428k307L493O7l674K159K532l803n99M126k352k397L609J45l660
2681b515J803K447l134o29L973k095k652L371O84l863J749K426l436k56L717j882
2697b92k505L083P38l555J344K723l325m71L563j411l169L318J172l740R34K953
2713A360k669j124L925j306k967K965J428l923R99L534l006j728L900j123k963
2728b698L107J248l615Q41L676k879j799L584o43k937K375J943l803M48L918k725
$$ y = [-389, -1493, 2208, 1091, -2022, 943, 2071, -1339, -344, 2945, 53, -1422, 2301, 1775, -1739, 1182, 2726, -917, -245, 3218, 215, -1203, 2434, 1620, -1674, 1072, 2836, -1357, -361, 3039, 165, -1713, 2286, 1544, -1490, 587, 2795, -1012, -817, 2731, 455, -1515, 1849, 1368, -1959, 59, 2860, -1430, -958, 2574, 146, -2161, 1332, 1399, -2275, -116, 2416, -1387, -1986, 2140, -212, -2609, 1000, 1145, -2515, -712, 1735, -1399, -2028, 1945, -150, -2802, 569, 1253, -2610, -861, 1565, -1871, -2127, 1590, -292, -2797, 286, 1024, -2531, -1187, 1536, -1789, -2260, 1303, -108, -3277, 41, 1213, -2527, -1593, 1360, -1309, -2433, 1492, 186, -2781, 184, 1612, -2311, -1312, 2222, -784, -2512, 1388, 265, -2698, 409, 1657, -1958, -1117, 2559, -320, -2119, 1465, 822, -2115, 260, 2203, -1600, -1152, 2766, 41]
2744D1k085L753j86l500K683J760l583K40L965k941j842L905k96l590K088K327
2760B739l465O2L297k229k084L713j4l988K261K735l569n10L786k045k238L671
2776B122J4m081K286K567l161q13L916k207k218L051K70l353J143L151l482m66
2792a261L393j618k402K935P59m046J603L284l468r65L771j489k529K731P40l640
2808b202J406L159l692n10L291q99l030K702J147l569J181L098l602r98L826r99
2824C09l034K480J634l811P77L152k718j088L077l74l364K676J787l817P98L145
2840A629k544j602L332m90l256K507J997l788N96L740k391k213L571n06l071K352
2856a37K122l443K20L211k189k016L390r8l140K137K115l290L5L130j779k397
$$ y = [41, -2044, 1709, 1523, -1977, 706, 2466, -1117, -877, 3088, 147, -1695, 2210, 1914, -1676, 412, 2739, -726, -664, 2633, 404, -1680, 2033, 2019, -1969, 292, 3027, -542, -1052, 2734, 689, -1549, 2122, 2136, -1945, 341, 2908, -253, -1066, 2850, 643, -1575, 1476, 1746, -1607, -464, 2687, -795, -1261, 2132, 514, -1888, 1047, 1806, -2240, -637, 2647, -821, -1786, 1985, 496, -2033, 698, 1438, -2202, -796, 2363, -1329, -1839, 1452, 553, -2477, 225, 1372, -2197, -1016, 2082, -1520, -2518, 1308, 309, -2725, -245, 1389, -2422, -1645, 1507, -1211, -2299, 778, 404, -2960, -284, 1503, -2314, -1516, 1629, -915, -2517, 815, 325, -2931, -424, 1573, -2215, -1619, 2121, -270, -2483, 1088, 582, -2489, -137, 1985, -1458, -1238, 1973, -216, -2232, 1158, 1060, -2080, 57, 2172, -1118, -1083, 2047, 268, -2129]
2872b129L348K08l069J857K458l559n98L917j775k515L573q4l136K041J662k817
2888f18m16L832j822k672L333O49l446J596K471l200n61L719j848k828L376N32
2904B097l375J361K922l218j050L328j041k896L065Q36l632J357K823l070j011
2919a504L476j171k855K763J262l776J119K425j824j819L419l77l421K915J110
2934A742l512N62L195k707j624L475m65l387K595J821l684M52L233k543j766L630
2950A017q2l733K490J915l344j68L491k384j949L363j2l213J861K172l171J00
2966a647L009k158j907L240L06l406K115K012l357n7L077j683k074L498L65m048
2982b715K028K491l117n77L622j919k037K857P02l431J779K306l147n08L467j147
$$ y = [-2129, 1219, 1427, -1642, 215, 2673, -886, -1484, 2433, 658, -1857, 1716, 1632, -1504, 537, 2199, -618, -1034, 2798, 976, -1696, 1637, 2286, -1160, 436, 2907, -293, -854, 2865, 1017, -1811, 1565, 2097, -1278, 83, 3005, -213, -1263, 2065, 1024, -1872, 1193, 2029, -1603, -246, 2577, -493, -1504, 1972, 801, -2054, 709, 1971, -1805, -686, 1739, -85, -1904, 1515, 1138, -2283, 632, 1742, -1770, -1208, 1987, -720, -2344, 1131, 666, -2721, -126, 1695, -1989, -1537, 1696, -847, -2613, 1017, 935, -2798, -308, 1607, -1737, -1905, 1586, -798, -2747, 616, 604, -2609, -748, 1424, -1747, -1647, 1362, -796, -2703, 537, 843, -2563, -448, 1564, -1793, -1850, 1227, -456, -2530, 968, 1333, -2715, -687, 1804, -1313, -1890, 1732, -187, -2224, 633, 1335, -2096, -317, 1989, -1158, -1666, 1801, 654]
2998F54k343K441J030l630J512K816k887j025L555j113k853K977Q03l129J004
3013a88K794k735j207L829j393k992K877J163l373R25L026k826j189L453p74k836
3029a446K362J258l284Q89L013k834j378L662q23l429K806J583l565N35K970k021
3045B98j777L117j95l139K274J474l126L4L159j837k146L353k44l196K053J904
3061B006l449J93L082k077k212L403J80k988J754J504k453m24L254j833k413L169
3077F96m9k892J815J955k979l76L477j771k344K790O60k982J036K358k860n79
3093b045L248j338k583K888P76l180J279K637k988m91L176j307k346K504J246
3108A476l739J349K629k625q76L288j005k613K356J109l117P20L098k635j354
$$ y = [654, -1689, 752, 1782, -1848, -336, 2480, -407, -1432, 2123, 1010, -1843, 1134, 1937, -1192, -188, 2606, -129, -1336, 2493, 1100, -1892, 985, 2148, -1225, -300, 2726, -100, -1289, 2164, 1390, -1446, 916, 2174, -1110, -221, 2792, -42, -1420, 2242, 1419, -2010, 796, 2379, -1186, -651, 2319, 298, -1479, 1638, 1443, -1696, 578, 2052, -1074, -1040, 2119, 282, -1864, 1489, 1245, -1951, 102, 2006, -1443, -1250, 1832, -245, -2457, 946, 1126, -1862, -108, 1396, -1057, -1481, 1773, -60, -2473, 696, 647, -2245, -430, 1525, -1454, -1830, 1647, -124, -2468, 322, 982, -2000, -964, 1394, -1466, -2045, 1203, -135, -2718, 170, 946, -2234, -955, 1682, -1306, -1797, 1379, 72, -2274, 230, 1476, -2263, -914, 1715, -910, -1786, 1502, 497, -2116, 240, 1349, -1768, -1048, 2050, -585, -1939]
3123a939L135k15l073K420J246k969Q01K929k870j135L402n23k839K150J639l123
3139i64K63K960j940k061L561l99k727J858J773k806M6K579j729j649L003m4l293
3156a569K002J965l247M43K595j782k057L249K17l254J703J893k881J83K628j676
3172D12j795K928J66l247J781J871k753m25L333j929k097L045K65l363J586K397
3188B175k996o49L195j169k539K686K85k729J398K050k418j048L045r00k447K184
3204A23P98k885O99K998k922q08L182p47k861K453J030k736K63K645k330q01K915
3221A016p13k592K333J184l149P67K264k062j187K934n41k719K489J261l078M14
3237a379K634j681j822L108n5k634J498J665k883L50K758j917j460K817rk867
$$ y = [-1939, 1196, 981, -2092, 328, 1574, -1395, -594, 2335, -535, -1670, 1732, 1209, -1630, 520, 2159, -964, -701, 2259, 319, -1742, 1819, 1420, -1307, 551, 2324, -482, -436, 2143, 414, -1235, 1768, 1724, -1569, 433, 2398, -849, -406, 2189, 407, -1650, 1599, 1816, -1438, 265, 2158, -723, -540, 2088, 412, -1383, 1545, 1711, -1536, 245, 2116, -637, -1062, 2271, 342, -1755, 1290, 1555, -1808, -222, 2175, -821, -1470, 1725, 556, -1983, 703, 988, -1741, -343, 1707, -711, -1759, 1286, 386, -2061, 123, 921, -1964, -1265, 1733, -1189, -1997, 1185, 438, -2423, 30, 1060, -1676, -1413, 1232, -1098, -1899, 1016, 303, -2289, 44, 1228, -1921, -1154, 1110, -952, -2139, 795, 254, -2465, 24, 1285, -1793, -1379, 1255, -426, -2248, 860, 805, -1829, -331, 1334, -1549, -1199, 1559, -358, -1818, 999, 990, -1877]
3253a877K384J230k986Q6L151j936j679K995K36k891J573J647k605K09K650j858
3269C29j868K752K80k772J488J626k550j3K749j427j822K517M91l102J075K299
3285B052k139q49L060j560j856K470O89l240J183K239k332n34K629j286j952K285
3301H59Q54k825J135J981k310j190L102j028k167K076J112k981N47K974k567q98
3317a326K940j098k147J835J272k995J061K249k468p71K681p12k758K435J168
3332A366k694M08K480k044j433K734l70k762K075J219k703M60K448j932j120K365
3348D97p5k725J885J688k560m5K421j643j435K736j00k813J827J546k613Q8K882
3365A561j760j852K624Nk438J597J679k426n09K987j318j841K633L87k830J263
$$ y = [-1877, 507, 1737, -1249, -1163, 1988, 52, -1627, 1368, 1604, -1287, 286, 1933, -672, -463, 2187, 329, -1539, 1213, 1493, -1279, 209, 1835, -715, -728, 2021, 594, -1228, 1289, 1780, -1322, -247, 2052, -87, -936, 2124, 564, -1292, 1178, 1867, -1373, -190, 2049, -283, -817, 1812, 526, -1426, 859, 1713, -1112, 23, 2004, -306, -1496, 1606, 578, -1589, 487, 1599, -1382, -835, 2139, -428, -1326, 1614, 516, -1631, 204, 1476, -1519, -458, 1791, -677, -1448, 1233, 521, -2237, 198, 1366, -1328, -920, 1560, -484, -1917, 817, 447, -2315, -240, 979, -1724, -1264, 1184, -748, -1868, 497, 422, -2303, -418, 1270, -1290, -1335, 1086, -557, -1992, 744, 644, -2169, -342, 1204, -1409, -1321, 1561, -199, -2051, 573, 578, -1860, -263, 1416, -1010, -1519, 1468, 150, -1691, 942, 1329, -1501, -238]
3381b38J653k293j34K571j137k203K716N44k687J139J927k445m89L043j318k018
3397a369K350O50k907J310J935j845q86K581q51k331K514M91k759J026K249j869
3413B89j225K789r82k406K559Q57k943O14K451k053r17K737o38k276K091Q18k680
3430i15O94K713k512j364K803p23k078K050R72k535L56K399k005j505L061o86
3446G25k269J886J238k788L66K671k140j421K731n33k327J569J389k455K46K349
3462A237j791j276K438P4k493J039J752k493J90K564j544j643K545J88k621J229
3478f05J647k511j2K584j211j891K389L66k599J117K068k486n47K715r70j887
3494a833K057N74k455R84K033k089m15K277o71k195K490J35k733J176K147k215
$$ y = [-238, 1415, -878, -1012, 1559, 422, -1781, 935, 1479, -1208, -69, 1858, -587, -1076, 1967, 649, -1369, 981, 1631, -1276, 34, 1969, 124, -762, 1819, 968, -1363, 1151, 1642, -1117, -91, 2158, 289, -936, 1853, 871, -1535, 1024, 1881, -1062, -448, 2003, -50, -967, 1770, 1132, -1144, 947, 1765, -915, -221, 2492, -20, -1384, 1419, 696, -1382, 668, 1640, -895, -539, 1860, -145, -1650, 1411, 725, -1544, 342, 1580, -1208, -842, 1829, -311, -1732, 999, 466, -1861, -292, 1097, -1358, -1112, 1237, -554, -1830, 608, 682, -1811, -772, 980, -1513, -1323, 1241, -303, -1946, 599, 787, -1834, -605, 1042, -1469, -1481, 1103, -108, -1999, 390, 756, -1843, -726, 1342, -1144, -1691, 1024, 54, -1833, 224, 798, -1657, -673, 1360, -729, -1144, 1133, 462, -1733, 757, 892, -1841, -665, 1482, -733]
3510g33p36K824j057j815K313O75k759J259J734j990p99K683q47k163K045P63
3526A397k561J132J770k008q77K772o67k437K081J059k323M72K320k032r45K155
3542A308k43k156J856Q72k262K82K317j710j392K695l71k313J746J122k280j24
3558f53K284j125j325K195m83k294J601J720k352o76K450r91j669K314j04k011
3574a119J105J548k256k67K562j764j587K715k1k381J306J284k039QJ937j115
3590h4j560J778O75k028O47J754k042n09K719j652j657K223L96k367J211J762
3606A266k023q99K358o78k039K164O79k354M23K241j732q14K032m00k005J851
3622G0Q50k518O92J846j449j153K515l48k533K279Q10k307M10K415j765j410K563
$$ y = [-733, -1469, 1355, 298, -1517, 796, 1471, -1288, -29, 1705, -285, -1084, 1599, 752, -1411, 634, 1397, -1164, -32, 1738, -270, -1147, 1625, 958, -1479, 602, 1661, -662, -190, 2130, 98, -847, 1308, 1065, -1091, 765, 1637, -625, -343, 1974, 264, -1128, 1567, 1196, -1117, 629, 1751, -529, -653, 1631, 506, -819, 1376, 893, -1401, 200, 1920, -432, -1108, 1342, 351, -1318, 996, 892, -1119, -14, 1534, -722, -989, 1573, -191, -1778, 937, 916, -1465, -159, 1125, -914, -906, 1031, -84, -1644, 134, 809, -1219, -572, 1182, -860, -1369, 1350, -302, -1959, 264, 660, -1707, -496, 1266, -757, -1656, 702, 24, -2015, 149, 828, -1526, -1103, 1138, -594, -1408, 624, 224, -1781, 70, 920, -1598, -906, 940, -509, -1662, 853, 505, -2028, 251, 1061, -1246, -836, 1579, -186, -1596, 967]
3639I67k94k240J771R17k054K60K271j805r99K254P8k366J232J589k557K87K179
3656A490j413j044K319j28k406J510J556k233k76K546j680j252K164R7k054J232
3672D28J604k467N6K187j338j490K137L2k206J473J346k028k62J992q26j630K100
3689A108j4k032J247J316k159j07K045j042j662K232K07k240J107J814k371n98
3705a149K231r34j517J725N99j925O16J300j601p66K564j019k187J916J314k320
3721a153N93J869j927q72K084m5k454J815J155k349N03J628j511j079K323m03
3737A77j899J709O33j994L69K334k051p64J879k49j940J678J066k049J0K333j212
3754C0j613K068k91j815J464J295k317o3K450j594o95J596J81k001J441J331k296
$$ y = [967, 673, -1567, 204, 1121, -933, -673, 1598, -207, -1206, 1048, 1126, -1240, -8, 1581, -976, -689, 1490, 77, -967, 1352, 1224, -1182, 328, 1884, -349, -625, 1921, 241, -1011, 1153, 1250, -804, 428, 2032, -435, -379, 1808, 470, -1020, 1117, 1149, -1057, 416, 1762, -266, -528, 1464, 638, -992, 1108, 1094, -938, 309, 1625, -534, -641, 1404, 362, -1300, 932, 1139, -1101, 6, 1820, -551, -1149, 1082, 148, -1369, 356, 955, -970, -354, 946, -655, -1421, 1143, 124, -2063, -147, 1167, -1153, -560, 1309, -618, -1490, 594, 549, -1905, -90, 1065, -1284, -781, 847, -664, -1743, 580, 177, -1722, -13, 620, -1374, -1005, 1329, -722, -1486, 393, 144, -1796, -118, 948, -1101, -1091, 1242, 30, -1583, 485, 194, -1621, -157, 1138, -1179, -1242, 1208, -386, -1081, 515, 696, -1305, 136, 1467, -829]
3771h29J14K265j783j040K064M72k499J124J646k086OK036j330j398K478J41k314
3788i33P92J497j225o29K070r84j268J682L86j977O43J618j661n94J674n80j300
3805g89J811J93k316J158J687j688q23J907l86j850K038P38k748P87K004j984
3821b61p22K217o19j685J399P73k008O35J725j467q35J910l41k075J602M74j445
3838g23K74J730j570r34K206m94j724J408J011k321M98J467j204o36J694j19k383
3855a820J661J382k167m43K429j665r23K140n34j875J154J525j843j94K102j465
3871e36j063K262k51k103J386J210j814j27J657p19j391J584N03j847J034J248
3887A033j763m53K111q55j362J648N46j966Q46J341j536n13K284j025j413J520
$$ y = [-829, -715, 1550, -233, -1273, 791, 1263, -1236, -112, 1534, -552, -546, 1490, 160, -1238, 1240, 1381, -933, -141, 1356, 131, -498, 1572, 588, -680, 1002, 1388, -589, 54, 1672, 11, -583, 1091, 511, -789, 1022, 1215, -1101, 57, 1744, 56, -767, 1140, 754, -1096, 942, 1680, -1068, -281, 1723, -261, -983, 1234, 615, -1070, 329, 1102, -906, -271, 1454, -13, -848, 1062, 721, -1354, 248, 722, -723, -449, 1281, -289, -1223, 983, 489, -1235, 173, 1184, -1137, -639, 828, -376, -1012, 682, 563, -1820, -159, 1223, -944, -1387, 1042, -623, -1546, 594, 60, -1815, -661, 864, -979, -1173, 929, -536, -1599, 663, 412, -1691, -305, 905, -909, -1036, 621, -98, -1489, 95, 598, -1249, -215, 1033, -730, -1183, 928, 73, -1289, 359, 905, -1061, -215, 1126, -410, -923, 1361, 336, -1077, 443]
3903D43N59j819M74J763j870n41K164k19j776J093Q07j820L99K120j917m72J938
3920A326p45j590J638P13k052K84K236j753n32J752l72j864J646J011k320M13
3936b09J292q91p31J908n15j886J709O33j737J81J667j471q99J847k37j200J003
3953D64Q49k074j1K108j301j132J903k80j469J383O36j604qJ553r46j250J928
3970G49k11k000J485Q67j511k92J831q39j439J738Q8j664N16J424j289m41J924
3987I36j101j312K019j65j417O13J461j713l49K077j377j071J658L54j785Q92
4003b80J141j518k83J511o73j078J431M90j606K98J576j473r00K333p53j553J503
4020A66N37j955Q82J347j426p12J735j36k116J460J356k061N56J461j247p91J817
$$ y = [443, 1002, -817, -343, 1420, -450, -991, 1173, 954, -822, 271, 1078, -742, -343, 1777, -140, -612, 1326, 581, -1009, 629, 1342, -710, -426, 1810, 57, -475, 1277, 905, -959, 687, 1698, -622, -209, 1083, 192, -539, 1369, 854, -1032, 677, 1310, -427, -246, 1421, -50, -949, 898, 661, -539, 464, 1313, -761, -772, 1336, 35, -1097, 806, 526, -943, 440, 1076, -528, -536, 1017, 71, -1179, 749, 538, -1462, 23, 890, -621, -913, 918, 79, -1360, 378, 466, -1198, -682, 742, -547, -988, 936, -165, -1477, 542, 377, -1040, -427, 1034, -679, -1028, 1049, -328, -1399, 259, 613, -1172, -280, 861, -657, -940, 571, -102, -1180, 251, 741, -865, -567, 1009, -464, -1364, 969, 216, -1337, 166, 703, -1252, -370, 977, -449, -1161, 574, 438, -1678, -218, 1138, -923, -367, 1094, -153, -944, 873]
4037H73k47j941J747P97j768J20J703j223q71J850l92j684J543R65j792k5J727
4054A382j015q35J611m83j889J510J199j837r3J789j092j138J595K30j803J252
4070C83J016j673l11J699r58j061J808j54j567P98J334j893j76K125j374r58J669
4087G07K18j983J348J466k048l64J697j220r99J834N73k118K64J879j833n75K041
4104H87o47j647J607M74j920Q99J430j706l14J534m77j790K266L06k358Q14J304
4121F62j388n52J982p81j159J292P36k292N82J724j424q26K015n88j490J583N47
4138F23j709M03J702j602n16J555P5j960J436Q81j942K49J845q80j288J565J07
4155E44j653J023J034j842K05J484p43r18J923j50j994J088Q94j544J53J550o52
$$ y = [873, 626, -1315, 432, 1229, -539, -419, 1284, 61, -810, 1040, 648, -1036, 507, 1472, -320, -345, 1382, 367, -468, 1143, 660, -1229, 281, 1480, -357, -450, 1339, 247, -891, 704, 934, -869, 383, 1399, -274, -585, 1114, 156, -905, 903, 749, -818, -20, 1314, -579, -755, 1370, -4, -962, 707, 925, -1058, 290, 1756, -292, -656, 1041, -179, -1178, 656, 1229, -889, -625, 1254, -579, -1154, 887, 240, -1407, 200, 674, -1246, -347, 1083, -623, -937, 597, 120, -1670, 596, 902, -1456, -642, 662, -726, -1278, 704, -77, -1236, 56, 792, -1500, -918, 806, -618, -1444, 571, -17, -1507, 76, 623, -1086, -683, 1019, -583, -1099, 456, 531, -1429, 7, 888, -1054, -805, 1040, 160, -1128, 437, 544, -1109, -86, 948, -894, -689, 795, 52, -866, 1057, 907, -1087, 1, 895, -649, -496, 1054, 402]
4172D02j393J984l11j729J042J162j581Q1J895j444q46J588K99j856Q84J107j407
4189a23l97J701p80j111J471K02j728R11J053j450k70J591m65j388J685J25j585
4206e58P28J482j963k98J456k20j652J661K08j590N54J502j672n79J877m86j315
4223h65R76N29j635M88J313j233n86J842n79j622J607N72j540K50J415j434n80
4240a082J921n37j384J130N03j793N71J346r33r96J588j01j330P51J442j917m12
4257a233J992q28j329J675J13j726J155J195j750L9J311o76j021J618M5j559Q96
4274h3R44j561l17J956o98j210J093N86j678N35J207j504lJ646r92j417K238m7
4292F95j613P64J356j534j70J261l41j326J607M25j879P55J328j426n22J877q41
$$ y = [402, -991, 993, 682, -1047, -5, 1157, -424, -343, 1552, 108, -738, 850, 1149, -707, 177, 1284, -123, -520, 1181, 401, -710, 761, 963, -765, 146, 1199, -251, -521, 1070, 605, -783, 902, 1027, -558, 170, 1652, -311, -609, 847, 627, -1025, 636, 844, -746, -192, 1310, -362, -941, 936, 450, -865, 111, 640, -995, -507, 806, -427, -1013, 829, 250, -1372, 235, 807, -733, -483, 932, -502, -1082, 839, 302, -1082, 48, 551, -1242, -671, 675, -258, -1254, 334, 233, -1097, -346, 1096, -821, -1233, 759, -69, -1398, 277, 390, -1336, -181, 1014, -736, -697, 614, -62, -1083, 535, 580, -979, -83, 861, -700, -1017, 939, 241, -969, 124, 710, -968, -433, 774, -730, -733, 913, -79, -1496, 742, 695, -918, -154, 1202, -332, -502, 759, 418, -908, 699, 1124, -755, 0, 1328, -98, -620, 1257, 416]
4309D16j193J301M60j754N96J553j540l72K013p73j529J284O72j940Q02J271j237
4326C0p82J780Oj627J116O11j810N05J411j268r03J739m15j361J198Q77j456k43
4344e92J738j066j265J764J90j650J291O35j651J47J620j438o30J758l52j451
4360i52R36O18j172k98J609p69j081J593J56k029Q56J411j642j67J664q15j147
4377a229J556J97k040J207J205j630J8J129m68j320J564n7j038P02P15j338j52
4394i79J830q42r17J008M23j512P70J230j623o66J833m12j415J645J66j406K00
4411f67J329j075l47J430m76j246J417O44j378P1J405j528p42K031m50j415J206
4428B09J181j944R0J526j408l66J472j14j118P99Q42j390q9J598j016q06J388
$$ y = [416, -777, 524, 984, -770, -174, 1379, -161, -533, 1480, 707, -822, 462, 1134, -806, -4, 1267, 30, -752, 1028, 1034, -593, 523, 1134, -676, -171, 1240, -28, -931, 808, 393, -968, 230, 1107, -349, -592, 1146, 80, -1185, 579, 769, -881, 410, 1045, -606, -459, 1161, -277, -907, 851, 499, -952, -16, 602, -570, -868, 741, -28, -1109, 484, 640, -1389, -533, 878, -764, -931, 733, -82, -1229, 327, 524, -1516, -309, 896, -734, -716, 413, -55, -1375, 189, 132, -906, -204, 511, -827, -979, 851, 9, -908, 100, 523, -989, -219, 1011, -612, -1278, 555, 143, -1272, 373, 539, -867, -667, 662, -413, -760, 670, 194, -1052, 365, 1009, -369, -298, 1107, -421, -1163, 868, 418, -997, 209, 1390, -554, -464, 1062, -346, -712, 760, 646, -472, 327, 1169, -221, -310, 1288, 272, -534, 854]
4445H54j01j311R52O08j354j65J708j074o20J386j26j287O28J142j556p4J536
4462A146r84j074J610J57j833R92J299j919K93J646j111r86J440P4j441R45P09
4479I63j304m49J522r96q47J508K23j603Q67R47j237l01J493j031p72J126N01
4496F10j644Q47R03j272m11J363m76j099J415O5j426O79R44j209k04J772o29j151
4514i23J038M68j863Q65J203j381l38J466n88j005J146L57j503M52J353j109o20
4531i82J661l60j548J087Q92j752J30J643q72r32J592K1j505J020Q22j383J68
4548b98J263j212n84J553k51j342J007Q87j536q4J477p55j078J469K75j719J175
4565B47P98j245k11J369n63j163J498J8j245O31Q47j323O6J397r67q27J448j08
$$ y = [854, 753, -558, 394, 1002, -352, -517, 1191, 117, -503, 883, 757, -530, 98, 1240, -316, -390, 1146, 162, -912, 698, 855, -978, 14, 1313, -606, -313, 1333, 222, -764, 676, 750, -691, 254, 963, -341, -790, 732, -264, -1111, 397, 620, -983, -116, 831, -406, -707, 786, -245, -1017, 109, 610, -1034, -187, 716, -556, -967, 396, -80, -1179, 236, 301, -1125, -446, 498, -711, -915, 857, 228, -923, 115, 583, -1280, -415, 788, -593, -931, 535, -53, -1058, 88, 445, -1058, -606, 747, -362, -982, 679, 319, -1229, -142, 750, -1002, -872, 771, -101, -1033, 559, 580, -925, 95, 917, -466, -298, 965, -247, -831, 722, 471, -871, 136, 1023, -513, -597, 880, 125, -953, 516, 791, -928, 247, 1045, -200, -411, 958, 395, -768, 730, 748, -497, 134, 981, -342, -276, 1121, 154, -673, 775, 667]
4583F67j348Q87R53j563J21J325o73j167J119P68j671M02J123j422k1J587p81
4600C06j239J429K35j530O30J156j151o89K033j002j304J222L30j119N66J243
4616A116j323n81J351m96j213J383O05j913O40R11q84l32J199l33j242J085N66
4633E39j397N52Q46p91q18J386Rj240R42P58j885M24J379q47o13J289l51j482
4651a300J497N44j634p4J768q90r50J168K97j240K24J154j250L44J375j151p38
4668h56R22M70j519P12J102j339o8J178p87n42J366j52j343J071Q49j189m01J448
4686I22j079n97J227L11j445N64J034j015j04J093n41o93R74P2j629Q67J190j632
4704d81r4J566n67j236J195L40j442O88J312j612k82J451l85j331J588L93j667
$$ y = [667, -681, 206, 1159, -404, -283, 1042, 369, -798, 321, 1089, -582, -180, 943, -479, -500, 1087, 306, -933, 496, 731, -799, -169, 987, -164, -853, 1180, 178, -1126, 96, 426, -693, -127, 1116, -207, -788, 563, 67, -1146, 237, 842, -1071, -431, 480, -404, -736, 463, 130, -1112, -27, 539, -858, -306, 540, -251, -1069, 317, 326, -914, 28, 786, -1099, -675, 704, -143, -756, 533, 182, -1300, 197, 741, -893, -967, 801, -89, -1039, 129, 426, -814, -590, 564, -686, -342, 1033, -118, -856, 66, 536, -983, -271, 831, -508, -576, 602, -185, -727, 639, 487, -856, 215, 1064, -125, -526, 922, -157, -754, 473, 784, -661, -97, 937, -78, -182, 911, 370, -323, 651, 723, -906, -39, 1151, -481, -575, 991, 424, -812, 383, 723, -719, -31, 1281, -331, -613, 838, 453, -878, 710, 1103, -564]
4721e64M89J257j074m21J084l76j185J046O82j533M92R21p63p18J393N8j857J430
4739C61L86j334K22J326r24j205K054o17j277Q81P03j393M04J109r35n20J395
4756F36m59j349J188N94j734K47J546n87j185J681l80j256Q52Q61j294p4J130
4773D17m50r53J278M5j406P20J008j295j57R64K40j127Q85K49j244J91J034p98
4791c99l09J430j092o31J236K89j342Q61O31j206l1J267l40j163P57O00j214J80
4809d76J282r24l45R12k23q51J316j31j088L88J245j500k05J330l00j213J192
4826D09N31j668L68J241p55m67J033k00j146J061L74j349K12J553j217m11J155
4843G24m32j203J054R51j603L83J277j257o61J744m43r58M79J089j502j40J139
$$ y = [-564, -75, 1182, 108, -313, 771, 395, -790, 256, 938, -595, -103, 818, 55, -663, 730, 788, -1069, 361, 747, -587, -365, 961, 37, -1168, 886, 269, -1008, -127, 576, -817, -413, 696, -239, -759, 636, 177, -1172, 16, 610, -1124, -877, 669, 82, -1103, 578, 198, -1058, -206, 655, -639, -713, 417, -33, -986, 292, 337, -1069, -349, 659, -636, -793, 171, 411, -716, 169, 418, -826, -635, 399, -399, -708, 722, -370, -1001, 235, 524, -818, 43, 674, -532, -563, 704, 364, -799, -42, 558, -656, -476, 806, -118, -463, 449, 226, -625, 691, 560, -528, -140, 1105, -395, -600, 730, 430, -783, 409, 940, -728, -360, 881, 126, -341, 692, 492, -654, 407, 781, -568, -356, 1197, -20, -431, 724, 292, -911, 143, 1094, -509, -126, 1151, -106, -767, 977, 534, -424, 55, 1144, -358, -498, 641]
4860F41o69p81J401K08j662N97J129j208K5J089p70q53J353j22j032N71P93j245
4878e35K74P49n38p39J066J89j619J206P70j195k03J080l59q05Q03P2q84K31R22
4897D85j074j50J275p19m87P92K12j148O98P22q91m95J619j035r87J309J47j111
4915h38L52J165j220l28J607n28j024J106k8q45K94J113j195n1Q00j88p39N91
4933D4Q04j551J4J507r54n47J224l73p52J012K11r32J51J068j183o59J534j09
4951E09j268R02O35j241R6J322j021l35J295n01q91O46N66p98J67O07m26n81P44
4970D27r2r23P82O78j122k6J003n19o65J071j14j040P14P25j136k92J336p99n09
4989e01O64N07j432P10N61p20m45J187l11q56Q44J93r31N24O54r72m60J585p86
$$ y = [641, -28, -809, 592, 800, -862, -265, 864, -344, -319, 770, 0, -853, 500, 378, -654, -83, 710, -535, -261, 488, -50, -789, 277, 466, -1153, 53, 823, -372, -575, 505, 146, -659, 144, 216, -668, -437, 485, -589, -739, 536, -183, -670, 122, 334, -814, -116, 606, -285, -780, 839, -196, -1183, 126, 273, -838, -486, 679, -541, -869, 738, 210, -814, 292, 264, -581, -287, 826, -369, -420, 380, 192, -547, 44, 848, -703, -689, 818, -136, -683, 541, 168, -584, 428, 639, -293, -142, 926, -257, -916, 618, 509, -759, 143, 778, -463, -367, 955, -66, -401, 894, 393, -498, 148, 714, -84, 83, 690, 264, -317, 427, 335, -588, 194, 872, -250, -276, 727, 208, -457, 614, 500, -540, 174, 899, -237, -529, 807, 8, -501, 163, 670, -762, -52, 509, -211, -656, 531, 220, -636, 208, 401, -530, -6, 648, -324, -784, 801, 15]
5008A5q47Q65K42j013L35R32j004j80J119l97r71J082M07j486O16P80q21k44J168
5027E98m96j053J212M39j378K46J061j112j40P28k06p23N78O92j124L75P12o90
5045b81n02J078j08j034Q60K49r81L58J264j349l41R67J62p78L44P67p47j68R63
5064G23p66o28J290p9j169P73N78q93m67J005m08n34Q98K97j118M65J043j122
5082a12l15Q89l55o17R50J4p71P86O9o00o1P91l97r01J065L68j432N57P53o61
5102B0m21J153o42n37P48K40q09M06O10p63n09J429o94p16Q27J72p70O7J046p14
5122A43n03R37m46q70J236K49j112K21J028j003n54J053j29j158R86N00j141o7
5140f30J263p37l23P46k86r46O64P73j475O19O50l63o01Q27k00q26P65M94r90
$$ y = [15, -832, 33, 275, -738, -403, 529, -475, -655, 464, 67, -904, 178, 585, -901, -285, 495, -326, -570, 598, 102, -951, 261, 700, -678, -432, 629, -483, -623, 105, -101, -824, -246, 446, -678, -303, 409, -281, -783, 295, 187, -847, 13, 262, -719, -361, 903, -446, -787, 180, 342, -436, -92, 675, -72, -240, 723, -43, -671, 619, 540, -629, 144, 722, -171, -638, 367, -41, -575, 323, 620, -498, -33, 1010, -112, -427, 462, 107, -510, 440, 454, -317, 469, 538, -62, -123, 668, 271, -630, 435, 803, -629, -72, 681, 20, -401, 752, 110, -427, 321, 561, -248, 158, 768, 5, -504, 925, 231, -485, 342, 514, -256, -189, 857, 143, -360, 577, 131, -739, 497, 746, -366, -145, 883, -120, -674, 379, 250, -908, 78, 578, -563, -630, 633, -104, -427, 319, 33, -913, -249, 524, -951, -332, 318, -45, -646, 181, -19, -845, -80, 414, -576]
5159e76j2P88n67m17J149P8j199Q79M10j031k36J132n69m44Q73K41j215M98Q38
5178F20q70l03P31k61o18O67N14j053M46O90o98j81J000o26m42Q19Q5j044N12
5197a2R55j044k21R51k78q60O55K84p93K23Q32r62L9P55l97n12N86L40j009L66
5217a02R45q22l50Q68l84p12N38O68q99L08M62m88n27J318l35p50O95J51r04K53
5237f7N41n64m06R14K12j266R92M66j066j5P63n83m12Q29j34j027J311M46j514
5256e80J02J264q14j33M64j17r92J091J33j134P21M68l00j035R02J41m30J65M53
5275C69q90J14Q59m91p20Q22M43j074L60P93j234M1R78l32p19R75N64j427L48
5294b21L74n00l49J100n04n41Q05k27n45K84P16j139J14J052k68r70J133m3q41
$$ y = [-576, -588, 200, -367, -784, 365, 443, -756, 123, 533, -498, -734, 398, -171, -615, 258, 499, -716, -218, 620, -250, -553, 178, -83, -701, -34, 480, -573, -127, 563, -135, -316, 684, 58, -384, 435, 520, -524, -12, 943, -101, -322, 629, 351, -509, 146, 430, -363, -140, 692, -270, -231, 524, 127, -385, 201, 541, -468, -102, 843, 21, -329, 539, 155, -557, -19, 649, -250, 58, 520, 32, -495, 823, 488, -262, 433, 584, -320, -67, 474, -90, -496, 418, 630, -636, 356, 822, -244, -259, 504, -79, -491, 338, 204, -823, 488, 934, -580, -478, 786, -28, -161, 303, 186, -806, 285, 418, -716, 5, 473, 173, -862, 40, 181, -249, -84, 369, -521, -407, 452, -39, -759, 63, 506, -568, -208, 585, -649, -608, 370, 38, -681, 294, 858, -569, -221, 153, -347, -696, 404, -100, -641, 164, -63, -608, -324, 392, -747, -633, 419, 151, -819, 314, 271, -570]
5313e70J91O82m76l34R66o13m36P17L85q31j16J059p51l14P47j72r13R42L66j224
5333f95M85R20o72k22R80l24q65O81L42r23m5J267p35q31J165l98n80N37M79q58
5353b92J83R22r46n9O25j61n42M69M56r08P4R20p67k01R85m42q76N61O82q49k21
5374c87J047o12l60J108l57j068M73P39p19j43Q14k87n50P79J34j066L35O61p94
5393b53j29O41%n81N05J06p97M39N87n24l30M74j78q06R45Q5n97M43L37n26o27
5414g86P78J45p66Q01k39o71M58N68j10o10O18p7o23K16O63p76J96N12l69m17
5434d89N05Pn41L61O19j049L55Q00m64o17Q41Nr09Q11Q9p25K44N15l57m95M16
5455g8K59m00L61M06p59l4J129q65n23Q10K23q67L34N69q22j13J025p34j15N63
$$ y = [-570, -379, 303, -173, -507, 459, -154, -590, 127, 512, -319, -435, 624, -127, -441, 306, 134, -779, 163, 529, -695, -210, 710, 38, -184, 796, 472, -393, 288, 630, -293, -338, 929, 194, -637, 528, 130, -450, 87, 566, -292, -109, 813, -133, -192, 433, 272, -270, 199, 655, -253, -179, 741, -26, -227, 758, 316, -560, 1, 683, -166, -387, 660, 48, -312, 796, 439, -629, -156, 583, -136, -279, 535, 248, -302, 477, 611, -455, -120, 541, -253, -382, 259, 259, -322, 183, 289, -508, -69, 518, -6, -336, 138, -40, -846, 99, 184, -413, 30, 367, -159, -786, -8, 137, -629, 172, -67, -738, -280, 288, 178, -432, 186, 109, -514, -298, 365, -411, -215, 297, -72, -489, 16, 23, -518, -157, 462, -587, -232, 568, 104, -513, 328, 333, -576, 235, 324, -401, -157, 358, 1, -494, -78, 181, -219, 142, 548, -211, -245, 884, 19, -504, 306, 529, -338, -4, 565, -257, -370, 655, -79, -194, 369]
5475C69Q7q00O31K68p46O0P86m62p99R85j30o84M93P76q86j50P61k47o46P09J36
5496E11r06L80Q32q72m21Q35K8r24J007K50q92K34P36q79o8K99J11r04R70K65
5516E92j171N57N03o68j53P03m66k82N09M05q24j36J128q31m09O69M4q05M91M91
5536C47j000J00O23l72k33Q57j39q34Q35L13j138M53M98n16m86O65J7p22O29M37
5556C34o04q6Q15r26J38P14j77n94M14N13q63k49J194p98l09R00l75o14M53O50
5576E30q53j98Q87n29j89M24L18p49K70P07r10N7Q32n33q25R29j82m94N00M19
5596D11l44j01M26m5o16L86R2n00J61Q57n95k44O69m61q39J094K81r12L20O29
5616F69m59n49R43l3j153P61N15j020L14M93l89l38P13j22q34J011k58p24r9J256
$$ y = [369, 456, -344, 287, 555, -191, -131, 655, 193, -606, 379, 249, -435, 58, 834, -52, -202, 559, 312, -334, 375, 511, -395, -15, 817, -55, -476, 359, 387, -537, 470, 720, -172, 62, 798, -81, -149, 150, 261, -643, 327, 592, -579, -22, 481, -187, -340, 363, -103, -385, 124, 529, -295, -431, 697, -134, -543, 126, 170, -635, -144, 347, -653, -553, 70, -302, -535, 322, 183, -651, 184, 497, -641, -188, 310, -206, -692, -27, -10, -732, -103, 334, -270, -356, 459, -467, -329, 385, 208, -386, 28, 541, -322, -571, 623, -175, -484, 416, 41, -573, -120, 530, -323, -521, 366, -163, -352, 72, 390, -359, -89, 618, -292, -235, 597, 64, -761, 168, -14, -508, -8, 411, 67, -34, 392, 347, -269, 117, 209, -291, -130, 727, 132, -112, 557, 96, -743, 351, 632, -280, 40, 669, 210, -339, 604, 571, -582, 179, 694, -326, -12, 481, 92, -246, 467, 345, -489, 522, 264, -460, -559, 697]
5636F97q46j40N91N5q55O55L18q82L18N60n38l42R28k69p41L81M34q42K52P39
5656D73m95n53Q69j29o26O05K65r93M31N97m10p44Q67l25m79N20N24o07j76P82
5676C96m71o96O10O09q34K71N00p06J07N85n00l26Q03j90m44P8N44o47k46N88
5696C1J93p92O16M75j029O38L39o06r5O18l93l80M90K42o30lR80j148j81R31K09
5717E05p83L85M57p85K79L51m69k77P00N4m55L38K06r30M95O11r01m57J255n6
5737E23j006P27L14p76l6N91m06j28L08J48o11L51N91q34j35R26m52r4M98o1r12
5758d74N49K19n83K77L52k64j46M35l57l85N63K67r27o1Q20j93n99J012j63p17
5778c75M19M58q85k84J212m86m59Q31L2q16L7M72n70Q0Q32n26l51N15J14r06L93
$$ y = [697, -149, -289, 302, 357, -498, 157, 475, -407, -89, 471, -67, -409, 519, 250, -491, -110, 324, -518, -266, 473, -22, -575, 294, 165, -461, 144, 409, -584, -153, 444, 34, -710, 157, -168, -647, -127, 397, -210, -386, 396, -75, -771, -161, 448, -386, -115, 385, -321, -214, 371, -129, -455, 348, 158, -286, -208, 336, -311, -557, 31, 224, -568, 48, 523, -506, 132, 471, -135, -230, 388, -5, -385, 105, 347, -283, -286, 694, -454, -635, 296, 505, -278, 107, 564, -221, 58, 409, -60, -337, 363, 417, -38, 300, 506, -424, 71, 682, -219, -676, 579, 523, -483, 244, 558, -218, -254, 337, -69, -197, 111, 259, -352, -1, 590, -244, -379, 547, 95, 1, 499, 438, -474, 75, 294, -289, -12, 340, 76, -70, 365, 8, -377, 186, 453, -474, -535, 285, 92, -507, 505, 342, -375, 44, 502, -383, -667, 545, 59, -400, 431, 463, -353, -316, 156, -414, -334, 498, -28, -379, 136, 250, -656, -263]
5799b63N12o15l2R94k27p26N20M12p26M00L40q01o5L75m7n25P46k64k91J55M14
5820B86p03k99J023j51n19M66K46r91O98J30j60n12P73M9o62J11N52o68L04L75
5840C48o22j72Q35j58o68K94L28k81j57O85l08m15N53l76l05N37M07q76l44J297
5860F02p6j004R24p5o22M10K33n37J84L83j81p41O95L95q05L67K97q37q4J024
5880E52l53n20N35O7n40L57N36o91k79J085p74j58M76K63q91O31L8l36k80L17
5900C5R6o64N71K49o71J65N27p68Q4O96o7q93Q56J20n66j07N29m48R3M42m17k59
5922c97M18M10r57J76N72p87K00O22k52o90P58K81n90k45Q36p07l50J099n39k75
5942d17L24L06n25j08Q66o95k63Q73k96n07M67N8m30M06L36j82n92O88p1m18o6
$$ y = [-263, 249, -366, -398, 596, 369, -357, 163, 575, -151, 249, 589, -212, -277, 98, 51, -474, 272, 8, -283, -128, 286, -417, -716, 307, 156, -363, 103, 349, -642, 56, 186, 26, -486, 287, 336, -326, -215, 337, -331, -27, 348, -274, -446, 389, 231, -437, -143, 185, -96, -253, 432, 124, -291, 262, -114, -419, 118, 525, -351, -695, 602, 526, -478, 446, 371, -251, 159, 392, -145, 39, 422, 241, -500, 195, 590, -215, 152, 449, -388, -472, 552, 199, -321, 214, 281, -259, 98, 634, -57, -336, 749, -25, -183, 293, 556, -335, 296, 334, -2, -282, 35, 131, -533, 38, 287, -384, -219, 308, -460, -376, 320, 253, -640, 216, 336, -230, -337, 192, -256, -163, 279, -138, -397, 21, 431, -526, -350, 222, -565, -365, 257, 5, -685, 73, 354, -236, -481, 355, -352, -702, 397, -142, -417, -93, 213, -312, -420, 446, -249, -512, 361, 65, -442, 25, 83, -347, 59, 395, 213, -379, 309, 238, -180, -246]
5963b46M85o17R0P78k68l88K44J53n72K49O44p42j64N33jn28O38j76m34M52L29
5984D59n35l48O67j33j82K60J32o77O22N9l49k7N72m67o66P67L52q47N07K28k36
6005A58L9L78m25m60P01P6l98j51K35k59K01M03kq58O03J66q04L27M92k96m21
6026b95P67l29o20Q19J58q18J65P14n30k00M37l56j91M04L26n47j99Q94o91J47
6046E5J89o1p24O88J63n92K5O31m93l31P36K3o02N75q1l57k37N28j09l24L82n3
6068C1n09L74M52o68L41J1J09j30L98k17n16M20K23p70M45K25k39l62P45k94l78
6089c09L16O78m69l55J55J04m87O05j04o23M24M91n44k50N99k20j40M74K24r50
6109c81O29M15q80J86M20k21m08M47J68m74K02L57o12k9N82m16q8J51J91l17l1
$$ y = [-246, 239, -378, -288, 490, 222, -166, 78, 231, -341, -92, 552, -190, -354, 179, 178, -350, 288, 112, -322, 130, 459, -76, -424, 243, 110, -72, 188, 320, -357, 265, 324, -25, -52, 520, 53, -613, 154, 506, -341, 166, 394, 158, 197, 575, 150, -310, 391, 467, 69, -82, 153, -106, 95, 498, 496, -362, 241, 407, -397, -70, 422, 126, -295, 472, 143, -477, 342, 500, -318, -153, 561, 31, -169, 268, -88, -279, 125, 451, -96, -295, 599, -92, 55, 244, 183, -541, 147, 310, -282, -257, 374, -119, -450, 286, 309, -293, 282, 201, -156, -393, 135, 26, -298, 84, 31, -478, -104, 348, -320, 21, 32, 141, 11, 409, 192, -324, 96, 319, -451, -6, 219, -20, -382, 363, 69, -309, 7, 685, 216, -139, 16, 120, -367, 238, 134, -489, -65, 426, -118, -368, 231, 11, -129, 345, 569, -381, 248, 663, -217, -31, 389, 168, -240, 207, 375, -99, 103, 460, -152, -181, 401, -15, -103, 48, 239, -78, -109]
6130a09K54j94j65M58O1l01L57O9l04L6Q2l23k19M40O3k29l5K19k41k7M83m87
6152a12j79O05k80l83L81N78j114P3P33m60j09P30l35k62k75P50n43P7N11p06
6172c20k49P54k24n10M74K30l26j29Q79m69m76O10j7o14L67O9p91M78Q14q55k8
6193c33K38N34q71N4N78m96q2M01q4m92N79j46l19L43M07n71k9O06l61m81O29
6214A04J41m17o0L22l30n2J016j081K59n5N28q25O33j9k16j52N11m50k04N46R2
6235B91n16J18O76p06K14k53N99q81P15k91K9p2K23j82j14M16k39j09k53M79l36
6256a92P7K86l95K6N62N6o33N22q4n70pP24j78m60O22k98p54Q71K72m19l55Q28
6278E01m59k69M80j0m08J06L06j33k05P6N0j13l1L20k68J6L93o94M14J48l46j60
$$ y = [-109, 145, -49, -214, 244, 305, 4, 361, 430, 126, 162, 244, -79, -298, 142, 205, -24, -59, 160, -81, -108, 375, -112, -291, 314, 34, -349, 32, 610, -504, -431, 302, -158, -267, 463, 128, -134, -409, 341, -202, -125, 386, -320, -569, 185, -39, -549, -75, 155, -171, -300, 579, 110, -366, 244, 227, -387, -20, 49, -742, -264, 550, -305, -333, -95, 439, -432, -378, 200, -296, -378, 23, -61, -553, 26, -120, -439, -96, 311, -260, -289, 317, -44, -525, 104, 245, -172, -232, 90, -240, -292, 724, -357, -98, -153, 375, -450, 183, 164, -52, -204, 307, -143, -347, 199, 291, -225, -107, 569, -137, 77, -176, 423, -458, 257, -34, -5, -77, 146, -36, -150, 266, 27, -82, -335, 144, -192, -115, 171, -224, -198, 364, 420, -213, 309, 225, -345, -352, 372, 194, -266, 356, 58, -696, 175, 447, 28, -327, 501, 42, -227, 253, 243, -165, -59, 247, 114, -91, -15, 35, -78, -109, 211, -57, -41, 352, -342, 72, 220, -126, -286]
6300b86O42L6p10N14M81q91M7L10j41m6K10j72k18K16J13Jl75N11l75m40O17L45
6322C89o40P5L54n62L0K72M00o65K71O6k24l1N19p36J01L07j95j02R4M76o29L95
6344c5J92m21M7K36j61j03L32o9n18K26O15m81k47N75n0l02q2N29n64J65L33k92
6366g5j56K98J96l99J9J02l70L51M27k94m19M11K50p22N51j39j14J83J89j91k93
6387a95O69m95r7L56J29o67m8N25k29j36O26J95q64J86L50m33J74K93m20J7L76
6408C12l7o69N11K75o87J43L17j27l51M42p3J1K9k4O7n81P91K04r00P47q7l41
6430b8N6L18l56m54N67j2r88J021J57l97N2N59q96R4M46j58m95N85K82m26o6r8
6452b37M8L4K18r7k18Q4J68k13R6L25j38l30J00L70o24J18M63k81l10P12j01l49
$$ y = [-286, 356, 392, -318, 196, 677, -214, -167, 143, 2, -44, 166, -6, -224, -8, 105, 106, -269, 242, -133, -573, 44, 389, -251, -176, 178, -384, -354, -82, 318, -347, -76, -10, -234, -265, 254, -482, -381, -74, -269, -371, -277, 199, -430, -35, 157, -264, -217, 19, -142, -245, 87, 18, -500, -274, 341, -140, -387, 188, 138, -164, -246, 283, -281, -116, 217, -75, -231, 67, 263, -136, -117, -15, -385, -34, 393, 99, -320, 91, 341, -381, 170, 31, -83, 100, 289, 98, -195, 474, -21, -118, 238, 367, -300, -348, 177, -52, -188, 438, 633, -231, -45, 305, -128, 46, 339, -81, -64, 312, 275, -394, 117, 392, -295, -152, 165, 38, -313, 129, 56, 67, 96, 72, 139, -442, 349, 553, -347, 400, 313, -28, 28, 346, -10, -464, 103, 91, -897, 124, 281, -116, -64, 495, -401, -307, 139, -19, -514, 71, 353, -73, -139, -237, -189, -155, 63, -34, -252, -168, 0, -213, -117, 208, 70, -260, -160, 210, -414, -296, 167, -114, -424, 288, 187, -162]
6474a62L25j80l8k05M74k95l74M80K98n66K80j4j43L74o4k49r0R2L01k19J13n
6496A33m08M29K14l97l24O40l39k85K33M59m28l17P37o51P04k66j99K4j60N5J63
6517A7q0N38o53l3N77l67j35K06K97n46M0N78j82q2p3k21k95M11L15n47K05N26
6539D96n29o3K03o4k19P6M60p16J58N96n11q0L58j18l90L09M14o23j90P75n51
6560b09k73N51K52m52J60J53l76J03K67L0m68K51M24q66L52J28k67p8M70j52l57
6581c57K48R6m6Q7J05k64p3M33m55Q6K59Q4l58k79P01k02k91L01Q5l35J78j63
6603a60m3j3M50l85j7J3K98k97L48p0l00L47l6l44m6L77P4m45L62Q4k22m1L71
6626C05m03r9M99N3m38O9J42k78M0K85k52K18J48j04j93l0K83m75K73K0j73L5
$$ y = [-162, 163, -17, -55, -260, 214, -81, -455, 25, 323, -243, 37, 23, -120, 254, 190, -59, -149, -57, 244, 25, 138, 133, -275, 154, 368, -29, -353, 287, -52, -337, -104, 355, -73, -390, 347, -304, 400, 134, -65, -41, -201, -146, 17, -63, 475, -178, -211, 366, -1, -136, 70, 367, -179, -139, 439, 257, 175, 102, -119, -414, -3, 312, -235, -30, 496, -33, -96, 107, 43, -176, -100, 360, -356, -198, 398, -113, -193, 165, 47, -343, -34, 380, -243, -433, 342, -209, -482, 69, 321, -131, 29, 182, -194, -91, 176, 206, -262, -11, 413, -453, -101, 27, -240, -318, 152, 0, -357, -109, -13, -59, 28, 133, -131, -204, 229, -226, -140, 119, 203, -155, -434, 267, 65, -226, 75, 160, -175, 3, -160, -203, -216, 234, -151, -168, -155, 143, -154, 194, 124, -176, 171, 135, -209, -255, 122, 196, -249, 113, 197, -25, -66, 305, -98, -197, 302, 355, -83, -14, 128, -150, -110, 175, -77, 141, 289, 185, -8, -38, 245, -230, 43, 63, -110, -75]
6648g5K6M43m38K50R7l01n3L55l13m70N09q9j67R0N42n97J4L01J50o51P63l62
6670B4j79K04K50j65k3K48o5m69K62O2l12K28J21l54R5K55j69k65K36J21m39L01
6692c3P1l80K63J58l79K08M2O5l67L45N58n29k67N21l68j05M43l8l93O0K39j6
6714I8m16O86j94l64J88p8j06Q7J9k9j05K86ro35M79K08n21K62L57j87k51J36
6736h9K29k3K5j33j8j44L06j45k23K02j3q7R3M81p97O0L86L2m24J72K28k98L48
6759A68j75R7j92N21n32r9K04L83l60j99N09n89J49L91n4n59L91M0j31Ko4j41
6781b40q5M15R0l92K49n6j21J0N06n66N8N1L2j18L33K2k44j58J11L15j36j09j30
6804a63j64O69J0o03J71R3ql43M37J3j47N0K50k58j71P9j51K2J22R7k78k4K25
$$ y = [-75, -49, 394, -44, 206, 303, 2, -51, 304, -9, -479, 30, -59, -226, -136, 406, -191, -177, 124, 274, -377, 386, 24, -155, 49, 299, 134, 111, 359, 294, -175, 87, 149, -163, 65, 186, -168, -73, 182, 13, -252, -16, 105, -334, -33, 38, -342, -79, 79, -300, -92, -50, 15, -352, -7, 551, 22, -245, 276, -92, -197, 246, 208, -185, -125, 114, 98, -318, 368, 174, -190, -2, -80, -186, -99, -80, -109, -214, 72, 63, -572, -93, 115, -406, -144, 213, 26, -225, -89, 140, 117, 142, 9, -9, -153, 153, 8, -215, -13, -26, -113, -20, 461, -336, -276, 110, 142, -282, -110, 118, -180, 168, -7, 90, -102, 419, -113, -212, -8, 375, 15, -184, 325, -264, -115, 276, 222, -337, 54, 94, -37, -35, -99, -240, -325, 90, 180, -212, 37, -19, -140, -130, 376, -190, -132, -81, -49, -167, 166, 188, -56, -214, -103, 212, 76, -33, -163, -327, 342, 352, -251, -80, 13, 5, -338, 99, 112, -35, 15, 265, 7, -164, -85, -236, -214, -92, 5, -273, -297, -72]
6827g2M6J44k62J30j51L43jn44M41k5Nk85M25m44P4J28r9J5m4K64k43J65k1Nk0
6852b6M1o6n1J28N0j71P0L22k74k83M29J57j92l7O4j04m01N26k45nL96k64k23
6875a59P7J15j37r7K77k11o4K84J26m73L22R3Pj9R7n4n8j56M9q6J70k51L12l13
6899a49J57J30k57K12p4m46M79M89o49J51K57q7k91J53K84n63l10O34J9kl3k07
6921a03p4L85Q5k31j27K32k07l01L12p8L61k81Q3l07Q9M99n01K1J37L51n27K80
6943I8K11m57J17K14r0k7k48N20j24j48J75o20N40k50J50l5K63k47q0K71m57n
6965b29K18K07m86j05M24M15q67L03J59l3O8J11j64k03K55m8l51O17l13L9l04
6986b87L25J5Q5K05k45j2r6N7j35j62J96K58n73M26J43l07J22q0rj0J41J98l07
$$ y = [-72, -26, 118, -144, -14, -165, 178, 177, -367, 74, 49, 54, -231, 194, -250, -176, -48, -147, -132, -176, 88, -155, 10, -11, -6, -26, 15, -51, -102, 26, 76, -95, -25, 297, 23, -260, 169, 326, 134, 97, 161, 57, -344, 182, -63, -68, 328, 64, -159, -82, 33, -104, -201, 76, -135, -199, 85, 211, -262, 60, 153, 160, 141, 238, 184, 126, -30, 19, -67, 103, -148, 164, -149, 8, 138, -119, 93, 19, -427, 52, 541, -108, 43, 300, 213, -78, 75, 359, -204, -514, 120, 139, 137, 104, -103, -177, 208, 293, 62, -65, 167, -40, -341, -29, -107, 254, -27, 56, -251, -162, 337, -164, -143, -6, 345, -182, 98, 309, -148, -31, 183, 93, 66, -182, 338, 214, 66, 241, -379, 161, -89, 61, 26, 289, 42, -38, 233, -224, -229, -11, 196, -290, -395, 29, 444, -423, -120, 39, 6, 74, 185, 21, -182, 73, 25, -326, 291, -22, 17, -287, 38, 53, 138, 343, 98, 86, -10, 47, -88, -250, -54, 204, -369, 57, 200, -107, 15, -65, -74, -84, 57, 255, -52]
7009e2j76L26j24RL82l56PJ17q7j55M11k61r8P2n8j74J26j07N31m16J52R2l90
7032b29K14KJ54k28M40m05j43K18L72m15l8K26m3j07j09L09p4j00L61l27o0M03
7054D21m45J35R8j81oJ25k06j48K7K19K44n93M56j05o9J48M81o53Q5Q3k17J38
7076C7p4K19l94K34J04l04K02o4J29m53N06j83J67j91K66j48o0k22M37J85n19
7097a26M40m21M23k16k45l5L08l75K90R6j23J72k39L80q3k95K04o0o34N71K89
7118C21l75PL91m17j80K82N4k31O1K52j49J57o7q7J58L88n03l11K12p4L22k46
7140c5L69k91k6Q1j72K11n03L64m5R8j38J23j51j3J43K28l72L92k39k35M90m02
7162a23J11K01p5j3j60L08k63j69N97n39J57J26Kj81n7Q1P2K61j24l24m6L13k50
$$ y = [-52, -228, 98, -26, -17, 365, 9, 16, 133, 46, -109, 302, 41, -57, 15, -43, -217, -91, -198, 333, -83, 69, 161, -229, -15, -13, 141, -87, 353, -52, -195, 23, 395, -20, -58, 168, 125, 18, -91, 218, 144, 44, 405, 78, 18, 421, -24, 111, 209, 28, 22, 147, -59, -207, -180, 39, 283, -310, 146, 41, -28, 120, 601, -52, 33, 116, -101, 37, -37, 182, -212, 22, 126, -178, 24, -40, 89, -364, 142, -41, 126, -65, 201, 53, -7, -229, 208, 393, -126, 314, -107, 316, 100, -145, -180, 128, -247, 43, 139, 16, 188, -51, 329, 246, -49, 155, 95, -539, 32, 321, -54, -47, 344, -73, -253, 29, 83, -148, -87, 165, 16, 173, 106, 19, 177, 565, 62, -249, -37, -111, 211, -35, 334, 43, 17, 98, -74, 137, -366, -2, -47, 51, -87, 36, -115, -128, 15, 243, -129, 263, 24, -211, 279, -123, -12, 189, 114, 101, -59, 249, -14, -183, 414, -125, 32, 158, 160, -21, -78, 3, 75, 336, 212, -112, -158, 155, -95]
7185i5K25l04J63m4k6J95r0l72M39M01n95J14N2k09Q5J36j53j47N52k55j75k0
7207a23L82m69J11QK54j86J02j10L58m17J90K6r7J36j46j85L95J7l81q9L97m09
7229b36K68K24l87j7K73l31L30Ln0o0k40N32j11l21K97K6l38J45J48k36J04J46
7251A69k8O6k25R8k11LK23k0j89M24n14r0M53p4j06j22J69J06k58L83K9n25K39
7274@l7j13k5J10J77j90J24J50m34J88L10k58j46L21N9k8k35j6j57L64J56l93
7296g3j18r6K11K15L5M4k13K6J89ql50j8K24k00J09J95l43J79K38n6j30Lk2m39
7320c98O05J31Ol65n8J30K6J88k07J27j91K17l87J51J66r6k12L70k22l9M08l09
7342D1m7l20M31m21L24O3j54J06j9J57j0n23P39o71L49j49M7o8J1O3k80K66J20
$$ y = [-95, 130, -174, -11, -55, -81, 114, 24, -348, 91, 492, -103, 11, 63, -146, -61, 75, -78, -225, 327, 72, -103, -123, 259, -210, -99, -91, 163, -23, 79, -31, 327, -90, 100, 126, 29, 165, 19, -166, 229, 246, -135, -224, 173, -236, 32, 256, -131, -148, 125, -206, 124, 127, 77, 17, -223, 309, 198, -123, 174, 200, -138, 7, 155, -81, 23, 169, 141, 207, -18, 80, -131, -128, 95, 75, -114, 310, -204, -294, 159, 85, -21, -143, 26, 132, -126, 257, 286, -239, 0, -37, -150, -175, -65, 112, -78, 46, 196, -238, -50, 260, 2, -144, 177, 236, 208, -27, -43, -200, 164, 320, -73, -191, -287, -76, 139, 174, 218, 5, 31, 220, 212, -138, -156, 68, -132, -23, 172, -171, 8, 246, 190, 60, 63, 41, -398, 207, 338, 344, -21, -79, 51, 77, 265, 58, 185, -6, 211, -176, -25, 141, 45, -167, 203, -19, -58, 350, 41, -6, -326, 105, -316, 8, 71, -83, 23, 4, 161, 151, -372, 367, -304, 45, -104, -57, -125, -114, -51, -331, -65, 55]
7365E5j9K03m01J55l96L92p8J68j04K27k11j87M39l76j06n1L20k33K19K15l34
7386a03J82j23K59j79j64M65l41j46K00J00k60J32J30n39L59M41n81k18M47k8
7406C3k57L28O6l8r3K12k86j92K00M41m21O6j6J36n41P57m39k25K54R7j80K53
7428A55k3l50J35K47Q2k44L38k2n18K83k32J18j1K21J33k93Q7K18m25K45kk62
7450a20K57l59K59m30J03O69m27q5m9K52j29k38M09l81K32r0l4J45L17m08R8J15
7472A06j45m89N39K98l09j16J04K26m54J68L35o57K85K87k89j71J18J30N3L64
7492C83J54l48k85L3k69J84M85m78R2k06L23k50m7M98l52K12k08L02k99J34J73
7513B31l8k75J61J9j1L29m78k70M83j3j21j6n4k31N4J21K34j53L56k54r9o1M07
$$ y = [55, 36, 239, -162, -7, -403, -11, -89, 79, -25, 202, -9, -196, 243, -133, -239, -290, 30, -203, 16, 231, -103, 79, -44, 215, 36, -128, 337, -4, -150, 50, 150, -110, 22, 152, -387, -28, 413, -168, -386, 61, 33, -224, 104, 170, 132, 39, 251, -35, -227, -27, 414, -7, 59, 43, 179, -362, 395, -44, -269, -15, 82, -98, 155, 132, -218, -83, 164, 246, 2, 340, 318, -200, 83, -149, -31, -42, 179, 312, 19, 106, 324, -101, 144, 142, -120, 137, -222, 37, -393, -290, 379, -48, -133, -182, 70, -59, -297, 112, -269, -37, -127, -161, -16, 301, -107, -9, 106, -39, -528, 11, 309, 0, -116, -12, 214, -240, -72, 263, -394, -109, 178, -111, -282, -164, -34, 19, 383, 537, 189, -96, -63, -332, -148, 337, -141, -49, -255, 68, -182, -229, 269, -83, 129, -79, 223, -76, 58, 231, 193, -82, 79, 98, 87, 416, -62, -332, 151, 138, 17, 1, -53, -284, -230, -109, 125, -28, 328, 74, -25, -86, 321]
7536C21j01J24m95p4L97l04J58k38j66N31p7j81L75j58k02K23k90J53j95pK88
7557H2k8J69j89j14r8M22N9l63K04k42m7N05j88l81K59M5j1Jl05L14k2j34j89
7580b51R5Q2L39j08K1k41m6j04m1M07q4l20K50o8k15L47J97m87K48Lj25O2j10
7603a49K9J97J33r6m8k19K94j01o4J21j63j23nL59m25J76M3O2k31q9M76n59N18
7626A36rj68J19j36l5k8J22j90J43%q4L48o26L72Pj07K03P3m39R4k62M36j44K10
7650C5j95L03j85K12k80L43m05K32k75MR2N1o3J31J61k05j82M17l38j53r3K59
7672a34K39p2j16p5L12m34r6M69j45J55K21m03p1M05k04l15O1L05j41l46K92J64
7694G1J65l39N1j30K32n4Q4J0j32K94l75K00L04m51L00m70M19r9j02k18K25j8
$$ y = [321, 220, 344, -151, -225, 172, -132, 26, -212, -378, 153, 76, -105, 270, 112, -90, 133, -157, -4, -199, -206, 82, 54, 223, 34, -80, -178, 244, 303, -60, 144, -98, -145, 360, 172, -209, 50, 95, 84, 85, -220, 94, 72, -62, -251, -156, -74, 265, 157, 178, -63, -109, -213, -254, 153, 69, -251, -1, -69, -284, 63, 260, -227, 21, 24, -101, -39, -149, -120, 77, 210, 114, 66, -153, 141, 40, -24, 97, -66, -189, -194, 165, -260, -84, -41, 21, -210, -299, 177, -382, 136, 127, -41, 78, -58, -93, -121, 1, -189, -46, -46, -130, 218, -408, -36, -29, -136, 67, 140, -299, -205, -467, -31, -175, 35, -160, 143, -42, 170, -110, 233, -172, 60, -215, -211, -119, -68, -131, 0, 161, -44, -226, 191, -147, -300, -393, -134, 105, 33, -83, -158, 154, -280, -376, 93, -52, 103, 324, -79, -150, 255, 51, -264, -203, 102, -39, -385, -93, 71, 236, -103, -52, -182, 50, -4, 80, 90, -42, 252, -123, 77, 381, -70, 230, -240, 179, 80, -22, -240, -15, -33]
7716c3K87k07N8J74n9k22J9L9k91J29L97n22K80lL6l2J63l71J94J54j03J98j42
7739A43k97J73j58L29j50p0l6Q2m67N37N9j7K1l06J22r0L71l51J35L6J43k58l96
7762d45N73n3k35J87K85m66J48k31N9M8K08j2l72L01J93k94Q9P1j22J7J70O8n05
7785c18R9P7K27j46j9k23K63L14k18o3J01jk11j09L06q1k54L40k31J64R2k5k4
7808F0k10N6K00j82j39K56J20k91L96rq9Mj13M9J74m16L17k35J49j11P2k72L23
7831A09j9j07K20m64P6J38k00P6K25j72j7n6L97l70k72P16o8j54j40L06n60L53
7853A7r6p4M63l97j7J4K37j16M1j62N0J50q8l2JQ5l39J16L2K96n51R0K30N3JM7
7879E1L65m96K49l43K49j43K2m5J74k34r2M07l15r8J85J06k04q2p0M91l99M68
$$ y = [-33, 254, 47, 105, 279, 220, -2, 17, 56, -235, -106, 291, -231, 49, 46, 82, 50, 213, -158, 36, 190, 87, 285, 143, -154, 19, -139, 190, 40, -30, -66, 16, -451, 86, 145, 128, 149, -157, -35, -125, 246, -105, 30, 66, 209, -49, -445, 128, 75, -160, 27, 312, -154, -6, -237, -178, -130, 78, 66, -306, -5, 188, -106, -17, 54, -68, -51, 119, 187, -318, -219, -142, 85, -61, -80, -303, -40, 274, 56, -7, 94, 93, -118, -227, 79, -2, -256, 84, -147, 17, 109, 84, 60, -150, -94, 106, -76, -215, 41, 161, -130, 266, 257, 168, 172, 59, 108, 282, -134, 183, -52, 97, -14, 58, -214, 109, 90, -17, 203, -261, -185, -47, -247, -171, 54, -118, -135, -191, 206, -164, -436, 280, 212, 58, -82, 224, -336, 17, -79, -153, 310, -87, -104, -90, 147, 31, 72, -90, -40, 110, 22, -10, -9, 76, -263, -147, -115, 181, -370, -280, -50, 3, 4, 51, 416, -80, 169, -174, 75, -68, -46, -91, 83, -151, -243, 164, -151, -249, -64, 42, -162, -244, -314, 177, -222, 246]
7901B46m21m4L64m38L91j03L12k68M7r7K6j29K3L17n05L96k51R8J19J4j41R4j55
7924a05J98k10j44L89J45J28m66k69J96M19k95J06n0Lk69J34R3j05K6J37Pk37
7946a69K55L2k06L7L53l84M4K39jn20J41N37n01J57K14k09j76K98J32l57J41k73
7968b16N41k48j19l06N0N49k64j31J96P6j86K5J9jj20L08j80L67k68K07j65k03
7990f9L34j69l40N29k42n06K60N35l13K6j85j17K53l5J52k7J56L2n41L13M5p8
8012A3Q6m1J77l22j44J73L76m69M8K67j63k9K64j31k09K0J8J73k27K80j11J56
8034B05j14k57j03N51j61l57J73J63l31J95J95k91L7j1M04k95R2p6K0l38L58M1
8056A00j40K06k29j57L82j60j23q8J79J19j19J62l30J93J89k95J17J72m54L20
$$ y = [246, -175, -219, 145, -293, 98, -5, 307, 39, 86, -11, 15, -114, -91, 226, -279, 117, -134, -36, 83, 97, -44, 50, -105, 93, -117, -261, 128, 273, 401, -65, -334, -138, 281, -14, 92, 42, 45, -224, -90, 3, -102, -76, 61, 68, -169, 86, 118, -88, -51, 302, -82, -38, 201, 200, -320, -179, 358, -143, 14, 228, 19, -157, 141, 273, -84, 57, -216, 325, 77, -42, -348, -298, 251, -13, -144, 52, 128, -58, -33, -14, -15, -135, 173, -7, 360, 92, 299, 134, -69, 265, 96, -244, 285, 43, -463, -203, 332, 19, 45, -140, -257, -4, -39, 113, 86, 242, 274, -267, 46, 91, 13, 99, 58, 235, -87, -231, -58, 318, -151, -103, 164, 1, -28, 236, 105, -104, -84, -66, 107, -120, 160, 49, 205, 91, -166, -269, 282, 121, -236, -63, 100, -231, -36, 159, -132, -95, -106, 298, 3, 95, 19, 39, -299, 59, 100, -40, 166, -63, -220, 162, 2, -121, -209, -30, 89, -30, 132, -198, -5, 184, -111, 6, 178, -276, 44]
8076D4k92N51j92j84O4J52j4l03n5O38n56K92j37j15k9J69J16R4j40O4l49L15
8098A33j11j74K84o1J92n04M14p1O4l55Q8P8l6J5m6K82k05R7k66K23K15k89N6
8121B3K09mO0l23L24q5m8p4m14J92O4N63l26m1n3j83J78j67j23K79L09l80m55
8144d75K61J24k61J84RK35k19M89l85K01QK1l65K75J07k25q1J73n8j5Kl3l3n1
8168a12Q4r7K21m28L71m16M68J90n58J52L24k43M3L46k14m4L42m89p9R2N9j36
8190a24q6
$$ y = [44, -248, 303, 111, -73, -9, 143, 129, -174, -229, 409, -147, 145, 8, -107, -136, 33, 149, 243, 103, 167, -182, 133, 22, -152, 132, 71, 263, -241, 173, 102, 166, -189, -101, -23, -59, -44, -90, 192, -13, 84, -182, 41, 256, -33, 23, 232, 228, 288, -35, 289, 204, 156, 82, -332, -140, -76, 487, 161, 120, 67, -116, 62, -105, -228, 51, 360, -20, -475, -214, -90, -351, -167, -158, 77, -142, 347, -38, 163, 171, 192, -173, 102, 209, -16, -97, 76, 18, 3, 5, -28, -61, -112, -28, -125, 96, -332, 39, -377, 91, 281, -277, -125, 199, -44, -1, 345, 131, 87, 429, -60, -139, -47, 12, -124, -210]
8191b10
$$ Imaginary data points
##PAGE= N=2
##DATA TABLE= (X++(I..I)), XYDATA
0@%%%%%%%%%%%%%%pJ5j6J6j6J6j9K7l2L3l7M4n0N8o6P4q3R3j04J15j29J45j62
37h5J78j96K18k41K67k96L26l63M04m48M99n59O28p08Q06r27J081j282J557j961
57a102K611l829O850k5526m9760O2745K3553l5144m030K1115j0699o27J0322j3571
71a7092m865J9998j0397j6654K0053M197k5574J9228L1724k4350j8137K7010n461
84c20k6757K6466K2826l4110r207L1529l009j5522J6622K672j8587P962M906k0304
98a4833Q312K3505j6993j2140K3837p426k6923K2981K1324k8914q750K3243j2454
111e231j4941K9176P937k8375N836J9053j9006r788K1004m5q980J0792p621j6175
125a6364K4310J5370l1000k098L0096j4244k5143K4407J1429k4733P111K2261
$$ y = [0, 0, 0, 0, 0, 0, 0, 0, 0, 0, 0, 0, 0, 0, 0, -7, 8, -8, 8, -8, 8, -11, 16, -16, 17, -20, 24, -26, 32, -34, 40, -43, 50, -54, 61, -68, 77, -85, 93, -103, 115, -126, 141, -155, 171, -192, 212, -236, 263, -296, 332, -376, 430, -497, 584, -698, 859, -1102, 1509, -2320, 4530, -20996, -70756, -8011, 15542, -19602, -23632, -2517, -13216, -13843, -3521, -17092, -21957, -1959, -12356, -29010, -8957, -4760, -30334, -11106, 20618, -3732, -21869, 5141, -320, -27077, -611, 22215, -11895, -21102, 10427, 7418, -8104, 8518, 11190, -7397, 565, 5471, -14833, -6521, 16984, -9, -12149, 11688, 4262, -22661, 320, 21644, -7270, -16020, 7223, -5231, -20172, 9004, 16941, -11434, -5598, 13455, -5551, -15339, 5665, 5620, -3360, 7432, -189, -16364, 7946, 23316, -7684, -9782, 20314, 6070, -19073, 5334, 16763, -7970, -859, 21402]
137B1402k1536j3410K4119J036j7038J0287L604j6953Q002J3343j6518K888K1340
150B0566j8855j9934K8521Q468l1554O647K8664j7458j8502K1314K840j5688J3797
163H826P665k1544P13J5216j0947j858K0146j0017j9729J8182P747k3018P358
176a260K0895j9686j2957K3814k365k2976J6498J7202k2962o702J7464q324r066
189a0425J6909j154j6950J0883O647j8528O559J9570j7207j2976K2036k184k2287
202a9107J5287J6954k2230m000K1073j0860j6008K0082O594k0225M632J0621j3937
215a1124J057J6506j0809r570J9385l594k2754J4557J7178k0945l515K2552j0174
228a250j8627J9582Q772j9774M977J4550j5941o021J8793l991j0749J4398O05
$$ y = [21402, -134, -13544, 10575, 11611, -5427, 4860, 8464, -8489, -487, 12856, -3662, -774, 20566, 1711, -18223, 10298, 18766, -12788, -6141, 22523, 5065, -13437, 7877, 10717, -4971, 8826, 16491, -5053, -4340, 10876, -71, -1929, 18217, 8200, -11529, 6653, 14400, -8618, -1260, 19635, -51, -13008, 10806, 8441, -14535, 1963, 19165, -3797, -10499, 6965, -1359, -10425, 6484, 5330, -11620, -737, 5910, -12618, -6059, 13511, -3696, -16672, 5364, 3180, -19107, -3820, 13134, -9096, -13096, 7977, -2883, -18891, 1191, 7785, -12440, -7808, 2813, -11124, -10067, 6439, -4370, -13940, 5445, 1851, -20903, -6346, 10832, -10113, -13628, 8924, -1250, -19877, -295, 8477, -11297, -6320, 8230, -7711, -13732, 5061, 1070, -9679, 4719, 5324]
241E324j8513J0335J4415j7707k498K1733r481j8334J8411Q781j9838O111J7732
254A6471j6690j0166J9316j218j4175J2938O881j8292L713J3856j2789k856J8767
267A5756q280j7674J5354Q278j8499N035J7627j5962j0222K0339k425j8730J3501
280D098J1877j8129k152J4322r453o092J7519l564j6619J1670O740j7355M962
293b176J7419j4412j0977J9488r55j9630J2595J2992j7884l212J7642r559j2078
306a0747J6305L013j4625P300P546j6498J644J7986j0779j1659J6523q64j8117
319a2972J1594J3178j7952l130J9253r248j5447J6183N442j5395N061J0419j4918
332g932k747J7078o713j1671J4566J174j7869P310J3976j4111l512J7586q403
$$ y = [5324, -13189, -2854, 11561, -6146, -8644, 13089, 3608, -14726, 3685, 12466, -7372, -1261, 16471, -219, -10385, 8931, 7713, -6462, 6476, 13357, -4935, -1222, 12634, -155, -3011, 15756, 7476, -10198, 5156, 13434, -5065, -30, 17597, 1635, -8587, 11752, 9327, -9403, 4098, 15975, -2154, -4306, 10016, 563, -5529, 11990, 8426, -8193, 3477, 10217, -7138, -2176, 15243, 831, -10146, 9342, 8387, -11243, 1352, 14344, -3540, -6752, 10890, 1331, -10747, 5558, 8571, -6054, 1246, 8792, -7706, -6062, 11924, 1145, -10514, 6009, 5145, -12972, -1378, 11800, -6152, -9282, 9971, 723, -14724, 1459, 6901, -8494, -3433, 6986, -7932, -10679, 6399, -314, -11985, 2581, 3755, -14114, -6804, 7172, -6939, -10451, 7135, -1268]
345a268j5689J6075P052j7328L912J4296j2998p218J5899k671j1818J2549M276
358E069j6605M574J3712j2422m447J7301n133j4871J2731O799j6534N081J5935
371A1190j3384r415J6508k84j3661J0931P814j5391J512J3841j0927o468J6626
384H892j851j4802J0209P011j5595L286J7187j1589j0229J5143o6j5329J0774
397C041J0557j5259j550J4297r189q265J5834M34j5490Q186R265j4923J4J5317
411A2269q425r036J4587r87j6707R567J2974j4610l672J4227p302j0063J4016
424F838K074j4511O758J0038j4292l126J5708n953r853J2485J266j5835O675J2154
438A0426j3163m227J6008o131j3460J1972N258j3917N222J0376j3109m533J4929
$$ y = [-1268, -16957, -882, 6170, -11158, -7246, 7050, -5948, -13166, 2733, 62, -11756, 793, 5069, -11536, -6962, 6750, -5672, -10119, 7182, 2049, -12822, -91, 6708, -9826, -4745, 11190, -2194, -11609, 4899, 4615, -9046, 1885, 9699, -5692, -4180, 9661, -1266, -7734, 8892, 7041, -7761, 2448, 9459, -6136, -2850, 14337, 2748, -7481, 7662, 7596, -7733, 3041, 13598, -1661, -3211, 11086, 1897, -6368, 9466, 9900, -5590, 2596, 11861, -3062, -3048, 12269, 3844, -5192, 9395, 8408, -8299, 1268, 14242, -368, -4040, 10187, 2885, -7178, 6838, 8912, -5599, 1159, 11197, -3095, -6221, 9487, 3534, -6319, 6166, 7432, -8403, -1728, 10426, -2737, -6964, 9044, 2913, -10547, 1425, 6683, -7234, -2012, 8364, -4745, -9278, 5651]
451E651m324j1541J1778M376j5430L433J2456j1342m640J5699m150j4270J0525
464a779O524j3622L154J2118j0988o299J4151l173j2662J1839P218j5624R27J3044
478D828r509n828J4956k246j4025R660P337j3900J421J4155q973p957J2921j323
492A517j2398J0458Q143j4434O3J3836q621q134J3939Q98j3266Q072P521j3295
506e701j81J4856p365r136J2215P25j2400P621Q912j2076q40J3291p932r643J3651
521E997K592j3475O142R130j2286k395J4028n164r967J1713K461j3541M711J0744
535A0690j0851k288J2884o742j0253J2368L301j3438N118J0949j2469m524J3925
548H670l748j0737J1028L974j4587L643J1412r841m875J3180l768j1027R612M257
$$ y = [5651, 1327, -10214, 1564, 5940, -9490, -6057, 6399, -4943, -9583, 6116, 1966, -12304, -1779, 4745, -8877, -5723, 6395, -4593, -10892, 3259, 86, -12576, -737, 6481, -9143, -8216, 4828, -4681, -10509, 4447, 2201, -11824, -2164, 5173, -8727, -7306, 6849, -2124, -10081, 2840, 1517, -10881, -423, 7720, -6714, -6651, 7185, -1436, -9570, 4369, 5267, -7999, 73, 7594, -5701, -5882, 8974, 1609, -7527, 4688, 5413, -6987, 634, 9546, -2530, -3370, 9921, 1989, -7654, 5997, 8589, -4886, 1256, 10386, -1900, -4295, 9733, 4569, -5398, 6315, 8776, -4765, -54, 10690, -161, -2449, 10435, 3693, -6560, 5808, 9109, -4329, 789, 11738, -731, -5255, 8670, 4922, -5815, 5213, 9187, -5400, -1757, 9655, -186, -5061, 8119, 4351, -6676, 2936, 7193]
562G193j2824M622J0906j1620n580J3811k852j1803J0659N647j4187J574J2001
575G547r494o009J3017j024j2214P186N972j1328J945J0961r204n861J2582k312
589A764j2785R773P733j3369r6J2301q415p590J3392M79j3179O398Q123j1253
603f724r01J1542o092o397J0313q47j1493Q156Q150j2681m98J2486o841q879J2367
618A661K149j2458N470R446j1716l062J3193l876q476R498J736j1014N327Q533
632F411j0471j284J2601o268r463J1799L106j2650N441R978j1417l676J3360l122
646D345j0596R776M545j1624K630R200q279k535J1333m723r607J0365L697j2024
660c497L793J0330j0159m835J2882k767j1244R601O497j3264N40J1149p177n159
$$ y = [7193, -5631, -1009, 9897, -1723, -7303, 6508, 3656, -8147, 2512, 8159, -6028, -4454, 7547, -1947, -7956, 5061, 4037, -8177, -991, 4981, -6347, -4402, 6559, -2645, -8506, 4076, 1764, -11021, -1248, 6485, -6884, -6980, 5321, -3094, -10684, 2708, 3187, -9992, -3594, 4529, -6724, -7625, 3917, -2175, -8572, 1741, 894, -10599, -2443, 5707, -6974, -7472, 5014, -1827, -10706, 1661, 3810, -8648, -3178, 6268, -5448, -8510, 4683, 807, -7669, 1829, 3565, -7449, -2122, 6411, -4060, -5344, 7257, 989, -8474, 3325, 6431, -6219, -778, 9200, -2217, -5893, 7467, 4345, -6251, 3525, 8070, -3554, -924, 8276, -3, -2538, 8795, 4072, -5535, 4830, 8527, -3497, 296, 10626, 467, -4368, 8514, 5747, -5497, 4104, 10601, -2663, -2123, 9026, 1849, -3310]
674c310J0614j876r923P833M441j1373K456J0985r022o155J1546j745j0825Q702
688B348O477j2518m29J2024o899p856J0785J272j0235N037N768j0194M51J0268
702F299o528o482J0435q55j0869P615O614j1661p3J1853p082q898J1732K862j2575
717g613M581Q006r585k356J0909m549p519R654P57j1023N748P696j0368q63J1378
732D853o593q621J1426K853j2611M164J0473r936m915J1733k076q669P998L302
746C381j0349L153Q353q862j870J0301l816q827R679L013j1461M198J0450j0061
760b718n657J2191o64j0170P214N799j0058Q60R240p436l394J0434k178r145P870
775B188M186j0664L147J0157q951n334J1884j063j1311P854P357j0927p25J0051
$$ y = [-3310, 7304, 5428, -4495, 3338, 7779, -3594, -1138, 9847, 825, -5330, 6216, 4471, -6354, 2348, 8825, -3693, -4122, 7902, 1003, -6853, 3932, 5204, -5031, 6, 5774, -4420, -3969, 6299, -229, -6711, 3724, 2869, -8000, -385, 6229, -5432, -5505, 6348, -734, -9632, 2100, 4962, -7613, -3032, 4974, -4611, -6967, 3942, -607, -8126, 1528, 2285, -8738, -2990, 4706, -5662, -6525, 4853, -1740, -10361, 1065, 3918, -8693, -4529, 5944, -3992, -8907, 2826, 750, -7919, 79, 3381, -6968, -3815, 4538, -4324, -6194, 4107, 291, -8536, 1143, 4156, -7305, -3107, 7343, -2718, -8375, 3816, 3152, -7018, 196, 5995, -4063, -3203, 6037, -1399, -4793, 5641, 3463, -5682, 2188, 6374, -4290, -1143, 9014, 63, -5271, 6613, 5550, -5761, 2093, 9450, -1477, -2202, 7849]
789G849n627n838R838j84r362N900N306r589P31R940o826n597J0056r81j1291
804e675P922P749j1296j846J1445n386q121R594K192j0661M653O960r294j455
818c219R653m319o548Q453O7r902O477O739j0708j495J1643n357r428R913L310
833E279j1018L096Q547r010l254R993k853p523P797K018r625L335P129q024j557
848e670J0445n160q989R515L858j1517K681R860q022m996J0306j805q391P153
862g32M326r972J406Q169o472l051R335k925q367Q067M118j1222K875J0393q257
877b309n857J0907l11j0436O783O636j0126k23R673n756n228R036R6q844O546
892E87M410r754J814R591p168n883J0894l9j0853O306P220r272j097J0111n439
$$ y = [7849, 2222, -3616, 6222, 6038, -3324, 2576, 7882, -1707, -976, 8964, 2138, -3459, 6597, 5616, -5675, 2247, 9996, -1300, -3146, 8299, 2913, -5208, 4386, 6578, -4083, 570, 7530, -1764, -3219, 6434, 2115, -4433, 4020, 4087, -5815, 662, 7401, -3307, -4802, 6841, 1484, -7944, 1969, 5279, -5739, -2643, 5904, -3106, -6360, 3633, 780, -6743, 1054, 3072, -6553, -3218, 3911, -4113, -5670, 4775, -385, -9374, 141, 3999, -7518, -4837, 5023, -2999, -7995, 2311, 506, -7885, -732, 3594, -6378, -4972, 3197, -3275, -6326, 3009, 84, -8283, -216, 3902, -7320, -4445, 5948, -2309, -8166, 2741, 2430, -8006, -1223, 5413, -4713, -4936, 4737, -1019, -6247, 2789, 2885, -5959, 587, 4997, -4757, -2943, 6648, -520, -6403, 4491, 4452, -6401, -95, 7125, -2147, -3244, 6867, 1428]
907A428o838R491J416q919L876O466q318l11Q706n530n331R747J69j0862N758
922I48P884r236k069J0263m279p770Q496K616r478L120P328p532l276R168l018
937C165o656P809J530r632M059P341q726k160R855l365q754Q151L748j0729K986
952a378Q542p875l980R366j560q555O661L809r389J775P613p257l249J0095k713
967A905r413P870M255j0274J830R235p541n162J0005q48r908O715N443q930J88
982d630P992n844m433R060j397q501O553M710r667R47R405o456n784R949l12r908
998h316O149O603r139j257R736m680o225Q227P64p999M772N660r244K10R696n503
1014e46o189R045Q16r402M938P187q990j640J0365m009p547P890L039q897L400
$$ y = [1428, -5410, 4081, 5497, -3422, 454, 6920, -1398, -1709, 6997, 1467, -3864, 5883, 6052, -4810, 948, 8832, -404, -2473, 7790, 3511, -4259, 4237, 6853, -2625, 495, 7823, 291, -2985, 6183, 3165, -3491, 4318, 5848, -3784, 275, 7616, -1110, -3270, 6585, 3220, -5534, 2617, 6365, -4364, -1378, 7164, -711, -4691, 4675, 3115, -5440, 1221, 5030, -4359, -2584, 5029, -2228, -5477, 4618, 1905, -7508, 362, 4617, -5657, -3827, 5408, -2133, -7295, 2710, 1862, -8046, -1331, 4112, -4818, -4630, 3362, -2482, -6915, 2145, 748, -7753, -1200, 3510, -6157, -5210, 4195, -2261, -8045, 1904, 1592, -8316, -2167, 4436, -4703, -5960, 3776, -904, -7129, 1098, 1862, -6137, -1365, 4295, -4949, -4739, 4957, -546, -6735, 2310, 3126, -6276, -1338, 5849, -3141, -4781, 5584, 1575, -5972, 1918, 4957, -3940, -540]
1029e40O207p234j979Q949m042n972Q128K099r596L586P582q012k191R742l521
1044C206q151Q012L764r941K764P875o629l562Q539k416p158P221L384r755K752
1059i5P752p194l427R562k376q546P589L527r853J809Q885o597m906Q885j035
1074C980p976N927M095q960J332Q170p086m059Q912p57q800O314M133r194Q01
1089c168Q967o169n763R402k26r436N382N722q275k82P985n271n363Q722J92q734
1105f315M871N644q850M8Q304m709o426Q949P07r489M567O754p966j777Q509l898
1121a077o375P988J449q622L997O410q225j389Q973l615o523Q050J777r561M222
1136b521P211q175k351R952l216p728P310K976q582L361O831p425k579R061k262
$$ y = [-540, 5667, -1567, -3546, 5403, 1361, -4611, 3517, 5616, -3980, -394, 7188, -824, -3015, 6727, 3206, -4945, 3067, 6831, -3110, -346, 7529, 900, -2662, 5877, 3461, -3697, 3524, 6908, -2847, -95, 7657, 463, -2964, 6598, 4222, -4324, 3265, 6792, -3061, -1252, 7633, 1036, -3870, 5015, 3980, -3996, 1931, 6026, -2934, -1602, 6568, -518, -4577, 4335, 3578, -5222, 1092, 5225, -3969, -3168, 5799, -370, -6133, 3269, 3043, -6393, -1011, 4711, -3564, -3846, 4139, -1132, -6495, 2227, 2419, -6315, -1444, 4200, -4650, -4602, 3702, -1007, -7433, 1516, 2223, -7266, -2699, 4055, -3911, -5688, 2821, -1077, -7452, 536, 1985, -6637, -2640, 3770, -4455, -5844, 3129, -486, -7009, 1041, 2818, -6743, -2521, 4690, -3485, -5836, 4116, 900, -6828, 482, 3458, -5124, -1763, 5068, -2357, -4936, 4125, 1863]
1151A863p657P325K877r047K973P635p622l000J0030k299q694P488M171r122J672
1166a407Q125o901l211Q815j965p988P223M028r043J281P752o058m028Q847j083
1181D387q211O185M399r010J189Q087n406m608Q192p95p966N821M533q582K63
1196a522Q112n024n284Q188L14q515M688N194q565l3Q770n000o071Q235P27q471
1212d257M262N431q079l83Q203m602o169Q022J563q940M140N579p849j066Q339
1227D194l797o483P702J598q901L377O418p487j544Q479l957o772Q081J912q905
1242f085K965O783p150k549Q690l334o210P128K581r346L029P292o853l023Q174
1257B092j461p013O235K730q177K436P322o606l551Q876j643p439O589L398q855
$$ y = [1863, -5794, 1531, 4408, -4639, -1666, 5969, -1653, -4653, 5377, 3078, -5616, 1872, 6043, -3079, -1407, 6718, -183, -3394, 5421, 3456, -4532, 2691, 6719, -2324, -1043, 6709, 651, -3377, 5470, 4387, -3824, 2361, 6760, -2250, -1061, 7026, 1620, -2988, 5204, 4409, -3557, 2264, 6797, -1785, -1522, 6590, 1566, -3718, 4470, 4784, -3731, 957, 6151, -2414, -2447, 6323, 1323, -4748, 3487, 4214, -4257, 5, 5436, -2643, -3026, 5177, 575, -5594, 2428, 3991, -4949, -809, 4770, -3079, -4145, 4194, 397, -6086, 1616, 3214, -5687, -2310, 4108, -3379, -4923, 3556, -401, -7173, 908, 2820, -6085, -3120, 3663, -3487, -6036, 2654, -680, -6890, 238, 2819, -6527, -3498, 3794, -3059, -6082, 2092, 631, -6382, -147, 2583, -5594, -3158, 4164, -2442, -5993, 2883, 1240, -6199, 390, 3788, -5067]
1272e067K346P235o100l773Q831r74q012N866M120q171J209P621n569m004Q313
1287C871n87q116N716M785q124M29P612m939m471Q286l49p946M946M922q076N40
1303a501P477m243m902P742k18q186N069N618p988p37Q077m168n701P710Q55p962
1319c058L995N930q045j676Q777l518n851O818J281p945L741N839p802j042Q159
1334E603l464o730P125J889q261L391O059p247k078Q584l254o580O697K448q265
1349d083K375O330o665k233Q178l115o280O228K888q401K296O826o879k572P872
1364B765k146p015O346L382q075R34P057n391l455P519j516o732O257L018q339
1379e391J480P256n349m011P865r65p292N765L992q278P99P901n134m521P677
$$ y = [-5067, -2721, 4514, -1586, -5359, 3472, 2498, -5514, 352, 4472, -3699, -2490, 5131, -438, -4442, 3871, 3284, -4832, 884, 5669, -2455, -2026, 5586, 647, -3824, 4462, 4113, -3833, 1113, 6035, -2041, -1501, 5976, 1733, -3169, 4573, 4355, -3831, 1238, 6856, -1132, -1869, 6208, 2040, -3661, 4049, 4904, -3058, 937, 6867, -1178, -2854, 5923, 2405, -3446, 3372, 4653, -3292, 449, 6288, -1514, -2556, 5603, 2139, -4591, 2534, 4423, -3838, -447, 5612, -1635, -3713, 4871, 1617, -4963, 1734, 4182, -4083, -1708, 4622, -2043, -4276, 3902, 787, -5493, 735, 3623, -4778, -2482, 4344, -2535, -5107, 2765, 619, -6396, -50, 3332, -4743, -3809, 3248, -2143, -5598, 1921, 405, -6327, -70, 2948, -5391, -3911, 3345, -2004, -6015, 1850, 885, -6407, -642, 3350, -4928, -4129, 3772, -1362, -5883, 1794]
1394A794j61p191N011L708p279M17P803m885m242P672l05p417M622M876p573J29
1410c021Q027m659n316P643J368q023L776N711p441l90P259m223m598P369Q85
1425D367q230M402N370p523o77Q160l859n895P382J582q252L440O290p066k172
1440b681Q178k723n812O230J803p322K496O043p051j494P628k652o303O504K064
1455D908p993K563O742o374l160P973j985o786N969K581p107J469O527o292k752
1470c717P828j965o634N822K850p819J797O646o119l314Q274j733p282N287M087
1485D008p336K27O494m846l744P602p49p125M469M194p511N54P116n377l630P551
1501A897r57p423M933N157q015q1P702m125n164O983M51p109M181M897p181l59
$$ y = [1794, 1633, -5558, -547, 3161, -4118, -3701, 4102, -783, -5025, 2647, 2342, -5075, -453, 4423, -3150, -3021, 5006, 347, -4969, 2674, 4042, -3981, -205, 5506, -1935, -2325, 4934, 711, -3887, 3482, 4367, -3863, 539, 5909, -1614, -2291, 5869, 2010, -3885, 3497, 5079, -3173, 267, 6557, -509, -2681, 5497, 2774, -3038, 3192, 4995, -2327, 169, 6212, -839, -2333, 5295, 2643, -3660, 2844, 4908, -3085, -522, 6220, -154, -3314, 4659, 2674, -4112, 1857, 4438, -2669, -1200, 5327, -965, -3717, 4111, 2146, -4488, 1334, 4184, -3635, -1838, 4808, -1311, -4625, 3649, 1916, -5366, -79, 4008, -3328, -3101, 3393, -1453, -5197, 2405, 1656, -5469, -1000, 3194, -4317, -3763, 3353, -2024, -5654, 1897, 940, -6483, -1550, 3607, -4408, -4489, 3213, -912, -6076, 907, 1358, -5751, -1570, 3327, -3854, -4213]
1517d213O942l388m691O578N35p161M373M674p184n94P918l689o002P033J637
1532B768p165L132N199o112j337P144k774n328N914J867o991L078N221o366j159
1547b909P573k889o267O651K664q033K666O173o030k315P495k031o214N475L028
1562E037p398J993N709n448k263O996j885n754N342K746p828K083O956n962k895
1577b571O998q65o693N032L246o943P49O470m887l669O998q47o075M617L242p312
1593b510J357O485n484l673P185j85p078M162M299o698p3O307m220l722O248J54
1609B554o985L829M411o583l65O545m240l829O827l19o994M086M826o767j185
1624d189P028l443m640O280O13o846L343N039o438j453P109k926m471N682O31
$$ y = [-4213, 2729, -659, -5350, 1228, 1763, -5398, -1025, 3649, -3535, -4129, 3789, 100, -5902, 1131, 2768, -4397, -1265, 3934, -2178, -3515, 3629, 855, -4473, 1441, 3308, -3683, -605, 4616, -1750, -2909, 4664, 1775, -4492, 2159, 4823, -3210, -544, 5629, -401, -2716, 4779, 2748, -3466, 2009, 5037, -2361, -368, 5341, -107, -2370, 4626, 2741, -3013, 2329, 5075, -2753, -670, 6286, 324, -2571, 4427, 3562, -3131, 1901, 5147, -1796, -1047, 5423, 536, -3133, 3865, 3018, -3057, 1560, 4802, -2510, -1153, 5332, -152, -3825, 3360, 3175, -3903, 259, 4558, -2140, -2213, 4094, -126, -3848, 2400, 2554, -4431, -602, 3809, -2774, -3139, 3406, -834, -4663, 2164, 1845, -5149, -1063, 3763, -3004, -4189, 2839, -604, -5244, 1036, 1649, -5197, -1854, 3185, -3253, -4706, 2403, -523, -4994, 688, 1319]
1639A319o505L272M973o295j184O963k547n553N615K168o879K735N506n915k365
1654d692P294j914n524N251J938o054J925N506n701j846P318k247n814N484K813
1669C737p106J980O168n547k522O698j124o253M769L532o605J282N635m765k880
1684c001O738j073o052N108L175o926J111O037m657l217O543m11o462M733L507
1699E153o400n5O542l788m034N879J73o000L779L723o796O63O324l808m187O181
$$ y = [1319, -5186, -1914, 3059, -3236, -4420, 2543, -4, -5557, 58, 2226, -4653, -1918, 3588, -2327, -4692, 2602, 688, -4836, 415, 2353, -3701, -1776, 3730, -1971, -3817, 3501, 1254, -4560, 924, 3737, -3369, -1389, 4779, -768, -3290, 3408, 2284, -3969, 800, 4332, -2273, -991, 4644, -121, -3001, 3737, 2664, -3388, 1720, 4895, -2031, -920, 5117, 460, -2757, 3786, 3375, -3087, 1646, 5153, -1247, -1302, 5240, 1452, -2582, 3297, 3470, -2530, 1249, 4972, -1824, -1161, 5163, 1355, -2832, 3349]
$$ [...]
8191F1
##END NTUPLES=NMR FID
##END=
