##TITLE=1H_TG-2240-2
 CDCl3, 8 sc, 
 1.4.2019
##JCAMPDX= 6.0         $$ Bruker NMR JCAMP-DX V2.0
##DATA TYPE= NMR FID
##DATA CLASS= NTUPLES
##ORIGIN= UXNMR, Bruker Analytische Messtechnik GmbH
##OWNER= root
$$ XWIN-NMR		Version 3.5
$$ Mon Apr  1 14:19:36 2019 Russian Standard Time (UT+4h)  she@DPX200
##.OBSERVE FREQUENCY= 200.1316
##.OBSERVE NUCLEUS= ^1H
##.DELAY= (6, 6)
##.ACQUISITION MODE= SIMULTANEOUS
##.ACQUISITION SCHEME= undefined
##.AVERAGES= 8
##.DIGITISER RES= 18
##SPECTROMETER/DATA SYSTEM= spect
##.PULSE SEQUENCE= zg30
##.SOLVENT NAME= CDCl3
##.SHIFT REFERENCE= (INTERNAL, CDCl3, 0, 15.7039)
##AUDIT TRAIL= $$ (NUMBER, WHEN, WHO, WHERE, WHAT)
$$ ##TITLE= Audit trail, XWIN-NMR		Version 3.5
$$ ##JCAMPDX= 5.01
$$ ##ORIGIN= Bruker BioSpin GmbH
$$ ##OWNER= she
$$ F:/spectra/data/she/nmr/H-F/1/audita.txt
$$ ##AUDIT TRAIL=  $$ (NUMBER, WHEN, WHO, WHERE, WHAT)
(   1,<2019-04-01 14:18:10.85 +0400>,<she>,<DPX200>,
      <created by zg, POWCHK disabled, PULCHK disabled
       configuration hash MD5:
       00 E9 B6 7A A2 85 ED C7 34 08 36 98 17 FE 4E 26
       data hash MD5: 16K
       A7 57 44 FD 53 75 02 55 CB BA 0C A9 50 C4 B1 3A>)
$$ ##END=
$$ 
$$ hash MD5
$$ 8D 60 17 BF 57 8C 4C E5 3B F6 C4 93 97 ED 20 EA
##$RELAX= 
##$RELAX= 
##$RELAX= 
##$RELAX= 
##$RELAX= 
##$RELAX= 
$$ Bruker specific parameters
$$ --------------------------
##$DU= <F:/spectra>
##$EXPNO= 1
##$NAME= <H-F>
##$PROCNO= 1
##$TYPE= <nmr>
##$USER= <she>
##$AMP= (0..31)
100 100 100 100 100 100 100 100 100 100 100 100 100 100 100 100 100 100 
100 100 100 100 100 100 100 100 100 100 100 100 100 100 
##$AQSEQ= 0
##$AQ_mod= 1
##$AUNM= <au_zg>
##$AUTOPOS= <>
##$BF1= 200.13
##$BF2= 200.13
##$BF3= 200.13
##$BF4= 200.13
##$BF5= 200.13
##$BF6= 200.13
##$BF7= 200.13
##$BF8= 200.13
##$BYTORDA= 1
##$CFDGTYP= 0
##$CFRGTYP= 5
##$CHEMSTR= <none>
##$CNST= (0..31)
1 1 145 1 1 1 1 1 1 1 1 1 1 1 1 1 1 1 1 1 1 1 1 1 1 1 1 1 1 1 1 1 
##$CPDPRG= <>
##$CPDPRG1= <>
##$CPDPRG2= <>
##$CPDPRG3= <>
##$CPDPRG4= <mlev>
##$CPDPRG5= <mlev>
##$CPDPRG6= <mlev>
##$CPDPRG7= <mlev>
##$CPDPRG8= <mlev>
##$CPDPRGB= <>
##$CPDPRGT= <>
##$D= (0..31)
0 1.2 0 0 0 0 0 0 0 0 0 0.03 0 0 0 0 0 0 0 0 0 0 0 0 0 0 0 0 0 0 0 0 
##$DATE= 1554113890
##$DBL= (0..7)
120 120 120 120 120 120 120 120 
##$DBP= (0..7)
150 150 150 150 150 150 150 150 
##$DBP07= 0
##$DBPNAM0= <>
##$DBPNAM1= <>
##$DBPNAM2= <>
##$DBPNAM3= <>
##$DBPNAM4= <>
##$DBPNAM5= <>
##$DBPNAM6= <>
##$DBPNAM7= <>
##$DBPOAL= (0..7)
0.5 0.5 0.5 0.5 0.5 0.5 0.5 0.5 
##$DBPOFFS= (0..7)
0 0 0 0 0 0 0 0 
##$DE= 6
##$DECBNUC= <off>
##$DECIM= 24
##$DECNUC= <off>
##$DECSTAT= 4
##$DIGMOD= 1
##$DIGTYP= 9
##$DL= (0..7)
0 120 120 120 120 120 120 120 
##$DP= (0..7)
150 150 150 150 150 150 150 150 
##$DP07= 0
##$DPNAME0= <>
##$DPNAME1= <>
##$DPNAME2= <>
##$DPNAME3= <>
##$DPNAME4= <>
##$DPNAME5= <>
##$DPNAME6= <>
##$DPNAME7= <>
##$DPOAL= (0..7)
0.5 0.5 0.5 0.5 0.5 0.5 0.5 0.5 
##$DPOFFS= (0..7)
0 0 0 0 0 0 0 0 
##$DQDMODE= 0
##$DR= 18
##$DS= 0
##$DSLIST= <SSSSSSSSSSSSSSS>
##$DSPFIRM= 0
$$ [...]
##$SUBNAM2= <"">
##$SUBNAM3= <"">
##$SUBNAM4= <"">
##$SUBNAM5= <"">
##$SUBNAM6= <"">
##$SUBNAM7= <"">
##$SUBNAM8= <"">
##$SUBNAM9= <"">
##$SW= 24.9336934301222
##$SWIBOX= (0..15)
0 0 2 0 0 0 0 0 0 0 0 0 0 0 0 0 
##$SW_h= 4990.01996007984
##$TD= 16384
##$TD0= 1
##$TE= 0
##$TE2= 300
##$TE3= 300
##$TEG= 300
##$TL= (0..7)
0 120 120 120 120 120 120 120 
##$TP= (0..7)
150 150 150 150 150 150 150 150 
##$TP07= 0
##$TPNAME0= <>
##$TPNAME1= <>
##$TPNAME2= <>
##$TPNAME3= <>
##$TPNAME4= <>
##$TPNAME5= <>
##$TPNAME6= <>
##$TPNAME7= <>
##$TPOAL= (0..7)
0.5 0.5 0.5 0.5 0.5 0.5 0.5 0.5 
##$TPOFFS= (0..7)
0 0 0 0 0 0 0 0 
##$TUNHIN= 0
##$TUNHOUT= 0
##$TUNXOUT= 0
##$USERA1= <user>
##$USERA2= <user>
##$USERA3= <user>
##$USERA4= <user>
##$USERA5= <user>
##$V9= 5
##$VALIST= <valist>
##$VCLIST= <CCCCCCCCCCCCCCC>
##$VD= 0
##$VDLIST= <DDDDDDDDDDDDDDD>
##$VPLIST= <PPPPPPPPPPPPPPP>
##$VTLIST= <TTTTTTTTTTTTTTT>
##$WBST= 1024
##$WBSW= 4
##$XGAIN= (0..3)
0 0 0 0 
##$XL= 0
##$YL= 0
##$YMAX_a= 178415
##$YMIN_a= -388465
##$ZGOPTNS= <>
##$ZL1= 120
##$ZL2= 120
##$ZL3= 120
##$ZL4= 120
##$ABSF1= 10
##$ABSF2= 0
##$ABSG= 5
##$ABSL= 3
##$ALPHA= 0
##$AQORDER= 0
##$ASSFAC= 0
##$ASSFACI= 0
##$ASSFACX= 0
##$ASSWID= 0
##$AUNMP= <proc_1d>
##$AZFE= 0.1
##$AZFW= 0.1
##$BCFW= 1
##$BC_mod= 2
##$BYTORDP= 1
##$COROFFS= 0
##$CY= 11.3945322036743
##$DATMOD= 1
##$DC= 2
##$DFILT= <>
##$DTYPP= 0
##$F1P= 18.9103706918063
##$F2P= -1.10871071338519
##$FCOR= 0.5
##$FTSIZE= 0
##$FT_mod= 4
##$GAMMA= 1
##$GB= 0.15
##$INTBC= 1
##$INTSCL= 1
##$ISEN= 128
##$LB= 0.24
##$LEV0= 0
##$LPBIN= 0
##$MAXI= 10000
##$MC2= 0
##$MEAN= 0
##$ME_mod= 0
##$MI= 1.114404
##$NCOEF= 0
##$NC_proc= 0
##$NLEV= 6
##$NOISF1= 3.799351
##$NOISF2= 2.8
##$NSP= 1
##$NTH_PI= 0
##$NZP= 0
##$OFFSET= 15.70392
##$PC= 1
##$PHC0= -9215.161
##$PHC1= 20.60026
##$PH_mod= 1
##$PKNL= yes
##$PPARMOD= 0
##$PSCAL= 0
##$PSIGN= 0
##$REVERSE= no
##$SF= 200.130013532006
##$SI= 16384
##$SIGF1= 3
##$SIGF2= 2
##$SINO= 400
##$SIOLD= 16384
##$SREGLST= <1H.CDCl3>
##$SSB= 0
##$STSI= 0
##$STSR= 0
##$SW_p= 3612.71676300578
##$SYMM= 0
##$S_DEV= 0
##$TDeff= 0
##$TDoff= 0
##$TI= <>
##$TILT= no
##$TM1= 0
##$TM2= 0
##$TOPLEV= 0
##$USERP1= <user>
##$USERP2= <user>
##$USERP3= <user>
##$USERP4= <user>
##$USERP5= <user>
##$WDW= 1
##$XDIM= 8192
##$YMAX_p= 0
##$YMIN_p= 0
$$ End of Bruker specific parameters
$$ ---------------------------------
##NTUPLES= NMR FID
##VAR_NAME=  TIME,          FID/REAL,        FID/IMAG
##SYMBOL=    X,             R,               I
##VAR_TYPE=  INDEPENDENT,   DEPENDENT,       DEPENDENT
##VAR_FORM=  AFFN,          ASDF,            ASDF
##VAR_DIM=   8192,          8192,            8192
##UNITS=     SECONDS,       ARBITRARY UNITS, ARBITRARY UNITS
##FACTOR=    0.0002004,     1,               1
##FIRST=     0,             0,               0
##LAST=      1.6414764,     0,               0
##MIN=       0,             -388465,         0
##MAX=       1.6414764,     178415,          0
$$ Real data points
##PAGE= N=1
##DATA TABLE= (X++(R..R)), XYDATA
$$ [...]
3521G018m884p517K346O409M11p602k385P763L645q402m411P295N468m909n987
3536e742J922P917j75p812j030Q708J560p731k305O970M093m924o484L265Q376
3551F608k290q581O81Q428J53p466k222O273M268n897o932N212P719l708q860
3566f614K197P268K10o545j860O314L772o245n048O402O688n526o689L787O828
3581D939n48p011j579P512L347p973m020P571M995o355o215L740P019r31q580
3596d089j680Q566K213q239l057O952L189n004m909L653O699j694q580J083Q540
3611C643M72p629j071O763L073n419m597M526P201m130q536L507Q406j146p692
3626b629j208O342K958n915n079N015O021n511o543M079O818k019o643j042O906
$$ y = [7018, 2134, -5383, -3037, 3372, 3783, -3819, -6204, 1559, 5204, -3198, -7609, -314, 5154, 245, -5742, -3820, 4097, 3922, -3890, -4920, 3788, 5348, -2383, -4688, 2282, 6375, 1451, -5033, -1768, 6608, 4318, -4263, -3582, 4846, 4999, -2467, -4689, 1584, 5852, -45, -6977, -1765, 5954, 2246, -6614, -4417, 2851, 3061, -3484, -5344, 970, 4742, -1503, -6551, -149, 6539, 1013, -5676, -1889, 4939, 4391, -2620, -4199, 3313, 6660, -1313, -5333, 2238, 7233, 878, -5337, -1597, 5422, 4491, -4089, -5769, 2797, 5010, -3229, -6286, 666, 3855, -1149, -6058, -2405, 4294, 2600, -5980, -4897, 3643, 4115, -3514, -4585, 2178, 5251, -168, -4765, -239, 6962, 2832, -5704, -2197, 6209, 5063, -2629, -3837, 2505, 5463, -452, -5531, -516, 5505, -6, -6549, -2470, 4348, 2329, -4314, -5356, 1550]
3641A550K806o810m148O957M660o162m978N626N972k828p171N02Q342K272q767
3656b177k866P640L811n942m511L858N500k414p696J384P918N1q458j574P047
3671A571K667o038l613L936N509l300p303L017Q470k404q013Q49P690K021o142
3686a083m615N684O493m879o695M423P004k960o966Q53O641J651o347m347O156
3701A013N001n624o004M677N445l624n780J270O407J219p994k844Q504L243p198
3716b289l901N336N413l025o109J427P786M11q499j146Q450K512p074l463M754
3731E83N233k919o984K371P132j874q137J000P286K20o159l599N651M835m498
3746A41p060M329O992l158o739J645O775M01o272k875P413M610n785o133N179
$$ y = [1550, 4356, -2454, -6602, 355, 5015, -1147, -6125, -499, 5473, 2645, -4526, -4024, 4318, 6590, -2177, -5043, 2597, 6408, 466, -4045, -187, 5313, 2899, -4797, -3413, 4505, 4556, -3902, -5476, 1571, 4238, -1800, -5413, -1477, 4032, 732, -6571, -3554, 4916, 2512, -5501, -4652, 3038, 5059, -1083, -5698, -14, 6479, 1600, -5095, -672, 6332, 3372, -3594, -2741, 3900, 5551, -796, -5143, 1013, 6014, 390, -5614, -937, 4508, 884, -4896, -3626, 2781, 4000, -3994, -6838, 1666, 4909, -2289, -6190, -854, 4559, 1534, -4575, -3148, 4638, 5049, -3450, -4596, 3854, 6366, -708, -4171, 583, 5816, 2897, -4087, -1716, 5416, 3542, -4595, -3595, 3691, 3911, -2248, -5847, -196, 4639, 141, -6919, -2590, 4402, 1244, -5495, -3850, 2925, 3326, -2946, -5821, 1592, 6202, 417, -5716, -537]
3761e37O669l707n995K038N704K77o253k360P312L271p580m267N992M740l931
3776A373o070J782O218l25p368p44P531J740p503k753O264M243l856n972K742
3791b698P291j051p781O79P643L39o539j605O005L475m576o057M258O743l034
3806C092p124J883O556p73o280j658O085K993o018n664N556O545m513o686K789
3821c217O312n62n767j480O207L354o823l895O588N072n117m776K627O179o22
3836D080o798n28O761K120p439k535O574L409n549n015L314O147j673p756M37
3851d451P639J90o851j389N634K938m783m689M342O349l054p625K480P457p78
3866C409o348o08N934K763n647l933N044O165n110o404L545O252j455o246j101
$$ y = [-537, 6132, 2425, -3570, -1532, 4172, 4449, -1804, -4164, 3148, 6419, -1161, -5428, 564, 5304, 1373, -4697, -2915, 3303, 2978, -4390, -5134, 2397, 4137, -3366, -6119, 145, 4388, 532, -5440, -2698, 4593, 3542, -4239, -3560, 4083, 4422, -2117, -3722, 2283, 5758, 1182, -4875, -617, 6126, 3092, -4032, -2149, 4407, 3634, -2646, -4304, 1781, 4774, -1244, -6908, -1352, 5193, 680, -6006, -3217, 3095, 2533, -3234, -4714, 1493, 4847, -1976, -5871, 717, 5789, 672, -4104, -1477, 4702, 4080, -2718, -3246, 3515, 5635, -1804, -4339, 2235, 5644, 95, -4920, -1606, 4541, 2868, -4888, -4451, 3188, 3378, -3473, -4862, 772, 3710, -1073, -5762, -1420, 4929, 1875, -5750, -3270, 4187, 3409, -2939, -3547, 2387, 5150, -497, -4430, 614, 6779, 1669, -4735, -1190, 5062, 3607, -2639, -3740]
3881c740N738K620n619m626N703M983n827n115L974N467j858o183J0O775J781
3896D083o679k698O864L063n671l423M176N477k677o556R06P760P47p769j126
3911c523O229K655n315l833L876N115l240o520J794P261j611o744m51N821K191
3926C705n580l448M430M863m084n671L897O516k856n929P65N996J936n544l687
3941d691N681N142n423n120M274N418k770n439M59O127J300o626l098O002L507
3956D743n575m017M294M118l169n031J497O220J88p507j079P132K379o137k777
3971d721M514M390k837n584K327O838j372o598k98P438J067n935k312L922M555
3986E394l604n901L279N379k553n878J130N675P4n575k487N269M088n144n546
$$ y = [-3740, 1998, 4618, -1001, -5627, 76, 5059, -768, -5883, -1909, 3558, 1700, -4483, -4473, 2302, 4083, -2596, -5294, 1570, 4633, -1038, -4461, -285, 5192, 2515, -4041, -3135, 4625, 5372, -2397, -3523, 2706, 5361, 46, -3787, 89, 5204, 1964, -4556, -2762, 4499, 2888, -3856, -4307, 1514, 3705, -1875, -5323, -893, 3970, -114, -5785, -1888, 4628, 1772, -4157, -3392, 2604, 4540, -1004, -4691, 990, 6132, 709, -4411, -137, 5281, 2511, -2928, -2469, 3658, 4958, -1668, -4766, 1236, 4743, -832, -4849, -555, 3563, 394, -4637, -3140, 3080, 3268, -4239, -5318, 1814, 4193, -1944, -4721, -207, 4183, 1346, -4238, -1911, 4927, 3555, -3043, -3341, 4097, 5164, -771, -3083, 839, 5394, 1790, -4111, -832, 4547, 1994, -3884, -2754, 2921, 2995, -2580, -5067, 202, 4290, -854, -6400]
4001f400N068N747l724n321J729O022M18o051k140O616L856o090m331N171M463
4016E033l251m988J593N833k89o455j039O838J856o807k809M808L903l965m437
4031d176J642O143j508p246Q89P007M15o339j651N055L859l870m915K803O857
4046D965k344o462J699N873k84m933j550N138L283m800m749M208N285l633n489
4061c793J915N791j182n931j052N943K524n940m103N587M590m165n172K458N536
4076C006o37n519j214O559J947o138k142N486L741m308m252K193N399n18o322
4091b719KO803J00o159j304N203K690m735m447L186N945k698o790J408O614j250
4107A849n404p10N103K381m460l836M075N539l456n643K665N606j055n086o9M892
$$ y = [-6400, -1332, 4415, 691, -4630, -2901, 3121, 3539, -2512, -4652, 1964, 5820, -270, -4601, 570, 5033, 1782, -3206, -1613, 4220, 3931, -2524, -3563, 3275, 5131, -1676, -4485, 323, 4226, 261, -4176, -2534, 3609, 2101, -5145, -4256, 2751, 3166, -3173, -4824, 231, 4090, 220, -4695, -1892, 4965, 2621, -3841, -2142, 3731, 3447, -1486, -3036, 2102, 5385, 585, -4164, 44, 5329, 1696, -3793, -1878, 3913, 2731, -3200, -4252, 1691, 4215, -1725, -5828, -241, 4349, 184, -4988, -2530, 3006, 2369, -3150, -4364, 2195, 4142, -1996, -4138, 1348, 5089, 781, -3471, -1278, 4121, 3603, -2719, -2717, 4086, 4186, -1973, -3277, 1926, 4616, -119, -4566, -1380, 4565, 1867, -4923, -3515, 3099, 1849, -3555, -4265, 838, 3219, -1241, -5077, -1002, 4537, 1081, -4562, -1897, 3709, 2654, -2432, -2501, 2391]
4123B391K333m967l761N533M227n046m804L436M900j803n307n66N797J672o146
4138b111k631N597L074n080l679L672M299j620n728M28O288Q87o274q77N748J750
4154C743m517k970L770M769k217o112J484O904q18o518l25N060J984m597l427
4169c787L795M460l113o326K793O017k127n766L80N235J313n013l022M753M122
4184C714m071m854M119N322k696m584L19N241J957n718k835O070L229n167l908
4199c862M175M535k740n075P65N583M22o516j583O153J762n163k560L224L897
4214C017k780m587J347O529j274o317J40O299Q25m916k373M240M375l252n079
4229c806K296O543k301n476R18N053Q00m597k767M191L815m164m704L566M834
$$ y = [2391, 4724, -243, -4004, 1529, 5756, 710, -4094, -658, 4242, 2439, -2868, -3434, 2363, 4035, -2111, -4742, 855, 3929, -1151, -4830, -1158, 3141, 1521, -4207, -3779, 2509, 3396, -2878, -3755, 1993, 3743, -774, -3744, 26, 4795, 2578, -3534, -2050, 4854, 4036, -2482, -2807, 2253, 4237, -360, -3787, 8, 4468, 1355, -4971, -2178, 3839, 1712, -4054, -3674, 1561, 2874, -2139, -5161, -408, 3714, -357, -5211, -1092, 4230, 1534, -3050, -2731, 2510, 4467, -1251, -4086, 1984, 5213, 46, -3862, 313, 4848, 2108, -2967, -2202, 3381, 3803, -2713, -4296, 1857, 3619, -1544, -4104, -880, 3017, 237, -4350, -3003, 3526, 2252, -4065, -3925, 2374, 3199, -1717, -4090, 150, 4525, 1273, -3806, -1510, 5033, 2732, -2744, -1826, 3227, 4027, -570, -3337, 854, 4669, 505, -4199, -633, 4201]
4244D201l010n033J474M957j14n032k166N600K983n425l393M464M394l217m729
4259d046J524N628L51n530j565O364K186n528k960M482L381k602m399J293N056
4274C635l62n966k80N962L01n436j530L892L165l405m653K841N146j940o044J742
4290b932N598m68m718j567M603L302l834m393L872N325l368m926K382M712m10
4305C178m306j748M665K820n237l245M531M070l920m479K291M527j005n174p83
4320c815N559K176o100k831N155L446l870l666J905M656o22n363J56O183Q03n863
4336b091j297N274K073l724l474K804M771j824n712J492N816j271n431m06M787
4351A787K060m490l735L121N219l074n721K583N321j431m416o39M226K184l874
$$ y = [4201, 1191, -3842, -2368, 2589, 2475, -2557, -4723, 877, 3860, -1565, -4958, -494, 3900, 683, -4046, -2522, 3106, 3457, -2073, -3638, 2726, 4912, -616, -3576, 906, 4287, 1685, -2714, -1421, 3635, 3273, -2693, -2973, 2989, 3290, -2146, -3676, 216, 3381, -24, -4677, -1836, 3310, 1370, -4674, -2932, 2666, 2198, -2520, -4087, 516, 3818, -16, -4409, -537, 4788, 1420, -3506, -1124, 3588, 3178, -1128, -2876, 1789, 4609, -628, -3873, 658, 4728, 808, -3671, -1380, 3147, 2142, -3032, -3815, 1744, 3920, -2180, -5011, 144, 3590, -280, -3946, -2041, 2615, 1993, -3370, -3214, 2969, 3772, -2091, -3388, 1886, 3959, 235, -3239, -435, 4336, 2512, -3200, -1708, 4108, 2837, -2594, -3000, 1787, 3847, -643, -4378, -1257, 3962, 888, -4833, -2250, 3071, 1640, -2776, -3415, 811, 2995, -879]
4366h79l708M477M243l731l977K705M130q25m445l26M943J595n370k345N595K654
4382D736m589l358K891L792j482n275K87N648L88n851j460N245J955m231k793
4397d097K436M570j708n316J446N697o33n109p4M997J224l657k905L278M290k858
4413A581m780K104N344j611n126M28M419J233m058l348L990M166m497m360L376
4428a139M276j994m540L76M270J438m628k686N189L046m437k965L471M070k245
4443A502m144N62N146O48n508j241N560J837m933k111K880L652k380m644R66N601
4459C393o89n622oM834Q39m243k330L439L421k943m754K504N794k085n290J080
4475b658M873O91m202j864L738L380l030m595L626M611k616m377P38M702L03m340
$$ y = [-879, -4587, -110, 4133, 402, -3575, -870, 3260, 2435, -2010, -2336, 2607, 4202, -1168, -3513, 2082, 4736, 147, -3211, -320, 3472, 1990, -3285, -2998, 2650, 3038, -2813, -4273, 972, 2927, -1304, -4097, -1661, 2909, 1201, -4115, -2669, 3028, 2395, -2714, -2788, 2209, 3433, -224, -3129, 149, 4439, 1581, -3199, -1095, 4249, 2638, -2488, -2060, 2359, 3592, -466, -3814, 176, 4342, -155, -4515, -1139, 3137, 1143, -3397, -3021, 1249, 2687, -1941, -4627, 562, 3608, -829, -3794, -323, 3747, 1502, -2642, -2080, 3066, 3714, -1794, -3035, 2525, 4362, -571, -2682, 198, 3850, 1470, -3174, -2208, 3393, 2704, -2918, -2924, 1910, 2749, -1494, -3824, -385, 3036, 93, -4661, -2157, 3637, 1552, -3738, -2658, 2215, 2906, -1296, -3160, 578, 3958, 928, -3667, -41, 4570, 1954, -2423, -1685, 3017, 3320, -1020]
4491a020j875M048K626m258l324L585L665l220l682J373M144j49m694j218N299
4506A300J865n168k097M083L220k582l975J399N174n55n033m32N705R60n054j539
4522b729L814K587k605l852J833N050k100n494J311M947l62m432j444L908K481
4537B913l297l861K997M581l061m782K392M747p67l979j547M649K751l888l543
4552c695L770L986l436l569K245L885j21m773p57M757J723m926k091L961K668
4567C627l355l635K098L831r14m542p75N401J350n640j391M187K527l123l392
4582c746K376M420j100m982J056N073j90m658o22M077K149l127l576K636M617
4597D403k845m767K032M348j182m390l28M028J912m140l292L824L863l662m368
$$ y = [-1020, -2895, 1153, 3779, -479, -3803, -218, 3447, 227, -3455, -2082, 2062, 1913, -2781, -3999, 1300, 3165, -2003, -4100, -17, 3203, 621, -3354, -1955, 3219, 2664, -2369, -2801, 2904, 3864, -1190, -2729, 1085, 3672, 1067, -2785, -952, 4098, 1998, -3496, -2185, 2762, 2400, -2032, -3476, 432, 2913, -384, -4245, -1248, 3333, 272, -4510, -2118, 2629, 1862, -2117, -3664, 985, 3736, -152, -3695, 75, 4061, 625, -2944, -699, 3186, 3065, -1708, -2465, 2292, 4015, -911, -3002, 959, 3627, 272, -3363, -1265, 2566, 1652, -2890, -3665, 1736, 3086, -2554, -3945, 242, 2769, -354, -3746, -1370, 3050, 1950, -3032, -1976, 3097, 2907, -1751, -2373, 1704, 3853, 726, -2850, -214, 4403, 1558, -3209, -1177, 3171, 1989, -2401, -2729, 1299, 3211, -929, -4221, -397, 3466, -196, -4564]
4612d564L172L960j252m056k29M299J568m565k135M843K465l182l222K670L280
4627C052o71m383J98N103K51n064j272M805J494l625k769K149L844j670m677O21
4643b614N120j90n558k15M323J787l593k763K521M328k221m521J887M669j170
4658A790l741r9L993J199l949k168L488L717l665l632K716L852j886l996O04L962
4674B185O65m012k430M445K494l891l446L375L021j667l843L52M668L01m439j299
4690c521M678K238m407j955K978K921j566l831Q12M792k56m948m01N047R21m174
4706f72j892L027L315k653m507J957M613j494m617M35M203P5l528j479K856K966
4722B605l110l690L263M211k165l790P46M274M56l764j883M115K893m034l261
$$ y = [-4564, -1392, 2568, 1316, -2740, -2969, 1330, 2898, -1667, -3802, 1041, 3506, 324, -2898, -228, 3052, 2381, -2002, -1804, 3299, 3550, -1514, -2786, 2019, 3513, -112, -2881, -732, 3112, 1442, -3235, -2614, 2506, 2316, -3242, -3457, 866, 2653, -940, -3703, -1182, 3146, 925, -3596, -1709, 2960, 1790, -1951, -2050, 1943, 3142, -807, -2975, 513, 4230, 565, -3067, -351, 3501, 1615, -2381, -1777, 2185, 2850, -1162, -3592, 853, 3347, -544, -3990, -615, 2406, 739, -3104, -2752, 1916, 2217, -2222, -3521, 1157, 3395, -1012, -2967, 11, 2932, 1366, -2465, -1653, 3139, 2883, -2065, -2466, 2581, 3502, -672, -2564, 463, 3778, 1125, -3382, -1425, 3188, 1694, -2923, -2488, 1715, 1790, -1738, -3217, -361, 2605, -505, -4195, -932, 3279, 1114, -2676, -1930, 2344, 2800, -964, -2847, 1268, 4161, 127, -3134]
4737c134L146M154k808l814J082L718L87l875j581M331J523m240k090L323K895
4752C017k692l782J423M133j99m610n94M853J033m448q84L310K210k452l246J896
4768a032M542j266m815Q23M281M42l632j161L050K263l183l196K361M208k393
4783A292m266J134M062n07l477j577L746K495l931k865L464L236k788l703K004
4798a681L883o05l612o91L984K236m214k216L664K758k812k964J859L482o20m380
4814a929m06M653O93m522j052L420J834k954k792K004L414j268m335M98N071n25
4830A804m332m22L519J728k728k459K081L942k127l953J868L991o83l537p49L453
4846A396K142l334k894L250L321l450l301K246L381j227l732k07L622J438m290
$$ y = [-3134, 12, 4166, 1358, -2456, -1374, 2344, 2731, -1144, -2725, 1606, 3129, -1111, -3201, 122, 3017, 325, -3457, -2034, 2099, 1900, -2710, -3304, 1549, 2582, -1866, -2750, 560, 2770, 318, -2928, -1032, 3510, 2244, -2571, -1748, 2533, 2975, -657, -1818, 1232, 3495, 312, -2884, -523, 3685, 1292, -2974, -1840, 2222, 1715, -1762, -3339, 407, 2902, -1029, -3894, -430, 2806, 18, -3685, -1681, 2202, 1597, -2015, -2706, 1278, 3514, -700, -2916, 748, 3506, 694, -2270, -411, 3071, 2451, -1929, -2335, 2318, 3011, -1511, -2563, 857, 2691, -263, -3055, -1051, 2363, 1095, -3240, -2742, 2329, 1804, -2528, -2950, 569, 2297, -431, -2890, -809, 3133, 1006, -2947, -1079, 2912, 2229, -1308, -2057, 1396, 3538, 204, -2690, 560, 3881, 431, -2870, -624, 2757, 1530, -2202, -2409, 1213, 2651, -1639]
4861a639k002L774K608l157k974K181L197q65l742J2M320J281m612j113L921K082
4877C272l002k509K062L182j089m013P38M438n35m475l26L879J106l101k293K169
4893d97L302k171l849J068M664j256m422L43M091O81k969k401L116L318k584l660
4909c226K573L311j219l545N45L292Q22l178k167M004K481l409k982K840K732
4924B874j418l592K04L824O71m255j331M115J707m052j913K472K784j322l804
4939c036O53M303k42m155M4M313M81l476j349K937K742j983l632J370M245p30
4955B485m035k0L837L34l431j264K585K743k621l607J820L759j591l457O27L243
4971A407p3l123j286L423K474l565k813L109L230k279l132J353L600J60l739q68
$$ y = [-1639, -3641, 133, 2741, -416, -3390, -1209, 1988, 1123, -2619, -2607, 1713, 2994, -1618, -2731, 1190, 3272, 270, -2239, -177, 3005, 1916, -2097, -1359, 3079, 2544, -1931, -2257, 1622, 2728, -373, -2666, -497, 2805, 634, -3215, -2147, 2517, 1261, -3161, -2818, 1273, 1954, -1015, -3416, -300, 3018, 434, -3226, -653, 2658, 1439, -2106, -1561, 1731, 2553, -625, -2792, 1212, 3693, 284, -2698, 142, 2874, 1456, -2136, -1932, 1892, 2563, -1692, -3023, 1092, 2799, -1253, -3166, -694, 2090, 768, -3036, -2383, 1920, 1678, -2477, -2433, 1880, 2361, -1115, -2464, 473, 3215, 1232, -2400, -1030, 3215, 2485, -1550, -1570, 2267, 2601, -830, -2094, 491, 3234, 613, -2994, -1174, 2585, 994, -2463, -1836, 1407, 1334, -1789, -3075, 348, 2822, -743, -3556, -447, 2783, 504, -2628, -1275, 2325, 2485, -1254, -2122]
4987b122L929J631m115j970L301K639k255l149J075L516q0m601j95M150O26l738
5003a358j339K803K385k359l170J551L507n37m318P54L703N66l614r67L252K018
5019B877k640k965K469L922j966l926J222L456j1l423j033L184K183l410k708
5034b769K848K822k573l031J493K926n10l208l61L042J583l762j873L272K245
5049B144k486k603J863L168p5m194j22M240R03m073j057L492J848k361k615J415
5065e13L515r43m133K57L926O6l711o56L181J075k380k692J833L683j677l909
5081c078J194L634n52l345j82K752J811k929k212K767L528k808l093K131L214
5096B832r16k965m18K726J859l639j849L390K143l370k129J892K758j411l094
$$ y = [-2122, 1807, 3438, -677, -2647, 654, 3293, 1038, -2111, -1036, 2480, 2400, -2201, -2396, 1754, 2380, -1358, -2697, 106, 2491, 132, -3038, -1487, 2020, 1483, -2835, -2081, 1622, 2188, -1426, -2393, 859, 2877, 237, -2728, -259, 3663, 1697, -2229, -1007, 2449, 2438, -985, -2018, 1166, 3349, -61, -2769, 79, 2901, 328, -2703, -1210, 1716, 1206, -2002, -2363, 679, 2262, -1500, -3373, -101, 2144, -342, -2945, -1082, 2086, 2011, -2183, -2305, 1935, 2838, -1235, -2292, 1200, 3048, 687, -1928, -513, 3002, 2059, -2074, -1817, 2109, 2175, -1536, -2192, 989, 2064, -316, -3008, -1175, 2508, 831, -3078, -1884, 1750, 1198, -2147, -2329, 423, 2234, -695, -2907, -140, 3388, 580, -2513, -382, 2832, 1916, -1049, -1467, 1259, 3118, -521, -2370, 1020, 3163, -207, -2336, -444, 2314, 903, -2191]
5111b191l95L932Q10l747j528L720J552k943k415K628K553q66l625M28M275ll903
5128a718k48L205J175k478j951K588K336j867l558J781L734j310l402LK583J642
5144B515k897k347K574K501k070l674K056L331j279l243L41L303P00k869j937
5159b995L343K304k603k278J667L218j385k988N78L082R22l964j348L791J965
5174C309l741j565K178K316j478k992N09L307O6m139m91L744J025l256j310J825
5190f93K869j851l073J348L832j053l407j11L984L14k976j580K826K368k081k759
5206b043J396L616j516l236P48K830K10l165j504L362J987k661l133K684K695
5221B270j713k865P20K923r1l204o96L185J909l431j827K899K608k027k568J112
$$ y = [-2191, -2586, 1346, 2156, -1591, -3119, 601, 2153, -790, -3205, -577, 1976, 1110, -2515, -2087, 2188, 2185, -1718, -1966, 1239, 2414, -64, -2015, 573, 2909, 1042, -2516, -735, 2999, 1689, -1713, -1710, 873, 2515, -382, -2729, -155, 2346, 276, -3398, -1342, 1989, 710, -2533, -2192, 1111, 1811, -1058, -2995, 348, 2652, 49, -2229, -562, 2656, 1271, -1717, -1139, 1943, 2865, -1099, -2447, 1344, 3309, -432, -1997, 181, 2497, 1019, -1973, -1464, 1843, 1909, -2230, -2721, 1023, 2048, -1208, -2518, -693, 2176, 325, -2748, -1400, 2432, 1379, -2028, -2139, 1845, 2159, -817, -2397, 429, 2797, 716, -2043, -647, 2969, 1453, -1783, -1035, 1795, 2005, -1160, -2664, 698, 2685, 24, -3109, -425, 2270, 557, -2308, -1588, 1335, 1244, -1960, -2656, 529, 2438, -993, -2820, 79, 2687, 660, -1908, -796]
5237g96K899m5l557k63M033N96l827j148K925J983k219k554J087L094m21l968
5253b181K0L660ql057j074K592K076k009l362K192L340j446l118P49L228j79k570
5270a147q44L014J616k818k066K328L132k177l077J300L183l23l293n72K706J837
5286B799l437k137K949K382k313k633R01K850l9k951q67L490P37l451q84L103
5302D99J753k442k246J561L150m99l648L50L861k17k929p77L005J186k326k281
5318b000J800L187j865l265P83L362n71l017l65K511J303k653k104K503K700k536
5334b27k722K132K638j137k198m94K935J297k580k088L126K254k498k594J764
5349c92K869j062k601l75L212P63l531j037K880J697k875j667J816J885p92l219
$$ y = [-796, 2103, 2058, -1499, -1762, 2271, 2867, -960, -2108, 817, 2800, 581, -1973, -886, 2208, 1787, -2181, -2161, 1499, 1491, -1566, -2640, -48, 2028, 19, -3343, -1151, 2189, 743, -2375, -1626, 1602, 1423, -1147, -1991, 1023, 2639, -179, -2245, 83, 3215, 1038, -2039, -739, 2444, 2121, -1172, -1744, 962, 2799, -638, -2775, 174, 2556, 243, -2390, -1489, 1361, 1322, -1629, -2496, 994, 1731, -1720, -2604, 499, 2252, -190, -2436, -875, 2275, 1776, -1872, -1522, 2339, 2122, -807, -1584, 1421, 2607, 281, -2000, -200, 2987, 1122, -2143, -1360, 2002, 1431, -1586, -1951, 560, 1863, -790, -2894, -391, 2309, -227, -2949, -817, 1821, 684, -1514, -2008, 927, 2224, -356, -2444, 682, 2936, 438, -2156, -392, 2477, 1415, -1186, -1561, 1651, 2414, -1117, -2154, 726, 2423, -452, -2119, -303, 1582, 790, -2429]
5365b429L02L684k0l354l14L132R46k674j755J773K516j024l023J092L093j57
5381A788l085l01L216M47j845k006J936K507j859k764J292L110j271k841J5L021
5397A360M82k558j754K645K058k353k444J933K270j240k595L46L177N36l100j111
5413b348L287J179k266j911K148K111j143k449K14L520k09l680k56L108P26k170
5429a39j974J956K013j274l003R34L575j237l003j0L162R81k878j545K403J995
5445A956j911k402J578K713n23k961Q3L033O37k682j183K660J816k417k660K208
5461e5K541j333k845P17K615o4k832j073L069J200k656k027K532J766j243k603
5477b291N35L032j95k986n79L790M77k978q86K283K089j957k014Q62K879m60l034
$$ y = [-2429, -2127, 1557, 1537, -1817, -2131, 1001, 1947, -727, -2482, -709, 1807, 783, -2240, -1148, 1945, 1788, -1297, -1598, 1618, 2065, 220, -1786, 150, 2657, 798, -1966, -674, 2436, 1165, -1676, -1661, 1360, 1842, -716, -2470, 175, 2233, -120, -2564, -631, 1639, 399, -2196, -1850, 1327, 1863, -1237, -2348, 939, 2118, -148, -2059, 89, 2200, 1057, -1392, -1178, 2342, 2133, -1547, -1803, 1305, 2031, -139, -2113, -157, 1856, 582, -2421, -1487, 2088, 851, -2152, -2162, 1000, 1981, -897, -2442, -39, 1956, 45, -2357, -779, 1934, 1411, -1550, -1467, 1566, 2203, -479, -1662, 998, 2814, 397, -2263, -55, 2486, 1153, -1692, -975, 1640, 1576, -1256, -2329, 740, 1940, -716, -2743, -211, 1555, 312, -2291, -1756, 1276, 1081, -1905, -2484, 1306, 1783, -1195, -2081, 202, 2291, 334, -1680, -818, 2061, 1601, -1433]
5494a433k3L566J36l182o78K188J516j348l051J557K882j340k810M80K589K80
5510A329k644j096K516J575k181k224K350K390j397k874J232K549j71k511o44
5525a801K791J658k854k071K559K222j821k034J047J990n44j968q40K850R95l016
5541h37j153K145J614j940j884Q74K604n17k848L5L139K17k940n03K671J397k382
5558c08j578J243K930r79l232J185K657k63k641m56K930R45k618j646K060K129
5574B358j812k948J464K353l35k457l49K588Q72k656j603K341K202k183k388J476
5590a077K496n29k609K63K651J066k874j177K609J465k289j958K139K036q26k792
5606a406l2K707Q94l097o56K372R43j987j730J388J944n79l241Q00L380m33k811
$$ y = [-1433, -1456, 2110, 2246, -936, -1614, 574, 2090, 742, -2309, -752, 2130, 790, -2020, -1540, 1049, 1329, -1315, -2411, 105, 1680, -501, -2725, -375, 2015, 618, -2256, -1024, 1525, 1354, -1157, -1801, 990, 2648, -206, -2277, 282, 2504, 683, -1351, -304, 1686, 1142, -826, -1666, 1184, 2179, -837, -1990, 155, 1769, -171, -2055, -1181, 1423, 906, -1942, -1907, 1232, 1449, -1491, -1994, 677, 2074, -308, -1886, -643, 2287, 1308, -1924, -739, 1918, 1655, -986, -1442, 1488, 2433, -185, -1831, 229, 2358, 546, -2402, -938, 1415, 1080, -1377, -1726, 862, 1734, -922, -2525, -184, 2018, -165, -2553, -1077, 1419, 890, -1719, -1456, 1195, 2261, -613, -1790, 819, 2284, -5, -1963, 176, 2212, 1386, -1406, -1438, 1269, 2163, -934, -1590, 782, 1725, -262, -1992, -604, 1340, 761, -2480, -1680, 1700, 1267, -1544]
5623a544%K282O84j834j639J864K307j535k683J219L025j011k516L70K331N53
5639A873k082j755K287K226k585j767J420K433j244k393K09K383N50k709j326
5654b480K870J456k500k154K351J906j018k368L02K906K13k782o30L029R19k431
5670d11r48J623J495q54k299P13L166q24k953K27K445L93k215j136J443J723j535
5687E3k390J267K653q16k884N69K512L64k157j232J958J956k016k035J933K383
5703B118j296k413N69K537M25k309j372K589J451k202j858K056J991j683j976
5718a373M07K417L62k945r16L018O27k468j492J957J857j198k150M61K973o43
5734H94k717l4L069O25k581q20J878J607j514k295J380K717r85k574N54K563M2
$$ y = [-1544, -1544, 738, 1422, -412, -2051, -187, 2120, 585, -2098, -879, 2146, 1135, -1381, -1011, 1320, 1873, -209, -1964, 323, 2549, -36, -1803, -383, 2050, 806, -1587, -1378, 1005, 1555, -1154, -2480, 390, 1846, -654, -2808, -457, 1449, 431, -1937, -1635, 1271, 1484, -1298, -1928, 1101, 2020, -411, -1359, 264, 1759, 905, -1394, -681, 2485, 1661, -1292, -1065, 1380, 1773, -442, -1578, -135, 1588, 53, -2337, -1070, 1583, 767, -2117, -1548, 964, 1328, -829, -2061, -103, 1853, -163, -2198, -265, 2118, 822, -1591, -1022, 1515, 1940, -369, -1741, 848, 2299, 97, -1761, 295, 2286, 603, -1373, -966, 1451, 1813, -1132, -2048, 970, 1597, -871, -2363, -406, 1451, 253, -1897, -1436, 1537, 894, -1823, -1857, 1212, 1837, -744, -1564, 314, 1921, 407, -1888, -508, 2209, 1224, -1350, -796, 1767, 1809]
5751A809k553q19J762J837j818k015J358K257j348k462L87K785j07k235p80K489
5767E47J384k640j413J937J736q48k139R43J774J16k570j11K811N94k430j161
5783a470J673J911j654j729Q96J953k39k974L03K420O21k893n21K064J160j634
5799a13j973J118K517o54k755N54K759l0k989L8K221J135j796j896J584K508j239
5816I89k415Q22K665p66k307j26K192J014k065j454J435K392j797k385O93K195
5832A082l16k088l03K191R73k523j085K341J385k059j723J188K230k70k560J94
5848a343K684K64k309n36J994R10j623j339J214K198j127k382O30K277O8k339
5864g59m25J767R52j599j470J084J912r58k577J283K256o78j890k38J830Q87j859
$$ y = [1809, -744, -1563, 199, 2036, 218, -1797, -439, 1818, 470, -1992, -1605, 1180, 1073, -1162, -1942, 547, 1931, -709, -2122, -185, 1551, 703, -1436, -493, 1281, 1397, -1173, -1284, 1527, 2121, -309, -1470, 203, 2114, 460, -1269, -373, 1580, 1341, -1633, -1330, 1090, 1711, -1182, -1703, 361, 1521, -113, -2086, -968, 1549, 895, -1860, -1306, 1453, 1423, -1566, -1528, 693, 1828, 32, -1864, -280, 2228, 989, -1426, -604, 2061, 1295, -1012, -1138, 1054, 2068, 3, -1451, -16, 2376, 579, -1806, -1113, 1082, 766, -1322, -1625, 566, 1539, -984, -2069, 272, 1657, -402, -2125, -937, 1293, 1023, -1537, -1343, 1341, 1605, -704, -1240, 754, 1664, 41, -1298, -84, 2114, 987, -1395, -765, 1512, 1580, -759, -1184, 583, 1535, -64, -1534, -450, 1462, 504, -2073, -790, 1466, 788, -1102, -1340, 490, 1377, -482]
5881d82j518K159J841j686k187J495K315p91k338J30K070R27k566p86K118J542
5897B243k362j374J358J955p20k424J98K167O00k781o64J771J468k044j171J477
5913c03J807r68k251N09K418L82k591n72K328R17k007r49J361J738r98k580J381
5930c78K488q68k499N9K296L88j979j074J699J309j497j862J051K572r56k476
5946a727M05K086M54k166q85J976J757j922j900J954J367n86k067M95K200J82
5962A623k154j064K571J060k269j379J964J235r36k189O69K422l71k747O8K139
5978F42O20k097p66J323J325q93k066R49K618q00k850P33K591k9k026n56J440
5995A58J783j447j752J072K252j428j893J023J941k88k127j003K182J337k093
$$ y = [-482, -2000, 159, 2000, 314, -1873, -378, 1937, 1146, -1192, -1062, 1008, 1935, -631, -1417, 701, 2243, -119, -1493, -135, 1820, 1100, -1324, -1126, 1041, 1641, -1140, -1804, -33, 1435, -609, -1780, -303, 1504, 536, -1715, -1206, 1212, 1594, -997, -1569, 759, 1676, -331, -1280, 81, 1819, 821, -1759, -378, 2110, 1242, -1257, -1198, 1098, 1486, -493, -1567, 132, 1441, -56, -1918, -867, 1705, 749, -1727, -1322, 764, 1218, -948, -1833, 143, 1900, -22, -1922, 32, 1399, 813, -1254, -759, 1441, 1623, -531, -1595, 976, 2036, -233, -1612, 352, 1587, 651, -1538, -869, 1553, 1182, -1565, -1497, 642, 1262, -835, -1601, -278, 1047, 154, -1912, -963, 1655, 855, -1995, -1262, 1329, 1300, -726, -1282, 158, 1941, 494, -1258, -186, 2066, 638, -1255, -232, 1709, 1421, -706, -1709, 473, 1810, -283]
6010b83j601J708J628j381j606P21J867J9k372m60J936J590k269j568K140J479
6026A548j244j882N41K261%k009k34K540M51k539o85J835J165j435j941J267J981
6043A620q22k139j11K796l31k288m75K215Q60j538j679J335J993j026k065M39
6059a216K589p81j458n9J603Q35j348j898J929J803j645j562R35J500O7j997n17
6076a220K130P39k115j375K177J354j696j702J241J493j13k147j40K260L51k511
6092a274o37K267J095j405j664J155J781k67k245M4K214M65j969p94K222O42j720
6109i0j273J063K355j011k361N14K089p8k265M0J851M67j473j284J085J921j319
6126B31k492J216K108j93k387K23K076N01j654j459J940J767j492j711J345J362
$$ y = [-283, -1884, -176, 1452, 71, -1535, -814, 1053, 1072, -1300, -1760, 176, 1766, -503, -2071, 69, 1548, 304, -1578, -1037, 1224, 1224, -785, -1019, 1521, 1972, -567, -1252, 583, 1748, 313, -1628, -361, 1620, 798, -1341, -1452, 1344, 1013, -1275, -1750, 465, 1325, -213, -1892, -557, 1436, 410, -1655, -1216, 1373, 592, -866, -925, 678, 1513, 165, -1733, 196, 1999, 354, -1208, -273, 1227, 1294, -703, -1220, 910, 1649, -466, -1841, 336, 1690, -6, -1708, -467, 1026, 913, -1234, -1374, 886, 1237, -1274, -1911, 356, 1451, 46, -1618, -463, 1318, 1051, -1194, -1150, 1064, 1529, -440, -1234, 988, 1630, -90, -1363, -300, 2055, 1044, -1317, -803, 1286, 1208, -1057, -1017, 834, 1301, -172, -1456, -371, 1550, 231, -2261, -1045, 1063, 870, -1517, -1294, 782, 1283, -371, -1830, 110, 1877, 385, -1326, 19, 1381]
6142A381k48k079J91J927M36k325l32J729Q09j866j228J303J773r55k037K83K148
6159I10n0k159m17K369N61j783r45J108J918j040k029M37K732m57k486J41K147
6176I57L89j596r82J374K109j774j701O06K374o34k306M92J456M52k070p12J595
6193B9J469j405k054J608J658p62k064OK077M83j668p80K005R67j753j409J656
6210F3J409r31j606M16K055m4k048m69K100O11j690j065J548J113j024j629M64
6227g27K148n82k285L48K066k61j662n24J437R81m72j962J034J642k98j948J94
6244h71J822J33j629p69J462J466j171j669J546J179j029j529P89J712j5k122
6260f95q40J871J201j801j451J594J448j310j243M43J600n4j884l32J955O94j974
$$ y = [1381, 1133, -946, -755, 1172, 1608, -717, -1049, 680, 1489, -377, -1605, -302, 1471, 516, -1521, -1238, 910, 860, -1299, -1716, 653, 1214, -569, -1514, -406, 1512, 472, -1557, -1120, 1612, 1155, -1331, -1190, 957, 1346, -250, -1232, 142, 2251, 477, -1224, -618, 1756, 1122, -1184, -692, 764, 1216, -854, -1566, 29, 1498, 93, -1961, -353, 1305, 543, -1521, -1515, 562, 1045, -623, -1403, 602, 1569, -184, -1593, 63, 1472, 541, -1065, -649, 1406, 1362, -686, -1155, 945, 1556, -134, -1199, 349, 1462, 438, -1191, -727, 1421, 839, -1446, -1098, 968, 707, -955, -1479, -42, 939, 467, -1495, -461, 1181, 883, -1065, -871, 951, 1084, -545, -1314, 148, 1614, 443, -1226, 320, 1499, 470, -1059, -270, 1442, 1427, -695, -1535, 336, 1537, -264, -1715, -121, 1327, 17, -1226, -783, 817, 763, -1121, -1453, 502, 1196, -778]
6277g78j011J493J815j587r94O31J675n6k133O5K265O12k605p28J667J108r54
6294D85j964R58K021j012j727L85J807o8k165j95J817Q49j398j338J164J424o91
6311C52k013J016J540k45j155m50J675Q18j556j307J537J308j017j586P65J533
6327A215l52j629n70K250N14j997j181K141R86j567j293Q33J584l32j868k21K187
6344G00P1j778k33J805O06j514j440J454J240J07k225J55K365m53j415J65J324
6361I34O47j158j854J344J748j192j697P67J782p33j636k21J899M12j697p47J335
6378f7J595j852j376J184J630p36j705L56J866L08j738j020K147J147j575j462
6394a298J021J849p38j421k73J764O06k018m55J727P08k013p41J140J119n80j791
$$ y = [-778, -1789, -296, 1519, -68, -1062, -431, 1244, 1188, -945, -880, 1385, 1997, -608, -1336, 331, 1439, 485, -1479, -521, 1500, 488, -1239, -854, 953, 885, -1280, -1475, 342, 1191, -207, -1545, -381, 1043, 352, -1661, -645, 895, 650, -505, -955, 720, 1538, -18, -1325, 212, 1520, 503, -1083, -318, 1215, 863, -766, -1336, 914, 1428, -569, -1750, 391, 1377, -190, -1483, -650, 934, 602, -1266, -1487, 700, 771, -1007, -1240, 565, 1171, -343, -1783, -329, 911, 1018, -1207, -1052, 1313, 860, -555, -390, 934, 1581, 423, -1431, -87, 1661, 469, -1228, -461, 1321, 588, -1048, -1269, 630, 1042, -655, -1402, -67, 1528, -324, -1700, -516, 1114, 378, -1327, -971, 895, 1203, -535, -1555, 592, 1739, 164, -1298, -277, 1572, 834, -587, -860, 904, 1510, -508, -963, 764, 1472, -541, -1282, -142, 977, 397, -1394]
6411a394O10J647%k076Q2J703O67j634r28J125J591j006k014J404J844p35j785
6428h99M00J485L96j827q17J541J699j548j572J187J147o24j326l60J868J78j482
6445e54r96J798R92j587j262J580J128o00j730J27K127L07k207n52K284K10j305
6462b40j066J879R14r84j611O44K099m64k211R3K167K53k010o09J295J057j273
6479f7j557J060J922p98j826K05J642K18j261r09J235J072j072j343J152J749
6495A422r63j498M65J790k65j286q28J952P62j622q75J122J266j131j248M11J365
6512H39K07j962q6J832k4j268r30J607O24j227r79O00J522m25j594K57J771K95
6530A059j689n97J666L55l63j568P33J650n80j593N26J644l7j661q74J874R01
$$ y = [-1394, -784, 863, 863, -1213, -1131, 572, 1239, -395, -1323, -198, 1393, 387, -1627, -223, 1621, 886, -899, -499, 986, 1382, -445, -1262, 279, 1978, 430, -1142, 45, 1192, 568, -758, -1118, 750, 928, -554, -1550, 248, 1240, -347, -1609, -29, 1099, 499, -1231, -1104, 1023, 1330, -877, -1429, 855, 1065, -240, -1306, 573, 1487, 503, -1108, -464, 1635, 1171, -1040, -947, 1220, 1473, -537, -1146, 149, 1206, -67, -1624, -564, 1358, 560, -1266, -1061, 581, 799, -462, -1371, -136, 936, -136, -1479, -327, 1422, 459, -1039, -574, 1216, 951, -335, -1163, 789, 1551, -71, -946, 176, 1442, 311, -937, -526, 839, 1046, -916, -1002, 830, 806, -462, -1392, 215, 839, -388, -1367, -767, 755, 330, -1264, -1007, 764, 1059, -630, -1227, 439, 794, 431, -1137, -404, 1246, 666, -927, -401, 1243, 1206, -455, -1329, 545, 1446]
6547A446j576j135J032J491j287j377N58J874l69j460l95J312J279j869j125J080
6563e21J743j192j223Q10J258k25j260m36K066M23j891o14J648N70p75j228O55
6580a92J306n22j547J53J948p0j856o77J737N77o80j339N08J748m73j876L75J389
6598E09j10j199k36J653K39p11j317J176J624j300j501O49J659k23j580R2R82
6615D06P30j370p27P87J457q65j712R00J341l46j594L58J247O3j335r12J443J293
6633A164j671p97J020J289n38j671L12J700K30j425o70J941M53j315p86O15J912
6650A763r38j710P1J899J9j651o42J780M25j316p79R44Q99m74j450O03J579n01
6668E21j459m22J848L69j151j124J422J435j398j396J343J725j254j307O5J678
$$ y = [1446, -130, -1265, -233, 1258, -29, -1406, -848, 1026, 657, -803, -1198, 114, 1393, -476, -1601, -521, 1222, 30, -1193, -383, 875, 650, -610, -1046, 1020, 1443, -448, -1062, 586, 1156, 381, -847, -192, 1114, 592, -955, -802, 1146, 1076, -780, -1457, 280, 857, 177, -1162, -654, 1094, 621, -1255, -880, 509, 399, -800, -1036, 617, 856, 145, -1172, 4, 1628, 328, -1173, -524, 1135, 912, -668, -576, 406, 1136, -234, -961, -174, 1283, 418, -1294, -394, 947, 601, -993, -635, 612, 675, -660, -1572, -129, 1164, -507, -1304, -284, 1005, 467, -1204, -892, 808, 1038, -387, -1057, 884, 1337, 22, -764, -149, 1763, 825, -885, -814, 1085, 1104, -547, -1189, 591, 1016, -300, -1079, -135, 764, 290, -1160, -557, 1022, 521, -938, -1360, 488, 857, -294, -1418, 4, 1439, 41, -1355, -12, 1713, 459, -848, -783, 895]
6684H95L53j805n61J479J168j220j596J422Q19m88j386K38J578n5j482p43J764
6701C80O09j492p81J247J018o51j376K68J523K7j638j55J744M76j338r38J456
6718C79Q85r75j262N66J574%j778k34J773k13j139n91Q08J280j162j471J065J610
6736A115o72j741K36J329N97j483o70J421P07q98j020J247P21k57j512L25J774
6753A219p08j121l04J632M83j569q42J435R36j111q40L41J182p6j901J21J685
6770E62M23j774k76R19Q99p54j203N29J523k46j616N8J832L46j755n05J357Q00
6788A119q69j167Q18J174k16j744O04J168K80j654n47J355J005j389j401J300
6804a64R40n33j676O99J480j32j568K9J139N88j159r46J405J013j046q70O21J236
$$ y = [895, 1248, -557, -1118, 361, 1529, 309, -1287, 135, 954, 466, -920, -682, 896, 841, -641, -1384, 380, 989, -503, -1284, -37, 981, 330, -1046, -778, 745, 772, -866, -1021, 723, 1199, -139, -1077, 379, 1264, 289, -973, -407, 1167, 1167, -611, -845, 928, 715, -424, -1015, -207, 1073, -89, -1560, -495, 1115, 443, -1298, -1062, 267, 864, -619, -1289, 132, 839, -59, -1079, 168, 889, 632, -880, -555, 1219, 511, -610, -914, 718, 1201, -368, -1210, 225, 1161, 50, -790, -449, 733, 657, -1244, -1123, 562, 985, -789, -1065, -146, 753, -1, -1204, -675, 848, 602, -1014, -956, 876, 1222, -533, -1038, 319, 1119, 250, -917, -99, 1075, 859, -885, -281, 887, 1167, -487, -1034, 321, 1326, -63, -1464, -164, 776, 243, -1433, -734, 746, 614, -954, -925, 214, 802, -357, -1303, 102, 1115, 69, -801, -180, 1056]
6822A056m54j323m47K266Q8j682o94J329J282j282r62P18J277n79j482L44J292
6839G47K69j886j04J067Q94j049j310J052J389j063q98K64J871o61j341R3P94
6856A28J050j437q19J368J430j343j276N74J442l1j586q8J158O36j372j114J339
6873E9J056j091j035J002P63n13j363L01J356J40j737r6J244O53q80o80N27J052
6891G58r5j388K06J296K31j610p7J495O54j598p00J136J123q80j445L75J460l23
6909F18j449l41J717K27j167q38J071Q07o21j283O99J291k12j465L7J350K92j406
6927f73j63J114R91j263j168J079J176o03j320L81J223K33j495j36J010N23j177
6944b68o46Q11Q06l25j343J15J445M10j995l1J448R6r94p93J222O95n07j204M66
$$ y = [1056, 602, -721, -1168, 1098, 1186, -496, -1190, 139, 1421, 139, -823, -105, 1172, 593, -889, -545, 747, 1016, -870, -974, 93, 987, -62, -1372, -320, 1069, 6, -892, -628, 1243, 582, -759, -666, 128, 1178, -259, -1078, 290, 1720, 377, -899, -325, 1117, 1086, -500, -588, 570, 1206, -166, -1280, 59, 1115, 24, -1011, -9, 754, 241, -1122, -821, 535, 675, -1062, -1158, 86, 739, -141, -821, -294, 758, 663, -725, -519, 777, 1008, -602, -679, 816, 1470, -128, -828, 308, 1431, 551, -894, -519, 941, 618, -831, -1172, 545, 772, -395, -1233, -162, 645, 24, -1259, -560, 731, 519, -946, -909, 441, 733, -673, -836, 278, 1269, 6, -1162, -83, 1093, 490, -830, -449, 774, 1007, -488, -624, 386, 909, -268, -914, -103, 703, 378, -965, -850, 595, 1005, -990, -1021, 427, 523, -471, -1264, -42, 653, 146, -1058, -592]
6963e92J772o89j380L10J301L93j537l93J261O16q62j217P56J435n01j595N60
6980c62Q40R1q40n78J090J030j291q84P39J116p89j001j01J563j32j170m23J437
6998C35L15p91r33R97J428r14j223J17J538k12j306p2J207O98j349o81R85P34
7016H73p75q16K75J500l42j727N1J409O6j178l20Q92R17r22j158J040R21qj694
7035i96J98J528M20j581m05J171R02j407o81Q88R87o00r79K08J485m17j035m93
7053h07J186N10j231p42J183Q65o57j356P31J141k43j280m16J374K67j134o18
7070a227J253J093j376n77O63R48j76j061M6J437J40j807n09J517N04n43j521
7087a196P93J354r74p75J87J215K68j649J05J270K15q52j127P60J403p58j544
$$ y = [-592, 1180, 491, -889, -579, 722, 1115, -422, -815, 446, 1062, 200, -1017, -261, 1174, 673, -922, -362, 478, 569, -271, -849, 241, 1271, -20, -904, -165, 951, 162, -839, -940, 623, 491, -679, -1102, 335, 650, -141, -1074, -77, 1351, 437, -786, -669, 869, 657, -649, -721, 486, 1184, -165, -846, 139, 873, 98, -718, -443, 1057, 715, -1012, -961, 448, 514, -664, -984, -92, 825, -97, -1255, -215, 706, 698, -996, -798, 730, 1150, -431, -836, 335, 1237, -170, -851, 37, 1024, 424, -555, -347, 1138, 721, -314, -807, 379, 889, -342, -1084, 99, 964, 307, -1049, -318, 823, 580, -700, -1116, 258, 525, -609, -1227, 26, 1119, -257, -834, -171, 777, 601, -460, -414, 1023, 1163, -644, -1153, 364, 868, 325, -1196, -403, 951, -23, -798, -611, 604, 872, -777, -672, 598, 813, -39, -1166, -406, 997, 239, -1305]
7104a305P64J379m26q03m84J098P56j203k52M85Q39q15q96O08J236l1j478q9J303
7123F86M15j256j012J427N16q32r19P22J087m08j290N8J606j77j670J29R96O14
7141F92r30o92Q64Q14p1j488J98J976o70j354K20J013L20n23j176J044R16n31
7159F22j702Q72J192l71j320J00R32M30j195l58M85R59q02j165J071O45k18q76
7177f99L20J166j58j161l44J143Q51j191q51J051Q89m17j049LJ197J7j232k71
7195g36J039O13j176m48N04J310r24j038P3J517j06j412J89P78L12n45p52R73
7213A71O39q62j081P02J547k56j275j68J269K25j201k1O71R94j184r44O35J076
7231I37m98j188J65J437L9j492l46Q75J013j293r75R75Q76m44p02K9Q23L50j237
$$ y = [-1305, -541, 838, 412, -391, -875, 223, 979, -224, -476, 9, 848, 33, -863, -255, 981, 950, -528, -617, 686, 1101, -155, -1167, 260, 776, -56, -975, -253, 834, 426, -864, -806, 800, 623, -1047, -918, 78, 692, -238, -930, -66, 748, 677, -811, -613, 1363, 693, -661, -441, 572, 892, 369, -807, 237, 1153, 622, -1080, -208, 984, 613, -707, -607, 325, 755, -440, -798, -313, 646, -156, -1321, -250, 395, 177, -699, -379, 787, 629, -532, -876, 267, 1118, -73, -924, 127, 1016, 599, -450, -447, 750, 767, -465, -736, 303, 916, -260, -708, -204, 1106, 182, -856, -783, 734, 628, -784, -595, 183, 495, -50, -802, 171, 810, -52, -1133, -431, 1116, 860, -415, -583, 686, 911, -290, -311, 360, 1354, 170, -774, -139, 937, 439, -749, -584, 853, 892, -600, -946, -71, 942, -351, -1326, -351, 525, 81, -621, -592, 231, 581, -656]
7250f56k31J264N22j258o46J146P30o89q18L57J204j64j714M04J221J52j105n90
7268h71Q30O90m34j078K53J286n53j176O49R34P4j216p41J363O83o37j384J045
7286b83J174n56j045R5J365j41p30q19J037J037j172n33P35P77k74j227J51J029
7304F20j03r97n52J226M69j172n45J448L93o88j297P10J095m9j279r6J221L09
7322G13r92m28O46P33p99p75P25P08r7j360L43J365J07j056l17P88P46j058q36
7341h44O13J197o36j223O03P80Q6j359K1R78L49o85q30J107M83o04r17M97J287
7360I03m92p30j11O17J004j415p02J317N15m57j111O67R56n16q87r6J314N5j501
7379f70k10J223L17o33p95L05J087k84j199L20J203k18j146j72J140M97o09p69
$$ y = [-656, -887, 377, 899, -359, -1005, 141, 871, 182, -636, -279, 925, 761, -953, -549, 672, 824, -281, -871, -41, 649, 215, -863, -610, 676, 123, -1053, -404, 530, 604, -612, -1353, 10, 693, 56, -1328, -283, 891, 335, -710, -615, 750, 609, -121, -940, 97, 1134, -38, -571, 164, 941, 667, -560, -409, 620, 517, -480, -1032, 194, 663, -509, -1054, 394, 787, 99, -1198, -488, 607, 558, -721, -817, 404, 713, -279, -707, -61, 672, -127, -902, -177, 531, 434, -926, -583, 782, 889, -167, -484, 304, 1050, -8, -844, -231, 966, 330, -893, -290, 490, 576, -783, -762, 216, 565, -120, -950, 157, 640, 36, -881, -384, 903, 411, -319, -430, 187, 1191, -224, -926, 391, 906, 449, -662, 5, 961, 445, -442, -538, 776, 831, -670, -880, 343, 660, 27, -768, -463, 624, 340, -859, -539, 664, 446, -700, -872, 268, 765, 156, -613]
7397f13N10Q32l53j166P20J160n04q74j34P19N73r57n90Q52N95m72j033M84J121
7416H70j99j227j3Q87K43j111o11J064J149r34j133R59Q53l50j136L99O53M68
7434H31j256n54J250N48r09n26P37N92j71j488M80J395k14j102k61Q20M86o89
7452c1o75O56P17m81j162N96Q14j68j004r4R79M04j053k53R17Q01r08q15N98J165
7472A003q07q06K39P68M30n89j033J396O23j260r99R57Q25p24o65J48Q11L60j121
7491d44m11Q64O95j052m81P45R29n66r95J95J062Lj388Q5J388J95p97p12O56R84
7511I55p82o26K70J085k23j085j24J230k31o41n02O16Q18n53j026N52R95o01p34
7530f07R3R66m7j005l42J049N91j246l03P80O70m22p28K97Q20M31j082q32J301
$$ y = [-613, -103, 729, 376, -790, -70, 1090, 586, -288, -422, 297, 870, -87, -677, 175, 770, 298, -735, -251, 870, 671, -556, -569, 318, 561, -550, -1161, -97, 1052, 118, -1015, -56, 797, 447, -689, -290, 363, 831, -425, -979, 271, 819, -90, -616, 121, 713, 542, -946, -466, 929, 715, -387, -648, 172, 658, -31, -706, -50, 667, 186, -976, -380, 434, 266, -738, -832, 147, 551, -502, -755, 162, 963, 55, -760, -162, 1003, 196, -610, -371, 397, 827, 238, -795, 601, 1224, -36, -1035, -78, 747, 23, -642, -494, 317, 677, -444, -855, 9, 704, -348, -829, -84, 845, 279, -716, -521, 541, 544, -844, -759, 629, 824, 27, -685, -29, 955, 173, -453, -183, 902, 679, -406, -530, 700, 469, -172, -674, -58, 760, 207, -819, -267, 728, 127, -607, -514, 452, 405, -600, -942, 107, 698, -548, -851, -71, 599, 177, -551, -254, 566, 997, -85, -917, 384]
7549C84R18j523j18N49N60p44o41K42R25r1j107l46J117M96q56m01K11J189p16
7568D8q59K89R73k43r65O6J205K10j168j75P52N57q09m31M86R86j28j174j52J439
7588I07O0p99r08O83O96p39m91K28J181n91q61K48Q55J39j240o7Q17L84o22q88
7608a008R30O59l02q06L23J142o01r04q2J336l8q61l89Q02P62p41o85K86Q78l1
7628F70j287J29J071K45r51p11Q11P78n56p68Q2J222o21j017L52J101J70j095
7646c75o04J140O29n18r82L55J226n87r28N05P54l24m11j87R37K41q35j016R74
7665fR17o83j067M95Q72k62j031J57P40N60j356m29R95N89n37o29K56P04k0j014
7685g49L58R09j79n42l05J043k3n61o06O84P96m72q82L64P70j9r77m20R86M75
$$ y = [384, 1302, -221, -339, 210, 770, 26, -615, -373, 552, 461, -646, -992, 125, 621, -235, -636, -425, 764, 48, -811, -522, 451, 208, -757, -691, 514, 724, -444, -619, 133, 690, -119, -550, -64, 922, 794, -380, -532, 907, 967, 168, -740, -57, 639, -100, -591, -363, 818, 227, -634, -386, 469, 608, -632, -699, 118, 502, -120, -1008, -78, 581, 279, -527, -204, 938, 337, -567, -649, 687, 649, -212, -601, 201, 963, 222, -463, -177, 701, 670, -617, -488, 583, 828, -123, -834, -23, 755, 199, -569, -487, 735, 114, -903, -551, 550, 720, -375, -979, 161, 790, 272, -710, -355, 871, 284, -644, -139, 615, 291, -120, -307, 630, 871, 36, -980, -6, 911, 228, -839, -344, 528, 266, -765, -608, 132, 692, -664, -1093, -98, 491, -46, -675, -419, 285, 265, -749, -391, 518, 339, -203, -508, 535, 512, -49, -655, 29, 825, 353, -529, -165, 605, 586, -391, -811, 175, 650]
7705F50o38l93J84Q91o95q29N05R74j26j226K2P38M76o36r05J289Q66q96p95P98
7725B54N94j59j140O8P85k8r30M7J220K07p56j092P04Q12l20n84j2O39K77j203
7745f17q8Q60L68p85m46M85O71m22r04L90J053L6j313K03R24P1p31j84N42Q37
7765I50n35j178P58R82j136j49J92M71K90q27k19M22P64j004n16O25M85o7j103
7784g95N38O44K33j107m92J195K32p00n42R96M90n57m90K68N64J98p75n13J011
7803C98M97j045k17N57N16n40l44n0M43K18r24k15J102k19o27l93R11M40n08q17
7823h17K91J251p7j154J23O88M59j250l3P69L28k77q72M91J048q09n85l6J075
7842F13L8j135M8N70M72p53o42O18P72o24m52R7Q02Q1j004j76P50K82p82l37R53
$$ y = [650, 12, -381, -197, 694, -1, -830, -325, 649, 523, -703, -681, 57, 533, -103, -1008, 281, 1147, 251, -544, 254, 848, 689, -451, -383, 402, 374, -556, -509, 711, 918, 162, -930, -226, 586, 266, -318, -330, 309, 586, -617, -705, 155, 523, -262, -708, -223, 448, 26, -878, -488, 565, 601, -712, -509, 415, 486, -245, -429, 113, 950, 415, -763, -5, 977, -159, -308, -116, 355, 645, -182, -401, 21, 785, -219, -735, -110, 375, 308, -795, -257, 387, 620, -487, -979, 216, 448, -252, -794, 202, 692, 135, -355, -87, 477, 675, -100, -613, 398, 895, -150, -367, 190, 706, 166, -178, -228, 215, 433, -491, -706, 396, 177, -450, -843, 68, 508, 0, -817, -526, 725, 648, -506, -383, 305, 764, -486, -519, 250, 578, 301, -571, -80, 968, 159, -426, -462, 613, 651, -484, -436, 134, 606, -147, -789, -171, 601, -23, -475, -378, 424, 505, -499, -675, 75, 357, -425, -762, 191]
7863A91M32m32r49Q32N97J55j203k13Q58L23r17j20M91N10m28n86Q4R63l66n57
7883c35k78R15O3o93K8K54R66r76p73O29O58l79m13n3P89l42j89m64P84L00o94
7904b03l26N65P87n73p62N39L99L33q10k83N24L98n39o90P49N60n01n24K71M65
7924C79r8q14j07Q67K93r17k68Q13L30p46j03R2O83l49o69J42P55K07p73k22Q43
7945C38K3m51n00P63N31m54p59O6J056l52p74M1N29N56r31m80P98O83n39r69L55
7966d70N87J41j020K16L80M55l73n49O67O57o57o26L16Q31j11q63P2R09m5o88
7986a71j31L56N06n60m44M80L41r5m82k96J025m98o07N7J002J11o23p35N44R44
8006G24l46j005J19J068j16n98l07O20J80j81p40P47O19n66p37K58R19M7j296
$$ y = [191, 623, 191, -758, 74, 671, 826, -377, -590, 268, 591, -326, -446, 45, 555, 127, -459, -375, 588, 222, -335, -613, 302, 365, -328, -300, -46, 920, -56, -829, -200, 458, 79, -334, -387, 402, 60, -129, -593, 191, 491, -203, -529, 36, 823, 250, -512, 27, 426, 759, -51, -334, 190, 588, 49, -641, 108, 668, 167, -357, -86, 379, 281, -533, -640, 227, 520, -397, -665, 148, 478, -268, -371, -279, 404, 55, -614, -472, 283, 490, -283, -505, 338, 361, -90, -590, 173, 704, 250, -509, -443, 613, 261, -513, -472, 57, 613, -318, -798, 0, 683, 144, -825, -470, 117, 258, -762, -546, -166, 289, -84, -633, 34, 691, 34, -592, -276, 555, 444, -419, -347, 562, 517, -171, -302, 54, 560, 0, -444, 36, 377, 282, -200, -496, 529, 31, -576, -519, 483, 594, -29, -764, -220, 724, 378, -627, -508, 560, 444, -154, -461, 159, 339, 158, -582, 165, 784, 218, -519, -261, 658, 705, -591]
8025e91K65K54N88o29p06N38P39m76m55L27O18l03p65L6Q25L71r47j07O27N28
8045G37n92o38L66R63o97m24k24J214l41p47p4Q34n9j54o51L69Q64m73p34J16
8065c45O83p8q02m0J141k84p10k05N37O07l68o28j40J068p1j168M73R75j48m81
8085A6m45P90N67q56m54M47M47q0j008K77N92J03p00r1O61M98p96l77M02O50n75
8106F8n03M4P04J99r31j15Q82M80j025m22P32K87m9n96l07J108n24k11J55N27
8126E03J9n21n92O62N96m01p67L93P99m01p87K78O29L6o82l18M39O88p00m64M54
8147a37P08m15p63L81M69J99q06K06K03M44m07m85M39P31l08j286N76P53j90o01
8167b89r2N91O06j241j73M36Q93l75j018J72P38k99m27j75P71M30r42k41R43R6
$$ y = [-591, -326, -72, 516, -113, -819, -281, 458, -18, -473, -146, 472, 169, -596, -560, 265, 636, -311, -418, 209, 737, 145, -493, -127, 836, 139, -285, -509, 705, 364, -383, -457, 377, 318, 164, -487, -118, 746, 273, -461, -345, 338, 260, -542, -582, 559, 275, -435, -640, -103, 504, 136, -492, -632, 436, 365, -803, -330, 645, 497, 16, -429, 361, 928, 72, -382, 65, 512, 432, -576, -299, 293, 396, -304, -395, 266, 764, -32, -409, -7, 643, 68, -435, -391, 313, 512, -419, -534, 348, 828, -197, -619, 113, 400, 351, -245, -552, 556, 32, -179, -24, 503, 522, 1, -591, 71, 667, 266, -501, -108, 691, 290, -497, -219, 410, 446, -236, -554, -115, 573, -127, -591, -137, 571, 156, -607, -226, 243, 442, -364, -158, 45, 489, 82, -403, 36, 767, 459, -827, -251, 502, 312, -289, -381, 210, 816, -425, -598, -162, 731, 356, -662, -490, 248, -51, -478, -653, 118, 548, -394, -635, 308, 404]
8187D04m45l47n9Q55
$$ y = [404, -41, -388, -447, 408]
8191D08
$$ Imaginary data points
##PAGE= N=2
##DATA TABLE= (X++(I..I)), XYDATA
0@%%%%%%%Qj6J6j6J6k4L2l3M1n3O1p2Q8j01J17j36J52j75K04k31K61k96L33l73
31a97M18m70N26n87O54p27Q09q97R93j100J218j348J493j655J838k042K275k547
49a346K861l232L682m236M938n865P144r030J2094j7887L2502j32172k77918L01255
63h7210K13560j79445j61425J31332R7671o6464m5347O2163L6666j3423j5079
74b7001J1595N4316J03895R378j42499q5205R1454M0275p7164K4003R1732q1641
86A3138j24045P3222J04424q4976j13905M0972J04582L4098j8972k2690j4147
97h299L592J5351r798j4146N1933N0735p6418q9532P4951R8586p2275j11308J6931
110f9697O4763K2581K978m661j034O241m4183o4408N7894J33070j5665j49753
$$ y = [0, 0, 0, 0, 0, 0, 0, 0, 8, -8, 8, -8, 8, -16, 16, -17, 24, -29, 32, -40, 48, -53, 64, -72, 80, -95, 109, -122, 139, -157, 176, -197, 221, -249, 277, -310, 344, -383, 426, -471, 522, -578, 640, -708, 785, -870, 968, -1074, 1201, -1346, 1515, -1717, 1965, -2271, 2667, -3198, 3946, -5084, 7010, -10877, 21625, -110547, -388465, -87210, 126350, -53095, -214520, -83188, 14483, -51981, -97328, -35165, 1501, -11922, -27001, -15406, 38910, 142805, 152183, 9684, -75521, 15933, 56208, -20956, 3047, 94779, 13138, -110907, -37685, 66739, -18237, -132142, -91170, 13412, 47510, 28538, 5848, -8299, -4707, 10644, 846, -13300, 38633, 89368, 12950, -76582, -1631, 96955, 24680, -86628, -69697, -4934, 17647, 20625, 15964, 14930, 21171, -23012, -87420, -29526, 103544, 87879, -61874]
122f1874j3990J54275L2384j62591n6833J38156L7716j25547o775J33181J2453
133H0555j15638m9378M5590O1959K9009m3100o2505L2766P4885k4349o6908K4907
145a2207M0883p0007n9175J08272J07250j03958j27905Q2157J04917p0896o3006
156f3675P7984M9804m9591k4243L1173K4517K083l9204n9972K1953J04857K3416
168I9102j12051p0858P3915N9386p1185m8433P1298K8094p5932j3653P5136K3118
180C7937l9536l0872j3485K7177O5124L512n9897K939N2509k5354o5027L4192
192a0781P8988l4933r4738L0467J07565j6712j01707k776N8384n645k4882J6897
204A27J8612K03k0922n0662R43Q5914K3373r9905m6758R1370O0241o8316n1638
$$ y = [-61874, -75864, 78411, 110795, -51796, -108629, 29527, 67243, -58304, -65079, 68102, 80555, -35083, -84461, -38871, 23088, 52097, 8997, -53508, -20742, 54143, 29794, -37114, -12207, 28676, -41331, -100506, 7766, 115016, 11058, -116847, -34690, 70227, -669, -63675, 14309, 64113, 14522, -9721, 21452, 45969, 48052, 8848, -51124, -29171, 75686, 99102, -12949, -83807, -9892, 49494, -21691, -70124, 1174, 29268, -46664, -60317, 14819, 37937, -1599, -32471, -45956, -18779, 46345, 49857, -10040, -7101, 45408, 20054, -44973, -10781, 68207, 33274, -61464, -30997, 76568, 59856, -41851, -44627, 13757, 8112, -16770, 127, 18739, 18942, -1980, -52642, -51699, 34215, 57588, -42317, -89075, 2295, 62536, -5780, -57418]
217e7418O0718L6040p4565l2540R5737N7730o7561n7823K5231M0336J6934j7526
229B5293m4326L308N4025m687n1107J9919M5795m9713p5792L9912R9423n827r7287
242d1064k3364P0296K3189m5502r859K8291L290j4897q860R287M1045R196p2461
255c1413l7132Q0600N8416o0302n5904M1558M2031l4237l3224L5906L3288m4600
267e013m1769M3278N4669j8765n2867k3275K6032M7606n017n4119R294O1893k5933
280A6014p7883K7182R0411j1493r0468j3449P6859L6344n2065m1201K7105K5334
292A2690j6789j2084J3911K0517K701l5885k7755N2167N4813n2186o3570M4957
304f513O0006k9750m0839K7237K9416l8383m7195L1679O6797q506p0469k7871
$$ y = [-57418, 3300, 39340, -35225, -67765, 27972, 85702, 18141, -39682, -14451, 25885, 42819, 25293, -19033, -15725, 38300, 33613, -17494, 2425, 48220, -1493, -77285, -37373, 62050, 56223, -41064, -64428, 5868, 29057, -16445, -26304, 1987, 5277, -9620, -18480, -9193, 31852, 41048, -31413, -68545, 12055, 70471, 10169, -45735, -4177, 37854, 3617, -29607, 6299, 39587, -5013, -46782, -3504, 51165, 32400, -20467, -43742, -17710, 29896, 24879, -29240, -19946, 41947, 16014, -61869, -34687, 55724, 44231, -46237, -59686, 17173, 53517, 1452, -39749, -12644, 12690, -4099, -16183, -2272, 18245, 20946, -14939, -42694, 9473, 64286, 12100, -51470, -6513, 53493, 23743, -17096, 10141, 39557, 1174, -46021, -14342, 52455, 43949, -26520, -54391]
316e4391L6875L7828o642m3261j4700M3672J6826m6408j969O2264k520p3970n461
329e1857P7435L4775n0513m4623K8142M4374j5270l5255J5688K7963j8596l6240
341b3977O758M8376K2367n9391o4130M2877P8424k3134o8741J2120M9195r841
353A0903m0819L685M1338Q857m3593k0535M5175L5469l0898m0717Q440L6456Q704
366B2465k9571q533L9442N430n4510q124O5687J9132o0867l5579L9651M7292j1289
379C0626m7249n650L8162J989m0823l525M5247J6458m2976m2446K5245N8954r616
392B4396o3921p81N4155K969l6834N480L1213o389l6333p005M8561L8712l8749
405A5474n6439K0172N6552J368m2326j2948L0838J5302l5070j8934M8309K8162
$$ y = [-54391, -17516, 20312, 13670, -29591, -44291, -619, 16207, -30201, -32170, 30094, 27574, -46396, -51857, 25578, 60353, 9840, -34783, -6641, 37733, 22463, -12792, 2896, 30859, 12263, -23977, -17219, 31157, 53524, -5867, -69997, -27120, 51304, 28170, -40571, -28451, 20744, 10903, -29916, -26231, 15107, 23964, -19629, -40164, 5011, 40480, 9582, -31135, -22695, 13761, 22465, -7106, -15639, 23803, 29233, -25277, -33401, 32286, 51418, -9449, -45028, -5377, 41915, 30626, -16623, -22273, 15889, 17878, -22945, -26470, 18777, 35235, -7741, -50187, -24942, 34012, 24396, -39525, -40306, 13849, 16818, -20016, -14536, 16677, 10288, -26045, -33050, 15511, 54223, 15474, -40965, -20793, 35759, 37127, -5199, -18147, 12691, 27993, -7077, -26011, 22298, 50460]
417E0460n8820m9638M0936N5104j2667m6441j1127L1674J6695k7679j3946L1501
429F052J0105l8410j3227M2128L3316k8577n2762O220O0688J2783n1462j1491
441b4637M5964Q251m2696j0834M0460K7847l3263m9232J8983N9798j025n5929
453a6313j4652L4335J3884k3898j6652K2320K4271k8236l9082K6669M9187j9852
465A1981n0759O385M8077J2870l3962j9047L1721K0651l8706k4313M7647L8206
477E0751l7194m8754J2180M9053J3472m2919l0283L2326L0639k7432k3155K9100
489G784K2985l0395l7376J8509N2449R25n8064j6949M9413J9432l6979j7376K4363
502a279J2354k2040j8720K5199L9449j8607n9531J156O1684K1624m1878k8186
$$ y = [50460, -8360, -57998, -17062, 38042, 25375, -21066, -32193, -519, 16176, -11503, -25449, 6052, 16157, -22253, -35480, 6648, 39964, 11387, -41375, -35155, 25533, 38316, -13146, -24637, 21327, 29578, -13118, -23952, 16508, 44355, 11092, -38140, -19157, 40641, 39616, -16313, -30965, 3370, 17254, -6644, -23296, -976, 23295, -4941, -44023, -17354, 31833, 11981, -38778, -32393, 15684, 28554, -5408, -24455, 7266, 27917, -10789, -35102, 12545, 50751, 13557, -35197, -23017, 26036, 39508, -3411, -33694, -1368, 29271, 1839, -21316, 7784, 30769, 374, -37002, -18493, 33956, 34881, -23183, -40132, 9281, 28713, -8266, -25642, -1279, 11075, -10965, -29685, -4486, 34963, 16356, -43175, -42019, 19665, 41289, -589, -28775]
514b8775K6437L1527j7461l1115K2419L7067k7871m5868K1852N0918l271m6427
526a0568k2305K8525L2191k0986l5107J8051L1361k3376l6171K0534M1645q670
538A5124m9642j1488N2892L1148m0445l2583L0984K6705k1014j9390K0741L0582
550C3614o932m1700p340M9069K2012m7739l2061L4187L0470k3266l2307J3512
562h481K9378j7355m3565J1492N0577j880m7771j1989L5676K7308j5099l2786
574b4495M354L7500j000l4734J1629M2519j1449n0788l730M9497K2508l9940l5308
587c3437K6618L4336k0285k9252J6087K4344j1591k5798J302L7462K0779m2536
599a971m2377L6019N0865k3609m6845J0276L5159o770l2892L385L4589l546m3989
$$ y = [-28775, -2338, 29189, 11728, -19387, 3032, 40099, 12228, -33640, -11788, 39130, 35859, -10568, -32873, -4348, 27843, 6857, -28250, -10199, 21162, -2214, -38385, -17851, 23794, 15124, -34518, -46006, 6886, 38034, -2411, -34994, -4010, 22695, 1681, -17709, 3032, 33614, 26682, -15018, -22358, 26711, 48723, 984, -31077, 3110, 33580, 10314, -21993, -8481, 20897, 3542, -40023, -28531, 22046, 20166, -27605, -39594, -3918, 23390, 8291, -24495, -20141, 17359, 16359, -18375, -6746, 35773, 24324, -26464, -30194, 19303, 41811, 1871, -33437, -6819, 27517, 7232, -22020, -5933, 18411, 6820, -18978, -17676, 19786, 40565, -1971, -44348, -8329, 42536, 18927, -27918, -17642, 17517, 10747, -22145, -18760, 15829, 12283, -31706]
612c1706n293M5406K0348k7759k6041R661K9775M875k8646l578L9308M942m7981
625a6689p976N1742J7233m8561l4223L1550M1286j5869m2101N302L2931n572k8519
638a9466K007K7163J0821k4600k7761K0176M2470j3516m7824P354M0594o609l2516
651b1707Q080L2652l976l9817q903M4217K6224l5058l1983K3925L5838l119l1651
664e278r845L0037J7692l4007k1080L9720K3726m5269l5597K9984L5659j6291
676I451l7007r47K9127N266k4924q41K5924J708k6315p917L0395L1791j7495m6129
690b7913O511N4164K244m9801l934M2681M221l7531j0326L0918J8818k9010l3172
703c2130J7780L9478k701l4848j1426K2593J8085j7919k2173K0909K5676k9728
$$ y = [-31706, -36999, 8407, 28755, 996, -25045, -15384, 14391, 19266, -9380, -12958, 26350, 31292, -16689, -24665, 27077, 44310, -4251, -38474, -6924, 34362, 18493, -23608, -18306, 14625, 9053, -19466, -17459, 9704, 20525, -4075, -31836, -11660, 30810, 17294, -30530, -23176, 17418, 10809, -21707, -13627, 19025, 15049, -24768, -33671, 10546, 36770, 1712, -30271, -6346, 29492, 26373, -5278, -15123, 14914, 32606, -1401, -22481, 17239, 40965, -4304, -39901, -9917, 25742, 9451, -27556, -28503, 624, 5890, -19034, -19875, 6049, 7757, -18558, -26475, 3920, 35711, 18216, -27913, -21402, 32762, 35006, -14795, -18729, 23952, 28173, -9358, -19684, 11234, 30052, 1042, -32130, -14350, 25128, 22427, -12421, -23847, -1254, 16831, -1088, -23261, -2352, 23324, -6404]
715f404l1987L4391L7567l0193m0279J5921L6962K89k8195n845K8673J2237k7753
728d616j6545K7409K8667j5701l8695m12M5588J5859m7542k6560L8493J8867l4523
741i711j2477K9611J0524k8175k1133J8144L1644m953l2944m219L1368J1930k1387
754a778j4559J9334K0643k2825l2355K6204M6072k3049n4675J0923M8291P27l6066
767a3113j1540K3562J9784j4318k0029J4650K4374j3112k8544Q202L5510O932
779C2358l7237k0943L1761K5244l2643k6258K9331J7847l1186k0773K4317K5386
791A7204j3237l4055l857L7808K1240k8383k3402K2688K8195j1885k7051J0111
803d624L5281m930m1907J802M5806L208m2534j2549K6370J2216j6532j6848Q309
$$ y = [-6404, -38391, -4000, 33567, 3374, -36905, -20984, 15978, 16267, -11928, -17773, 10900, 23137, -4616, -21161, 6248, 34915, 19214, -19481, -19893, 25695, 41554, -5988, -32548, 5945, 24812, -9711, -22188, 7423, 17947, -10228, -31361, -13217, 18427, 13474, -19470, -23689, 7679, 19609, -1778, -16337, 2997, 23640, 815, -31540, -5336, 40736, 17687, -36988, -26065, 22226, 22953, -13113, -24653, -1091, 18693, 4375, -15654, -1004, 23370, 10258, -18286, -10084, 25426, 32358, -4879, -25822, 5939, 31183, -1460, -27718, 1613, 19460, -11726, -32499, -8182, 17204, 3967, -30088, -33945, 3863, 25103, -3280, -26682, -3994, 24201, 12316, -14735, -4624, 30657, 25727, -16180, -14378, 31428, 34636, -7898, -20447, 5923, 18139, 1607, -15241, -6932]
816f932J9392j0329l0333O950L6107N62l7649j2683L5302K6926k6265l2748K3735
829g965L4018k1301k9681K3161L0117j4130k9545j49K7926J7570k3226k9068J5711
842f562L1538r988k9168O824K6285o992l4131R75M2884Q049m6881j7417L8824
855D240J8960k7384j7832J4215J6407n067j8915K36K7810O278l4075j4421L5084
868E536K5516k4631l1379J5378L5693q705l5545Q764L4101r635l3349O467L1386
881A9597L401k6544k0083J6007L0112p914l3922L552L1146k063l0834j829L0857
894A1483Q398l2513j8933L2704K7199k7147k8426J7274K3838p414j9320N45K2182
907I870Q777k6947j6429L3072K6155l0178l1678K1933L4534r162l2395J340K9610
$$ y = [-6932, 12460, 2131, -28202, -21252, 14855, 15417, -22232, -34915, 387, 27313, 1048, -31700, -7965, 26053, 4752, -24929, -1768, 28349, 14219, -15326, -15475, 12451, 30021, 6795, -22273, -6562, 24976, 14988, -14180, -7356, 18929, 11937, -22194, -21219, 21665, 29714, -17167, -34584, 4240, 23200, -4184, -22016, -7801, 8606, 3539, -15376, -15140, 12670, 18948, -15127, -29548, 5536, 31052, 6421, -24958, -9580, 26113, 17408, -18137, -9373, 24728, 15093, -18256, -11789, 19597, 22998, -3546, -23629, -7622, 22490, 14576, -19346, -15794, 15352, 13289, -17545, -19374, 11483, 19881, -12632, -31565, 1139, 28338, 1191, -27235, -9961, 13877, 6463, -12857, -12312, 9870, 18647, -8300, -24729, 8343, 34498, 4320, -27358, -5425, 29109, 19947, -12448, -11108, 18502]
920A8502k52l2248k165L1976M237k9270j4767J6962K2054n805k9717m404L1709
933F812O897l0906l960L1935N655l2056j1265L2865K6149k5247l3526J7749L5882
946B6984p497k9077N01K1406N701j7976j4279J8764K3438k1171l4637J5346L6182
959B3685q164l3981o60K6463N271k4710q439K5509R735k7539j3174K6883J9286
972B0165j6604k4526M008K9035R967k9715j3937L1555J7259l0689j8614K9147
984G051K2716k1146k9799J0789L3963j127l3781m697K5012N208j9959q254J4674
997F50J3191j3514k4274J1574L2533q485l7929K955L6427L379k8793q277K5435
1010D872J4815k3641k0823K4097K8794j7272l0633O203K9765Q093k4297j8428
$$ y = [18502, 18250, -13998, -16163, 15813, 20050, -9220, -23987, -7025, 15029, 9224, -20493, -24897, 6812, 13709, -17197, -21157, 10778, 16433, -15623, -26888, 5977, 32126, 6879, -26647, -8898, 26984, 19487, -9590, -9089, 12317, 18018, 42, -14237, 4527, 27965, 6794, -27843, -12497, 23685, 15521, -18460, -19120, 7343, 12614, -12096, -20535, 4974, 14709, -12830, -26004, 879, 20165, 3561, -20965, -16957, 12078, 22045, -7670, -21607, 9948, 27207, -3482, -22096, 7051, 29767, 8621, -21178, -10389, 23574, 22447, -11334, -16031, 8981, 14189, -5770, -14024, 650, 13841, 327, -23947, -12373, 20160, 11675, -26254, -23299, 13128, 16507, -12286, -20563, 4872, 19687, -3954, -24777, -680, 28114, 10842, -19791, -13588, 16177, 24270, -27, -18455]
1022a8455J9228K2762j7987k2673J9730K0638k0780k3583J3883K5174m873k7991
1034a4927n582K6675J0300k5225j2686K1356J3745j7854j8980J4092K8979m667
1046A5226l8243l421M1196J2204l3488j4890K5035J7614j5115j8529J0460K2536
1058B0585p055k7448L145K9111J745k5984j0531J8312J5709j5884k1994J4602
1070e687K4369j7631k8770J6542L0636j0286l0958j679K8913J5059k3083k1488
1082b4063J9715K4391j4814k2611J1111K4503j708k6272p240K8514J6150k8193
1094e17k0105K4069J9015j9382j6693J3535J6299r944k3391L948K8273J919l1942
1107a4916r902K7776J5729j9585k1537J0790K5123n197k8983M688L2861j057l2859
$$ y = [-18455, 773, 23535, 5548, -17125, 2605, 23243, 2463, -21120, -7237, 17937, 13064, -14927, -20509, 6166, 16466, -8759, -21445, -89, 13656, -4198, -23178, -9086, 19893, 15226, -23017, -26438, 14758, 26962, -6526, -21416, 3619, 21233, 6118, -12411, -1951, 20585, 13530, -13918, -10773, 18338, 20083, -5901, -16432, 1880, 17589, 1705, -20289, -5687, 18682, 1051, -27719, -11177, 19459, 9173, -21785, -23464, 5449, 20508, -2575, -24063, -4348, 20043, 5229, -17382, -6271, 18232, 16524, -9748, -16988, 11526, 27676, -517, -20622, 3447, 22462, 3080, -13613, -78, 16221, 6277, -17114, -13166, 15107, 17026, -14916, -24818, 2958, 18687, -898, -22435, -11645, 13478, 8281, -20702, -16014, 16847, 15790, -17069]
1120a7069l432K9227J3259j9401j9154J2319K4149p448k3871O669K2818o202k2847
1133a0983J375K3495O777k4485j8919K1860K4360j9799k7216J4441K4175r347
1145E734k3270K100K4189N552k6796j4585K7384K1667k0971k2990J4188K2488
1157A4690m217k1569J54K4863M647k6930o293K8365J0719k4903j5662J6723J9906
1170B0493q877k4706K014K5980o69k9556k586K7923N825k5438j4320J9144K2166
1183A7393j2462k7962P548K9051m403k4525L074K2689L212j9467j0771J9897K0249
1196B3523j6887k5615J4010K7031q462k4296J717K0625M270k1440j0167K2650
1208F959J5404k4901k0519K0348K1464j2862k2981K446K2413M667k3561q636K4814
$$ y = [-17069, -20501, 8726, 21985, 2584, -16570, -4251, 19898, 12450, -11421, -4752, 18066, 11864, -10983, -9608, 13887, 20664, -3821, -22740, -880, 23480, 3681, -23535, -9094, 15081, 5734, -17536, -15436, 8753, 14305, -12491, -27076, 308, 21975, 1004, -21986, -7798, 14690, 10473, -11096, -10942, 13921, 18568, -8362, -14655, 13710, 24429, -474, -16136, 587, 20493, 11616, -13090, -11076, 14904, 14235, -15321, -17907, 10016, 15841, -9597, -23917, -4773, 17393, 4931, -23031, -15483, 13568, 9165, -15360, -12286, 10403, 13615, -5852, -16623, 3274, 23523, 6636, -18979, -4969, 22062, 13600, -10696, -8979, 11646, 15916, -5524, -15691, 6959, 22363, -2538, -23057, -2709, 18755, 5893, -17088, -14642, 7771, 12438, -11123, -19759, 5055]
1221E055R919k4368j2547K1840J8267j3988k2473N959K8025J821k8511m139K7744
1234A2604P146k3443r572J9194J4659j4572k2708R015K7661n605k8733O09K3890
1247A0145K959k0835q264J6820J3961j6904k0190J6250K4751j3304k6937Q147
1259a3401K5104J25k2198p324K1808J4459k1345j7972K0790K1328j4850k1617
1271a5093P460K2998K988k1905j0597K1995J3870k2360j3768J9298J3843j7055
1283A674j8479J0130K0307m528k6627j921K6925N133k5755p874K1650J1475j5346
1296c236j6600J1925K5471n081k9014J883L0715M813k5258q938J9145J4345j4201
1309E969j8526J0856K0806j1258k3555Q647K2214m268k2008l565J9003J0630j8754
$$ y = [5055, 14974, -9394, -21941, -101, 18166, 4178, -18295, -12336, 15689, 17510, -11001, -15140, 12604, 19750, -3693, -13265, 5929, 20588, 6016, -16692, -7677, 19984, 14379, -14354, -13745, 10145, 13104, -7731, -15995, 825, 14786, -2118, -22308, -6058, 18693, 5389, -21548, -13401, 11703, 11828, -10370, -17694, 4114, 18573, -2772, -20744, 46, 21374, 6524, -15093, -7633, 15365, 18353, -3552, -14149, 7846, 21716, -644, -14412, 4886, 18729, 1674, -16805, -6675, 13632, 9104, -17523, -19444, 7481, 12614, -13141, -21015, 635, 12110, -3236, -19836, -7911, 17560, 12479, -16535, -14652, 16063, 20876, -4382, -13320, 5825, 20170, 5969, -12557, -1701, 19105, 7847, -15708, -7061, 15153, 10885, -11123, -14688, 4315, 14945, -3809]
1322c809j6739J8274J9784j7787k1203J4149K2382o601k3794l388K5350J2539
1334A9157k4177j6767K1509J9424j4877j8344R071J9801k206k1144k524K4666
1346A3589O778k5154r024K1627R453j7468j2308J1094J5574r081k2043M481K5915
1359A3433j814k7659m458K4229J1611j8197j7954J3043K4190r084k6543Q002K8016
1372A6815m004k3950j324K0917Q460j6825j3880J3920J8036j2273j8417J0765
1384a760J7494q029j7984J028K0456N576k3502j3130K3844J7243k2892k0076J5870
1397e862J9928r093k1486J076K3284M992k4393r566K3714J3583j8282j4563J2433
1410d235J8564m260j9903J628K3284R01k4141p62K3070L698k0955r615J5038J5135
$$ y = [-3809, -20548, -2274, 17510, -277, -21480, -7331, 15051, 8450, -15344, -18732, 6618, 19157, -5020, -21787, -278, 19146, 4269, -14075, -5004, 14797, 12591, -8553, -11077, 13589, 20367, -4787, -13811, 7816, 17269, -199, -12507, -1413, 14161, 5080, -16963, -12482, 13433, 11619, -16040, -20498, 3731, 15342, -2855, -20809, -7766, 16424, 7340, -19203, -11201, 16815, 12811, -11139, -12463, 8454, 16914, 89, -13791, 129, 18165, 5892, -12525, -1760, 15734, 7705, -10279, -9251, 11205, 16781, -6721, -19851, 3993, 21236, -1656, -21732, -5862, 14066, 4973, -16513, -15437, 7847, 12839, -11554, -21120, 2594, 16177, -2105, -16668, -4235, 14329, 10069, -9834, -8206, 15078, 15979, -8162, -8924, 14146, 17844, -3111, -12726, 2312, 17447]
1424A7447j1898k2190P028K4464n451k5549K28K3025N056k0049j3117J7146K0237
1437A6377j4108k2992J1916K3445p010j9880L102J7699M115j6071r374J7479J4682
1450A9380j7600j7318J5899J8573j0682j9719M498K0276J661k3629p189K4700
1462H850R943k4452j3532J8330J5534j1034k0048K838K1992K581k3880n201K3441
1475E362P703k0404r537J6849J4966j1403j8155Q627K3317n019k3948L751K2093
1488A4202O25j9104o174J5569J2756j3965k0103J0906K3603j0191k4415M300K2299
1501A0308R27k0311p867J8525J3320j8336j6310J6826J7862j3699j7113P608J7779
1514I519K92j7856o545K0296J1677k0060j3779J9447J5633j4128j7262Q295K0686
$$ y = [17447, 5549, -16641, -9613, 14851, 9400, -16149, -15921, 7104, 12160, -7889, -21006, -3860, 16377, 2269, -20723, -8807, 14638, 7628, -12252, -9150, 8549, 12664, -3407, -12781, 4698, 19380, 1780, -15538, 361, 18934, 8252, -11467, -6969, 13307, 14968, -8661, -15850, 8850, 18793, -5659, -19191, -861, 14673, 3639, -16409, -13571, 8421, 11002, -12878, -18079, 5362, 13065, -7339, -16876, -27, 14939, 3536, -14619, -5992, 17325, 12306, -11642, -7891, 14202, 14827, -4277, -10451, 5118, 17874, 3909, -16194, -5288, 18315, 8124, -16291, -11991, 10308, 11235, -9076, -16943, 1582, 14902, -3434, -19744, -2918, 14944, 1245, -15868, -8260, 9519, 9811, -8045, -14590, 5706, 17383, -2677, -16456, 2991, 18624, 4496, -12766, -4471, 16215]
1527A6215j942k3299k265K3380M713k3012p542J7681R704j3265j5306O940J9227
1540A1229m222k3397O73K4024J800k1647n139J8796J0721j3828j6030J2980K1045
1553A7005r215k2255P302K2547j829j9399m301J6849J0846j5306j6480J4507J8972
1566A9243j4637j9438R837J8183n379j9087j720J8929P475j9947j2513J8691J4190
1579A3827j5360j5889J0076J8098k934j9731l300K3527Q009k3167r538K1910J1588
1592A7116j6014j2536R982J5972m282j9004J541K0510L62k0684l534J7952O631
1605A4012j5077j4018J1304J8698r591k3387O918K4092n335k2889J90K0403O537
1618A1857j6699j2769J4934J8258j1405j9414Q986J9463l591j7089j608J6908
$$ y = [16215, 14273, -9026, -11291, 12089, 16802, -6210, -13752, 3929, 13633, 368, -14938, -7998, 11229, 7007, -16390, -15717, 8307, 10107, -11540, -16679, 2117, 12838, -990, -17020, -4040, 17005, 7790, -14465, -7163, 15384, 13555, -5844, -10145, 6704, 17550, 2244, -14236, 271, 19243, 4606, -14832, -4995, 13188, 7809, -11278, -12998, 5931, 13406, -6541, -19054, -363, 13827, -1533, -17422, -7346, 10752, 7818, -11913, -15213, 8314, 16323, -6844, -16382, 5528, 17116, 1102, -11434, -1452, 14520, 10238, -8766, -7225, 13285, 13647, -7037, -10571, 7381, 14012, -1065, -15083, -3779, 14919, 5328, -18059, -11141, 12951, 7616, -15273, -15083, 5320, 11857, -4842, -17611, -2677, 15581, 4176, -15238, -6252, 13211, 9620, -7469, -9077, 7831]
1630G831P994j6666j2568J7860J4264j7088j5286J3805J5523r573j7205J970J9089
1643I950K629k2037p607K1335J0139j8817j4074J3260J6684n889k0318M65K2979
1656H699L466k2581m414K0952P230j6174q570J2155J3369o976j7660N870J9817
1669A5183l674j9890J206J8353K218j7067r017J4810J4713j4567k0694J1918K1726
1682A5218r121k1076K246J8564L982j6226j0769J5540J5144j3728j6427J2219
1694d434J7353p297j6380K763J7693L282j7931n933J9590P660j8798r176J6429
1707D821J1355j2039j5286N302J8835o1k3251m658K2052P217k0185j0795J4814
1720a879J4006r886j8809N691K1880k986k1778J018J9897K566j5262n414J2161
$$ y = [7831, 15825, -841, -13409, 4451, 18715, 1627, -13659, 146, 15669, 6096, -11109, -9139, 9950, 12579, -9458, -17065, 4270, 14409, -4408, -18482, -5222, 11462, 5573, -14745, -14280, 8699, 12165, -10416, -14830, 6122, 13352, -2822, -11392, 763, 14132, 7156, -10504, -4634, 15183, 11509, -8381, -7175, 11178, 13396, -3671, -12688, 2122, 16835, 2268, -18426, -6508, 15218, 6097, -14979, -12733, 5831, 9813, -6413, -17182, -1642, 13502, -226, -16653, -4434, 12919, 5622, -10758, -7995, 9698, 12980, -4951, -10884, 8706, 16366, -2432, -11608, 4821, 16176, 4137, -11149, -5847, 12988, 12927, -10324, -14982, 7070, 14287, -5898, -16693, -1879, 12127, 2241, -16568, -10877, 11003, 8017, -13761, -12743, 7154, 9720, -5542, -10956, 1205]
1733A205J0569r108j4640R412J8852q110j9770N543K0068l14j8948o435J7049
1746E373J2202j7641j6023J5177J7086j2836j7808N766J6806O58j6804q049J6914
1759H21J1560j5929j3270J4642J3479j0806j3092P043J5920j605j8234j457K1817
1772A0889M446j9979o674J7120R577j2243j3362P494J7468l947k2051Q26K2177
1785A1741J992k0976p415J6369J0021j1831j4988Q412J7106o355j9005N229J8679
1798H979k110j6712k502J5250R566j3296j3669J3340J7182j1340j7214R650J7383
1811A4507m357j7373j872J7855P953j8080j2934J6109J3883j2963j4764O997J4741
1824I702k848j6861k668J8387N914k0090q737J8525J0295j3955j2459R878J4803
$$ y = [1205, 11774, 2666, -11974, -2562, 16290, 8180, -11590, -6047, 14021, 13707, -5241, -11676, 5373, 17575, -66, -16089, -912, 16174, 3338, -14470, -8704, 8102, 8760, -8044, -16093, 821, 12381, -3548, -16818, -2176, 11303, 497, -12595, -5552, 10368, 8763, -9471, -10928, 10889, 15335, -4644, -11318, 5802, 15379, 3136, -10226, -2732, 14736, 10789, -11262, -10436, 11741, 13733, -7243, -14658, 1711, 11732, -99, -15087, -6675, 10431, 4076, -14929, -9700, 8979, 6869, -9843, -12345, 2905, 12471, -825, -14494, -1154, 16028, 4688, -12526, -2876, 14507, 10150, -7223, -9095, 8760, 16713, -1367, -14301, 1808, 15691, 2728, -12036, -5039, 9702, 6854, -10007, -12675, 5712, 11626, -8464, -17201, 1324, 11619, -2336, -14795, -4917, 9886]
1837I886m483j7330K764J9839P81j9594k330J7716P702j3548j2071R201J6773
1850A5306o255j9820M608J9798l043j9729o86J6952M568j5316j1420J2440J5143
1863A2546j0647j7888Q277J7095m695j5873n7J5914N536j5408j0710J6787J4876
1876A5753j4059j5780J1317J5876n363j4841N59J6059L869j6930p033J7678Q873
1889A5978j6643j1348J1312J3093o134j6748M27J8649J325k0568l513J8979N573
1902A0382j6510r379J2231J3879o616j8043M127K0027q48j8154n57J6688M134
1915A1361j3670p510J2269J3138j0483j7071R243J7928o666j7601K464J5080J779
1928A0261j4724q348J4798J1954j4936j6162J2901J6962q280j6867J256J6149
$$ y = [9886, 5403, -11927, -9163, 10676, 11457, -8137, -10467, 7249, 14951, 1403, -10668, -1467, 15306, 9051, -10769, -6161, 13637, 10594, -9135, -9821, 7131, 11699, -3617, -15037, -2597, 12546, 1899, -15989, -7712, 9383, 4688, -11185, -11242, 4672, 10208, -5200, -15910, 877, 15753, 1694, -14086, -2769, 13107, 7744, -7097, -6538, 9521, 13390, -3540, -10573, 7105, 15978, -665, -12013, -701, 12392, 6258, -10490, -10063, 8586, 9911, -10657, -14170, 4809, 10382, -6128, -15507, -3276, 10603, 3987, -14056, -9929, 10098, 9250, -8904, -9461, 7227, 11361, -2309, -9819, 2450, 15588, 5105, -11966, -2723, 15205, 8539, -9062, -6598, 8482, 10261, -4463, -12811, 1987, 13941, -995, -17157, -4256, 12706, 4426, -12441, -11185, 4964]
1940D964M328j5603q002J6433R535j5072j0277J3345J2155q303j3061L361J6076
1953I879J576j7042l578J8055N047j6870o679J4054R965j0860j5907O399J9683
1966A3722l456k1862j014J9260L065j5869p240J1601J0299q616j4611P397J7780
1979A0456n461j6969K615J6472J553j2861n410J2983R946j1989j2421J2920J4822
1992A6656j1607j6023P110J6480q77j7172o063J6237J0068j6734j2307J3373J2624
2005A1765j0773j3709M725J5020N00j6810n200J7493P463j5495p792J3474Q475
2018I136q990j0243P239J4570m015j7936K196K0153J025j8176m317J4419Q777
2031A3838j1247j2601Q041J6147o941j9322L573J8706o95j7148n544J3269J0100
$$ y = [4964, 9292, -6311, -14313, 2120, 11655, -3417, -13694, -349, 11806, 3503, -9558, -6197, 9879, 11455, -5587, -9165, 8890, 13937, -2933, -9612, 4442, 14407, 3547, -12360, -5961, 13722, 10266, -11596, -12610, 6650, 9715, -6154, -13394, -1793, 8506, -110, -14721, -7324, 10456, 4995, -11974, -9359, 7113, 8666, -4195, -9605, 3378, 13324, 1335, -11086, 1834, 16656, 5049, -10974, -3864, 12616, 11739, -5433, -11496, 4741, 14809, -1925, -14232, -859, 11765, 992, -12717, -7992, 7028, 7528, -9282, -14482, 3011, 10474, -5021, -12813, 661, 9136, 146, -10097, -2858, 11712, 7697, -10239, -8043, 12110, 13135, -5041, -9358, 5061, 13838, 2591, -10010, -1969, 14178, 7237, -12085, -8512, 10194, 9499, -7649, -13193, 76, 10176]
2044A0176j0741j3424R465J3860q337j3224O961J3843l374j3701j471J5043P378
2057A2454j4103j0851J4397J2516j2037j2936R008J3927l932j6164j196J8181
2069I264N986j8808r875J5830J0216j0898j1844N620J2241k296j5031n08J6617
2082F514J741j7187m217J5464O983j1510j0250Q712J3740n631j5451N294J7910
2095A2112l008j7450k1J6567N907j3264j1905J0425J5335p993j6921N719J4853
2108A0356l557j4576m68J3073M960j3934j0112J3114J1832j1048j3254Q473J2327
2121G186m162j2419N32J4731L431j5862o911J7910J0610j5521j1309J0556J3397
2134A2169m845j4022J122J5156J844j6441l444J5533N376j3343r884Q287J3009
$$ y = [10176, -565, -13989, -4524, 9336, 999, -12225, -5264, 8579, 5205, -8496, -9967, 5076, 12454, -1649, -12500, 1897, 14413, 2376, -10560, -1552, 12375, 8443, -7721, -8917, 9264, 15250, -3558, -13433, 2397, 12613, 1715, -10129, -4509, 7732, 5436, -9595, -10103, 6514, 8255, -8932, -13149, 2315, 9298, -2212, -12462, -3750, 9990, 4359, -11092, -5798, 12112, 9104, -8346, -8367, 8200, 14107, 843, -11062, -637, 14698, 6705, -10216, -4497, 10356, 6799, -7777, -8245, 4828, 9788, -4146, -14258, -1144, 10688, -360, -13614, -5141, 7186, 3024, -9395, -8863, 5868, 9299, -6563, -13474, 4436, 15046, -475, -11784, -1228, 12169, 7324, -6698, -5576, 9580, 11424, -5017, -8461, 7072, 12448, -895, -10779, -2492, 10517]
2147A0517m824j6173J228J6749j125j7098q1J5725K557j4133o610J2016J2329
2160A1077r026j5239P150J6347k732j4843J351J3117L134j1926p580J2451J1840
2173A5121j1723j5217R687J5610o499j5019J392J3263K004j3684o156J4127P872
2186A0778j4907r749J1967J1784p286j3932K393J4632L090j5759m320J6050N683
2199A0424j4786o560J2952R883q444j3014M461J6243q82j6484r27J4618K978j2833
2213b371n713J1246Q609r442j4701P145J7351n476j7914J396J5215J794j2907
2226e768m954J0359Q575r866j1608R811J3986p056j3907L459J3918K213j2704
2239c542n664J3297Q537j3049r540J3251J1003j1332j2335O363J3732p92j5714
$$ y = [10517, 5693, -10480, -9252, 7497, 6372, -10726, -10807, 4918, 7475, -6658, -13268, -1252, 11077, 2051, -13188, -6038, 10309, 7577, -7266, -5915, 7202, 10336, -1590, -9170, 3281, 15121, 3398, -11819, -2132, 13478, 6979, -8040, -6648, 6615, 8619, -5065, -11221, 2906, 10778, -4129, -13878, -1911, 9873, 2587, -11345, -8952, 5680, 8770, -6989, -11309, 4741, 10424, -4362, -10922, 2030, 11913, 3469, -9545, -5084, 11159, 10277, -6207, -7134, 7484, 10462, -2371, -8084, 3162, 11771, 2329, -12372, -5227, 12124, 6648, -11266, -9870, 5345, 7139, -5768, -10722, -363, 8212, -1654, -13262, -3451, 10535, 3479, -10428, -6969, 6949, 9162, -3542, -9206, 4091, 12628, -421, -9961, 3290, 14293, 2961, -9374, -3011, 10721, 9929, -5785]
2252e785m626J4832O713j3979q251J0618R097q654j1960N305J4412j682j6755
2265a0715j174J6811L552j4258m124J1867N927p980q604P559J2883n541j5200
2278h997L151J6986M16j4842n350J2458Q855j0531j2660R475J3251q697j5550
2291a2035N797J4832k505j3325l686J1065Q255r884j0615R680J0437q181j0416
2304a0581O866J2414l355j3396r74J6379N745j6113p644J4516Q922j1286r262
2317g769P165J1122l521j4261l83J5807L567j5987p174J2557Q758r030j0560N187
2331d522J1520m196j3410L473J4915k767j4451m57J3342M867j0035q707Q341J2444
2345A0357o720j3489O245J4843l789j4299k71J4320N999j3324j0735J1521J1957
$$ y = [-5785, -10411, 4421, 11134, -2845, -11096, -478, 8619, -35, -11995, -6690, 7722, 6040, -10715, -11889, 4922, 8474, -5784, -9908, 1959, 7886, -94, -8698, -1139, 11744, 6203, -8997, -5846, 11140, 11556, -3286, -8636, 3822, 12677, 2146, -10514, -1039, 12212, 3515, -12035, -6238, 8594, 6089, -7236, -10922, 143, 8398, -1486, -12101, -2421, 8016, -165, -10581, -3715, 8699, 5344, -8052, -9026, 7353, 13098, -3015, -10659, 3857, 12779, 1493, -7769, -604, 10518, 6997, -7264, -7647, 8160, 11727, -4260, -11434, 1123, 9881, 851, -9709, -4522, 6998, 2802, -10608, -7135, 7780, 5013, -9438, -9895, 3447, 8314, -1721, -10428, -2087, 10357, 3637, -9852, -3607, 11236, 7447, -6852, -7123, 7197, 13196, -128, -10863, 658, 12615]
2358A2615q681j2414N695J0822m045j0791k18J0752M386j2824q290J3095R115
2371I217j0665j0233P671J0893m241j1762K328J4667M28j6049k311J6129O145
2384A2217j2504q606P768J1637k851j3357r3J4305O58j4510k216J3372M391j2575
2398b364p984Q979J0932o916j3622N163J2709m188j2021K326J1569J043j1048
2411e422o106J1483J1602r846j4144Q191J4948m044j3261J098J2529K544j2265
2424b693n747J3194Q247j2111j0635R031J0875m965j0946l57J0512K673j2488
2437e410m357J3584M871j4089p133J1839R695p563j2381L030J4680k2j4297j045
2451h598J3984K985j1814m885R805R692o816j3251M363J5222j405j5081K06J2457
$$ y = [12615, 3934, -8480, -2785, 8037, 3992, -6799, -7017, 3735, 8121, -4703, -12993, 102, 9217, -1448, -11681, -4010, 6883, 2642, -9120, -6792, 7875, 8303, -7746, -10057, 6072, 12217, -287, -8893, -1125, 10512, 7661, -5696, -5789, 8516, 9174, -5336, -7552, 5820, 10211, -2364, -10348, -1369, 9563, 2647, -10975, -5812, 6897, 2709, -9312, -6986, 4583, 5626, -5422, -11528, -45, 11557, 1711, -12433, -4242, 10706, 6662, -6599, -5501, 7028, 9572, -2693, -8440, 4754, 13001, 890, -9745, -714, 10161, 5196, -5750, -6107, 4405, 7078, -5410, -9767, 3817, 8688, -5401, -12534, -695, 9000, 1437, -10944, -7914, 6766, 6744, -7553, -8598, 5386, 8371, -3443, -8328, 1477, 11169, 4353, -8898, -4535, 10687, 9282, -5799, -5593, 6864]
2465F864J325j0953m176R642O707r595j1300Q530J2628o729j2845K196J1630J484
2479E408j0497n434J1190Q401j1795r642J1620J1486q151j2064M350J2651R44
2492H467j1693m005J2365N005j1633n543J0286P149q090j0174M081J2316j36j5160
2506f765k551J4285L391j3093n390J1250N719q816q807O378J2811m104j4388J520
2520h560J4319J226j0667m154R241O891p311r308P711J2754p222j3862N262J3663
2534I983j174j2284l367J0264O109r506q888R024R327q758j0561N453J0700j142
2548E180j2144l763J2542O631j1778p483J0837P820r499p429P416R754l623j1944
2562g483O3J4622L211j3464n230J1484O986q611q023N298J0901m056j3713K031
$$ y = [6864, 8189, -2764, -6940, 2702, 9409, -186, -11486, -2956, 9672, 2943, -9902, -7706, 3924, 5408, -5089, -10523, 667, 9068, -2727, -12369, -749, 10737, 2586, -9478, -5128, 7523, 8467, -3226, -7231, 5134, 10139, -1494, -7037, 3249, 10398, 2308, -7866, -3785, 8531, 8395, -6765, -9316, 4969, 8360, -4733, -10123, 1127, 6846, -1970, -10777, -4399, 8412, 4308, -10080, -8560, 5759, 6985, -3682, -7836, 1405, 8296, 985, -8323, -612, 12142, 4920, -8942, -3680, 9983, 8809, -3475, -6842, 3422, 9531, 25, -8863, 161, 9488, 730, -9831, -4378, 6322, 5180, -6964, -10727, 1815, 8446, -3332, -10815, 22, 7842, -1657, -9086, -1670, 8084, 4461, -7483, -7420, 7202, 10413, -3051, -8281, 3203, 10189, 1578, -6445, -1147, 9754, 5698, -8015, -5984]
2576e984J4448M46j4678l391J1126N179p912p775N436R559n180j1625N041J2239
2590F929k627j2362n47J1706N804j0229q393R327J1084q302j0999P915J0714m634
2604E386j0626J23J1761M748j2256q391J0201R506q449r629N124Q629k892j0759
2618g524N25J2008J534j3855l951J3183N783j0513o511P095Q454l561j0088K306
2632e115J2926J6j4293j324J4165N005j1018q340P009J1196m105j3005L153J1951
2646H221k367j2364J205J0536J559j0060o190Q346Q898o982j1100N813J0925m769
2660A671r605K395J0582J286j1479n289J2826R073j1099j0377Q564J0705m038
2673E215j0003N68J0107K317j1401m034J2078N661j1403p754Q215Q435m101j0305
$$ y = [-5984, 8464, 8910, -5768, -9159, 1967, 7146, -766, -8541, -3105, 6454, 1274, -10351, -5310, 6929, 4302, -8060, -8607, 3099, 8903, -1326, -9719, -392, 10692, 2390, -8609, -694, 10020, 5386, -5240, -5117, 6644, 11392, -864, -9255, 946, 10452, 2003, -7626, -2502, 6127, 3235, -7524, -6999, 5009, 6543, -7312, -11263, 1920, 7703, -2810, -9321, -2226, 6228, 2667, -7421, -5115, 7811, 7827, -6466, -7790, 6375, 11380, 362, -7978, -969, 10227, 6122, -6883, -3730, 8221, 5854, -6510, -5305, 5231, 6790, -3270, -9460, -1114, 7784, 802, -10298, -4485, 6440, 1671, -7934, -5539, 5043, 6329, -5150, -10439, 2387, 11460, 361, -10016, -1452, 9253, 5215, -4788, -4220, 5887, 8204, -3197, -7231, 4847, 10508, -895, -8649, -434, 8001, 3900, -6405]
2687f405J055J0652k50j1916o27J2783R89j1840m182R656Q173o567j1746L548
2701f677J3997j371j3193M67J2349J866j0215m270Q954Q752p671j1016N675J2434
2715A0081m023j1342J864R048J86q553l391R043N603j0858q864R939J0121p295
2729A559j1369L252J0633O65j0396l478J1814N103j1321o348J0626Q981p053r685
2743g017L246J0770J368j1279k951J1214L231j0194l924R221M987p531q811M733
2757b937J1122k810j3234L60J2009R24j1075k399Q557N348p710q520O930J2104
2771H669n414j2798L420J1852R48r615l081Q307O232p670q081Q469R766q492j0024
2786g512N287J0541j693j0479k717R544M970j0008o361R537O796r402p806N760
$$ y = [-6405, -5350, 5302, 5052, -6864, -7491, 5292, 6281, -5559, -9741, -85, 8088, 1521, -10225, -6677, 7320, 5949, -7244, -6777, 5572, 7438, -2777, -7047, 1907, 10659, 2988, -8028, -2353, 10081, 6058, -5284, -3420, 5628, 5814, -2739, -6130, 2913, 8516, -2342, -11206, -1267, 8854, 1559, -9810, -6558, 4075, 4740, -5656, -9134, 2680, 7783, -3538, -9886, 740, 9721, 2668, -7017, -3771, 6999, 8367, -2912, -5863, 5351, 8582, -1612, -5536, 3685, 8672, 1141, -7670, -2937, 8185, 5375, -7859, -7499, 4510, 5434, -5641, -8040, 517, 5865, -1845, -10365, -3435, 8669, 3255, -9543, -6123, 5729, 6677, -2938, -6019, 2288, 8520, 850, -7231, 1238, 11004, 2512, -7512, -2225, 8316, 6623, -3856, -6573, 2971, 7941, -2067, -8428, 1109, 7905, -1497, -9303, -3543]
2800c543R818j927j1644k399J2818N000j2134m878J0234N412p343o796N861R725
2814H204l674j1632J547J3297Q56j2144k211R072M463o514p221N604R265n487
2828C425j1793M073J2632k478j1914j506R315M948p986p787O777Q992p085q931
2842i318O077R773l597r903j97J0771M972j0213o894R745Q114p773q025O595Q428
2857H555l956r604L78J1561K673j2692n381J0930O045q907o563M795P496l259
2871B071r869J676J1469n7j2937j925J1995L929q890n485N877Q524l920r579L793
2886c328J1659k687j1345Q09J0820L348r215o982P087R617o147j0134M595R712
2900G809m479r689J804R186J310r935n532R143P922q212q371O052Q611m202q541
$$ y = [-3543, 6275, 4348, -7296, -9695, 3123, 8123, -4011, -8889, 1345, 6757, -586, -7382, -1521, 8204, 4530, -7102, -5555, 7742, 8598, -3546, -5757, 3315, 7778, 1264, -5957, -353, 8912, 3425, -8368, -4295, 8337, 5859, -6055, -7561, 1754, 6702, -1284, -9071, -2294, 6698, -387, -9318, -3241, 6532, 2935, -6968, -7165, 3606, 8578, -1635, -8529, 1216, 9330, 1557, -6468, 127, 8555, 4599, -5005, -4627, 6934, 9607, -3085, -8466, 2464, 8509, -398, -6961, -2166, 5330, 2071, -7798, -6122, 5347, 5290, -7647, -9572, 2423, 6352, -2538, -8023, -2146, 6378, 2458, -7121, -3328, 8331, 5644, -5701, -4892, 5928, 9276, 61, -6921, 166, 9783, 3636, -6498, -1903, 7809, 3330, -6359, -4555, 4631, 5941, -3994, -9526, -383, 7539, -673, -9044, -2992, 5619, 1417, -7124]
2915g124K298R630J308j1129l894J2536O571j0707p429P982Q210m038q602J234
2929c154R280N83j0710j849J1040L096j0570n061O914P558m569r895K666J0324
2943E653k421j1090J886J0656j75r998k985Q560P618o981r899N152J1473l014
2957D435r915J280R656J010q683l688Q788O747q656q798P434R256n396q472K260
2972b742P603l25q383k531R647L650j0744o221R596P409o127r068K508J0043O30
2987D945j0796j547J0781L497j0541m067R668N994n627q177K673J0420k80j0875
3001c932j05R649Q36r060j966Q000L971p426q023O103J0298n318j1194K809R945
3016D587p72r037j807P993M908p373q230P729J0311n901j0520L360J0236O06q608
$$ y = [-7124, -4826, 4804, 6112, -5017, -8911, 3625, 10196, -511, -7940, 42, 8252, 4214, -4388, -3154, 6126, 6709, -4001, -5850, 5190, 8286, -2284, -7345, -431, 7127, 2558, -7337, -4671, 5653, 3232, -7858, -5972, 4684, 4509, -5489, -8474, 86, 7704, 723, -9176, -4024, 7449, 4435, -5480, -4200, 5456, 6466, -2217, -5905, 2883, 9630, 974, -7824, -390, 8866, 3470, -5002, -2742, 4861, 4536, -3847, -6378, 3269, 6919, -3825, -10046, -450, 6959, 832, -8236, -5728, 4315, 4945, -5851, -7398, 3383, 6880, -3661, -7728, 1940, 7934, 2307, -5870, -3197, 7223, 6943, -3932, -4037, 5612, 6448, -2612, -4578, 3422, 7393, -33, -8056, -1953, 8345, 3027, -8167, -5358, 4587, 3815, -5222, -7029, 964, 5872, -1501, -9731, -2002, 8309, 2408, -8112, -4752, 5484, 6090, -2518]
3031b518k772Q303M635q366n097Q997O165q274p386N260P925j313r784k066J0037
3046C746L416j0473m253R304M441p788p344N840R390k532j1870K14J2305J513
3060E909j0306k090Q243L639n582n220M406Q493l338j0644K808J1382j044j0290
3074c634q43Q176L383p091o376O927P849p545r391N847R634l447r640p80Q273
3089A342N079q493o850P594P696o856p383N465Q734l294q498J73R793K926r618
3104b190m265R157N139p671n085N809O626m003r095J475J0847P42j2020l011J0200
3119B655L955p805o195N413P146l872r281K965J0533k003j0827Q01Q929L224p098
3134a460n349N923P665m569q940N348R727m408r531K017R576J678r061n166Q220
$$ y = [-2518, -5290, 3013, 7648, -718, -5815, 3182, 9347, 1073, -6313, -1053, 6872, 5559, -4225, -6291, 3746, 7162, -3311, -7564, 1740, 6181, -1607, -8951, -3111, 6279, 3747, -8123, -7909, 4396, 5909, -4397, -6487, 1756, 5395, -187, -5407, -1001, 7492, 4154, -6490, -3682, 7700, 6656, -3634, -4477, 3699, 7082, -9, -6385, 542, 8391, 846, -8545, -2698, 6936, 3489, -6151, -6931, 1342, 6421, -2072, -8922, -1328, 6368, -488, -7871, -2406, 6328, 3034, -5464, -5291, 4502, 7428, -2190, -6455, 2702, 7841, 170, -4915, 894, 7520, 3517, -5578, -4103, 6744, 7486, -4534, -7545, 2655, 6610, -1195, -7390, -1977, 5169, 1297, -7984, -5019, 5514, 3511, -7316, -6515, 2414, 5638, -1460, -6809, -886, 6779, 2210, -6730, -1382, 8345, 3937, -5594, -3577, 5999, 7677, -1384, -6550, 1670]
3149A670O610p009p675N496P355m455p583J103Q602J280r716m684R983O172q864
3164a715o531O591O834m288o855K161R025j71j0145j095J0746L041q730m899O494
3179D63O831l647q111J767R567j110j0964O25J0156R78r683l742P088O239n274
3194A183q835M191Q966l612q911K178Q454K87q209l625Q293P026p024q492O092
3209b038R440m098q101K316P860J42p753k811R068M812r245o256P517O765n140
3224B478p203J373P598J02r272j541J0036K203j0390l913Q670N644n780p658L530
3239d123Q763o67r424j66J0140Q96q238k673P842N243n697p757L755J0198l212
3254D880r652J898Q453q96p888j190P251L288p349o768O749Q212n297r495L204
$$ y = [1670, 8280, 1271, -6404, -908, 6447, 1992, -5591, -4488, 4114, 5394, -4322, -9006, 977, 7149, -1715, -8246, -1655, 5179, 891, -5964, -3803, 5222, 5051, -5094, -6189, 4557, 7598, -1132, -6031, 463, 7294, 3647, -4464, -2697, 6870, 5760, -5204, -4579, 5577, 6555, -3128, -6870, 218, 6457, 1183, -7652, -3461, 5505, 1893, -7018, -4840, 3614, 3901, -4308, -7933, 360, 7386, 362, -8130, -2038, 7402, 3304, -4797, -2481, 5379, 5521, -2232, -5043, 4025, 8837, -408, -6664, 853, 7618, 2478, -4725, -3352, 4246, 4348, -4924, -6465, 3571, 5774, -4616, -8529, 141, 5785, 5, -7653, -4123, 4640, 3973, -5451, -5617, 4523, 5419, -2819, -5492, 2350, 7593, 1896, -5861, -2106, 8092, 4880, -4772, -2874, 5579, 4683, -3205, -4395, 2856, 6144, -1205, -7973, -1224, 6988, 1691, -7804, -4600]
3269d600Q593p34p614k369Q248M471q537o034R057P322o976p426L978Q026n75
3284D830p448j766Q159K771q135l540Q215M506p001o551M478Q175k187j0065j97
3299e756J0286P50r826j784Q014L767p333n889N035Q503k981j0394J825J0135
3313D352L39q166j448O805L633n865n208N801P558n724q334M788Q480k214q136
3328c339m14P330K847p454n151P239N892p099p488N590P592k497q643j119Q853
3343B139L589r140m360Q207N046o749m854N255O299k863p639O23R588J533r536
3358b862j818Q420K967o913m320N669O020m537q902K881J0260j883j0343q27Q328
3373B140L001o884n232N250O902m399q412M041R010k980q527J038P618K803o765
$$ y = [-4600, 3993, 3259, -4355, -6724, 1524, 5995, -2542, -8576, 481, 7803, 827, -6599, -2621, 5405, 4830, -2618, -4384, 3775, 6546, -1589, -5129, 3086, 7592, 591, -5960, -1482, 6693, 4506, -5559, -5756, 4530, 5280, -4546, -6330, 1684, 5451, -1882, -7771, -2736, 5767, 2786, -7608, -5783, 4352, 4691, -3475, -4923, 1882, 5515, -350, -5558, 243, 7801, 2077, -6257, -1469, 7011, 4797, -3339, -3753, 3577, 6424, -1030, -6181, 1058, 6950, -149, -7637, -2047, 5545, 3048, -5595, -6714, 2139, 5728, -3412, -7772, 435, 5481, -1268, -6122, -867, 5432, 2569, -5070, -4447, 5141, 6674, -2862, -4680, 3740, 6707, -206, -4526, 1143, 7163, 2626, -6276, -3395, 6865, 4982, -5361, -6188, 2140, 5141, -1743, -6975, -1725, 5177, 778, -7634, -3593, 5417, 2437, -6090, -5052, 2566, 5369, -1396]
3388a396m431O634O465o247o717O119O676m424p133J683Q248J441q868m736Q221
3403A535N912p624o300N810O172m310p092J554Q447J26r265k457R236L374p634
3418b516l850N553N045l050o489K177Q824r83r754M84R653J635q082l769N985
3433H63O172m583p985L997Q374l170r357K096Q312m3p323l393O086N834n664p577
3449g361N125P319m323o845K477O965K06p443k626Q209N138p750n899O768O698
3464F658m718o036K500P155k61q146j611Q961K846q745m548P032M799m329o529
3479d972J801P479j004q634q1Q901M59q403k230O868M900n024o966L381Q742j951
3495C266q877K062Q569n22p384j359P227L831n722o938N475P904m228q043K858
$$ y = [-1396, -5827, 807, 7272, 1025, -5692, 427, 7103, 2679, -4454, -2771, 5477, 6918, -1950, -6686, 1535, 7447, -177, -6477, -667, 5505, 1195, -5897, -4343, 4104, 4230, -5035, -7492, 1744, 5118, -2516, -6366, -813, 4232, 1182, -5307, -3130, 5694, 4711, -5043, -4559, 5094, 6729, -1353, -5122, 863, 7035, 2452, -5533, -1536, 6838, 3668, -5689, -3593, 4719, 4676, -2647, -6040, 46, 5880, 216, -7361, -2236, 5083, 760, -6085, -3608, 3357, 3563, -3880, -6506, 1703, 6841, -909, -6808, -40, 6658, 1940, -4096, -1596, 5559, 5298, -2848, -4459, 4502, 7348, -1397, -5945, 1087, 5886, 1557, -4972, -3171, 4308, 3304, -5330, -5411, 3490, 3949, -4454, -6684, 184, 5084, 60, -6906, -3525, 5217, 3266, -5611, -3549, 5020, 4498, -2886, -4245, 2982, 6813, 1091, -5847, -372, 7532, 3304, -4739, -1881]
3510a881O486o58o839k128P048L744p684n774O977O873n821p262L428O513k08
3525B814p395j159Q184K648q091l822Q247N082n960n714L480P048n13q085n72
3540c808Q803Q91q384j576P207L042o173n609M016P343k629q867J126Q541j48
3555C775q133j181O988L064o336n555N610P559l938q828L313Q275q51o495j094
3570c827O245K833n727m897O695O283o068p152M839P003k564o836q75P086K214
3585E252p463l546P216M411p085n870N001O242j889p603n98Q834J686q410k169
3600e991P265L257n856l757M576N903k946p143J708Q608j06q189q86P029K226
3615E698n626m734N584N501m555q270L991Q451k497q473j57O887K236n931m225
$$ y = [-1881, 4605, 3947, -2892, -5020, 2028, 5772, -1912, -7686, -709, 6164, 343, -6919, -3491, 3022, 2814, -4581, -5740, 2444, 5092, -2999, -6821, 1426, 6508, 548, -5166, -1686, 5362, 4849, -3236, -3808, 4995, 5886, -2498, -4074, 3133, 6175, 2, -5607, -1591, 5752, 3123, -5744, -4618, 3923, 3775, -4358, -5539, 1449, 4513, -1823, -7378, -1768, 5791, 1853, -6975, -3662, 4613, 3762, -2733, -3827, 2418, 5251, -476, -5373, 1322, 7605, 1537, -5615, -776, 6227, 3663, -3173, -4048, 3038, 5252, -2211, -5757, 1459, 5870, -1215, -7085, -2084, 4158, 2269, -5334, -5932, 2902, 4588, -3822, -5991, 1274, 4531, -1325, -5082, -506, 5397, 2451, -4692, -2984, 5624, 5518, -2671, -3557, 3472, 5698, 72, -4662, 922, 6423, 1868, -6402, -2411, 6040, 3543, -4930, -5087, 1800, 4036, -1895, -6120]
3630f120N263N563n342o442N120O957l216o434P88O631J984o671l560P150N129
3645F800o700m821N696N162m036o144J274Q259M26q738k371P886L183p096m363
3660e583N072M976l407o643J514P838m04q632o68Q154K240o474k956M630N304
3675D961m313n520L343P703l005p788J616P725J132p331l124N882N372n568o501
3690e416M585O781m202o789J963O783N0o307l442O396M694o085n624N244N339
3705C970l366n958K324O791m22p040j487Q380L046p880l552O424M684m169n376
3720c631K141O876o76q299n98Q676J183p816l002N650M502m206o109K446P098
3735D235k035p750J336P631o17o676j617N915M437n049n767M661O742l410p161
$$ y = [-6120, -857, 4706, -636, -7078, -1958, 4999, 1783, -4651, -3863, 2768, 4752, -1919, -5479, 1671, 6800, 100, -4721, 975, 6137, 2101, -4043, -2769, 5490, 5916, -2822, -5193, 2693, 5876, -1220, -5583, -511, 4465, 1058, -5585, -4071, 3767, 3363, -5269, -5937, 2217, 4457, -2017, -4973, -343, 4961, 648, -4872, -1529, 6174, 3169, -4619, -3003, 4722, 5854, -1477, -4601, 1281, 6653, 1085, -5416, -831, 5950, 1748, -5041, -3078, 3705, 3755, -2552, -5994, 402, 5096, -989, -6613, -1369, 3970, 604, -5354, -3030, 3761, 3339, -3701, -5188, 3192, 6238, -1642, -5194, 1230, 5914, 1745, -3631, -1490, 5386, 4710, -3589, -4187, 4489, 5672, -2144, -5146, 504, 5006, 800, -5309, -2863, 4235, 2200, -5550, -4214, 3417, 2800, -3876, -5493, 422, 4859, -190, -5957, -1296, 5446, 2036, -5125]
3750e125L145O911p68o793j343O710M062o530n731N849O139m479o329K561N341
3765C620n66o342j280O653K785p453m123P056M156m762n287K672O251r90p288
3780d898N28P742P31p325j623O672L481m723m842K776P035j589p679R65P691m22
3796D520p329o45O084K444n215n109M400O061l416p401K373P125j396o379q24
3811d707O187K590o135m422N949O165n146o398L981O388j217n935n09O154K509
3826E454o482l435O700M335o102m985L832N739j824o406o27O990J346p436k339
3841e240P217K357o261l915M561N383k666o922R48P854j50p280l89O353K057n032
3857a125l087L942O002l011p581K791P571j397p110K84O090J742n956l778N283
$$ y = [-5125, -1980, 4931, 4163, -2630, -3973, 2737, 6799, 269, -5462, 387, 6526, 2047, -4282, -1721, 3620, 3054, -3288, -4568, 2085, 4870, -2583, -6706, 350, 4506, -256, -5543, -2871, 3380, 2390, -4898, -4370, 3372, 4103, -3222, -4845, 1827, 5308, 585, -4257, -1481, 5554, 3965, -3714, -2749, 4942, 4520, -2809, -3454, 2630, 5074, -141, -5250, -850, 5211, 1795, -5606, -3233, 3892, 2496, -3883, -4707, 1480, 4070, -2065, -6487, -538, 5627, 481, -5917, -1936, 4452, 3235, -2700, -3209, 2945, 5454, -1028, -4463, 2237, 6572, 470, -4515, -683, 5056, 3232, -3174, -3801, 3189, 4535, -2901, -5240, 1977, 4334, -1927, -5842, -1281, 4102, 1436, -5486, -4538, 3316, 3166, -4114, -4503, 1850, 3907, -1125, -4212, -270, 5732, 2721, -4860, -2069, 5502, 4105, -3005, -2721, 3369, 5111, -845, -4623, 660]
3872F60M840m781o558M245O237k674o424J59O244J723o045l269N779M206n404
3887a062m992N135N623k913n840R44O664J050o631k300P086L097o526l118M876
3902A093M392l010o398J422P596n62p939j139O873J939o212k666M060M424l561
3917C12n947K588O849j013p506M74O672J132n363k601M758M481m031n830M181
3932h44O807l576o133J758O250L31n647k866N498M277n597n124M442N368l633
3947A311n732J824N556J24o017k576O656L070o367l255M830M298l716m407K212
3962b189N898m20p239Q3P016J788o730k126N430L894l764n156K393O386j624p615
3978c975R37P201j6o384k095M755L588l773n369L025N900k677o468K605N604q29
$$ y = [660, 5500, 719, -5839, -1594, 4643, 1969, -4455, -4296, 1948, 3671, -2374, -5643, 136, 4342, -1062, -6054, -919, 4704, 1791, -4049, -3105, 3559, 4609, -2022, -4322, 2764, 5861, -665, -3783, 1093, 5485, 2475, -3923, -2501, 5095, 4533, -3406, -4545, 2328, 4267, -1945, -4611, -551, 3873, 312, -5635, -3047, 3802, 2789, -4717, -4243, 2429, 3561, -1802, -4403, 355, 4836, 805, -5025, -844, 5963, 2387, -3746, -1988, 4262, 4593, -1054, -3920, 1578, 5855, 258, -4866, -424, 4944, 1311, -4421, -2597, 2959, 3083, -2934, -5510, 1146, 4216, -2151, -5406, -576, 3722, 6, -4401, -2189, 3709, 3289, -3950, -3867, 3149, 4937, -1793, -3919, 1511, 5405, 1641, -3515, -1122, 5264, 3640, -3975, -3038, 4163, 4147, -2237, -4332, 423, 4011, 238, -5131, -2106, 3794, 1117, -5351, -2746, 2858, 2029]
3994B029n135j362N337L757n275m768N127N617m043n427L220N442r31n618j260
4009c290O516K807o488l957N284M282m297m954K703M779r87o037l93O730P76o646
4025c172j960O169K519m502l924K730N664j829o298J318O842J40o681q78O222
4040B360K652m261m917L598O266k663o961K102O402j420n682o45N048K255m751
4055f17m806M835N403m329n708L066N275j637n317P6N230J921n517l733O539M217
4071D898m833m499L086N265j025n257o48O132J621o280k190O518K467m890l981
4086c616L576M292j692o014J95O596k78o557o48N806J320m780l196L492M795k114
4102A177o585J983P218p99o425L7N601J821m845l020M123N333l858n883L204O091
$$ y = [2029, -3106, -4468, 869, 4626, -649, -5417, -290, 5327, 1284, -4143, -923, 4519, 3588, -2030, -3290, 3226, 6033, -455, -4412, 872, 5154, 857, -4097, -1394, 3385, 2398, -3639, -4032, 2698, 3474, -3172, -5132, 1037, 3556, -946, -4870, -2140, 3524, 1695, -4603, -3285, 3557, 3697, -2984, -3862, 2360, 5012, 751, -4166, -568, 5698, 3035, -3926, -1824, 4578, 3158, -2524, -3169, 1879, 4134, -617, -5423, -588, 4815, 486, -5222, -2156, 3119, 1482, -3835, -3759, 1471, 3392, -2125, -5858, 681, 4898, 65, -4434, -1348, 3917, 2892, -2365, -3013, 3119, 4740, -1540, -3730, 2788, 5255, 365, -3616, -40, 4252, 2560, -3454, -3259, 3337, 3059, -3498, -4146, 1660, 2980, -1800, -4996, -1504, 3291, 1177, -5408, -3425, 3793, 2994, -3431, -3394, 2207, 4028, -817, -3837, 286, 5619, 1761, -4122, -918, 5173]
4118E173k561m918r1N264J255n284l075N348L957n733m600M032N024k852m893
4133c954L94N495J270o175k318O564L008n629l380M273M470k208n243R65O405
4148C937J6o234q39O379J370n126k483L701M048l374n195K065O352j451o851K18
4164c467N844Q64m864k671L574M214l475n385L311O065k112o117J170N126J286
4179C363m967k326M614M208m706m569M700M805l188n244J485N283M45n711k068
4194c876N647K983n456l858M582L640l058m942J812N131%o211r73O081J808n421
$$ y = [5173, 2612, -2306, -2397, 2867, 4122, -1162, -4237, 1111, 5068, -665, -5265, -1233, 3791, 939, -3954, -3560, 1935, 3205, -2970, -5288, 1276, 4284, -1345, -4725, -452, 4018, 1810, -3433, -2468, 3937, 3953, -2281, -3120, 3259, 4629, -497, -2980, 721, 4769, 1395, -3800, -1735, 4617, 3166, -3685, -3467, 2377, 3241, -1623, -4294, -720, 3494, 19, -5366, -2055, 4010, 1898, -4219, -3049, 2077, 3363, -1604, -3930, 684, 4892, 186, -4383, 317, 5122, 1934, -3310, -1825, 3458, 3903, -1808, -3876, 1771, 4754, -702, -4560, 22, 3662, 604, -4338, -2526, 2605, 2605, -3606, -4579, 1502, 3310, -2111]
$$ [...]
8191C67
##END NTUPLES=NMR FID
##END=
