##TITLE=1H_TG-2238
 CDCl3, 16 sc, 
 13.3.2019
##JCAMPDX= 6.0         $$ Bruker NMR JCAMP-DX V2.0
##DATA TYPE= NMR FID
##DATA CLASS= NTUPLES
##ORIGIN= UXNMR, Bruker Analytische Messtechnik GmbH
##OWNER= root
$$ XWIN-NMR		Version 3.5
$$ Wed Mar 13 14:27:04 2019 Russian Standard Time (UT+4h)  she@DPX200
##.OBSERVE FREQUENCY= 200.1314
##.OBSERVE NUCLEUS= ^1H
##.DELAY= (6, 6)
##.ACQUISITION MODE= SIMULTANEOUS
##.ACQUISITION SCHEME= undefined
##.AVERAGES= 8
##.DIGITISER RES= 18
##SPECTROMETER/DATA SYSTEM= spect
##.PULSE SEQUENCE= zg30
##.SOLVENT NAME= CDCl3
##.SHIFT REFERENCE= (INTERNAL, CDCl3, 0, 15.7039)
##AUDIT TRAIL= $$ (NUMBER, WHEN, WHO, WHERE, WHAT)
$$ ##TITLE= Audit trail, XWIN-NMR		Version 3.5
$$ ##JCAMPDX= 5.01
$$ ##ORIGIN= Bruker BioSpin GmbH
$$ ##OWNER= she
$$ F:/spectra/data/she/nmr/H-F/1/audita.txt
$$ ##AUDIT TRAIL=  $$ (NUMBER, WHEN, WHO, WHERE, WHAT)
(   1,<2019-03-13 14:25:54.01 +0400>,<she>,<DPX200>,
      <created by zg, POWCHK disabled, PULCHK disabled
       configuration hash MD5:
       00 E9 B6 7A A2 85 ED C7 34 08 36 98 17 FE 4E 26
       data hash MD5: 16K
       00 E0 0F A1 92 93 B3 69 E6 2F 14 8F E8 F9 8F 87>)
$$ ##END=
$$ 
$$ hash MD5
$$ 54 92 04 FC 47 3A 82 62 98 F1 35 29 A0 EB 13 C4
##$RELAX= 
##$RELAX= 
##$RELAX= 
##$RELAX= 
##$RELAX= 
##$RELAX= 
$$ Bruker specific parameters
$$ --------------------------
##$DU= <F:/spectra>
##$EXPNO= 1
##$NAME= <H-F>
##$PROCNO= 1
##$TYPE= <nmr>
##$USER= <she>
##$AMP= (0..31)
100 100 100 100 100 100 100 100 100 100 100 100 100 100 100 100 100 100 
100 100 100 100 100 100 100 100 100 100 100 100 100 100 
##$AQSEQ= 0
##$AQ_mod= 1
##$AUNM= <au_zg>
##$AUTOPOS= <>
##$BF1= 200.13
##$BF2= 200.13
##$BF3= 200.13
##$BF4= 200.13
##$BF5= 200.13
##$BF6= 200.13
##$BF7= 200.13
##$BF8= 200.13
##$BYTORDA= 1
##$CFDGTYP= 0
##$CFRGTYP= 5
##$CHEMSTR= <none>
##$CNST= (0..31)
1 1 145 1 1 1 1 1 1 1 1 1 1 1 1 1 1 1 1 1 1 1 1 1 1 1 1 1 1 1 1 1 
##$CPDPRG= <>
##$CPDPRG1= <>
##$CPDPRG2= <>
##$CPDPRG3= <>
##$CPDPRG4= <mlev>
##$CPDPRG5= <mlev>
##$CPDPRG6= <mlev>
##$CPDPRG7= <mlev>
##$CPDPRG8= <mlev>
##$CPDPRGB= <>
##$CPDPRGT= <>
##$D= (0..31)
0 1.2 0 0 0 0 0 0 0 0 0 0.03 0 0 0 0 0 0 0 0 0 0 0 0 0 0 0 0 0 0 0 0 
##$DATE= 1552472753
##$DBL= (0..7)
120 120 120 120 120 120 120 120 
##$DBP= (0..7)
150 150 150 150 150 150 150 150 
##$DBP07= 0
##$DBPNAM0= <>
##$DBPNAM1= <>
##$DBPNAM2= <>
##$DBPNAM3= <>
##$DBPNAM4= <>
##$DBPNAM5= <>
##$DBPNAM6= <>
##$DBPNAM7= <>
##$DBPOAL= (0..7)
0.5 0.5 0.5 0.5 0.5 0.5 0.5 0.5 
##$DBPOFFS= (0..7)
0 0 0 0 0 0 0 0 
##$DE= 6
##$DECBNUC= <off>
##$DECIM= 24
##$DECNUC= <off>
##$DECSTAT= 4
##$DIGMOD= 1
##$DIGTYP= 9
##$DL= (0..7)
0 120 120 120 120 120 120 120 
##$DP= (0..7)
150 150 150 150 150 150 150 150 
##$DP07= 0
##$DPNAME0= <>
##$DPNAME1= <>
##$DPNAME2= <>
##$DPNAME3= <>
##$DPNAME4= <>
##$DPNAME5= <>
##$DPNAME6= <>
##$DPNAME7= <>
##$DPOAL= (0..7)
0.5 0.5 0.5 0.5 0.5 0.5 0.5 0.5 
##$DPOFFS= (0..7)
0 0 0 0 0 0 0 0 
##$DQDMODE= 0
##$DR= 18
##$DS= 0
##$DSLIST= <SSSSSSSSSSSSSSS>
##$DSPFIRM= 0
$$ [...]
##$SUBNAM2= <"">
##$SUBNAM3= <"">
##$SUBNAM4= <"">
##$SUBNAM5= <"">
##$SUBNAM6= <"">
##$SUBNAM7= <"">
##$SUBNAM8= <"">
##$SUBNAM9= <"">
##$SW= 26.0245685251456
##$SWIBOX= (0..15)
0 0 2 0 0 0 0 0 0 0 0 0 0 0 0 0 
##$SW_h= 5208.33333333333
##$TD= 16384
##$TD0= 1
##$TE= 0
##$TE2= 300
##$TE3= 300
##$TEG= 300
##$TL= (0..7)
0 120 120 120 120 120 120 120 
##$TP= (0..7)
150 150 150 150 150 150 150 150 
##$TP07= 0
##$TPNAME0= <>
##$TPNAME1= <>
##$TPNAME2= <>
##$TPNAME3= <>
##$TPNAME4= <>
##$TPNAME5= <>
##$TPNAME6= <>
##$TPNAME7= <>
##$TPOAL= (0..7)
0.5 0.5 0.5 0.5 0.5 0.5 0.5 0.5 
##$TPOFFS= (0..7)
0 0 0 0 0 0 0 0 
##$TUNHIN= 0
##$TUNHOUT= 0
##$TUNXOUT= 0
##$USERA1= <user>
##$USERA2= <user>
##$USERA3= <user>
##$USERA4= <user>
##$USERA5= <user>
##$V9= 5
##$VALIST= <valist>
##$VCLIST= <CCCCCCCCCCCCCCC>
##$VD= 0
##$VDLIST= <DDDDDDDDDDDDDDD>
##$VPLIST= <PPPPPPPPPPPPPPP>
##$VTLIST= <TTTTTTTTTTTTTTT>
##$WBST= 1024
##$WBSW= 4
##$XGAIN= (0..3)
0 0 0 0 
##$XL= 0
##$YL= 0
##$YMAX_a= 71153
##$YMIN_a= -103299
##$ZGOPTNS= <>
##$ZL1= 120
##$ZL2= 120
##$ZL3= 120
##$ZL4= 120
##$ABSF1= 10
##$ABSF2= 0
##$ABSG= 5
##$ABSL= 3
##$ALPHA= 0
##$AQORDER= 0
##$ASSFAC= 0
##$ASSFACI= 0
##$ASSFACX= 0
##$ASSWID= 0
##$AUNMP= <proc_1d>
##$AZFE= 0.1
##$AZFW= 0.1
##$BCFW= 1
##$BC_mod= 2
##$BYTORDP= 1
##$COROFFS= 0
##$CY= 11.3945322036743
##$DATMOD= 1
##$DC= 2
##$DFILT= <>
##$DTYPP= 0
##$F1P= 18.9103706918063
##$F2P= -1.10871071338519
##$FCOR= 0.5
##$FTSIZE= 0
##$FT_mod= 4
##$GAMMA= 1
##$GB= 0.15
##$INTBC= 1
##$INTSCL= 1
##$ISEN= 128
##$LB= 0.24
##$LEV0= 0
##$LPBIN= 0
##$MAXI= 10000
##$MC2= 0
##$MEAN= 0
##$ME_mod= 0
##$MI= 1.114404
##$NCOEF= 0
##$NC_proc= 0
##$NLEV= 6
##$NOISF1= 3.799351
##$NOISF2= 2.8
##$NSP= 1
##$NTH_PI= 0
##$NZP= 0
##$OFFSET= 15.70392
##$PC= 1
##$PHC0= -8859.051
##$PHC1= 15.40026
##$PH_mod= 1
##$PKNL= yes
##$PPARMOD= 0
##$PSCAL= 0
##$PSIGN= 0
##$REVERSE= no
##$SF= 200.130013532006
##$SI= 16384
##$SIGF1= 3
##$SIGF2= 2
##$SINO= 400
##$SIOLD= 16384
##$SREGLST= <1H.CDCl3>
##$SSB= 0
##$STSI= 0
##$STSR= 0
##$SW_p= 3612.71676300578
##$SYMM= 0
##$S_DEV= 0
##$TDeff= 0
##$TDoff= 0
##$TI= <>
##$TILT= no
##$TM1= 0
##$TM2= 0
##$TOPLEV= 0
##$USERP1= <user>
##$USERP2= <user>
##$USERP3= <user>
##$USERP4= <user>
##$USERP5= <user>
##$WDW= 1
##$XDIM= 8192
##$YMAX_p= 0
##$YMIN_p= 0
$$ End of Bruker specific parameters
$$ ---------------------------------
##NTUPLES= NMR FID
##VAR_NAME=  TIME,          FID/REAL,        FID/IMAG
##SYMBOL=    X,             R,               I
##VAR_TYPE=  INDEPENDENT,   DEPENDENT,       DEPENDENT
##VAR_FORM=  AFFN,          ASDF,            ASDF
##VAR_DIM=   8192,          8192,            8192
##UNITS=     SECONDS,       ARBITRARY UNITS, ARBITRARY UNITS
##FACTOR=    0.000192,      1,               1
##FIRST=     0,             0,               0
##LAST=      1.572672,      0,               0
##MIN=       0,             -103299,         0
##MAX=       1.572672,      71153,           0
$$ Real data points
##PAGE= N=1
##DATA TABLE= (X++(R..R)), XYDATA
$$ [...]
2436A687N5j815J42J892o43j405J343R72j419j242J741P97j415n47J514K2j611
$$ 1687 1742 -73 69 1961 1318 -87 1256 2228 809 -433 1308 2105 690 143 1657 1679 68
2453F8L94J271k81j803P62J486j491j030J373N21j803k85J641k04j646N17J228
$$ 68 462 1733 1452 -351 411 1897 406 -624 749 1270 -533 -818 823 619 -1027 -510 718
2470G18r40r93M69J209j282o37J152O77k093P9J311K8j543N2J816p69j124P61
$$ 718 -222 -1215 -746 463 -819 -1456 -304 373 -1720 -1641 -330 -302 -1845 -1793 23 -746 -1870 -1109
2488a109J313j302j266J883N54j690m92K084l81j396N12J657j026q98J007J325
$$ -1109 204 -1098 -2364 -481 73 -1617 -2109 -25 -406 -1802 -1290 367 -659 -1557 -550 775
2504G75j186j105J951M02j789J45J575J9j520O10J449q30j270J438J184j366o78
$$ 775 -411 -1516 435 837 -952 -807 768 787 -733 -123 1326 496 -774 664 1848 482 -196
2521a96J607L58j571O1J622j38k033R07J550j069j413J317R80j584k98J467k93
$$ -196 1411 1769 198 259 1881 1743 -290 617 2167 1098 -315 1002 1982 398 100 1567 1274
2538A274o31k41J479o79j459N79J108q98j372J542M47j409o25J427N4j677J35
$$ 1274 643 402 1881 1202 -257 322 1430 532 -840 702 1149 -260 -885 542 596 -1081 -946
2555i46J569l84j766N41J582j038j358J298R16j595o93J418K81j323j8J585n48
$$ -946 623 239 -1527 -986 596 -442 -1800 -502 414 -1181 -1874 -456 -175 -1498 -1516 69 -479
2572d79j576J177Q03p52j079J354Q35j676k72J446M39j777N11J505p39j417J273
$$ -479 -2055 -878 -75 -827 -1906 -552 283 -1393 -1665 -219 220 -1557 -1046 459 -280 -1697 -424
2589d24J093q84j012J452R08j546k15J568J06j519N65J393q03j217J326P68j257
$$ -424 669 -215 -1227 225 1133 -413 -628 940 1046 -473 92 1485 682 -535 791 1559 302
2606C02n08J603N27j809J89J133J29j715O60J158p53j228J150Q44q66j271J658
$$ 302 -206 1397 1924 115 304 1437 1566 -149 511 1669 916 -312 838 1682 816 -455 1203
2623A203N2j033k91J316k0j617M69J533j162j289J237O39j432p08J746k00j529
$$ 1203 1255 222 -69 1247 1227 -390 79 1612 450 -839 398 1037 -395 -1103 643 443 -1086
2640a086J99J665q22j434P48J454j105j139Q92Q18j171o96J169M78j774M16J367
$$ -1086 -887 778 -44 -1478 -730 724 -381 -1520 -628 190 -981 -1677 -508 -30 -1804 -1388 -21
2657b1k75j871J098J192j100j001J286P88j283j76J272J81j421J49J616k28j653
$$ -21 -296 -2167 -1069 123 -977 -1978 -692 96 -1187 -1363 -91 90 -1331 -1182 434 206 -1447
2674a447R73J265j281n68J153J078j526k70J471J73j602L76J525j90j532R25R95
$$ -1447 -474 791 -490 -1058 95 1173 -353 -623 848 1021 -581 -205 1320 1130 -402 523 1518
2691A518r60r26J428Q48j512k12J441j17j622O60J335n83j708J101R25p41r21
$$ 1518 558 -368 1060 1908 396 184 1625 1508 -114 546 1881 1298 -410 691 1616 875 -46
2708d6J426J89j546k74J367j81j456K15J567o08j526R22J041j145r87J404M43
$$ -46 1380 1569 23 -251 1116 935 -521 -306 1261 653 -873 49 1090 -55 -1042 362 805
2725H05j685j46J579m96j569N82J589j133j268J216R87j311q20J201R2j227K63
$$ 805 -880 -1026 553 57 -1512 -930 659 -474 -1742 -526 461 -850 -1670 -469 -377 -1604 -1341
2742a341J301j39j592O66J440q89j411J424O43j071m84J583j0j223m1J783r36
$$ -1341 -40 -179 -1771 -1105 335 -554 -1965 -541 102 -969 -1453 130 120 -1103 -1144 639 -297
2759b97r48P86J376q48q78R59P12j281k08J468M41j602P1J727o61j287R06J568
$$ -297 -1245 -459 917 69 -809 150 862 -419 -627 841 1282 -320 -249 1478 817 -470 436 2004
2777B004j208q54Q61O10j124o87J770K18j694M30R24L3j519P11J044q47q12P38
$$ 2004 796 -58 803 1413 289 -398 1372 1590 -104 326 1250 1283 -236 475 1519 672 -140 598
2795E98R00j578l35J237K39j604J77J645n70j568O31O86p29o87J059L90j649L0
$$ 598 1498 -80 -415 822 1061 -543 -366 1279 709 -859 -228 458 -271 -958 101 491 -1158 -1128
2813a128J422j0j756K95J660p66j441J253Q36j007j401J286Q75j576J99J045j1
$$ -1128 294 284 -1472 -1177 483 -283 -1724 -471 365 -642 -2043 -757 118 -1458 -1259 -214 -225
2830b25j514O00J344p06j048J247M73r03p03J530K10j150j74J214K14j470R24
$$ -225 -1739 -1139 205 -501 -1549 -302 171 -732 -1435 95 305 -845 -1019 195 409 -1061 -137
2847a37Q85l08j436R09R85j013o44J744K38j428Q2J692l90j438O26J193n34j400
$$ -137 748 440 -996 -87 898 -115 -759 985 1223 -205 -123 1569 1179 -259 367 1560 1026 -374
2865c74J213P04r81p16J639J58j722n7J778l99j471O71J229q27j269Q71R68j228
$$ -374 839 1543 562 -154 1485 1643 -79 -136 1642 1243 -228 443 1672 845 -424 447 1415 187
2883A87o34J494k55j207J8J511n48j386N57R30p26j158J369N46j689r8J172k46
$$ 187 -447 1047 792 -415 -397 1114 566 -820 -263 667 -59 -1217 152 698 -991 -1089 83 -163
2901a63r22N9J183o88j154P88J223q56r27J143J29p32m13J485m74j038J41J307
$$ -163 -1085 -1026 157 -531 -1685 -897 326 -530 -1457 -314 -185 -917 -1330 155 -319 -1357 -1216 91
2919I1o49q88P14J323j176q55J164R26j514j00J512j36j251N57J075l93j256P30
$$ 91 -558 -1446 -732 591 -585 -1440 -276 650 -864 -964 548 412 -839 -282 793 400 -856 -126
2937a26J561j343o48J375M05j660O0J654l14j159L90J181n79r69R96O67j066n64
$$ -126 1435 92 -556 819 1224 -436 -376 1278 964 -195 195 1376 797 -172 824 1491 425 -139
2955a39J325M65j704N9J450m28j399R28Q05m79j245R72O14j223o90J339L56j693
$$ -139 1186 1651 -53 6 1456 1028 -371 557 1362 883 -362 610 1224 1 -689 650 1006 -687
2973f87j57J510j6j536M21R40n10q50Q47L53r09p55J241L98j601q8J779r76q69
$$ -687 -844 666 650 -886 -465 475 -35 -885 -38 315 -594 -1349 -108 290 -1311 -1399 380 -596 -1465
2992a465M18J104q19q99R51R83j042n53J169J51j280J54J585m28j365Q49R76q96
$$ -1465 -1047 57 -762 -1661 -710 273 -769 -1322 -153 -2 -1282 -1128 457 29 -1336 -487 489 -407
3010d07r50J205R06j304l00J532j35j360K76J276j36j363M68J544q38r82J210
$$ -407 -1357 -152 754 -550 -850 682 547 -813 -537 739 603 -760 -292 1252 414 -568 642
3027F42P97j484k51J417J15j166Q1J304p09p48M61J136q92q78J206O35j385j3
$$ 642 1439 -45 -296 1121 1236 70 151 1455 746 -2 459 1595 703 -175 1031 1666 281 268
3045B68J065o0j678N26J109l75j404J039R46j493p39J205M90j350j14R11N00j549
$$ 268 1333 1273 -405 121 1230 855 -549 490 1436 -57 -796 409 899 -451 -565 346 846 -703
3063g03L37Q31o16j096J075J137j416j005J171M93j270r4J052j9j296M88R71l50
$$ -703 -366 465 -151 -1247 -172 965 -451 -1456 -285 208 -1062 -1156 -104 -123 -1419 -931 40 -310
3081c10j053R06P03j488k20J219M51j727K88J575m89j173O60J245r11o95J075
$$ -310 -1363 -457 246 -1242 -1462 -243 208 -1519 -1231 344 -145 -1318 -658 587 -324 -1019 56
3098E6N34j109m47J468J65j546J18J447J02j645J030R57n94q42J404J70j081p08
$$ 56 590 -519 -966 502 667 -879 -761 686 788 -857 173 1130 536 -306 1098 1268 187 -521
3116e21J625K55j401J39J255k95j281Q64R23p96n98O18N54j389l2J142O6j229
$$ -521 1104 1359 -42 97 1352 1057 -224 640 1563 767 169 787 1341 -48 -80 1062 1128 -101
3134a01J3J328o95q32P18J093j087j626J611M10j346k66J475J50j888M96R81m27
$$ -101 -88 1240 545 -287 431 1524 437 -1189 422 832 -514 -780 695 845 -1043 -547 434 7
3152Gr63Q93M72j059n90J094N85j148l00J385k06j549M77J046n12q09N58P76j069
$$ 7 -956 -63 409 -650 -1240 -146 439 -709 -1009 376 170 -1379 -902 144 -368 -1177 -619 157 -912
3171i12n01J007P13j184l25J218k02j095O52R20p15o07O09Q90o45o32J373Q6j060
$$ -912 -1413 -406 307 -877 -1202 16 -186 -1281 -629 291 -424 -1031 -422 468 -177 -809 564 650 -410
3190d10j60J269k03r23O64Q51r17n88R25J107j397m37J511k2j294Q3J220k60j111
$$ -410 -570 699 496 -427 237 1088 171 -417 508 1615 218 -219 1292 1270 -24 59 1279 1019 -92
3209i2M23J122p66r27R58O65j138o42J340K9p90j87J054k51j547J026N97o08j009
$$ -92 331 1453 687 -240 718 1383 245 -397 943 972 182 -5 1049 798 -749 277 874 266 -743
3228g43Q98N30j236j2J087M4j324K68P71n1j432J065M71r98p12J062P10j267m67
$$ -743 155 685 -551 -563 524 568 -756 -488 283 232 -1200 -135 336 -662 -1374 -312 398 -869 -1336
3247a336J452r8j089k36J298l61j025N43J127j030o49J162L62r06n03J511k53
$$ -1336 116 18 -1071 -1307 -9 -370 -1395 -852 275 -755 -1404 -242 120 -786 -1289 222 -31
3264c1q27M94R89o81r22O85R27q26m90R90Q09j102n27J472j29j125K86J092m22
$$ -31 -858 -364 625 -56 -978 -293 634 -192 -682 308 1117 15 -512 960 831 -294 -8 1084 662
3283F62j333J157P43p84o38J246J44q01k98J052J1j551O25J097p12r05P22Q82
$$ 662 -671 486 1229 445 -193 1053 1197 396 98 1150 1161 -390 235 1332 620 -285 437 1319
3301A319j105l83R13K63j291J41J196q32m69L50P83n66j107Q33N01r94n73J093
$$ 1319 214 -169 744 1007 -284 -143 1053 221 -248 102 885 319 -788 45 546 -448 -1021 72
3319G2J09p71o1Q83j24j190L88J235j001m28R23N0j100J2Q58J42r02j61J035k53
$$ 72 181 -590 -651 232 108 -1082 -694 541 -460 -888 35 85 -1015 -1003 -145 -3 -905 -1066 -31 -284
3339b84r58L96J145r92n24J091M91q94n23J298m8q69K38P39Qj200N09J233j207
$$ -284 -1242 -846 299 -693 -1217 -126 365 -529 -1052 246 198 -671 -433 306 314 -886 -377 856 -351
3358c51l57J248O30j337k39J087K39j223M16J421r91p99N64Q89n96r06J093M15
$$ -351 -708 540 1170 -167 -406 681 920 -303 113 1534 543 -256 308 1197 601 -305 788 1203
3376A203j098j55J354j52j358K56J174m83q74N85L79o22o05Q95M39j202Q5J217
$$ 1203 105 -50 1304 1152 -206 50 1224 741 -133 452 831 209 -396 499 938 -264 -179 1038
3394A038o69q05J46J023n38q70O49R20j215p26R81L44j090k37J146J08j154L54
$$ 1038 369 -436 -290 733 195 -675 -26 894 -321 -1047 -66 278 -812 -1049 97 205 -949 -595
3412e95J069q42r44R25P02j132m68Q74M87j260K85J174o74r28P13Q84o08r14R46
$$ -595 474 -368 -1312 -387 315 -817 -1285 -411 76 -1184 -899 275 -399 -1327 -614 270 -338 -1252 -306
3431c06P55j097j35J150K28j522L11J252m93o69q4J219l30j047J057N32j029j28
$$ -306 449 -648 -783 367 595 -927 -616 636 143 -526 -610 609 279 -768 289 821 -208 -336
3449c36J009r7p03LJ474j077n57M94R36r03n74J191K76r66j94R95J08j052L49
$$ -336 673 576 -127 -124 1350 273 -284 210 1146 243 -331 860 1136 170 -24 971 1079 27 376
3468C76O43n10p66N90O10p80l34P11M12r94j45R07j18r93K97Q75m30j203R95N82
$$ 376 1019 509 -257 333 943 163 -171 540 952 -42 -187 720 602 -391 -94 781 351 -852 143 725
3488G25j191n13J365L4j244j32R32K69j142L25N86j06r07M40Q32p50l49Q14K40
$$ 725 -466 -979 386 420 -824 -956 -24 245 -897 -572 14 -92 -999 -559 273 -477 -826 -12 228
3507B28r93P1Q87l75p82K28R48p11q19P87J223j223o01J299n2m02l89J376n70
$$ 228 -765 -694 193 -182 -964 -736 212 -499 -1318 -531 692 -531 -1132 167 115 -287 -676 700 130
3526A30r62M02J339p43p81R10N05p80m74J105L06r62oJ147l01p09k1J085p61p50
$$ 130 -832 -430 909 166 -615 295 800 20 -454 651 957 -5 -11 1136 835 126 105 1190 429 -321
3546c21Q52P58j483j70J015K94r63J16R40k43j045P36O09p60n73O34K97p30m15
$$ -321 531 1289 -194 -364 651 945 -18 98 1038 795 -250 486 1095 335 -238 396 693 -37 -452
3565d52J200l54p90n5R92l84p01L99N26l62q89Q29N90j216j98P80Qq11q6J136
$$ -452 748 394 -396 -451 541 157 -544 -145 381 19 -870 -41 549 -667 -865 -85 -77 -888 -974 162
3585A62o80p76Q19O69r86l24R33M95p60m66R70J25j244L58P57j96r60P96M64p00
$$ 162 -518 -1294 -475 194 -792 -1116 -183 312 -448 -914 56 181 -1063 -705 52 -144 -1104 -308 156 -544
3605e44m86R25N18q83j76J140r2r22L41O86l99p13Q88O99q83m15J128J10j265
$$ -544 -1030 -105 413 -470 -646 494 402 -520 -179 507 108 -605 283 982 99 -316 812 922 -343
3624c43N69P15j75o38J27R57k66q99L85O00p60l70J136J16j530K99P25K28j536
$$ -343 226 941 766 128 255 1212 946 47 432 1032 272 -98 1038 1154 -376 -77 648 876 -660
3643f60Q09Q39p97p93R57L68p45k61Q82J02j025k58R27Q6j098O47N30o27o71O35
$$ -660 149 988 191 -602 355 723 -22 -283 599 701 -324 -582 345 431 -667 -20 510 -117 -788 -153
3663a53P29r32k95P89J68q41m9O70l73q27P20N09k50j000R33M70j002J4O39M22
$$ -153 576 -356 -651 138 306 -535 -584 86 -287 -1114 -394 115 -135 -1135 -202 268 -734 -720 -81 341
3683C41r26j88J160n15o95M07Q50q35m30Q91K25n38J03J038m74p15L55N78m28
$$ 341 -585 -773 387 -128 -823 -416 434 -401 -831 60 285 -253 -150 888 414 -301 54 632 204
3702B04o68P58L72l91q47J023N27q64k70Q63Q2j011M78N15m37m28L87Q31o51m97
$$ 204 -464 294 666 275 -572 451 978 114 -156 707 789 -222 256 771 334 -94 293 1124 473 -24
3722b4M58L29r30k26J470l79q24O08N77p89p75O24O32p21l55R58J17q81m10J096
$$ -24 434 763 -167 -393 1077 698 -126 482 1059 270 -505 119 751 30 -325 633 750 -131 -541 555
3742E55m76n62q0P10l75n76O88K71p04k92J111j83q16R4P43j68p78J41R68p01
$$ 555 79 -483 -563 147 -228 -804 -116 155 -549 -841 270 87 -729 -635 108 -60 -838 -697 271 -430
3762d30p42N83R01q65l12N62L97q14QO70K7p24M87Q44j095j79O89K86m18j85N47
$$ -430 -1172 -589 312 -553 -865 -303 94 -720 -712 -42 -15 -739 -252 592 -503 -682 7 293 -125 -310 237
3783B37J46j079N10P32o6o70M10L65l36n51N18O44o45k05O31M6r69K47Q29k84
$$ 237 383 -696 -186 546 480 -190 220 585 249 -302 216 860 215 10 641 687 -282 -35 794 510
3803E10p01Q17M23o04q26J059P9r98J86P12K6r63J89Q82o43o67O77O74q11l29
$$ 510 -191 626 1049 445 -381 678 757 -241 -55 657 683 -280 -91 791 148 -519 158 832 21 -308
3823c08Q24Q9p67l92R57K7r19K58P36o01p39L88P05p78m34Q96j02n01j95J246
$$ -308 516 605 -162 -554 403 430 -489 -231 505 -96 -835 -447 258 -520 -954 -58 -160 -661 -856 390
3843C90n69q87N68M55j48n42L77L76n80l01N41O12j111L73N35j59p24L65Q69m37
$$ 390 -179 -1066 -498 -43 -191 -733 -356 20 -560 -861 -320 292 -819 -446 89 -70 -794 -429 440 3
3863Co42N61N42m43o20J056R8r59J78J013j36q13M4J047m70p11N96M43n98l56
$$ 3 -639 -78 464 21 -599 457 555 -404 -226 787 651 -162 -118 929 459 -252 344 787 189 -167
3883a67J054p2j171K52J067m75o97L80O99q36j66O27J73n45m45O28M78q37l4M44
$$ -167 887 815 -356 -104 963 488 -209 171 870 34 -132 495 668 123 -322 306 784 -53 -87 357
3903C57J27p55J54P49o06n14N73L36m60l38N51np00q0P53j93r19M40P49q44j11
$$ 357 484 -271 -117 632 26 -488 85 421 -39 -377 174 169 -531 -611 142 -51 -970 -530 219 -625 -736
3924g36R24O9p59m19J270k24n74k11Q58k28j095P02M45l92n33Q36K05j101L61
$$ -736 188 257 -502 -921 349 125 -449 -660 198 -30 -1125 -423 22 -370 -903 -67 138 -963 -602
3943f02R99k29p71L18L67J43n23L09K69J42o36K52K56n69K1P87k4p52M45N08m15
$$ -602 397 168 -603 -285 82 225 -298 11 280 422 -214 38 294 -275 -254 533 509 -243 202 710 295
3964B95m43L27M88o22j08O23J88p53Q6P62j32r33K08Q22m58k74mR90q83o48J023
$$ 295 -148 179 667 45 -63 560 748 -5 81 843 711 -222 -14 808 350 76 72 1062 179 -469 554
3985E54Q3q17N2Q76o19p25N66M72n12m68O04L06j029O2P05J91n75l28N99J6k84
$$ 554 637 -180 -128 748 129 -596 -30 442 -70 -538 66 372 -657 -595 110 301 -274 -602 -3 13 -271
4006b71k2L74k90o86P28L36o59n27Q00L10q90L90M15l02l98N68K65k93l86J74
$$ -271 -293 81 -209 -895 -167 169 -490 -1017 -217 93 -797 -407 8 -294 -692 -124 141 -152 -538 -364
4026c64N25o33p0O66r0o25J13J204n16r28Q27N83o03n91N17M06o71n1O43r5p52
$$ -364 161 -472 -542 124 34 -591 -478 726 210 -718 109 692 89 -502 15 421 -250 -301 342 247 -505
4047e05O97K39K84r30O26N26n53l83N55M42j025j87R97l26p95L96Q55o66m73K33
$$ -505 192 431 715 -215 411 937 384 1 556 998 -27 -214 783 457 -338 58 913 247 -226 7
4067GO22m39l72N64J9o37J27P55k15o18QO06k42q33Q77K13p13k48M99J45m97n6
$$ 7 629 190 -182 382 401 -236 -109 646 431 -187 -179 427 185 -648 229 442 -271 -519 -20 125 -372 -428
4089d28N13j32r52P22O20n94p93R93K07n60n35N09K83k72j43P21k84o06O54M55
$$ -428 85 -47 -999 -277 343 -251 -1044 -51 156 -404 -939 -430 -147 -419 -562 159 -125 -731 -77 378
4109C78l98o90N12K22n54j00O29J25n29J29P77o9j070P54N12o60l90R84l67m3
$$ 378 -20 -710 -198 24 -530 -630 -1 124 -405 -276 501 432 -638 116 628 -32 -422 562 195 152
4129A52o6P50m24q11O10N56o84k35O24l0l08j93M16K70o52J23N25L8n64j5Q17
$$ 152 86 836 412 -399 211 767 83 -152 472 442 134 -59 357 627 -25 98 623 661 97 82 899
4150H99m66p79O88L02m67j10K08J15k57m13Q13k56p30J94K97L98j099O92K87n80
$$ 899 433 -346 342 644 177 67 275 390 133 -280 533 277 -453 -259 38 436 -663 29 316 -264
4170b64m48P05M29r07j56J038k48p78Q8P58l32r23O20L31n26J06M10ol11n24J027
$$ -264 -712 -7 422 -485 -641 397 149 -629 -541 217 -115 -1038 -418 -87 -613 -507 -97 -103 -414 -938 89
4191H9qq17J54O34m24j17N26J31k42k99P23n6o42N2Q54k21n87J69O50k15q05P59
$$ 89 81 -736 -582 52 -372 -489 37 168 -74 -373 350 294 -348 -296 558 337 -250 -81 569 354 -451 308
4213C08N47q61J14O25j79m99K57L02j56n78L61M00j41q21M26P83q78l14R52J43
$$ 308 855 -6 108 733 554 55 312 614 458 -120 241 641 500 -321 105 888 10 -304 648 791
4233G91r42J23P85n02o84K18P46m18k62N66J82j024K53N43n8n83K34M8J09p20
$$ 791 -151 -28 757 255 -429 -211 535 117 -145 421 603 -421 -168 375 317 -266 -32 16 125 -595
4253e95N68O81p45p52P49M09o69k3K05M1p50J06J149m62m38N46L08o59j23L81
$$ -595 -27 654 -91 -843 -94 315 -354 -377 -172 -131 -881 -775 374 -88 -526 20 328 -331 -454 -73
4273g3N68j146K5N59M5j106N09J080r00k42N87M16o84k0L54L37o82K04Q87m96
$$ -73 495 -651 -626 -67 -22 -1128 -619 461 -439 -681 -94 322 -362 -382 -28 309 -373 -169 718 222
4293B22o92N17M73m92k44O98o6m47o8M96J14m75j26O70l6n57J83O01j92j013R93
$$ 222 -470 47 520 28 -216 482 416 -31 -99 397 511 36 -90 580 544 -13 170 771 579 -434 559
4314E59K5l42k57K85K06r02N25L25K3o58K99P58o48l95M80j19o6n31P12O2q05
$$ 559 584 242 -15 270 476 -426 99 424 447 -211 88 846 198 -197 283 164 98 -433 279 341 -464
4335d64K94N56j52p70K37O07m25j72K45L47p47m17R24l0o58O6O40l53n89O33K40
$$ -464 -170 386 234 -536 -299 308 -117 -289 -44 303 -444 -861 63 33 -625 -559 81 -272 -861 -228 12
4356A2m93k12M22N17q23l1P45k46n24K55O84k03o94N56L58n29k97P15K20o48k85
$$ 12 -481 -693 -271 246 -577 -608 137 -109 -633 -378 306 103 -591 -35 323 -206 -503 212 432 -216 -501
4377e01J072k05o82M35L06l45m30K63Q14q56M4M45J54k84m37J021l32n38K40M64
$$ -501 571 366 -316 119 425 80 -350 -87 727 -129 -85 360 514 230 -207 814 482 -56 184 648
4397F48j64r10O83K38m83j16M32N4l92K75L72m29k71J31L99m43N1J44L57q50m
$$ 648 484 -426 257 495 12 -104 328 382 -10 265 637 208 -63 68 467 24 75 219 576 -274 -278
4418b78M79K71r92J06Q68k84o53M83J10k48m40P14P3n46k70L96p1n20N36K4J06
$$ -278 201 472 -520 -414 454 170 -483 0 110 -138 -578 136 209 -337 -607 -211 -282 -802 -266 -242 -136
4439a36m68M73K35m49k64M01N32q53k0L89O51j201K49P08m64m16J37J109l73j011
$$ -136 -604 -131 104 -345 -609 -208 324 -529 -549 -160 491 -710 -461 247 -217 -633 -496 613 240 -771
4459g71P23K60n59L32L03Lk46m03R14m37l18L77L76l41o13P44M58j016J01P94
$$ -771 -48 212 -347 -15 288 291 45 -358 556 119 -199 178 554 213 -400 344 802 -214 -113 681
4479F81j11m79j71M64k0n22K47P70o37o40K66O96q36n1P46J16o77J5Q40p30j52
$$ 681 570 91 -80 384 364 -158 89 859 222 -418 -152 544 -292 -343 403 519 -158 -143 697 -33 -185
4500a85K11L89m76p26J031L0p94o9J014k84n31k4N63l38n68M74J66n59N7N77J05
$$ -185 26 415 -61 -787 244 274 -520 -589 425 141 -390 -414 149 -189 -757 -283 -117 -676 -619 -42 63
4521F3l71l28J187m38q48N26M45n22n08O17K13o38J52L29M69q43J91K53K56q07
$$ 63 -308 -636 551 113 -735 -209 236 -286 -794 -177 36 -602 -450 -121 348 -495 -304 -51 205 -602
4541f02L77Q09o06n34P76Ql35l86R59J55o59r9O92l84l73J23N25n69n1K59M53
$$ -602 -225 584 -22 -556 220 228 -107 -493 466 621 -38 -137 555 171 -202 -79 446 -123 -174 85 538
4562E38k76m51N95Q3p54K34N52k02o81M38N09k20n64O25L64p07k34N02K86j228
$$ 538 262 -189 406 489 -265 -31 521 319 -362 76 585 365 -199 426 790 83 -151 351 637 -591
4582e91N29O47q05m0K83J35j3o79Q08Q0q14Q4P35j26n56J97J96J1r64N10O03m60
$$ -591 -62 585 -220 -260 23 158 145 -534 274 354 -460 -376 359 233 -323 -126 70 81 -883 -373 230 -230
4604b30o1M27J3n37j56P41q4p30K82K23N6p09L67O40o22p1O89o6p69K17N79O0
$$ -230 -291 136 149 -388 -544 197 113 -617 -335 -112 -56 -765 -398 242 -380 -451 238 172 -597 -380 199 259
4626B59q16L91N53m95m45N39M00l73k56Q23o5n54j51N84m3o74M59L77k58o04P70
$$ 259 -557 -166 387 -108 -553 -14 386 13 -243 580 515 -39 -190 394 351 -323 136 513 255 -349 421
4647D21J59n23l56P13J03o25M0Q87k99k88j51L92p7p40Q24M2p85N3J27K51l99
$$ 421 580 57 -299 414 517 -108 -68 819 520 232 81 473 396 -344 480 522 -263 -210 -83 168 -231
4668b31OM67j80m20K99M38q9r34O09J86l65l45O56J7o01o3Q96p58l94M76O28m49
$$ -231 -225 242 62 -358 -59 379 290 -644 -35 151 -214 -559 97 114 -487 -550 346 -412 -806 -330 298 -151
4690a51n67P86M07o44n53Q61j60l81O0P55m64n96O04K69l61l82N08L60o17j33
$$ -151 -718 68 475 -169 -722 139 -21 -402 -342 413 -51 -647 -43 226 -135 -517 -9 351 -266 -399
4710c99M68K86p78K43P06m60m43M34M07l47l89L60M73n62j34O54R9p23J96O14
$$ -399 69 355 -423 -180 526 66 -377 57 464 117 -272 88 561 -1 -135 519 618 -105 91 705
4730G05n22j30j20M04l15j93N86L1o23l2O42K29r10L38N20l35p52O07K90m87j40
$$ 705 183 53 -67 337 22 -171 415 446 -177 -209 433 662 -248 90 610 275 -477 130 420 -67 -207
4751b07L22L15o47k67R24m40p11P43K06k96l51O24J92n74k60K99J58k29j60L58
$$ -207 115 430 -217 -484 440 0 -711 32 238 -58 -409 215 407 -167 -427 -128 30 -199 -359 -1
4771am07N8j1P68m30p51O61p9M5m72P91j0o89L36P3l0o26N25L53j97q8K24R4m44
$$ -1 -408 -350 -361 407 -23 -774 -113 -192 -147 -619 172 162 -527 -191 -118 -148 -774 -249 104 -93 -181 43 137 -307
4795c07j98P74l60m14K09Q55l06l52L24Q3j69p75R20J01k39k12L45r4m54J48Q98
$$ -307 -505 269 -91 -505 -296 559 253 -99 225 308 139 -636 284 385 146 -66 279 185 -269 -121 777
4816G77n08m82M89K19l60j87L82M59q76N1P10j56q33J85M35J12m35J65K17k25
$$ 777 269 -213 276 495 135 -52 330 789 -87 -36 674 518 -315 -130 305 417 -18 147 364 139
4836A39l12L76J75p36J97M01k15n39L53K76J06o20L91J87k92m36Q98p2p10j23
$$ 139 -173 203 378 -358 -161 240 25 -514 -161 115 221 -399 -8 179 -113 -549 349 277 -433 -556
4856e56N99j46k80K15K39k54m75M60L09n39j45M89l6m71K02M96k37m58M39N99
$$ -556 43 -103 -383 -168 71 -183 -658 -198 111 -428 -573 -84 -120 -591 -389 107 -130 -588 -149 450
4876D50o43l9K68J23n20J05O4O75p37J3N77j97l80J84O61l22j07j45O48o34j5
$$ 450 -193 -232 36 159 -361 -256 -192 483 -254 -241 336 139 -241 -57 604 282 175 30 678 44 29
4897B9J46L03p47K31K18J32q0j39N54n44L3K58L49p47N6K65O3o03O7O83j31m50
$$ 29 175 478 -269 -38 180 312 232 93 647 103 136 394 743 -4 52 317 380 -223 -156 527 396 -54
4919e4J42N80o04j99O70P8p09J57K35j97n19J90M61k45n18K64M24k71j95K27M06
$$ -54 88 668 64 -135 535 613 -96 61 296 99 -420 -230 231 -14 -532 -268 156 -115 -310 -83 323
4940C23o50P7J47J28n25M40P9k05n04R80k16n29k06L82K31k18l40Q01m78K9J64
$$ 323 -327 -250 -103 25 -500 -60 19 -186 -690 290 74 -455 -661 -279 -48 -266 -606 195 -283 -254 -90
4961i0O5Q4o75O83J91k87k67L42J18m86K66K41m4m62J55O69n47l5L10R6k54m65
$$ -90 -25 59 -616 67 258 -29 -296 46 164 -322 -56 185 141 -321 -166 503 -44 -79 231 327 73 -392
4983c92N23J97j52m0L36j17o34K95K74l35j22P25j05r20J42Q75n2o66K28M97k32
$$ -392 131 328 176 136 472 355 -279 16 290 -45 -167 558 453 -467 -325 550 498 -168 60 557 325
5004C25p18K24L38l20j90N05L64n97N8N57l1n50j33L36j90k96K13J65l28j4K85
$$ 325 -393 -169 169 -151 -341 164 528 -69 -11 546 515 -35 -168 168 -22 -318 -105 60 -268 -282 3
5025CK60m45m33Q39Q3r41M40K99m22j77N75J23n81R5L27J33n78J84M19k0n87K00
$$ 3 263 -182 -615 224 307 -634 -194 105 -317 -494 81 204 -377 -282 45 178 -400 -216 203 183 -404 -204
5047b04K92j40o8k0L36m72r3L54L19l77k71P24j08o87K47O13n54k45L86L89l14
$$ -204 88 -52 -120 -140 196 -276 -369 -15 304 -73 -344 380 272 -415 -168 445 -109 -354 32 421 107
5068A07k80L27L18p76K89O33m59j86jO12k51n16K33O32o02j14M61N8q89K76N28
$$ 107 -173 154 472 -304 -15 618 159 -27 -28 584 333 -183 50 682 80 -34 427 485 -404 -128 400
5089D00j43n01J38N75k79l05L78m13K05n42O31k48j63J57K11m3n11K49M20k84
$$ 400 257 -244 -106 469 190 -115 263 -150 55 -487 144 -104 -267 -110 101 58 -453 -204 216 -68
5109f8j04K25L87o16j74N93k16l21k1L50m1l01K59J1K48o89J93M49p33l3P20L09
$$ -68 -172 53 440 -176 -350 243 27 -294 -315 35 -6 -307 -48 -37 211 -478 -285 164 -569 -602 118 427
5131D27o91J69L20j81m25J7N86j03m16L56N8k81m72Q67J95o47L03J66j15l64O25
$$ 427 -264 -95 225 44 -381 -364 222 119 -297 59 117 -164 -636 231 426 -221 82 248 133 -231 394
5152C94J50m93l39O56Rn42J02M86J4m64J13L45j88k25m4N80k15m25N7N19m30j23
$$ 394 544 51 -288 368 377 -165 -63 423 437 -27 86 431 243 18 -26 554 339 -86 -29 490 60 -63
5174f3O32k73l51l2K28j71j82K44K22l39j09M72J8n98k7M38J55n45K00L35m65
$$ -63 569 296 -55 -87 141 -30 -212 32 254 -85 -194 278 296 -302 -329 109 264 -281 -81 254 -211
5195b11j52O35p7m04k37M70Q6o20P8P42n49k45Q9M94l96l10M94K65k49j90L67
$$ -211 -363 272 195 -209 -446 24 110 -510 -432 310 -239 -484 -395 99 -297 -607 -113 152 -97 -287 80
5216H0o6m02K55K74ln21K23M13m39k78K81N21l78pK24R0m97J51O40j80l50k61
$$ 80 14 -388 -133 141 138 -383 -160 253 -186 -464 -183 338 -40 -47 177 267 -230 -79 561 381 31 -230
5238b30Q36m32j72J78J02k54N7J79J08m47J25K36j51J54j58J32nk28N9M20q04
$$ -230 606 174 2 180 282 28 85 264 372 -75 50 286 135 289 131 263 258 30 89 509 -295
5259b95k7N05K26o47Q8M80l30l40O12R3o09j22O39O5n21J08q6K63m67K09L84l19
$$ -295 -322 183 409 -238 -150 330 0 -340 272 365 -244 -366 273 338 -183 -75 -161 102 -365 -156 228 -91
5281i1k26Q4M65n84k64O12K12n01R7L11k2l39j17L25l61K01r2N52l69k60O12l85
$$ -91 -317 -233 232 -352 -616 -4 208 -293 -196 115 93 -246 -363 -38 -399 -198 -290 262 -107 -367 245 -140
5303a40j05pM44J40n95L6L88m59J85J1L95p27L60J41K10n36L29J73K52n81K47
$$ -140 -245 -252 192 332 -263 -227 161 -298 -113 -102 293 -434 -74 67 277 -259 70 243 495 -86 161
5324A61N58j041K71M57n7n69J01M09qn01M17k0J53o17M89KK56m87K16M3j33j25
$$ 161 719 -322 -51 406 349 -220 -119 290 282 -219 198 178 331 -286 203 205 461 -26 190 233 100 -25
5346b5K40l1q0k27L35Pm41L83J98m14R6O6J69n93NL33k06K0mL43k18k61J98j70
$$ -25 215 184 104 -123 212 219 -222 161 359 -55 41 107 276 -317 -312 21 -185 -165 -169 174 -44 -305 -107 -277
5370b77j82J14L72K9m68M13K7j48j19J61M80n26l08J43L57l12j4K60rj77j25L55
$$ -277 -459 -345 27 56 -412 1 28 -120 -239 -78 402 -124 -432 -289 68 -244 -258 2 -7 -184 -309 46
5392D6K7j49K84j28J92l74M5L86o36O9J52P61j039K66M63k06l94l1M39j50O8K83
$$ 46 73 -76 208 80 272 -102 -57 329 -307 -238 -86 675 -364 -98 365 159 -235 -266 173 23 91 374
5414C74J96n89QK17L51n24J57o2J56j28j48M11m27q0kN53k22m48O24k72l15j11
$$ 374 570 -19 -11 206 557 33 190 128 284 156 8 419 -8 -88 -90 463 241 -207 417 145 -170 -281
5436b81O63k77l05Q5N25n80l45O68l0k20J29J58k56l97K63J86j10l97L08K45N2
$$ -281 382 105 -200 -115 410 -170 -515 153 123 -97 32 190 -66 -463 -200 -14 -124 -521 -213 32 84
5457H4p41M77J31n3l1L96l14l22J75M35k57m05J57K53J40p37K86K45j81k4L29
$$ 84 -657 -180 -49 -102 -133 263 -51 -373 -198 237 -20 -425 -268 -15 125 -612 -326 -81 -262 -286 43
5478D3J23m73J74m2j22J77N08nn98J56L12K17q08K82L43P6l79L11k13m7j95M38
$$ 43 166 -307 -133 -175 -297 -120 388 383 -215 -59 253 470 -338 -56 287 363 -16 295 82 35 -160 278
5500B78K30k86l91N49l5o26J70N12j10n37j0O55k57k14J66R0l00n1M90Mm92l1
$$ 278 508 222 -169 380 345 -281 -111 401 291 -246 -256 399 142 -72 94 184 -116 -167 323 327 -165 -196
5522a96M80j62r9j66L8J66j26M4J63k60k43K70K16j81n8M4j70p7J83L86m70m2
$$ -196 284 122 23 -143 -105 61 -65 -21 142 -118 -361 -91 125 -56 -114 -70 -240 -317 -134 252 -218 -260
5544b60J52o1R4n02O00L8l88K95J79j37l53Q9M04k85k8N43q3o04J34L78rnk7K99
$$ -260 -108 -169 -75 -577 23 61 -327 -32 147 10 -343 -254 150 -135 -163 380 297 -307 -173 205 196 191 164 463
5568D63l71n6j87M55l26L8J7J87j58r7J56K49o73L93K42k55J73l13N59m12k06
$$ 463 92 36 -151 304 -22 16 33 220 62 -35 121 370 -303 90 332 77 250 -63 496 84 -122
5589a22N25j63K66m46j10K18n14M96j07J01o2J45Mn9m29L19K91m21p3M32j94j65
$$ -122 403 240 506 60 -50 168 -346 150 43 144 82 227 231 172 -257 62 353 -68 -141 291 97 -68
5611f8k48P96k98k94r9K96l59K16K4K72k68k19N73m20m33M78j13K15o07N20L40
$$ -68 -316 480 182 -112 -211 85 -274 -58 -34 238 -30 -249 324 -96 -529 -51 -164 51 -556 -36 304
5632C04n93o7Q5N31p09K42jL39m02k4P3J79k4J75K87m46j77K23K41j08m49M27
$$ 304 -289 -356 -271 260 -449 -207 -208 131 -271 -295 -222 -43 -67 108 395 -51 -228 -5 236 128 -321 106
5654A06k95q8L46L99m19k13K98N4m81K16N65m92j82J17L48j07l37K81j25R7l36
$$ 106 -189 -277 69 468 49 -164 134 188 -293 -77 488 -4 -186 -69 279 172 -165 116 -9 88 -248
5675b48K88M90o34J69Q1j2q1K3J06q3q0J13Q3o5n48O05j21n6O1M2j46k46K42K38
$$ -248 40 530 -104 65 146 134 53 76 182 99 19 132 215 150 -398 207 86 30 91 133 -13 -259 -17 221
5699B21p3m40Q0K25j72J8J78k37l30L95p0K54k86J71M4N2k45J14L66m82j77M58
$$ 221 148 -292 -212 13 -159 -141 37 -200 -530 -135 -205 49 -237 -66 -22 30 -215 -101 265 -217 -394 64
5721F4Oj33j15J84j46N5l5O50m59o6j37K11j98J76N5P8l06o7K35p6j61K83M06
$$ 64 70 -63 -178 6 -140 -85 -120 530 71 5 -132 79 -119 57 112 190 -116 -183 52 -24 -185 98 504
5744E04n25l01P18J23n69K72O2p7m02K42K55n70J25M56R1k89k0K23O5l62n18Q07
$$ 504 -21 -322 396 519 -50 222 284 207 -195 47 302 -268 -143 313 404 115 95 318 383 21 -497 310
5766C10L5m80L06J70j94N3Q0n7k64k92K92L59l55l94M48R6k61K18K0k41k04N30
$$ 310 345 -135 171 341 147 200 280 223 -41 -333 -41 318 -37 -431 17 113 -148 70 90 -151 -355 175
5788A75l7o82K74K98L93n43j01J29j38m0o4N99o3n36M03r1J10k10L22j00l82K02
$$ 175 138 -544 -270 28 421 -122 -223 -94 -232 -272 -336 263 200 -336 67 -24 86 -124 198 98 -284 -82
5810h2K02j67q1J33j4L26o03N25Q0n45j33N36J04l59J7K23j35k19K01J63M8l10
$$ -82 120 -47 -128 5 -9 317 -286 239 319 -226 -359 177 281 -78 -61 162 27 -192 9 172 220 -90
5832i0L58K18n25j19N1J51k59J33L88j50k88L14J82j53k92J27N2j60K8M02j50
$$ -90 268 486 -39 -158 -107 44 -215 -82 306 156 -132 182 364 211 -81 46 98 -62 -34 368 218
5853B18k55l3J85j01k79K76K45k72k11L85Lr8m13L22P8l04k86O85J3m55K58K09
$$ 218 -37 -70 115 14 -265 11 256 -16 -227 158 161 63 -350 -28 50 -254 -540 145 158 -297 -39 170
5875A70j84k18K46L07n24k33M72J01q0m11N82k76J72k15K48l49j70N44m9o19P9
$$ 170 -14 -232 14 321 -203 -436 36 137 57 -354 228 -48 124 -91 157 -192 -362 182 133 -486 -407
5896d07N17pk87O9K71j11j63J40J02m8j06L60m36K29m31O20k87j92M75J8l7m37
$$ -407 110 103 -184 -115 156 45 -118 22 124 76 -30 330 -106 123 -308 312 25 -167 308 326 289 -148
5918a48J22L60m31k62O36l8J84k00j16k14K7J47L40m2l82N3K46j02l33N46l82
$$ -148 -26 334 -97 -359 277 239 423 223 107 -107 -80 67 407 365 -17 36 282 180 -153 393 11
5939A1k0K78j27J5m28J20L45Q2k53o4O20m91j41J04K25k13k47K81p4m26M00J06
$$ 11 -9 269 142 157 -271 -151 194 276 23 -41 579 88 -53 51 276 63 -184 97 23 -403 -3 103
5961A03k04k1K82K8k39J6j0J39k91QR9L50n83K74J0nk48M15j14j92L62k07L7m18
$$ 103 -101 -122 160 188 -51 -35 -45 94 -197 -189 -90 260 -323 -49 -39 -44 -292 123 9 -183 179 -28 9 -409
5985d09L19J84k18K26J13j79M6m75L33L46k65l82N60M0n54N28l2Q4j97J01l23
$$ -409 -90 94 -124 102 215 36 82 -393 -60 286 21 -361 199 239 -315 213 181 265 68 169 -154
6006a54L39j04l5J43j44k30L08J5j61K56k79J5k33K70j90K82l43O54J13n06k07
$$ -154 185 81 46 189 45 -185 123 138 -23 233 -46 -31 -264 6 -184 98 -245 409 522 16 -191
6027a91L77o5j57j76L84k92j60O46k5j70m89N59k09o3l05M85j34j37J92J18n11
$$ -191 186 121 -36 -212 172 -120 -280 366 341 171 -318 241 32 -31 -336 149 15 -122 70 188 -323
6048c23r5J19J82j39O7L95j11l86L71j20J60l39pO70l99m92M79K92o15j14L84
$$ -323 -418 -299 -117 -256 -189 206 95 -291 80 -40 120 -219 -226 444 45 -447 32 324 -291 -405 -21
6069b1ql20K92J08l0k73M65j4k85J39K8L62n21J73q3J02k28j65M68j19k89J67
$$ -21 -29 -349 -57 51 21 -252 213 199 -86 53 81 443 -78 95 12 114 -114 -279 189 70 -219 -52
6091e2L02j16j44M79j39l24m15K87K94k52j42K99J20k63K27j78J68j24J78J63
$$ -52 250 134 -10 469 330 6 -409 -122 172 -80 -222 77 197 -66 161 -17 151 27 205 368
6111C68n23L10P3J74k00m42L76K18k87k27K54j12m26M47j0j73K28j71L64l86Q0
$$ 368 -155 155 228 402 202 -240 136 354 67 -160 94 -18 -444 3 -7 -180 48 -123 241 -145 -65
6132f5K27j6k54J10K04k84m1o6j26j48J76J08K55k02K30K47o05kP07j94l38k7
$$ -65 162 146 -108 2 206 -78 -119 -185 -311 -459 -283 -175 80 -122 108 355 -250 -252 455 261 -77 -104
6154a04J17J98l28j66K31k8k7K72J7P9m88O70l85j06k53O13j83j10m2K50j05j71
$$ -104 13 211 -117 -283 -52 -80 -107 165 182 261 -227 443 58 -48 -301 312 129 19 -23 227 122 -49
6176d9K57j42Ok72K08J55k76o2N01k16l9Q2J64j27k42ML27j59o39M91K91l16q2
$$ -49 208 66 72 -200 8 163 -113 -175 326 110 71 153 317 190 -52 -48 279 120 -519 -28 263 -53 -135
6199a35J43K35o74M61L49m77J31M0l2O4k42m4O9m9j29O1mJ29J89R3n0m21N1K50
$$ -135 8 243 -431 30 379 -98 33 73 41 105 -137 -181 -112 -161 -290 -229 -233 -104 85 178 128 -293 -242 8
6223Hq7n59P28o4j44p4K10j56L7m6L27j88j96K09J51j88j08K36K45o91L11lJ06
$$ 8 -79 -638 90 26 -118 -192 18 -138 -101 -147 180 -8 -204 5 156 -32 -140 96 341 -350 -39 -42 64
6246F4j27k15L59l27oL84k76J28N2M06n10L8J94j35N44o40L1L37n52m2K96K19
$$ 64 -63 -278 81 -246 -252 132 -144 -16 36 442 -68 -30 164 29 573 -67 -36 301 -251 -293 3 222
6268B22j87j9K21m2k05j7J85K5P2Mj77m8q5L16k7l51k70R0N97m55K35K29k71k93
$$ 222 35 16 237 195 -10 -27 158 183 255 259 82 34 -51 265 238 -113 -383 -293 304 -151 84 313 42 -251
6292b51L75j45K4r0qk23L00k18J86K00o95N92k0m6j03J74k63R7J1L31k1n31k42
$$ -251 124 -21 3 -87 -95 -318 -18 -236 -50 150 -545 47 27 -19 -122 52 -211 -114 -103 228 207 -324 -566
6315e66O46j63m31M23M01o01P9J3M54k44k32N25O0n07q0N32m08j85R6K89r5j77
$$ -566 80 -83 -514 -91 310 -291 -212 -199 255 11 -221 304 364 -143 -223 309 -99 -284 -188 101 6 -171
6337a71j00M22j89j59l5K68j22j55L83j0j83pM33ll02J06j4k58J49K15K95n26
$$ -171 -271 151 -38 -197 -232 36 -86 -241 142 132 -51 -58 375 372 70 176 162 -96 53 268 563 37
6359C7k87J70L92m54L41K35n01M06j86k75J23m12L12J46n26N13p1n6j39M60j91
$$ 37 -250 -80 312 -142 199 434 -67 339 153 -122 1 -411 -99 47 -479 34 -37 -93 -232 228 37
6380C7l13K26r6M37n99K0J95J82j09O7n2p5m34P44k10k06J55O1K55n79J25K02
$$ 37 -276 -50 -146 291 -308 -288 -93 89 -20 47 -5 -80 -514 230 20 -186 -31 30 285 -294 -169 33
6402C3L3o62J11O19m32o5n4N71m00R6N6J7m8j95O98k39j51j01n3K72k07J91K24
$$ 33 66 -596 -485 134 -298 -363 -417 154 -246 -150 -94 -77 -125 -320 378 139 -12 -113 -166 106 -101 90 314
6425C14n11J25J31P7K6p1N71j09n66J92L75n49M7K39l53k61M00J12K7l82K3J95
$$ 314 -197 -72 59 136 162 91 662 553 -13 179 554 5 52 291 -62 -323 77 189 216 -166 -143 52
6447E2mj42L02R0k25J56R1l72K30j40J42j99l66L00N5q7k33K69J08J49l12L51
$$ 52 48 -94 208 298 73 229 320 -52 178 38 180 -19 -385 -85 -30 -117 -350 -81 27 176 -136 215
6469B15j12j19R2l49K68n0m05N55j35n37N30j13J56m43M74r4J84k69L29j58m35
$$ 215 103 -16 76 -273 -5 -55 -460 95 -40 -577 -47 -160 -4 -447 27 -67 117 -152 177 19 -416
6490d16O93j90K79j97p8m3k20j4J02Q7j74L40j69J89m23J1P20m09l38O91k45l70
$$ -416 277 87 366 169 91 48 -172 -186 -84 3 -171 169 0 189 -234 -223 497 88 -250 441 196 -174
6512a74K97k7j53P3j55L60j98j36J4K93r6N8k18K52J60m51L35k34j38l62P85k72
$$ -174 123 96 -57 16 -139 221 23 -113 -99 194 98 156 -62 190 350 -101 234 0 -138 -500 285 13
6534A3L9n5K52k95j51K49J46l86K07N2lj68k86K72Qj33Q5M17l98Q1j42L25q8k65
$$ 13 52 -3 249 -46 -197 52 198 -188 19 71 68 -100 -386 -114 -106 -239 -154 263 -135 -54 -196 129 41 -224
6558b24M21l5m45L00j96M5k00R8L30j75k8pJ88k31K42k2KJ11l35L68j38k39K97
$$ -224 197 162 -283 17 -179 -134 -334 -236 94 -81 -109 -116 72 -159 83 61 63 174 -161 207 69 -170 127
6581A27n8K57m57j8J37k62K84r8J87l11J34K19Q2m27K38J69L9m46M02p3j51K3
$$ 127 69 326 -131 -149 -12 -274 10 -88 99 -212 -78 141 223 -204 34 203 242 -204 198 125 -26 -3
6603cL26l53L6k40O5K34j37K70p2j76O1L88k13l27q5L56j55j06j44K87J76k31
$$ -3 323 -30 6 -234 -169 65 -72 198 126 -50 11 399 186 -141 -226 130 -25 -131 -275 12 188 -43
6625d3J22J49k50k46L34R2k20K7J47J80l19J52k14q7k88L9N89j90j02M6J71J96
$$ -43 79 228 -22 -268 66 158 -62 -35 112 292 -27 125 -89 -176 -464 -425 164 -26 -128 -82 89 285
6647B85k77n7J08j40Q5J01m2l40L68O0Q3m03K18r6k65J27N87l59m01K10L26R9
$$ 285 8 -49 59 -81 4 105 63 -277 91 151 234 -169 49 -47 -312 -185 402 43 -358 -148 178 277
6669B77k24K45n1k82l03L36K32m05J34J8k5J93j24J01j63K4j92M76l74j31M07
$$ 277 53 298 247 -35 -338 -2 230 -175 -41 -23 -48 145 21 122 -41 -17 -209 267 -107 -238 169
6690A69k17j16K34J91j57l02J90O2j19j13M17p9l41n4N70n45J02m6K24l31R2J42
$$ 169 -48 -164 70 261 104 -198 -8 54 -65 -178 239 160 -181 -235 335 -210 -108 -154 70 -261 -169 -27
6712b7M53l22n28O26l48J65j51K51q7k97L19j08m9k00M9K08j67L43l21j31j0J81
$$ -27 426 104 -424 202 -146 19 -132 119 32 -265 54 -54 -103 -303 -254 -46 -213 130 -191 -322 -332 -151
6734a51J03L40l54Q3J26l09j22K00q9Ql87L48K08n3j04K18p3l32L31O8J18k17
$$ -151 -48 292 -62 21 147 -162 -284 -84 -173 -165 -552 -204 4 -49 -153 65 -8 -340 -9 59 177 -40
6756d0j19M70n09J30PM0L38m69K70m77M78q9M83k10l59O40n17L6j3J92n4k72p9
$$ -40 -159 311 -198 -68 -61 -21 317 -152 118 -359 119 30 513 303 -56 584 67 103 90 282 228 -44 -123
6779a23M13n92L64j56O5p6J84j12M91m47j06M65k27j92j0j03j5k94J77N54o9k93
$$ -123 290 -302 62 -94 -29 -105 79 -33 458 11 -95 370 143 -49 -59 -162 -177 -471 -294 260 191 -102
6801a02J59J3j97J46J19J41k59j06K2k36K1J29K09n1k53L97l45o2qK53L05k89
$$ -102 57 70 -127 19 138 279 20 -86 -64 -300 -279 -150 59 8 -245 152 -193 -255 -263 -10 295 6
6823Fj69K98J8k06j2ok7q5J23j77l0J19L8K84m43R0N02m86P2K30K31l64j70m3
$$ 6 -163 135 153 -53 -65 -71 -98 -183 -60 -237 -267 -148 -110 174 -269 -179 323 -163 -91 139 370 6 -164 -207
6847b07M85j80l73K55j0k6l5J64K42m60K00J81j89R0L26k31m20L31J68j97l49
$$ -207 278 98 -275 -20 -30 -56 -91 73 315 -145 55 236 47 137 463 232 -188 143 311 114 -235
6868b35L82J06k96Q0J77k78j95mL68L4r6k06L98j44j23j43J87J51j47k07K03Q2
$$ -235 147 253 -43 37 214 -64 -259 -263 105 139 43 -163 235 91 -32 -175 12 163 16 -191 12 94
6890I4j23L3J2l46M15%j31K41p1P3n07L4K79M71n63j23K44j48k47K46K98m33j55
$$ 94 -29 4 16 -330 85 85 -46 195 124 197 -310 -276 3 474 -89 -212 32 -116 -363 -117 181 -252 -407
6913d07qP14l71j22J77L8j86j33L56l32K7J62J93L3l62M82l72L42m02M92q2n34
$$ -407 -415 299 -72 -194 -17 21 -165 -298 58 -274 -247 -85 108 141 -221 261 -111 231 -171 321 239 -295
6935b95J21J02K28l31J97J73k72P5J26j53l44K33L38Lk05l7L92j92l96L31j37
$$ -295 -174 -72 156 -175 22 195 -77 -2 124 -29 -373 -140 198 201 -4 -41 351 159 -237 94 -43
6956d3K16j62r0K37l75l6M00L80p38K06JJ96j77j19L70n79J77PJ95j26J00p6k14
$$ -43 173 11 -79 158 -217 -253 147 527 -211 -5 -4 192 15 -104 266 -313 -136 -129 66 -60 40 -36 -250
6979b50L9K12K46j06k56n8L03l28J86j34R9K14l19n9L85k79Q9J30j85j44N1O12
$$ -250 -211 1 247 141 -115 -173 130 -198 -12 -146 -47 167 -152 -211 174 -105 -16 114 -71 -215 -164 448
7001D48m99nJ34J23l24K47m26M48m44L1M93n65K21J07L3n0j25M99j53p5P7j73
$$ 448 -51 -56 78 201 -123 124 -302 146 -298 -267 226 -339 -118 -11 22 -28 -153 346 193 118 195 22
7023B2L31o37L19RJ5j37M51k56m20K98k04N35m33L16k77J81l20K74R7n26L69K52
$$ 22 353 -284 35 44 59 -78 373 117 -303 -5 -209 326 -107 209 -68 113 -207 67 164 -362 7 259
7045B59k76k56K88K42J22p90N83n4m14q7K10K16J39j85J22l7j34K37k19L06l35
$$ 259 -17 -273 15 257 379 -411 172 118 -296 -383 -173 43 182 -3 119 82 -52 185 -34 272 -63
7066f3j39L04k13l75L98J50j10J55K0o1l9J49k10K58L4m38R6p0J96j08J31m8l25
$$ -63 -202 102 -111 -486 -88 62 -48 107 127 66 27 176 -34 224 258 -180 -84 -154 42 -66 65 17 -308
7089c08L47P4m35L34K69n4m22J93J1J38l44J40K51j30j04J88K71m86J42k51M57
$$ -308 39 113 -322 12 281 227 -195 -2 9 147 -197 -57 194 64 -40 148 419 -67 75 -176 281
7110B81l99j00M45j05ml29N49k58m18O38k95p3j54K16Kk55L39Q2j68n9%J04J66
$$ 281 -118 -218 227 122 118 -211 338 80 -338 300 5 -68 -222 -6 -4 -259 80 162 -6 -65 -65 39 205
7133B05j45J1k15JL24p8k80J80PQ2j57lk86L84j88m4K52M14l62k71K30j2j56l6
$$ 205 60 71 -144 -143 181 103 -177 3 10 92 -65 -68 -354 30 -158 -202 50 464 102 -169 61 49 -107 -143
7157a43N49m19J04R9k2j36L25O4k38k97P9J14M9l25K53q4J32j31kK89m95J02J60
$$ -143 406 -13 91 190 168 32 357 421 183 -114 -35 79 128 -197 56 -28 104 -27 -29 260 -235 -133 27
7180B7Q8j98K3L8j02o5L18J0k84P2O1N04m39j9J33K48k05j12k38L22Q0j76r6M02
$$ 27 115 -83 -60 -22 -124 -189 129 139 -145 -73 -12 492 53 34 167 415 210 98 -140 182 262 86 -10 392
7204C92m98K93l5k03k40J49L43n5j41J23K4m04K22L31j70j96Q2j13k06J61O4J43
$$ 392 -106 187 152 -51 -291 -142 201 146 5 128 152 -252 -30 301 131 -65 17 -96 -302 -141 -77 66
7226F6j91L05ok68K2k60P89n80N4J21Q6l26J28l17K78J73j50M1N8q3Ol2Q6k54
$$ 66 -125 180 174 -94 -72 -332 457 -123 -69 52 138 -188 -60 -377 -99 74 -76 -35 23 -60 -54 -86 0 -254
7250b54M62J13n84L97M7l21M6j76N55j09Kq1K0K2o73N69K0k90K74j07N13q56L98
$$ -254 208 321 -263 134 181 -140 -94 -270 285 176 178 97 117 139 -534 35 55 -235 39 -68 445 -411 -13
7273a3J72l2J47j40J36j88k00j37L70nj92K10j62J21J46O5k15j21o7J15J35L4
$$ -13 159 127 274 134 270 82 -118 -255 115 110 -82 128 -34 87 233 298 83 -38 -105 10 145 179
7295A79k56J4l31L80O4J85l02Q4Q9J49l58J06L31m41R5L09k61q4l4M03p4l80K81
$$ 179 -77 -63 -394 -14 50 235 -67 17 106 255 -103 3 334 -107 -12 297 36 -48 -82 321 247 -133 148
7318A48l9j01k09K15L35r4k94R1p8R7l87J97J60M4k30J91m44N51m17K61j88L48
$$ 148 109 8 -201 14 349 255 -39 52 -26 71 -316 -119 41 85 -145 46 -398 153 -264 -3 -191 157
7340A57O6m56k58L50K41j18k06K69k39j50L18K21K3R4n22O2j7n1k4J48M08j97
$$ 157 223 -233 -491 -141 100 -18 -224 45 -194 -344 -26 195 218 312 -210 -148 -165 -216 -240 -92 316 119
7362A19R9j68J26m11P8L30p6k05M26k72j54QK21k14j63P14m95K64n31K02M43o38
$$ 119 218 50 176 -235 -157 173 97 -108 318 46 -108 -100 121 -93 -256 458 -37 227 -304 -102 341 -297
7384b97K50l0K05j13j30K38P8j70K12k77l67M39j17J48j16j59L63k90Q8l4lL5
$$ -297 -47 -77 128 15 -115 123 201 31 243 -34 -401 38 -79 69 -47 -206 157 -133 -45 -79 -82 -47
7406d7j90K1K20qj69O9L3K1J07k45K18k15L00%m76L54k33L60j85J4j9O1p9J9L59
$$ -47 -237 -216 4 -4 -173 -104 -71 -50 57 -188 30 -185 115 115 -361 -7 -240 120 -65 -51 -70 -9 -88 -69 290
7431B90J07p43M96R5k23LJ01J62m85L43j99m0j11L68o2p6k42K34J5l2l12L01M05
$$ 290 397 -346 150 245 22 25 126 288 -197 146 -53 -93 -204 164 102 26 -216 18 33 1 -311 -10 395
7454C95n60K94k98P7j63N03j40k5J26J2P6m46R0K41l24N7r1J59J23k56p3M08k80
$$ 395 -165 129 -169 -92 -255 248 108 83 209 221 297 -149 -59 182 -142 -85 -176 -17 106 -150 -223 185 -95
7477i5qK22J82l62R8j25n2l0j25K33J1k68J57L02k32l3K07p7k7k30J60N4k44j35
$$ -95 -103 119 301 -61 37 -88 -140 -170 -295 -62 -51 -319 -162 140 -92 -125 82 5 -22 -252 -92 -38 -282 -417
7501d17O12Q8m18k2Q6k83M70k41L53o21J98K28k00k30M03P9l60K96j3L8l83L60
$$ -417 195 283 -135 -157 -71 -354 116 -125 228 -393 -195 33 -167 -397 6 85 -275 21 8 46 -337 23
7523B3K27p9l27K02J44j06m16L57j01J34L74n53K6R4r9K53L64l93j23J90k47J54
$$ 23 250 171 -156 46 190 84 -332 25 -76 58 432 -121 -95 -1 -100 153 517 124 1 191 -56 98
7545I8k60L31j91NK69j04j71j72N22l50m4k1J82J56k31j61J68m3j56J69J56k83
$$ 98 -162 169 -22 -17 252 148 -23 -195 327 -23 -67 -88 94 250 19 -142 26 -17 -173 -4 152 -131
7567a31O6r9K82j27j66M89k28l50O2L28n3o7J57j94j1k68M17l19k3M1L33M4k27
$$ -131 -65 -164 118 -9 -175 314 86 -264 -202 126 73 6 163 -31 -42 -310 107 -212 -235 -194 139 183 -44
7590d4n2M20l58jn1j21L04k6k9J34j83l72M09k48L51k1o7L66j58l50J39k28N3
$$ -44 -96 324 -34 -35 -86 -207 97 71 42 176 -7 -379 30 -218 133 112 45 411 253 -97 42 -186 -133
7613a33R4J27l78J56M71k32Nj54J58m7l27L18J7k66oM25k61j03m9M83k87k1K90
$$ -133 -39 88 -290 -134 337 105 110 -44 114 67 -260 58 75 -191 -197 228 -33 -136 -185 298 11 -10 280
7636B80k34l63M21j97K59P0m57K76j1M03n21J86o8k18K33J8P9k50J0P3j19k03
$$ 280 46 -317 104 -93 166 236 -221 55 44 447 -74 112 44 -174 59 77 156 -94 -84 -11 -130 -333
7658c33L00j06K42j15J43j40L9K5j07K2j49K57n9k9k35L25j21j29J46o0O8k05
$$ -333 -33 -139 103 -12 131 -9 30 55 -52 -30 -179 78 19 -10 -245 80 -41 -170 -24 -84 -16 -221
7680b21K98r3k26N0p2M80k67K9k68J55L9M5m2N1p7j85K64o6nM05l39k2kK83K9
$$ -221 77 -16 -242 -192 -264 216 -51 -22 -290 -135 -96 -51 -93 -42 -119 -304 -40 -106 -111 294 -45 -67 -69 214 243
7705B43m95M10j6k41K51j31l5J27k37K85J18l85K80m6k09j09R2L14l75k1J49Q3
$$ 243 -252 158 142 -99 152 21 -14 113 -124 161 279 -106 174 128 -81 -190 -98 216 -159 -180 -31 52
7727E2m7J79P5J8j79m6K52k56M6Q4j06k05j32M09l78n2K82J31K8l35LL49p8l07
$$ 52 5 184 259 277 98 52 304 48 94 178 72 -133 -265 144 -234 -286 -4 127 155 -180 -177 172 94 -213
7751b13K82j36K05j83L3R8p6l65L15J44l57k1K79q8m8J61M1p9N4j45k1M62o16
$$ -213 69 -67 138 -45 -12 86 10 -355 -40 104 -253 -274 5 -83 -131 30 71 -8 46 -99 -120 342 -274
7774b74K47L12m23j49M62j78j55L30j33j88j75L23K80k64k51K54j31K51K03j54
$$ -274 -27 285 -138 -287 175 -3 -158 172 39 -149 -324 -1 279 15 -236 18 -113 138 341 187
7794A87Nk82J87o5K8j78j53Q08l88J48j70j84j05L43k71J97r1j10k1K05l65M05
$$ 187 192 -90 97 32 60 -118 -271 537 149 297 127 -57 -162 181 -90 107 16 -94 -115 90 -275 130
7816A30j46l94K09L49J5k51J21M1q1l11M18k8j02K34k65M31o27L28j36J83j93
$$ 130 -16 -410 -201 148 163 -88 33 74 -7 -318 100 72 -30 204 -61 370 -257 71 -65 118 -75
7837g5J31k4m8j54N20m32j20J75J04j44l48L24k53K97k27J94J57j07J35K5j62
$$ -75 56 32 -16 -170 350 -82 -202 -27 77 -67 -415 -91 -344 -47 -274 -80 77 -30 105 130 -32
7858c2Q1j59J58q0M0j00J86j61P4j46L8Q2J61j44j14J50J3K8K6j57K08K16k81
$$ -32 49 -110 48 -32 8 -92 94 -67 7 -139 -101 -19 142 -2 -116 34 47 75 101 -56 152 368 87
7881H7j06r5M3j17K93n3j71O4j51Q5K95j58l1M27k11k12l6J51P3m05O57l44l05
$$ 87 -19 -114 -71 -188 105 52 -119 -55 -206 -121 174 16 -15 412 201 -11 -47 104 177 -228 429 85 -220
7904b20J10R2N1j33J72K65j19k20J10j11K13m13J38J45r9k16n6M79j22j6K81n44
$$ -220 -110 -18 33 -100 72 337 218 -2 108 -3 210 -203 -65 80 -19 -235 -291 188 66 50 331 -213
7926b13Q2L9M29l20j3O3j03M1M3K13l78j17P9qK4k61K97L21m69J0Q15p37K56j04
$$ -213 -131 -92 337 17 4 67 -36 5 48 261 -117 -234 -155 -163 -139 -400 -103 218 -251 -241 574 -163 93 -11
7950a1O9j5P7m9k2j84k19K64J86Q5k1l13K95p1P9j9r9K1J78j60o6n8m1oj04J42
$$ -11 58 43 120 71 49 -135 -354 -90 96 181 160 -153 142 71 150 131 32 53 231 71 5 -53 -94 -100 -204 -62
7976f2j04L62k03j40K68j04k39M97j79m41L54j32J40k00Q1J36k01n4M0K53m32
$$ -62 -166 196 -7 -147 121 17 -222 275 96 -345 9 -123 17 -183 -102 34 -167 -221 -181 72 -360
7997c60K31l2M05k68k03M83l24j29J68J1Jj62k98L32N8K9L22j38n0R7j12K42j35
$$ -360 -129 -161 244 -24 -227 256 -68 -197 -29 -18 -17 -179 -477 -145 -87 -58 264 126 76 173 61 303 168
8020A68k1j32Q1j90j16L05J07J07l76J22K00l19l0L29n04L60J95l80J16k5j74
$$ 168 147 15 96 -94 -210 95 202 309 -67 55 255 -64 -94 235 -269 91 286 -94 22 -3 -177
8041a77PN3O8J37j36k7k5J39P0J45r7M6q8M3P2l11j08L75k7L5O0j93O4l41K93
$$ -177 -170 -117 -49 88 -48 -75 -100 39 109 254 157 203 115 158 230 -81 -189 186 159 194 254 61 125 -216 77
8066G7k35J3J17J55K61j84o0r2Q4k01J49L4m6k76J5j9J39J23k67K87l96L46K87
$$ 77 -158 -145 -28 127 388 204 144 52 136 -65 84 118 72 -204 -189 -208 -69 54 -213 74 -322 24 311
8089C11j46k81k53M46j8j66J43o2j33j87L32l69K17k52N67k63Q0j01K24n2m15
$$ 311 165 -116 -369 77 59 -107 36 -26 -159 -346 -14 -383 -166 -418 149 -114 -34 -135 89 37 -378
8110c78N47R3k15j32K65j91P2j72n6K00j83K35K96n87J6M04q8J46m87K64m0L0
$$ -378 169 262 47 -85 180 -11 61 -111 -167 33 -150 85 381 -206 -190 214 126 272 -215 49 9 39
8132C9j70K88l3n50M37O2m8j88L65j17j77R4K82j36j22j53K05p4l2n1K50l52K17
$$ 39 -131 157 124 -426 11 73 25 -163 202 85 -92 2 284 148 26 -127 78 4 -28 -79 171 -181 36
8155C6o6N18n30M6J10m9q2kJ58n5j42k0J84l38L04K4j0N1k53J92m46J92J48L09
$$ 36 -30 488 -42 4 114 65 -17 -19 139 84 -58 -78 106 -232 72 96 86 137 -116 76 -370 -178 -30 279
8179B79k5k55O5K64l79K8j31L4k1J44q9L7
$$ 279 254 -1 64 328 -51 -23 -154 -120 -141 3 -86 -49
8191d9
$$ Imaginary data points
##PAGE= N=2
##DATA TABLE= (X++(I..I)), XYDATA
0@%%%%%%%%%%%Pj5J6j6J6j6K4l2L2m0M8n6O4p2Q4r3J06j22J38j56J76j98K22k48
$$ 0 0 0 0 0 0 0 0 0 0 0 0 7 -8 8 -8 8 -8 16 -16 16 -24 24 -32 32 -40 44 -49 57 -65 73 -83 93 -105 117 -131
35a31K74l03L38l77M17m60N11n68O30o98P74q59R55j068J197j347J531j754K030
$$ -131 143 -160 178 -199 218 -242 269 -299 331 -367 407 -452 503 -565 632 -715 816 -938 1092
54A092k389K878l581M688o711J1605m5111o5770N7735N3228J3259k0776m296N440
$$ 1092 -1297 1581 -2000 2688 -4023 7582 -37529 -103299 -45564 7664 20923 147 -4149 1291
68A291J4604P453p450k3065J556K5586Q820k3614j2359J2050K794k0018l139K4471
$$ 1291 15895 23348 15898 -7167 -5611 19975 28795 5181 -7178 4872 7666 -12352 -15491 8980
82H980K3185P10j3965k2040j5327J6525L7496O130l4434k0757J9031J8696j0197
$$ 8980 32165 32875 18910 -3130 -18457 -1932 35564 41694 7260 -13497 5534 24230 14033
95A4033j7630l606M925J2786J6342k168k5797j3642J2641P343j0803K164K0786
$$ 14033 -3597 -7203 -2278 10508 26850 24682 -1115 -14757 -2116 5227 -5576 -3412 17374
108A7374L274k5129j8090P267J3945P411O84j1958j4291J0396K5570m160l5425
$$ 17374 20648 -4481 -22571 -15304 -1359 6052 6736 -5222 -19513 -9117 16453 12293 -23132
121b3132j3909K7548K4243n968j6583q616m218L484J4041N218j0298k892J1635
$$ -23132 -37041 -9493 14750 8782 -7801 -16417 -20635 -17151 -3110 2108 -8190 -11082 553
134E53j430j8246j258J9291N319j3576l608J1542N133m356l813q094q021J4176
$$ 553 -877 -19123 -20381 -1090 4229 -9347 -12955 -1413 3720 -636 -4449 -12543 -20564 -6388
148f388K6971N04k8664j2086J6769J2533n598m655K948M72J691P467k586j4814
$$ -6388 20583 21087 -7577 -19663 -2894 9639 4041 -614 2334 2806 4497 11964 9378 -5436
162e436P9J7759M449j3534k186J3559K00j4992l374J0339N933Q36J195p417j2880
$$ -5436 -5357 12402 16851 3317 1131 14690 14890 -102 -3476 6863 12796 13632 14827 7410 -5470
177e470L646J7372O4j7158j740J6281L435j3437o245L321k06J019Q225n83j1719
$$ -5470 -1824 15548 15612 -1546 -3286 12995 16430 2993 -3252 69 -137 882 9107 8524 -3195
192c195q76J0294k886j4618J190J5699K385j1602l919L589k496k01O118j119j0427
$$ -3195 -4071 6223 3337 -11281 -10091 5608 7993 -3609 -7528 -3939 -6435 -6636 -518 -1637 -12064
207a2064K166J3610k107j6863j690J4031L567p657J0L642m198k692N159K24o812
$$ -12064 -9898 3712 1605 -15258 -16948 -2917 650 -7007 -6997 -3355 -7553 -10245 -5086 -4862 -11674
222a1674M485J3318l457j5703M70J3006J104q782K202O693j403j565M672k650
$$ -11674 -7189 6129 2672 -13031 -12561 445 1549 -7233 -5031 1662 259 -1306 3366 716
236G16r550L957J3844l74j1815J568J0274k562q400L850O840k721j770N892j514
$$ 716 -8834 -4877 8967 8593 -3222 -1654 8620 6058 -2342 1508 8348 5627 3857 9749 8235
251H235r858K666J2010j398j1238K207J0203k077q749J565L543l684R24P879j591
$$ 8235 -1623 1043 13053 11655 417 2624 12827 10750 2001 3566 7109 3425 4349 12228 10637
266A0637j0694J20R288k555j0266L591J0127l131q967J439M239m609j489N269
$$ 10637 -57 63 9351 6796 -3470 121 10248 7117 -1850 -411 3828 -781 -2270 2999
280B999j639p339L003R147n497j1636K934R981k276o536K807K453o080j724P690
$$ 2999 1360 -5979 -2976 6171 674 -10962 -8028 1953 -323 -6859 -4052 -1599 -7679 -9403 -1713
295a713j71p981J700Q942l545r223L541Q163m486n993N835N025n346k064N600
$$ -1713 -1884 -9865 -8165 777 -2768 -11991 -8450 -287 -4773 -10766 -4931 94 -5252 -7316 -1716
310a716j375p749N054J0589l370r348L272P625k986n004N015L214m809N09P722
$$ -1716 -3091 -10840 -5786 4803 1433 -7915 -4643 2982 -4 -5008 7 3221 -1588 -1079 6643
325F643j997q130L145Q582l239p154N560P246n741o128N302L992m125j18O122
$$ 6643 4646 -3484 -339 8243 5004 -2150 3410 10656 4915 -1213 4089 8081 3956 3838 9960
340I960k876p143L674Q059n128o991M730O597m907m844M609J245o509k31P490
$$ 9960 7084 -59 3615 11674 6546 -445 4285 10882 5975 1131 5740 6985 476 245 7735
355G735r31p617J806O006m747p244N229N451n413m706N350J279o250j73O087l272
$$ 7735 6804 -813 993 6999 2252 -4992 237 5688 275 -4431 919 2198 -4052 -4225 1862 -1410
371a410p385M649P128n269q188M418N682m202l205M815J152o469L88O863k356
$$ -1410 -8795 -4146 2982 -2287 -10475 -6057 -375 -4577 -7782 -2967 -1815 -8284 -7896 -1033 -3389
386c389o367L772O742m813o175O134M764o448l265O774K630n357M74O166k802
$$ -3389 -9756 -5984 758 -4055 -10230 -4096 668 -5780 -9045 -2271 359 -4998 -4524 1642 -1160
401a160n740M528O701m168n181N686M652n786j866O526Q07o112J672O963k617
$$ -1160 -6900 -2372 4329 161 -5020 666 5318 -468 -2334 4192 4999 -1113 559 7522 4905
416D905o330M190O333m839m655O108L775n782k778N695N41n650K030N745l182
$$ 4905 -1425 2765 9098 4259 -396 5712 9487 3705 927 6622 7163 1513 3543 9288 6106
431F106o173M504N284n843n204N793L678o278k090N732n16o567J162N640l300
$$ 6106 -67 4437 9721 3878 -1326 4467 8145 1867 -223 5509 4993 -1574 -412 5228 1928
446A928n322L973M315n978m456O063K582o929j600O116p94o439J486N539l876
$$ 1928 -3394 579 4894 -1084 -5540 523 3105 -3824 -5424 692 -102 -6541 -5055 484 -3392
461c392n110M704M483n620m025N536K112n964m53O253j145n784K235N999l884
$$ -3392 -8502 -3798 685 -4935 -8960 -3424 -1312 -7276 -7729 -1476 -2621 -8405 -6170 -171 -4055
476d055n131N423M520n328k964O110K450n960l23O310p69m746K867N441m172m239
$$ -4055 -9186 -3763 757 -4571 -7535 -1425 1025 -4935 -5258 1052 283 -4463 -1596 3845 -327 -4566
492d566N642M333n687k352O511K008o278K28O534j531n186L190N191l556m418
$$ -4566 1076 5409 -278 -2630 3881 5889 -389 -161 6373 4842 -344 2846 8037 4481 63
507F3M984L661o011j787O063J162o146K16N642j899n602K564N303m656m307M765
$$ 63 5047 8708 2697 910 6973 8135 1989 2205 7847 5948 346 2910 8213 3557 -750 4015
523D015L183n924k353N486L37o256M50N653k869n144K867L878m464m091N386K148
$$ 4015 7198 1274 -1079 4407 4744 -1512 -1062 4591 1722 -3422 -555 3323 -1141 -5232 154 2302
539B302o169j898N527Q33o767J140M928k328m691K969L764m882k792N275K171
$$ 2302 -3867 -5765 -238 595 -6172 -5032 -104 -2432 -7123 -4154 -390 -5272 -8064 -2789 -618
554f18o160n29N704l45n539J396N664k349m904M308M438m968k492N224K099n316
$$ -618 -6778 -7307 -1603 -1948 -7487 -6091 -427 -2776 -7680 -3372 1066 -3902 -6394 -1170 929 -4387
570d387q0N829q8n517K053N731k889m240M725M164m699k847O032J807n298p84
$$ -4387 -4467 1362 1274 -4243 -2190 3541 652 -3588 1137 5301 602 -2245 3787 5594 296 -488
586d88O214j63n322J880N061l104l609L925L493n028k232N906O88n577j71N817
$$ -488 5726 5563 241 2121 7182 4078 469 4394 7887 2859 627 6533 7221 1644 1473 7290
602G290j487n189J774M632l545m446M121K883n111k082M832Q16n881K25M761k015
$$ 7290 5803 614 2388 7020 3475 -971 3150 6033 922 -1160 3672 4488 -1393 -1168 3593 1578
618A578m988K199M528m277l944M220K265n201j810M988J45n183K50M867j673n024
$$ 1578 -3410 -1211 3317 -960 -4904 -684 1581 -3620 -5430 -442 -297 -5480 -5230 -363 -2036 -7060
634g060K671M032l826l128M251K304m981j833N804O00n753J271N444j966m628
$$ -7060 -4389 -357 -4183 -7311 -3060 -756 -5737 -7570 -1766 -1166 -6919 -5648 -204 -2170 -6798
649f798L507M056l740k764M951J940m491j024N946n7m948J439N256j837m413L767
$$ -6798 -3291 765 -2975 -5739 -788 1152 -3339 -4363 1583 1526 -3422 -1983 3273 1436 -2977 790
665G90M084l589k881N028K220m751q69N341l67m985J857M978k922m000L805L755
$$ 790 4874 1285 -1596 3432 5652 901 32 5373 5006 21 1878 6856 3934 -66 3739 7494
681G494m573k472M970J370n215n63N309q19m941R20M565k852l931L524K553m285
$$ 7494 2921 449 5419 6789 1574 1011 6320 5501 560 1480 6045 3193 -738 2786 5339 1054
697A054k379M688M21n233l22N165j541n350J951M234l085m337L292K692m413j981
$$ 1054 -1325 3363 3784 -1449 -1771 3394 1853 -3497 -1546 2688 -397 -4734 -1442 1250 -3163 -5144
713e144M327N41m956K87M632j653m548K133L754l080l275L709K821m677j265M345
$$ -5144 -817 -276 -5232 -4945 -313 -1966 -6514 -4381 -627 -3707 -6982 -3273 -452 -5129 -6394 -2049
729b049J281n018N48N206j545m266K461M241l238k827M462K250m436j065N557
$$ -2049 -768 -5786 -5238 -32 -1577 -5843 -3382 859 -2379 -5206 -744 1506 -2930 -3995 1562
744A562L11m840J364M814j202m488L295L795l161k778M169K555m657p65M861K82
$$ 1562 1873 -2967 -1603 3211 2009 -2479 816 4611 1450 -1328 2841 5396 739 -26 4835 5117
760E117m610J344M588k139l851K969L423l509l116M797J401m787q99M818l49m929
$$ 5117 507 1851 6439 4300 449 3418 6841 3332 216 5013 6414 1627 728 5546 5197 268
776B68J027M321k696l993L143K786l987k562M112R56m726r95M928j153m933J223
$$ 268 1295 5616 2920 -1073 2070 4856 869 -1693 2419 3375 -1351 -2346 2582 1429 -3504 -2281
792b281M259k773l591K439L017m098k236M221J024m977k60M656j154m612J825
$$ -2281 1978 -795 -4386 -1947 1070 -3028 -5264 -1043 -19 -4996 -5256 -600 -1754 -6366 -4541
807d541M316k615l787L576K772l929k130M203J500m347O8M499j068l775K160M105
$$ -4541 -225 -2840 -6627 -3051 -279 -4208 -6338 -2135 -635 -4982 -4914 -415 -1483 -5258 -3098 1007
823A007k599l061L838K775m299j241N118O50m358M98M973j039m132K383M137l086
$$ 1007 -1592 -4653 -815 1960 -2339 -3580 1538 2188 -2170 -1672 3301 2262 -1870 513 4650 1564
839A564k233L547K345l607j175M256Q19n079P79N009j894m062K541L618k979k954
$$ 1564 -669 2878 5223 1616 441 4697 5516 437 1216 6225 4331 269 2810 6428 3449 495
855D95L529K342m461j551M664m86m182O20L784j849m059K554L154l647l013L860
$$ 495 4024 6366 1905 354 5018 4532 350 970 4754 2905 -1154 1400 4554 907 -2106 1754
871A754J278m374r69L899j30m517N33L926k042l960K830K889l744k582L727J500
$$ 1754 3032 -1342 -2311 1588 1458 -3059 -2526 1400 -642 -4602 -1772 1117 -2627 -5209 -1482 18
887A8m361r31M396l99m330J220M175k046l741K580L339l269k368L788J861m431
$$ 18 -4343 -5274 -878 -1277 -5607 -4387 -212 -2258 -5999 -3419 -80 -3349 -5717 -1929 -68 -4499
903d499j46M249n38l595J690M046k277l277L565K997l566j513L969J326l929J69
$$ -4499 -4645 -396 -934 -4529 -2839 1207 -1070 -4347 -782 2215 -1351 -2864 1105 2431 -1498 -1329
919a329M389o67l762K017L968k367l151L230K905l736j492M382O64m365L58M383
$$ -1329 3060 2393 -1369 648 4616 2249 -902 2328 5233 1497 5 4387 5051 686 1044 5427
935E427q70m119J825L604k837k862L306J881l785j500L918M54m314O34L758j779
$$ 5427 4557 438 2263 5867 3030 168 3474 5355 1570 70 3988 4442 128 762 4520 2741
951B741l868J694L621l290k736L058J600l939j786M124J09m152J81L730j610l726
$$ 2741 -1127 567 4188 898 -1838 1220 2820 -1119 -2905 1219 1328 -2824 -2643 1087 -523 -4249
967d249K423K536l169k692L770J613m121j173M021P5m185Q58L719j116l748J870
$$ -4249 -1826 710 -2459 -5151 -1381 232 -3889 -5062 -1041 -966 -5151 -4293 -574 -1690 -5438 -3568
983c568L451l181j645L232J392l577j38M072l32l980J823L738k023l078K849L130
$$ -3568 -117 -3298 -4943 -1711 -319 -3896 -4034 38 -294 -4274 -2451 1287 -736 -3814 -965 2165
999B165k998k142M058J620l728k43M188j63l821J645M023k114l343L395K874l452
$$ 2165 -833 -2975 1083 2703 -1025 -1268 2920 2757 -1064 581 4604 2490 -853 2542 5416 1964
1015A964k179M091J215l938l56M339m73m327J540L324j923l391L279J899l586
$$ 1964 -215 3876 5091 1153 797 5136 4663 336 1876 5200 3277 -114 3165 5064 1478
1030A478j597L767O51m064n76M398j215l898J433L271k827k914K851K117m043
$$ 1478 -119 3648 4299 235 -341 4057 2842 -1056 377 3648 821 -2093 758 2875 -1168
1045a168j335L535L37m390L74L358r66m110J714L290l068k758K995K298l817j218
$$ -1168 -2503 1032 1369 -3021 -2647 711 -255 -4365 -2651 639 -2429 -5187 -2192 106 -3711 -4929
1061d929L691O01m261M81L965j440l385K031L129k791k202L617J577l324q83L818
$$ -4929 -1238 -637 -4898 -4417 -452 -1892 -5277 -3246 -117 -2908 -5110 -1493 84 -3240 -4123 -305
1077c05K75l569P28M090j323k870K413K873k723j763L524J378l510j79L831K09
$$ -305 -30 -3599 -2871 1219 -104 -2974 -561 2312 -411 -2174 1350 2728 -782 -961 2870 3079
1093C079l941J181L942j599l308K657L222l192k100L428J378l375n19L530ml412
$$ 3079 -862 319 4261 2662 -646 2011 5233 2041 -59 3369 4747 1372 853 4383 4379 967
1109I67P05L504j757l293K162K753l564j922L539O64l525n40L823r83l654Q57
$$ 967 1672 5176 3419 126 2288 5041 1477 -445 3094 3758 233 -307 3516 2533 -1121 -264
1125b64L462k367k969J913K570l458k148L707L34l746J13L470j052l658J607L054
$$ -264 3198 831 -2138 -225 2345 -1113 -3261 446 780 -2966 -2853 617 -435 -4093 -2486 568
1141E68k489k765K596K025l254j557L489P37l863M17L813j262l423K122K989k426
$$ 568 -1921 -4686 -2090 -65 -3319 -4876 -1387 -650 -4513 -4096 -283 -1545 -4968 -2846 143 -2283
1157b283k789L453K192l377j192M021L39l505O15L748p98l117J972K902k261k256
$$ -2283 -5072 -1619 573 -2804 -3996 25 364 -3141 -2526 1222 424 -2693 -721 2181 -80 -2336
1173b336L334J784k950p61L740L51l738J098L624j407l212K416L080k853k303
$$ -2336 998 2782 -168 -929 2811 3162 -576 522 4146 2739 -473 1943 5023 2170 -133
1188a33L083J630l289r20L744J90l640O32L297j666l157K170K877l192k134L468
$$ -133 2950 4580 1291 371 4115 4305 665 1297 4594 2928 -229 1941 4818 1626 -508 2960
1204B960Q06l685n33L688r96l569Q83K674j347l339K183K334l286k085L462Q25
$$ 2960 3766 81 -452 3236 2240 -1329 -446 2228 881 -2458 -275 2059 -1227 -3312 150 975
1220I75l604n36L606p75l623O96L625k132l219K944K254l102j786L634Q01l902
$$ 975 -2629 -3165 441 -334 -3957 -3261 364 -1768 -4987 -2043 211 -2891 -4677 -1043 -242 -4144
1236d144N4L958p25l672J420L239k162k253K434K538k911j460L598R89l638R8
$$ -4144 -4090 -132 -857 -4529 -3109 130 -2032 -4285 -1851 687 -2224 -3684 -86 903 -2735 -2637
1252b637L563m21l014J600L145j632k547L008K305l429r00L587P23l405K84L486
$$ -2637 926 505 -2509 -909 2236 604 -1943 1065 3370 -59 -959 2628 3351 -54 230 3716
1268C716q72l536K487K527j995k532K892J846l101r86L584k25l064L52L290j306
$$ 3716 2844 -692 1795 4322 2327 -205 2687 4533 1432 446 4030 3805 741 1093 4383 3077
1284C077l431J909K271k190k500K851J726l620j251L739k41m069P92L738j948
$$ 3077 -354 1555 3826 1636 -864 1987 3713 93 -1158 2581 2340 -1729 -937 2801 853
1299H53l167J987J990k631k122K752J418l548j041L581q8l581P38L039j570l125
$$ 853 -2314 -327 1663 -968 -3090 -338 1080 -2468 -3509 72 -16 -3597 -2859 180 -1390 -4515
1315d515K424K271k929j665L022O93l283Q2L521o6l827J130L485j728k413J823
$$ -4515 -2091 180 -2749 -4414 -1392 -699 -3982 -3900 -379 -445 -4272 -3142 343 -1385 -3798 -1975
1331a975K880k579j674L255J215k962m86L433l01l043J586L076j515k327K216
$$ -1975 905 -1674 -3348 -93 1122 -1840 -2326 1107 806 -2237 -651 2425 910 -1417 799
1346G99K519k927j170L546P98l533o5L676m69l201J534K878j876k545K796J621
$$ 799 3318 391 -779 2767 3565 32 -33 3643 3174 -27 1507 4385 2509 -36 2760 4381
1362D381l075j344L423K34k984N5L381j192l435J761K969k411k424K136J727l041
$$ 4381 1306 -38 3385 3619 635 690 4071 2879 -556 1205 4174 1763 -661 1475 3202 161
1378A61j411L220K44l627K79K892q25l270J551K435k754k093K716J481l410j134
$$ 161 -1250 1970 2214 -1413 -1134 1758 933 -2337 -786 1649 -1105 -3198 -482 999 -2411 -3545
1394c545L304M50l802K55L583j418k833J731K752k892k004K675J495k688j073
$$ -3545 -241 209 -3593 -3338 245 -1173 -4006 -2275 477 -2415 -4419 -1744 -249 -2937 -4010
1409d010L610j16l302J283K983j425k610J902K652k244j982L304J082k938m43
$$ -4010 -400 -516 -3818 -2535 448 -977 -3587 -1685 967 -1277 -3259 45 1127 -1811 -2254
1424b254L734k65l315J371L310j444k477K174K365k545j439L023J053l276J07
$$ -2254 1480 1215 -2100 -729 2581 1137 -1340 834 3199 654 -785 2238 3291 15 122
1439A22L182k23l018Q11L233j904k545K404K118k953j324L067R09l251j78L414
$$ 122 3304 3081 63 874 4107 2203 -342 2062 4180 1227 -97 2970 3879 628 450 3864
1455C864q32l344R76K674j743k587K047K219l380j423K819M99l214l8L066n73
$$ 3864 3032 -312 664 3338 1595 -992 1055 3274 -106 -1529 1290 1789 -1425 -1463 1603 1030
1471A030l467J329K969k629k470K570J655l277j066L029J05k905M7L104j155l059
$$ 1030 -2437 -1108 1861 -768 -3238 -668 987 -2290 -3356 -327 -222 -3127 -3080 24 -1131 -4190
1487d190J851K685k195k286K417J671k541j170L310N75l637L38L762q17l022J981
$$ -4190 -2339 346 -1849 -4135 -1718 -47 -2588 -3758 -448 127 -3510 -3172 590 -227 -3249 -1268
1503a268K118j783j845K574J699l099j51L145R5k706N54L023r13k701J963K043
$$ -1268 850 -933 -2778 -204 1495 -1604 -1755 1390 1485 -1221 -667 2356 1443 -1258 705 2748
1519B748j959j652K806J478k517o53K535M43l329J109K804j326k597K378J764
$$ 2748 789 -863 1943 3421 904 251 2786 3229 -100 1009 3813 2487 -110 2268 4032
1534D032k558j609K743R09k813n44K897l62k961O77K650j542k521K044J838k693
$$ 4032 1474 -135 2608 3517 704 160 3057 2695 -266 411 3061 1519 -1002 1042 2880 187
1550A87j933L134M11l336l57L303j071k796J134K372j721k421J761K116k577j516
$$ 187 -1746 1388 1799 -1537 -1894 1409 338 -2458 -1324 1048 -673 -3094 -1333 783 -1794 -3310
1566c310K685P65l352n6L456j185k647J297K432j637k282K192J983k840r76K875
$$ -3310 -625 140 -3212 -3268 188 -997 -3644 -2347 85 -1552 -3834 -1642 341 -2499 -3475 -600
1582f00R43l200J31K987o30k787J737K350j469k161K500J864k665q52K751Q94
$$ -600 343 -2857 -2726 261 -369 -3156 -1419 931 -538 -2699 -199 1665 -1000 -1852 899 1793
1598A793k853O26K858r76k502J620K270j618k019K621J461k422j011K913O06k849
$$ 1793 -1060 -434 2424 1448 -1054 566 2836 1218 -801 1820 3281 859 -152 2761 3367 518
1614E18K60K688j172k470J969J736k102j628K498J365l364l76K806n22k599N83
$$ 518 778 3466 2294 -176 1793 3529 1427 -201 2297 3662 298 -78 2728 2206 -393 190
1630A90K666j357k590J637J826k173j875K676O74l243o0K425j33l057N33K937
$$ 190 2856 1499 -1091 546 2372 199 -1676 1000 1674 -1569 -1629 796 663 -2394 -1861 1076
1646A076j745k455K237J595k595j674K921R73k896o32K801m96k692J002K756j868
$$ 1076 -669 -3124 -887 708 -1887 -3561 -640 333 -2563 -3195 -394 -890 -3582 -2580 176 -1692
1662a692k094K268J789k264j400K698Q26k841J54K819q0k903J333K491j281k161
$$ -1692 -3786 -1518 271 -1993 -3393 -695 131 -2710 -2556 263 183 -2720 -1387 1104 -177 -2338
1678b338K118J709k457o05K877M62k610J52L119q24k233J132K512j623k146K165
$$ -2338 -220 1489 -968 -1573 1304 1766 -844 -692 2427 1603 -630 502 3014 1391 -755 1410
1694A410J723k495r24L011L92k577J19K634o33k710R68K692k154j505J980J267
$$ 1410 3133 638 -286 2725 3117 540 659 3293 2660 -50 918 3610 1456 -49 1931 3198
1710C198k396r27K448J35l065L88K439p55k349J394K107k584j718J958J300k694
$$ 3198 802 -125 2323 2458 -607 -219 2220 1465 -884 510 2617 33 -1685 273 1573 -1121
1726a121q77K816j28l234N45K947j616k396J385K441k217j994K603J076k898k38
$$ -1121 -1998 818 690 -2544 -1999 948 -668 -3064 -1679 762 -1455 -3449 -846 230 -2668 -2906
1742b906K521j15k775Q36K623j369j806J371J606j722j539L077O85k703nK904
$$ -2906 -385 -500 -3275 -2439 184 -1185 -2991 -1620 -14 -1736 -3275 -198 487 -2216 -2221 683
1758F83n92j807M44K711j710j696J755J767j842j462K941O07k424j41L144o88
$$ 683 91 -1716 -1272 1439 -271 -1967 -212 1555 -287 -1749 1192 1799 -625 -766 2378 1690
1774A690k083Q32K710j699k099K344J241k037j182K646M85k502K18K463l68k648
$$ 1690 -393 439 3149 1450 -649 1695 2936 899 -283 2363 2848 346 564 3027 2659 11
1790A1J202J980j302k191J841J758k625j122K606K35k918J16K495p08k616J434
$$ 11 1213 3193 1891 -300 1541 3299 674 -448 2158 2393 -525 -409 2086 1378 -1238 196
1806A96J739j785j704J596J513k623j083K825K38k958L58K164r45k504J157K072
$$ 196 1935 150 -1554 42 1555 -1068 -2151 674 912 -2046 -1688 476 -469 -2973 -1816 256
1822B56j736j553K097P50k053n40K608j28k364K83K467o12k710J558J950j971
$$ 256 -1480 -3033 -936 -186 -2239 -2779 -171 -299 -2663 -2380 87 -525 -3235 -1677 273 -1698
1838a698j174K188J157k202n87K608l18k015N66K811j077j929J914J279j511j491
$$ -1698 -2872 -684 473 -1729 -2316 292 -26 -2041 -1475 1336 259 -1670 244 1523 12 -1479
1854a479K507J040k539l01K921j22k568Q32K577j298k064J820J618j733j182K064
$$ -1479 1028 2068 -471 -772 2149 2027 -541 291 2868 1570 -494 1326 2944 1211 29 2093
1870B093R89k404o27K686m1k605Q91K009j310k030J633J381j881j350K190N53
$$ 2093 3082 678 51 2737 2696 91 982 2991 1681 -349 1284 2665 784 -566 1624 2177
1886B177k475L1K211p12k389Q81K016j508k159K077J317k250j174K381L18k935
$$ 2177 -298 -267 1944 1232 -1157 -276 1740 232 -1927 150 1467 -783 -1957 424 742 -2193
1902b193L00K303q53k589J276K377j644j978J794J380k384o86K359K59k222j00
$$ -2193 -1893 410 -443 -3032 -1756 621 -1023 -3001 -1207 173 -2211 -2897 -538 -279 -2501 -2601
1918b601K297m57k006R54K146j741j073K071J102k186n36K262L46k226O55K151
$$ -2601 -304 -761 -2767 -1813 333 -1408 -2481 -410 692 -1494 -2030 232 578 -1648 -993 1158
1934A158m66k339J786J484j291j335J832J210k123m54K719k17k371P23K131n39
$$ 1158 692 -1647 139 1623 332 -1003 829 2039 -84 -538 2181 1964 -407 316 2447 1908
1950A908j921J087J841j501j535K028R84k408k04J898R6k036Q6K500q23k519J441
$$ 1908 -13 1074 2915 1414 -121 1907 2891 483 279 2177 2273 237 323 2823 2000 -519 922
1967I22J670k318o68J461R49k303l57K435n86k530N42K028j086k195J801J301
$$ 922 2592 274 -394 1067 2016 -287 -644 1791 1205 -1325 -783 1245 159 -2036 -235 1066
1983A066j974j043J698P96k282k13K078l07k453P04K362j611j826J974Q95j838
$$ 1066 -908 -1951 -253 543 -1739 -1952 126 -181 -2634 -1930 432 -1179 -3005 -1031 -136 -1974
1999a974r34K480Q4j859l8K066k88k096Q61K242j630j503J554J816k282p56K500
$$ -1974 -2908 -428 -344 -2203 -2241 -175 -463 -2559 -1698 544 -1086 -2589 -1035 781 -1501 -2257 243
2016B43L91k441P75K144m17j929J228J946j273j725K092J184k123o57K321K97
$$ 243 634 -1807 -1032 1112 695 -1234 -6 1940 667 -1058 1034 2218 95 -562 1759 2056
2032B056j997M9K331n60k081J555J801k087p46J389R34j994n46K300p8k186K73
$$ 2056 59 108 2439 1879 -202 1353 3154 1067 321 1710 2644 650 104 2404 2326 140 413
2049D13K103p72k341J485J506j639j220J664P67j964o92K113j21k752L93K659
$$ 413 2516 1744 -597 888 2394 755 -465 1199 1966 2 -690 1423 1302 -1450 -1057 1602
2065A602j240j964J124J009j194j462J965P29k278j86K219l44k660Q26J632p11
$$ 1602 362 -1602 -478 531 -663 -2125 -160 569 -1709 -1895 324 -20 -2680 -1854 -222 -933
2081i33j903J369J764k297p67K138O89k210l01K412k34j908N22K273j456j426
$$ -933 -2836 -1467 297 -2000 -2767 -629 60 -2150 -2451 -39 -273 -2181 -1659 614 -842 -2268
2097b268J604J152j352j151K241M87j717k08K210k22j556Q34J911j549j380J693
$$ -2268 -664 488 -864 -2015 226 713 -1004 -1212 998 776 -780 54 1965 416 -964 729
2113G29J606j978p85K277L85k118J57J960m27j857R49J708j047j753J376J377
$$ 729 2335 357 -428 1849 2234 116 273 2233 1806 -51 898 2606 1559 -194 1182 2559
2129B559j499q30J779M57k341j41K264j005j558R50J433j224j300J615L81j787
$$ 2559 1060 230 2009 2466 125 -16 2248 1243 -315 635 2068 844 -456 1159 1540 -247
2145b47p12K058M42k628q0K218o97k542J584J170j360j283J636Q56k090j09J965
$$ -247 -959 1099 1541 -1087 -1167 1051 354 -2188 -604 566 -794 -2077 -441 415 -1675 -1784 181
2162A81k04k307O05J809p69j643Q00J542j818j139J964R45j886j38J838p8j835
$$ 181 -23 -2330 -1725 84 -685 -2328 -1528 14 -1804 -2943 -979 -34 -1920 -2058 -220 -298 -2133
2179b133M92K134q72j667J216J560j550j166K374N58k076l3K205Kj858M81K253
$$ -2133 -1641 493 -379 -2046 -830 730 -820 -1986 388 946 -1130 -1163 1042 1044 -814 -333 1920
2196A920q58j905J593J245j431p09J550P19k116L12J657k2k113P40K048j287j364
$$ 1920 1062 -843 750 1995 564 -145 1405 2124 8 320 1977 1955 -158 582 2630 1343 -21
2213b1J157J438j716j076J994O61k341J35J561N4k377J006J427j314j641J786
$$ -21 1136 2574 858 -218 1776 2437 96 231 1792 1846 -531 475 1902 588 -1053 733
2229G33J022k149m20J531O04j841l45J752l98k116Q11J702j616r48J024J212k201
$$ 733 1755 -394 -814 717 1321 -520 -865 887 489 -1627 -816 886 -730 -1678 -654 558 -1643
2246a643o33J867Q0k030N02J693n55j778J384J088j097j449J626J067j662p11
$$ -1643 -2276 -409 -329 -2359 -1857 -164 -719 -2497 -1113 -25 -1122 -2571 -945 122 -1540 -2251
2262b251J827O77k265L25J987m56j477Q85J620j296j194K153N42j657m38K322
$$ -2251 -424 253 -2012 -1687 300 -156 -1633 -748 872 -424 -1618 535 1077 -580 -1018 1304
2278A304l50j664L72K136r69j329J085J385r79j130J443P94j653j21J704l95j318
$$ 1304 954 -710 -338 1798 829 -500 585 1970 991 -139 1304 2098 445 324 2028 1633 315
2295C15K59J785r45j727J037J628j693m17Q72R50j652l98J800j89k042M97J550
$$ 315 574 2359 1414 -313 724 2352 659 242 1114 2064 412 14 1814 1625 -417 80 1630
2312A630p75j509Q67J479j950q06J612M94j922j82J703n75j628N76J592r47j782
$$ 1630 855 -654 213 1692 -258 -1064 548 1042 -880 -1062 641 66 -1562 -986 606 -341 -2123
2329b123J611N37j243j104J786J41j586n0K049k06k019P71J677j397r79J349Q24
$$ -2123 -512 25 -1218 -2322 -536 -395 -1981 -2031 18 -188 -2207 -1436 241 -1156 -2135 -786 38
2346C8j503o62J788J82j286j64K057p12j459J046J261q46j079J327J236j466o94
$$ 38 -1465 -2127 -339 -157 -1443 -1607 450 -262 -1721 -675 586 -260 -1339 -12 1224 -242 -936
2363i36K099J0j547j50J838m74j295J011J329j203r12J552O63j826L1J765J89
$$ -936 1163 1173 -374 -524 1314 840 -455 556 1885 682 -230 1322 1985 159 190 1955 2144
2380B144j510m05K161q84j697R10J373j329j042J507Q39j766n46J858l72j578
$$ 2144 634 229 2390 1506 -191 719 2092 763 -279 1228 2067 301 -245 1613 1241 -337
2396c37M51J373q58j444Q14J316j796q75J784N21j708o02J907l06j716K69J706
$$ -337 114 1487 629 -815 -1 1315 -481 -1356 428 949 -759 -1361 546 240 -1476 -1207 499
2413D99r11j648R89J229j469o42J383M98j495m01J677j51j544M63J490n11j564
$$ 499 -412 -2060 -1071 158 -1311 -1953 -570 -72 -1567 -1968 -291 -442 -1986 -1523 -33 -544 -2108
2430b108J431J068j379q28J628J02j060k13J523J08j871R21J446j109j029J527
$$ -2108 -677 391 -988 -1816 -188 -86 -1146 -1359 164 272 -1599 -678 768 -341 -1370 157
2446A57P61j140p49J857N68j942L60J583k86j678J104J286j357p37J131J252j547
$$ 157 918 -222 -971 886 1454 -488 -128 1455 1169 -509 595 1881 524 -213 918 2170 623
2463F23o65J748J81j419Q6J297n62j334Q89J053j114j106J259M29q97q18J629
$$ 623 -42 1706 1887 468 554 1851 1289 -45 844 1897 783 -323 936 1365 468 -350 1279
2480A279K14j890L67J215m75j612P26J378j221j300J342P27j703m55J719k42j609
$$ 1279 1493 -397 -30 1185 710 -902 -176 1202 -19 -1319 23 750 -953 -1408 311 69 -1540
2497a540M40J257o49j317O59J415j350p15J341M50j935l5J741k81j405M02J263
$$ -1540 -1100 157 -492 -1809 -1150 265 -1085 -1800 -459 -9 -1944 -1979 -238 -519 -1924 -1522 -259
2514b59m53j028Q56J410j628m68J389M02j709j5J604K33j253M93J399r54q74Q87
$$ -259 -712 -1740 -884 526 -1102 -1570 -181 221 -1488 -1503 101 334 -919 -426 973 19 -855 32
2532C2J204j535o32J766M70j323l42J643K22j726N86J535j047j137J546R19j590
$$ 32 1236 -299 -931 835 1305 -18 -360 1283 1505 -221 365 1900 853 -284 1262 2181 591
2549E91o75J593K65j582j14J505N0j769P15J672j512r85J205O60j553o33J610
$$ 591 -84 1509 1774 192 78 1583 1633 -136 579 2251 739 -246 959 1619 66 -567 1043
2566A043L77j753P7J518j022j071N23J376r45j539J384P02j185p06J084M37j734
$$ 1043 1420 -333 -256 1262 240 -831 -308 1068 123 -1416 -32 670 -515 -1221 -137 300 -1434
2583a434J5J604j011r27P86J114p84j369J156R31j540o57K003l12j369K10J933
$$ -1434 -1419 185 -826 -1753 -967 147 -637 -2006 -850 81 -1459 -2116 -113 -425 -1794 -1584 349
2600C49q41j394J012J221j277q24J710L26j095n23J562J21j652Q76J524p99r63
$$ 349 -492 -1886 -874 347 -930 -1754 -44 282 -813 -1336 226 347 -1305 -429 1095 296 -667
2617f67P17J470j318q67J367O61j463j49J780k3j721K90J426p09j210J335R49
$$ -667 50 1520 202 -665 702 1363 -100 -249 1531 1508 -213 77 1503 794 -416 919 1868
2634A868j179r92J569M01j331l8J243j66j663Q84J197r14j485J444J012j549o59
$$ 1868 689 -303 1266 1667 336 298 1541 1375 -288 596 1793 879 -606 838 1850 301 -358
2651c58J313j82j178k01J535l16j873O64J404p49j062P04J052j368j102J445M86
$$ -358 955 773 -405 -606 929 613 -1260 -596 808 59 -1003 -299 753 -615 -1717 -272 214
2668B14j776N1J686n96j439Q86J247j058j153J282J015j682m34J402L14j101k87
$$ 214 -1562 -1511 175 -421 -1860 -974 273 -785 -1938 -656 359 -1323 -1757 -355 -41 -1142 -1429
2685a429J202j63j557J026J302q22j343J432R66j355r7J310q5j164K33J663n92
$$ -1429 -227 -390 -1947 -921 381 -441 -1784 -352 614 -741 -838 472 387 -777 -544 1119 527
2702E27j126M34J560r51j323J833M33j077o76J861l5j396L08J445m77j619P40
$$ 527 -599 -165 1395 444 -879 954 1387 310 -366 1495 1460 64 372 1817 1340 -279 461
2719D61J043n65j170J550O93j753m1J025M39j737L47J075l55j454Q93Q17r20q04
$$ 461 1504 939 -231 1319 2012 259 218 1243 1682 -55 292 1367 1012 -442 451 1268 348 -456
2737d56R80N18j557l92J769n14j277N29J347q71j427R69R53j101r29J303K05j408
$$ -456 524 1042 -515 -907 862 348 -929 -400 947 76 -1351 -382 571 -530 -1459 -156 49 -1359
2755a359l46J881l93j561P36J189o01j810J515Q64j282m23J124M35j187r5J575
$$ -1359 -1705 176 -217 -1778 -1042 147 -454 -2264 -749 115 -1167 -1590 -466 -31 -1218 -1313 262
2772B62n38j398R58J222p31j329J387R31j423o01J764N35j509O6J339k09j305
$$ 262 -276 -1674 -716 506 -225 -1554 -167 764 -659 -1260 504 1039 -470 -404 935 726 -579
2789e79M99J552j188o27R65O66q38p59J463M52j580K3J411K1j787J010J055p51
$$ -579 -80 1472 284 -343 622 1288 450 -309 1154 1606 26 49 1460 1481 -306 704 1759 1008
2807A008j237J462L72j004q41J346M55j676K31J203k67j748Q42J123j099o67Q05
$$ 1008 -229 1233 1605 601 -240 1106 1561 -115 116 1319 1052 -696 146 1269 170 -497 308
2824C08P14j222n60J197J40j614J78J772r73j474O78J597j264j092J449L72j383
$$ 308 1022 -200 -760 437 577 -1037 -859 913 -60 -1534 -856 741 -523 -1615 -166 206 -1177
2841a177m76J414K24j520J65J635j016p44N86Q59o80j032J543N77j582n0J542
$$ -1177 -1653 -239 -15 -1535 -1370 265 -751 -1495 -909 -50 -730 -1762 -219 358 -1224 -1274 268
2858B68l97j091L98J276n97j050R97P88q35q86J539M47j708L33J459o1j354N73
$$ 268 -129 -1220 -822 454 -143 -1193 -196 592 -243 -1129 410 857 -851 -518 941 880 -474 99
2876I9J277r37q00R16J033j169q56J657K67j595L28J597l39j401M01J329q91j238
$$ 99 1376 439 -361 555 1588 419 -437 1220 1487 -108 220 1817 1478 77 478 1807 916 -322
2894c22J323O06j110n29R95L59j442j4J304m86j070L15J525j377o98J226O01j596
$$ -322 1001 1607 497 -32 963 1322 -120 -134 1170 684 -386 -71 1454 77 -621 605 1206 -390
2912c90n22J357L55j615l3J312l41j262M31J163j101r69J356O04j278q17J677
$$ -390 -912 445 800 -815 -848 464 123 -1139 -708 455 -646 -1615 -259 345 -933 -1750 -73
2929g3J21j617K08J417m01j548J020J044q54q06J153O51j528k28J351L75j303
$$ -73 48 -1569 -1361 56 -345 -1893 -873 171 -683 -1489 -336 315 -1213 -1441 -90 285 -1018
2946a018K11J021k83j268P44J560j029r43J286O08j380j51J250k7r83L84J125
$$ -1018 -807 214 -69 -1337 -593 967 -62 -1005 281 889 -491 -642 608 581 -402 -18 1107
2963A107n58j158J198Q32r74r68J545N53j604J79J275o3j190J28J479r49j020
$$ 1107 549 -609 589 1421 447 -521 1024 1577 -27 152 1427 1364 174 302 1781 832 -188
2980a88Q70R10j049j110J559J81j613K12J617n36j397N27J258j061j126J226M41
$$ -188 682 1592 543 -567 992 1173 -440 -228 1389 853 -544 -17 1241 180 -946 280 721
2997G21j217n96J409K43j483L00J135k14j498M32R99n48j445J360Q16j414o82
$$ 721 -496 -1092 317 560 -923 -623 512 298 -1200 -768 231 -317 -1762 -402 414 -1000 -1682
3014a682J293L58j663M97J399j40j677L90J534p20j105J018R17j216m63J046P97
$$ -1682 -389 -31 -1694 -1197 202 62 -1615 -1225 309 -411 -1516 -498 419 -797 -1260 -214 583
3031E83j518K43J235q7j748R25J125r50p41J234M97j097n63J696J83j457J73J437
$$ 583 -935 -692 543 456 -1292 -367 758 -192 -933 301 798 -299 -862 834 1017 -440 -267 1170
3049A170m20j099P58J289j515n67J142N84j081N5P62L35j605M89J458q84j028
$$ 1170 750 -349 409 1698 183 -384 758 1342 261 316 1078 1413 -192 297 1755 871 -157
3066a57P60Q01j107q07J157L84j229k26J490l83j159K38J163p44r17Q87Q47j250
$$ -157 603 1404 297 -510 647 1031 -198 -424 1066 683 -476 -238 925 181 -736 151 998 -252
3084b52q98J558L5j178l50J601l33j264J89J304o28j206Q38P35j277J16M73M79
$$ -252 -1150 408 443 -735 -1085 516 183 -1081 -892 412 -216 -1422 -584 151 -1126 -1010 -537 -58
3102e8j242K8J301L9j540J32J523p62p34Q58J040j511k26J321j24o83l23J028
$$ -58 -1300 -1272 29 68 -1472 -1340 183 -579 -1313 -455 585 -926 -1152 169 45 -638 -961 67
3120F7J94j225P21R80m54j268J324M14j006l38J643j11j005J99J104l68j150Q56
$$ 67 261 -964 -243 737 283 -985 339 753 -253 -591 1052 941 -64 135 1239 871 -279 577
3138E77P19q80p91J239M15j044m77J279M10j623L23J290n31j232R77R29j088p78
$$ 577 1296 416 -375 864 1279 235 -242 1037 1447 -176 147 1437 906 -326 651 1580 492 -286
3156b86Q85N77j034o83J466M5j443L93Q46o94r00N96R34r35q66J211K27r35n65
$$ -286 599 1176 142 -541 925 970 -473 -80 766 72 -828 -232 702 -233 -1099 112 339 -596 -1161
3175a161J147J90j179jJ285q77r62J065Q33q17r89J234L94j267k12J239k87j171
$$ -1161 -14 176 -1003 -1004 281 -596 -1558 -493 340 -477 -1466 -232 162 -1105 -1317 -78 -365 -1536
3193a536M29J219p21o99J038L33m11o65J040M28j184L01J260k37j425L85J255
$$ -1536 -1107 112 -609 -1308 -270 63 -348 -1013 27 455 -729 -428 832 595 -830 -445 810
3210H10m96j383J220O59r18l96J057M64r73k22J189p1j055N16J192j088n42P94
$$ 810 314 -1069 151 810 -108 -504 553 1017 44 -178 1011 940 -115 401 1593 505 -37 757
3228G57P27j170n26J179K79j475O24J227o65j498R56J005j089n65J155K20j211
$$ 757 1484 314 -212 967 1246 -229 395 1622 957 -541 415 1420 331 -234 921 1141 -70
3245g0n22J214K39j603O24P82m14j117P09Q15j034n39R63J59p80o63J427J7j098
$$ -70 -592 622 861 -742 -118 664 250 -867 -158 657 -377 -916 47 206 -574 -1237 190 207 -891
3264h91K54P38o73j113J123N11n41q90Q69Q30j349k68J236L09j411M28J234p48
$$ -891 -637 101 -572 -1685 -562 -51 -592 -1482 -613 217 -1132 -1400 -164 145 -1266 -838 396 -352
3282c52j035P83J150j121l78J130K90j007o7J009P4j058O3J304n21q88O21J131
$$ -352 -1387 -604 546 -575 -953 177 467 -540 -607 402 476 -582 -519 785 264 -624 -3 1128
3300A128r57m83J058j07r42K94J199j53j419L62J391m93j149P16Q30r51o39J159
$$ 1128 171 -312 746 639 -303 -9 1190 1037 -382 -20 1371 878 -271 445 1275 324 -315 844
3318H44L68j228k6J346M2j625N79Q60p37r15P19Q44q13r52J216M17j432n0J205
$$ 844 1212 -16 -42 1304 1346 -279 300 1160 423 -492 227 1071 258 -694 522 939 -493 -543 662
3337F62l02j327Q78O61q80q45R74N19o51r63J207L55j190pJ147q04m60J44J192
$$ 662 360 -967 -89 572 -308 -1153 -179 340 -311 -1274 -67 288 -902 -909 238 -566 -1026 -882 310
3356C10q48j157J420L30r73m47J565k9j191J72J294m88j085O60J277j257n93J309
$$ 310 -538 -1695 -275 55 -918 -1365 200 171 -1020 -848 446 -42 -1127 -467 810 -447 -1040 269
3374B69J04o02m48J296j57j058J40J387o72p00Q45N96p28p36J128N87j072l39
$$ 269 373 -229 -677 619 462 -596 -456 931 259 -441 404 1000 272 -464 664 1251 179 -160
3392a60J148K07j384L93J198p00r50P82R00q14q53J033L88r77m41J226l74r27
$$ -160 988 1195 -189 204 1402 702 -248 534 1434 620 -233 800 1188 211 -230 996 622 -305
3410c05K10J305q16p79Q04N17q45r24J321J71j386J44Q50j08j164P36P80m66j081
$$ -305 -95 1210 394 -385 419 936 91 -833 488 659 -727 -583 267 159 -1005 -269 511 45 -1036
3429a036P35R93j409j02N93L39j145k94J617o68q00J56R54m81o85Q83N87r28n51
$$ -1036 -301 692 -717 -819 -226 113 -1032 -1326 291 -377 -1177 -1021 -67 -548 -1233 -350 237 -691 -1242
3448a242J229K58j076k91J448k64q32L88O74m45p39P86N14p65l39R78L46j070
$$ -1242 -13 245 -831 -1122 326 62 -770 -382 292 -153 -892 -106 408 -357 -696 282 628 -442
3466d42K02J145n38q77Q13Q83r87m27Q07N62r18m72J250J5r29q3J117k74j318
$$ -442 -240 905 367 -510 303 1186 199 -228 579 1141 223 -249 1001 1016 87 4 1121 847 -471
3485d71R75M99n55k50M05O06j128l44J052n2q15J08Q37l87j089N38R20j000m75
$$ -471 504 1003 448 198 603 1209 81 -263 789 737 -78 30 867 480 -609 -71 849 -151 -626
3504f26R94J20j291K44R73l3j107m9J419l88j073R9J058o86j85L44J59j112L32
$$ -626 368 488 -803 -559 414 381 -726 -775 644 256 -817 -718 340 -346 -531 -187 -28 -1140 -808
3523h08P86k69j065L08R26j32r68P03O85m77p54Q95M66j018M9Q59k91o59M36P13
$$ -808 -22 -291 -1356 -1048 -122 -254 -1222 -519 166 -311 -1065 -170 296 -722 -673 186 -105 -764 -328 385
3543C85m39o81O29P43r42m99J071L69q14O3P23l33o03L51R27l48q08Q82L59q33
$$ 385 -54 -735 -106 637 -305 -804 267 636 -178 -115 608 275 -328 23 950 602 -206 676 1035 202
3563B02p41J271K75r26n9R16N3r43J19R79l72r87O38M86p37k1M64P1o75j23J199
$$ 202 -539 732 1007 81 22 938 991 48 167 1146 774 -213 425 911 174 153 617 688 13 -110 1089
3584A089o27p85N74O73q07o96R81K92j220j7Q06J86j299R1J123p90n59N91O36
$$ 1089 462 -323 251 924 117 -579 402 694 -526 -543 263 449 -850 -759 364 -426 -985 -394 242
3603B42m44r56R96L66r87j62Q89Q8j084J11J080l76q58N35N25q86q8Q41N36j086
$$ 242 -202 -1158 -162 204 -783 -945 -56 32 -1052 -941 139 -237 -1095 -560 -35 -921 -1009 -168 368 -718
3623g18l21J249n9r73L11R13l15n15L65P29o79n77J008J37j016J86J096r9q39
$$ -718 -1039 210 151 -822 -511 402 87 -428 -63 666 -13 -590 418 555 -461 -275 821 722 -117
3642a17J41R31k42q81Q03L32q33l57P37P08j120k15J035O3j276L47J401j131o39
$$ -117 24 955 713 -168 635 967 134 -223 514 1222 102 -113 922 985 -291 56 1457 326 -313
3661c13O78O96j057j84P84K73j070l14J228k42o20P9N61m93p75Q36J58o37k92
$$ -313 365 1061 4 -180 604 877 -193 -507 721 479 -141 -62 499 6 -769 67 225 -412 -704
3680g04O78N51j079k97J009l86m50J42P01m07j055Q95O41q48m11R23M11r35l67
$$ -704 -26 525 -554 -851 158 -228 -678 -536 165 -242 -1297 -402 239 -609 -1020 -97 314 -621 -988
3699i88J091k80p61J00Q74n73l46Q12K85j022KJ215j69p87J01R62n85o39P69P22
$$ -988 103 -177 -938 -838 36 -537 -883 -71 214 -808 -806 409 240 -547 -446 516 -69 -708 61 783
3719G83j070l30O95N32r67l2Q51K97j069L86Q54l30n34K69O54p69l83P71K49r98
$$ 783 -287 -617 78 610 -357 -389 462 759 -310 76 930 600 66 335 989 220 -163 608 857 -141
3739a41j32J194n31p05L19R07l93q51P30N04p35l82O67R3n03n7N69J89j495O08
$$ -141 -273 921 390 -315 4 911 518 -333 397 901 166 -216 451 544 41 -16 553 742 -753 -145
3759a45O30r12J9M30M73p73l49Q08k1o33k02R51q4j008J99R96n54p84M33Q00r34
$$ -145 485 -427 -408 22 495 -278 -627 181 160 -473 -675 276 192 -816 -617 379 -175 -959 -526 274 -660
3780f60l09O64N60q08k38P72L13j066K49N72k14j017Q82P39p83j30Q70J54j165
$$ -660 -969 -305 255 -553 -791 -19 294 -772 -523 49 -165 -1182 -300 439 -344 -474 396 550 -615
3799f15J12J053k45q08O70M45m32o12R22J38q20l28J132K29j118K82R11m43m09
$$ -615 -503 550 305 -503 167 612 180 -432 490 628 -192 -520 612 841 -277 5 916 473 64
3818F4J45Q93k98r90P40M56o19l13P26j86o47k07R71l70o25N33P02q49l84P68
$$ 64 209 1102 804 -186 554 1010 391 78 804 618 -29 -236 735 365 -260 273 975 126 -258 510
3838E10J28o50k92Q06j33q77J10Q95l77r64O78N57p63o5P40r0r14K49O76Q0j252
$$ 510 638 -12 -304 502 369 -508 -398 497 120 -844 -166 391 -372 -437 303 213 -701 -452 224 304 -948
3859i48J26Q74l83o80N75L49o08k38O98L84p37k61J070m4j070M12P36o30k41N71
$$ -948 -822 52 -331 -1011 -436 -87 -695 -933 -235 149 -588 -849 221 177 -893 -481 255 -375 -616 -45
3879d5O1j18n71P18L74q47k19J136k47p32N08M92m40k53O73L11r78J84N81K48
$$ -45 16 -102 -673 45 419 -428 -647 489 242 -490 18 510 70 -183 490 801 -177 7 588 836
3899H36q59k88J361p28p65O88P14q28R7J32L72n57p3O78k9n83oP15l55p32M61
$$ 836 -23 -311 1050 322 -443 245 959 131 228 360 732 175 102 780 751 168 162 877 522 -210 251
3920B51L97m77n51R39L52p39n14O67k30m59M38M04k27p84M24M79m30q87R22o1
$$ 251 648 171 -380 559 911 172 -342 325 95 -364 74 478 251 -533 -109 370 -60 -947 -25 -86
3940h6l86j08P41j17j106N48O95n47l86L90L95l53m63O70Q6o30m55J102j6n07
$$ -86 -472 -580 161 44 -1062 -514 181 -366 -752 -362 33 -320 -783 -113 -27 -657 -1112 -10 -26 -533
3960e33O2P37l61m82L11P76o90l39O3P08o39Q1O97k86n85M08Q57l94q07P62K78
$$ -533 -471 266 -95 -577 -266 510 -180 -519 -456 252 -387 -306 391 105 -480 -72 785 391 -416 346 624
3981F24k93n51N54M54p93J1J159o06q70K82N48k96o35R63L42n13l91P67k19l72
$$ 624 331 -220 334 788 -5 6 1165 559 -311 -29 519 223 -412 551 893 380 -11 756 537 165
4001A65l19P83m48l44K04P27o39o35Q10L36p84l07O84L38r54J89O67l80l82J5
$$ 165 -154 629 181 -163 41 768 129 -506 304 640 -144 -451 233 571 -383 -194 473 93 -289 -274
4021b74Q14q07l63N16M87j159j43J015J26r59O7J013m75p80L91N92l18n46N38
$$ -274 540 -267 -630 -114 373 -786 -929 86 212 -747 -680 333 -142 -922 -531 61 -257 -803 -265
4040b65L32j024L41N87j39l93mQ48O0p77M54N43o38p34P71P02o61l35N24Q9q51
$$ -265 67 -957 -616 -29 -168 -561 -565 283 343 -434 20 563 -75 -809 -38 664 3 -332 192 281 -570
4061e70L75O60j58l03J67P03n91m82N37N40n99j29Q77l60o76K92N37m92o83Q25
$$ -570 -195 465 307 4 171 874 283 -199 338 878 279 150 1027 667 -9 283 820 328 -355 470
4081D70L52n63m6M07K50r94J36O78Oq15J92L39k57k99L58M56o82m48O20m8m85
$$ 470 822 259 213 620 870 -124 12 690 696 -119 73 412 155 -144 214 670 -12 -460 160 112 -373
4102c73k26R93j42n40r8J137o21q33M95M42r22j00P16J66q44K26N67K23p92o5
$$ -373 -599 394 252 -288 -386 751 130 -703 -208 234 -688 -788 -72 94 -750 -524 43 266 -526 -591
4122e91P83o93j88J30O30m15m15N59L0k82k25Q18l05l99L80N70l57p79R87J74
$$ -591 192 -501 -689 -559 71 -344 -759 -200 -170 -452 -677 141 -164 -563 -183 387 30 -749 238 412
4142D12o67k92R94k28q21L61N70J0q26N73N55n91n8M18N90n23o00R69m38n92L96
$$ 412 -255 -547 447 219 -602 -241 329 339 -487 86 641 50 -8 410 1000 477 -123 846 408 -184 212
4163B12K26j03l58L9O16m47m07O87K92p11j46J031j35j064L3O68j84o67L67M17
$$ 212 438 335 -23 16 632 185 -222 465 757 46 -100 931 796 -268 -235 433 249 -418 -51 366
4183C66n38pM52L0n09q5M67J41j121L15R54n60o17L94P14q10j45N51Q6o81J26
$$ 366 -172 -179 273 303 -206 -291 176 317 -804 -489 465 -95 -712 -318 396 -414 -559 -8 78 -603 -477
4204d77L29om44J94P07m65n39N80K42m44m76P87K15p68n3Q72j81p57P25M23l72
$$ -477 -148 -154 -598 -404 303 -162 -701 -121 121 -323 -799 -12 203 -565 -618 254 73 -684 41 464 92
4225I2q72Q65N38p89j02P70J22j094O03N19m57m15J33P09l92k88M40j0l75k78
$$ 92 -780 85 623 -166 -268 502 624 -470 133 652 195 -220 -87 622 230 -58 382 372 -3 -281
4245b81Q47K84o80K29K13k65n39L11N61l14p02L46Q55r75o7Q12l63m74R7R21m20
$$ -281 566 850 170 399 612 347 -192 119 680 366 -336 10 865 -110 -177 635 272 -202 -105 816 396
4266C96l11k80O29k55q02M23L16k37m28O80j21m16k81J265q41p55O15N85k52n79
$$ 396 85 -195 434 179 -623 -200 116 -121 -549 131 10 -406 -687 578 -263 -1018 -403 182 -70 -649
4286f49N44r6j91k60P02n1p11L50M66p4o74M39N90l67n24N90K80r35J18N11%o60
$$ -649 -105 -201 -392 -652 50 -1 -712 -362 104 30 -644 -205 385 18 -506 84 364 -571 -453 58 58 -602
4308f02J26P74j80m82R7P57q84J66N43M16q62k77J031m3r28L55N26m69l19P09
$$ -602 -476 298 118 -364 -267 490 -394 -228 315 731 -131 -408 623 580 -348 7 533 64 -255 454
4328D54m3m07k46P67J09o35j5R01k09j024O22K61j07o63N26N51p98k72O28J31
$$ 454 411 4 -242 525 634 -1 -16 885 676 -348 274 535 428 -235 291 842 44 -228 400 531
4348E31o79K88N09p04l52L45O17n96k66M72m0o90j23R93k18n89j99J032o42m40
$$ 531 -148 140 649 -55 -407 -62 555 -41 -307 165 125 -565 -688 305 87 -502 -701 331 -311 -751
4368g51O07M76l30n99O12j41m98p3P27J13p97L73M03m51k86K28M28j13m69Q04
$$ -751 -144 332 2 -597 15 -126 -624 -697 30 143 -654 -281 122 -329 -615 -387 41 -72 -541 263
4388B63q8l86J8K38L35r47N26KJ22m72j30R00k14l76O93J6o75q9J095l34o68K22
$$ 263 175 -211 -193 45 380 -567 -41 -39 83 -389 -519 381 167 -209 484 500 -175 -264 831 497 -171 51
4410E1L41j17p27N65M29l81n89O38L43o28J20P64k67o59Q1N47l27k32M35K47p85
$$ 51 392 275 -452 113 542 161 -428 210 553 -75 45 809 542 -117 -36 511 184 -48 387 634 -151
4431a51j31M99L17q00J28N91j07j003M38M84m52l7J30M98q17k38Q50j35o60J77
$$ -151 -282 217 534 -266 -138 453 346 -657 -219 265 -187 -224 -94 404 -413 -651 199 64 -596 -419
4451d19M61o7n32K16N48m39k67L40K20l27m00J069l34o62l13P73K41p09K72N75
$$ -419 42 -25 -557 -341 207 -232 -499 -159 61 -266 -666 403 69 -593 -906 -133 108 -601 -329 246
4471B46n86l87N26N74q55MO57j09l60M8M62J40r45P95K71o39p6L66M61k48n10
$$ 246 -340 -727 -201 373 -482 -478 179 70 -290 -242 220 360 -585 210 481 -158 -234 132 593 345 -165
4492a65P74j01p52J31O48n3r96P78N72n76k69L55M19o69PK43j4m65K88O84o36
$$ -165 609 508 -244 -113 535 482 -514 264 836 260 -9 346 765 96 103 346 332 -133 155 839 203
4513B03n23L81N40o60j88O75Q3j056M28K44K01n84Q3N09j79p56O16L69n52j53
$$ 203 -320 61 601 -59 -247 428 511 -545 -117 127 328 -256 -173 336 157 -599 17 386 -166 -319
4533c19P16k73p03L65K75R2o59p5Q39o21k11M58J9n1m92P68j7p87M25L04m26l23
$$ -319 397 124 -579 -214 61 153 -506 -581 258 -363 -574 -116 -97 -148 -640 128 111 -676 -251 53 -373 -696
4555f96J64N35m75l8O46o1k85n8L59Ql25J60O71k55o20J78N73k39m10N27j81R
$$ -696 -532 3 -472 -510 136 75 -210 -268 91 99 -226 -66 605 350 -270 -92 481 242 -168 359 178 187
4577A87q07R68J02o41L18O81m09p65N63M92k66o60L52O86r85K2P65k48o67K26
$$ 187 -620 348 450 -191 127 808 399 -366 197 689 423 -237 115 801 -184 -162 603 355 -312 -86
4597h6Q53o34l14L66M30m55m15K21L89o13mN99j69m06j84Q67m85j88j56M46m73
$$ -86 767 133 -181 185 615 160 -255 -34 355 -258 -262 337 168 -238 -422 445 -40 -228 -384 62 -411
4618d11l46R01J66l84m62O96p2p72J81O79l31k03R8O16l81n71O69L7l39m38P38
$$ -411 -757 144 310 -74 -536 160 88 -684 -503 176 -155 -358 -260 356 -25 -596 73 110 -229 -667 71
4639G1n6o63R7P98l59n06O57J69p41L09J32M45m39l60P91k84l6M1M39m04o42P28
$$ 71 15 -648 -551 247 -112 -618 39 208 -533 -224 -92 353 -86 -446 345 61 25 66 505 101 -541 187
4661A87N21r34j29Q91k17n53K61M51m3l74N1P13l58p63R15k2m47j62O81k87o54
$$ 187 708 -226 -355 536 319 -234 27 478 435 61 112 825 467 -296 619 597 150 -12 669 382 -272
4682b72J06M61j4o31K10P47o44o53J199k02o94J81M46K8n89J70K65qo75K87O85
$$ -272 -166 295 281 -350 -140 607 -37 -690 509 307 -387 -206 240 268 -321 -151 114 106 -569 -282 403
4703D03o13j44L77J96o84J57K82j37l09K87K75k30l59K40L45m68L3K42K12p29
$$ 403 -210 -354 23 219 -465 -308 -26 -163 -472 -185 90 -140 -499 -259 86 -382 -349 -107 105 -624
4723f24Q3L50L65p59k5P56k13m04L10N64m43m15L44K14k99j54M49K35p23M67M09
$$ -624 -541 -191 174 -585 -610 146 -67 -471 -161 403 -40 -455 -111 103 -196 -350 99 334 -389 78 487
4744D87k60o40P07K03n02n18M22P03p19Q4L93K45m30OL07l60l01K57M62l22l09
$$ 487 227 -413 294 497 -5 -523 -101 602 -117 -33 360 605 175 181 488 128 -173 84 546 224 -85
4765h5N49K5q10J34N85j05n20m3N73j85l16L05L77n49l66M23M75o08r9L25J30
$$ -85 464 489 -321 -187 398 293 -227 -270 303 118 -198 107 484 -65 -431 -8 467 -141 -240 85 215
4786B15p13L14N54n04m28N46L2j38j79N02l99l12O8O49l97l39n5O99m14k57K85
$$ 215 -498 -184 370 -134 -562 -16 16 -122 -301 201 -198 -510 -442 207 -190 -529 -584 115 -299 -556 -271
4807b71M19m93j43P55j81o91M02M74k33l96K65M64l39n85N22K28n96n9P12Mn45
$$ -271 148 -345 -488 267 86 -605 -203 271 38 -358 -93 371 32 -553 -31 197 -399 -458 254 258 -287
4828b87K42L83l58k68L65O08o71j39L74J13l94k84O94K24p40M94N17o92o17K90
$$ -287 -45 338 -20 -288 77 685 14 -125 249 362 -32 -316 378 602 -138 356 873 181 -436 -146
4848a46O32k73k72M57p5l93p5O60l19j98L7L63k8n13K30p3j28l22N13K96o67K38
$$ -146 486 213 -59 398 323 -70 -145 515 196 -2 35 398 370 -143 87 14 -114 -436 77 373 -294 -56
4870e6M2P6l75K3N75m51k54K06M92n66m04O19J22l50j03N91m97j00L6K87nl61
$$ -56 -14 62 -313 -290 285 -166 -420 -214 278 -288 -692 -73 49 -301 -404 187 -310 -410 -374 -87 -92 -453
4892d53K64N04n44o5L34k4n04j53R83k20o59K50O49m35m60P50L10q62J89O13J82
$$ -453 -189 315 -229 -294 40 16 -488 -641 342 122 -537 -287 362 -73 -533 217 527 -335 -146 467 649
4913F49q88J72M81m6n95O06M80m83o66P14j6m46j8M61pn34K6N43k7l14J25L55
$$ 649 -239 -67 414 368 -227 379 859 376 -290 424 408 -38 -56 405 398 -136 -110 433 406 92 217 572
4935E72m57j55M45j13p8l79O04k15n05M46R8j77n11K89P49o75m76O17J71m91R2
$$ 572 115 -40 405 292 214 -165 439 224 -281 165 263 86 -425 -136 613 -62 -538 79 250 -241 -149
4956a49K82J38o83P9N79m82k04L75J96n24l68P70L7m94K26L79k22l11K28L60m47
$$ -149 133 271 -412 -333 246 -236 -440 -65 131 -393 -761 9 46 -448 -222 157 -65 -376 -148 212 -235
4977b35l40P25N1n44k62M45M21o67L93J68k70l53O24J3j31m00L96K10l26l94P09
$$ -235 -575 150 201 -343 -605 -160 261 -406 -13 155 -115 -468 156 169 38 -362 34 244 -82 -476 233
4998B33o0m26L21M24o6m71J21K25l07k12O04j23l70M7K18K17k87L2K21L0l38j7
$$ 233 173 -253 68 492 426 -45 76 301 -6 -218 386 263 -107 -60 158 375 88 120 341 371 33 16
5020A6L93n05j41L16J91j78k86N60k66m07J89K82j82k51m0Q42m21n72P13J68n33
$$ 16 409 -96 -237 79 270 92 -194 366 100 -307 -118 164 -18 -269 -309 533 112 -460 253 421 -112
5041a12k23M94r1n99M06M20k82k48n5Q07p74k81R54l60m90j2K58Rm02P2O47r2
$$ -112 -335 159 68 -531 -125 295 13 -235 -290 517 -257 -538 416 56 -434 -446 -188 -179 -581 -509 138 46
5063D6n44J74M58m74l9L3O83p25K70N51j81m34J87M41n00j98M60J47l64j32j02
$$ 46 -498 -324 134 -340 -379 -346 337 -388 -118 433 252 -182 5 446 -54 -252 208 355 -9 -141 -243
5084b43P23n21L0K38K0l63J22N23r4o01N08j31l49j88O39K01m60k54N03k6k10
$$ -243 480 -41 -11 227 247 -116 6 529 435 -166 342 211 -138 -326 313 514 54 -200 303 277 67
5105F7k51Q07m46k71L88J6n3k30n6k65R4q8P42l61l82L77K52j65o45L67M43l94
$$ 67 -184 623 177 -94 294 310 257 27 -29 -294 -200 -288 454 93 -289 88 340 175 -470 -103 340 -54
5127e4j19L30K14q33J85J77R0k82N4K66k76l28K65L42l24M4P1km91N6P09n5n32
$$ -54 -173 157 371 -462 -277 -100 -10 -292 -238 28 -248 -576 -311 31 -293 -249 -178 -180 -671 -615 94 39 -493
5150d93L12L43n97k02N86R8j26k46P75n35l08L58N52l25m51K56L52l87k12O04
$$ -493 -181 162 -435 -637 -51 47 -79 -325 450 -85 -393 -35 517 192 -259 -3 349 -38 -250 354
5170C54j76n03L72J20J27l41K65n8k0k92L70J09l80m79P54j30k80L34O4K14o80
$$ 354 178 -325 47 167 294 -47 218 160 140 -152 218 327 -53 -532 222 92 -188 146 210 424 -256
5191b56L57M03k32l52J86K37j28j3o9r5n95L87O37k47o23L47L32k58l04K91J23
$$ -256 101 504 272 -80 106 343 215 202 133 38 -557 -170 467 220 -403 -56 276 18 -286 5 128
$$ [...]
8191a15
##END NTUPLES=NMR FID
##END=
