##TITLE=1H_TG-2235
 CDCl3, 32 sc, 
 8.2.2019
##JCAMPDX= 6.0         $$ Bruker NMR JCAMP-DX V2.0
##DATA TYPE= NMR FID
##DATA CLASS= NTUPLES
##ORIGIN= UXNMR, Bruker Analytische Messtechnik GmbH
##OWNER= root
$$ XWIN-NMR		Version 3.5
$$ Fri Feb  8 14:37:10 2019 Russian Standard Time (UT+4h)  she@DPX200
##.OBSERVE FREQUENCY= 200.1313
##.OBSERVE NUCLEUS= ^1H
##.DELAY= (6, 6)
##.ACQUISITION MODE= SIMULTANEOUS
##.ACQUISITION SCHEME= undefined
##.AVERAGES= 32
##.DIGITISER RES= 18
##SPECTROMETER/DATA SYSTEM= spect
##.PULSE SEQUENCE= zg30
##.SOLVENT NAME= CDCl3
##.SHIFT REFERENCE= (INTERNAL, CDCl3, 0, 15.7039)
##AUDIT TRAIL= $$ (NUMBER, WHEN, WHO, WHERE, WHAT)
$$ ##TITLE= Audit trail, XWIN-NMR		Version 3.5
$$ ##JCAMPDX= 5.01
$$ ##ORIGIN= Bruker BioSpin GmbH
$$ ##OWNER= she
$$ F:/spectra/data/she/nmr/H-F/1/audita.txt
$$ ##AUDIT TRAIL=  $$ (NUMBER, WHEN, WHO, WHERE, WHAT)
(   1,<2019-02-08 14:35:45.73 +0400>,<she>,<DPX200>,
      <continue with go, POWCHK disabled, PULCHK disabled
       configuration hash MD5:
       00 E9 B6 7A A2 85 ED C7 34 08 36 98 17 FE 4E 26
       data hash MD5: 16K
       96 44 55 E7 09 7E 79 39 DE 80 E3 4F 37 6A D4 C1>)
$$ ##END=
$$ 
$$ hash MD5
$$ E8 9E E2 55 55 A8 4E A0 7F C0 39 B4 D8 FB 93 6B
##$RELAX= 
##$RELAX= 
##$RELAX= 
##$RELAX= 
##$RELAX= 
##$RELAX= 
$$ Bruker specific parameters
$$ --------------------------
##$DU= <F:/spectra>
##$EXPNO= 1
##$NAME= <H-F>
##$PROCNO= 1
##$TYPE= <nmr>
##$USER= <she>
##$AMP= (0..31)
100 100 100 100 100 100 100 100 100 100 100 100 100 100 100 100 100 100 
100 100 100 100 100 100 100 100 100 100 100 100 100 100 
##$AQSEQ= 0
##$AQ_mod= 1
##$AUNM= <au_zg>
##$AUTOPOS= <>
##$BF1= 200.13
##$BF2= 200.13
##$BF3= 200.13
##$BF4= 200.13
##$BF5= 200.13
##$BF6= 200.13
##$BF7= 200.13
##$BF8= 200.13
##$BYTORDA= 1
##$CFDGTYP= 0
##$CFRGTYP= 5
##$CHEMSTR= <none>
##$CNST= (0..31)
1 1 145 1 1 1 1 1 1 1 1 1 1 1 1 1 1 1 1 1 1 1 1 1 1 1 1 1 1 1 1 1 
##$CPDPRG= <>
##$CPDPRG1= <>
##$CPDPRG2= <>
##$CPDPRG3= <>
##$CPDPRG4= <mlev>
##$CPDPRG5= <mlev>
##$CPDPRG6= <mlev>
##$CPDPRG7= <mlev>
##$CPDPRG8= <mlev>
##$CPDPRGB= <>
##$CPDPRGT= <>
##$D= (0..31)
0 1.2 0 0 0 0 0 0 0 0 0 0.03 0 0 0 0 0 0 0 0 0 0 0 0 0 0 0 0 0 0 0 0 
##$DATE= 1549622001
##$DBL= (0..7)
120 120 120 120 120 120 120 120 
##$DBP= (0..7)
150 150 150 150 150 150 150 150 
##$DBP07= 0
##$DBPNAM0= <>
##$DBPNAM1= <>
##$DBPNAM2= <>
##$DBPNAM3= <>
##$DBPNAM4= <>
##$DBPNAM5= <>
##$DBPNAM6= <>
##$DBPNAM7= <>
##$DBPOAL= (0..7)
0.5 0.5 0.5 0.5 0.5 0.5 0.5 0.5 
##$DBPOFFS= (0..7)
0 0 0 0 0 0 0 0 
##$DE= 6
##$DECBNUC= <off>
##$DECIM= 32
##$DECNUC= <off>
##$DECSTAT= 4
##$DIGMOD= 1
##$DIGTYP= 9
##$DL= (0..7)
0 120 120 120 120 120 120 120 
##$DP= (0..7)
150 150 150 150 150 150 150 150 
##$DP07= 0
##$DPNAME0= <>
##$DPNAME1= <>
##$DPNAME2= <>
##$DPNAME3= <>
##$DPNAME4= <>
##$DPNAME5= <>
##$DPNAME6= <>
##$DPNAME7= <>
##$DPOAL= (0..7)
0.5 0.5 0.5 0.5 0.5 0.5 0.5 0.5 
##$DPOFFS= (0..7)
0 0 0 0 0 0 0 0 
##$DQDMODE= 0
##$DR= 18
##$DS= 0
##$DSLIST= <SSSSSSSSSSSSSSS>
##$DSPFIRM= 0
$$ [...]
##$SUBNAM2= <"">
##$SUBNAM3= <"">
##$SUBNAM4= <"">
##$SUBNAM5= <"">
##$SUBNAM6= <"">
##$SUBNAM7= <"">
##$SUBNAM8= <"">
##$SUBNAM9= <"">
##$SW= 20.0189088683792
##$SWIBOX= (0..15)
0 0 2 0 0 0 0 0 0 0 0 0 0 0 0 0 
##$SW_h= 4006.41025641026
##$TD= 16384
##$TD0= 1
##$TE= 0
##$TE2= 300
##$TE3= 300
##$TEG= 300
##$TL= (0..7)
0 120 120 120 120 120 120 120 
##$TP= (0..7)
150 150 150 150 150 150 150 150 
##$TP07= 0
##$TPNAME0= <>
##$TPNAME1= <>
##$TPNAME2= <>
##$TPNAME3= <>
##$TPNAME4= <>
##$TPNAME5= <>
##$TPNAME6= <>
##$TPNAME7= <>
##$TPOAL= (0..7)
0.5 0.5 0.5 0.5 0.5 0.5 0.5 0.5 
##$TPOFFS= (0..7)
0 0 0 0 0 0 0 0 
##$TUNHIN= 0
##$TUNHOUT= 0
##$TUNXOUT= 0
##$USERA1= <user>
##$USERA2= <user>
##$USERA3= <user>
##$USERA4= <user>
##$USERA5= <user>
##$V9= 5
##$VALIST= <valist>
##$VCLIST= <CCCCCCCCCCCCCCC>
##$VD= 0
##$VDLIST= <DDDDDDDDDDDDDDD>
##$VPLIST= <PPPPPPPPPPPPPPP>
##$VTLIST= <TTTTTTTTTTTTTTT>
##$WBST= 1024
##$WBSW= 4
##$XGAIN= (0..3)
0 0 0 0 
##$XL= 0
##$YL= 0
##$YMAX_a= 100940
##$YMIN_a= -94493
##$ZGOPTNS= <>
##$ZL1= 120
##$ZL2= 120
##$ZL3= 120
##$ZL4= 120
##$ABSF1= 10
##$ABSF2= 0
##$ABSG= 5
##$ABSL= 3
##$ALPHA= 0
##$AQORDER= 0
##$ASSFAC= 0
##$ASSFACI= 0
##$ASSFACX= 0
##$ASSWID= 0
##$AUNMP= <proc_1d>
##$AZFE= 0.1
##$AZFW= 0.1
##$BCFW= 1
##$BC_mod= 2
##$BYTORDP= 1
##$COROFFS= 0
##$CY= 11.3945322036743
##$DATMOD= 1
##$DC= 2
##$DFILT= <>
##$DTYPP= 0
##$F1P= 18.9103706918063
##$F2P= -1.10871071338519
##$FCOR= 0.5
##$FTSIZE= 0
##$FT_mod= 4
##$GAMMA= 1
##$GB= 0.15
##$INTBC= 1
##$INTSCL= 1
##$ISEN= 128
##$LB= 0.24
##$LEV0= 0
##$LPBIN= 0
##$MAXI= 10000
##$MC2= 0
##$MEAN= 0
##$ME_mod= 0
##$MI= 1.114404
##$NCOEF= 0
##$NC_proc= 0
##$NLEV= 6
##$NOISF1= 3.799351
##$NOISF2= 2.8
##$NSP= 1
##$NTH_PI= 0
##$NZP= 0
##$OFFSET= 15.70392
##$PC= 1
##$PHC0= -8685.833
##$PHC1= 17.40019
##$PH_mod= 1
##$PKNL= yes
##$PPARMOD= 0
##$PSCAL= 0
##$PSIGN= 0
##$REVERSE= no
##$SF= 200.130013532006
##$SI= 16384
##$SIGF1= 3
##$SIGF2= 2
##$SINO= 400
##$SIOLD= 16384
##$SREGLST= <1H.CDCl3>
##$SSB= 0
##$STSI= 0
##$STSR= 0
##$SW_p= 3612.71676300578
##$SYMM= 0
##$S_DEV= 0
##$TDeff= 0
##$TDoff= 0
##$TI= <>
##$TILT= no
##$TM1= 0
##$TM2= 0
##$TOPLEV= 0
##$USERP1= <user>
##$USERP2= <user>
##$USERP3= <user>
##$USERP4= <user>
##$USERP5= <user>
##$WDW= 1
##$XDIM= 8192
##$YMAX_p= 0
##$YMIN_p= 0
$$ End of Bruker specific parameters
$$ ---------------------------------
##NTUPLES= NMR FID
##VAR_NAME=  TIME,          FID/REAL,        FID/IMAG
##SYMBOL=    X,             R,               I
##VAR_TYPE=  INDEPENDENT,   DEPENDENT,       DEPENDENT
##VAR_FORM=  AFFN,          ASDF,            ASDF
##VAR_DIM=   8192,          8192,            8192
##UNITS=     SECONDS,       ARBITRARY UNITS, ARBITRARY UNITS
##FACTOR=    0.0002496,     1,               1
##FIRST=     0,             0,               0
##LAST=      2.0444736,     0,               0
##MIN=       0,             -94493,          0
##MAX=       2.0444736,     100940,          0
$$ Real data points
##PAGE= N=1
##DATA TABLE= (X++(R..R)), XYDATA
$$ [...]
2262C8p03R46m48m67P74k20K27l46L42p54R91J65o50L14L70k18m80Q02j202J75
2282c44N44n93k9P93l87n23N36O4n25R35K38j061M52k56n02J177l87m43M44M98
2302F31j016R28J74j048K27K41j52k10N24p21L15J20n35OQ46o08p4N95l99m12
2322e68J224p13j88M44n5o38P79K35n92J57M21j205Q81J53p62O51k3p39K9P11
2342B02l11j77N56m16l20P88j51l17N34j99p28J046l99j11r7Q21j032K88M61n55
2362a17L51k18l71l8N00n02L35L15o36L69O18m42m23O01m66m63J241n30m49N95
2382B70p1o93L40O04n65j52K14n50O76L09n49K33j14m06L37L97n19J57J91l29
2402b20J4P98l73p79J086l82q05O35q4J34N21l71j79M03l6n93K21J27k41o03J222
$$ plain form
2262 38 -665 281 -167 -634 140 -80 147 -199 143 -611 380 545 -105 209 579 361 -119 683 -519 -344
2282 -344 200 -393 -422 371 -16 -539 -3 61 -464 471 709 -352 100 -156 -658 519 132 -311 133 631
2302 631 -385 543 717 -331 -104 137 -15 -225 299 -422 -107 13 -522 -516 330 -278 -352 243 -156 -568
2322 -568 656 -57 -245 199 144 -494 285 520 -72 85 506 -699 182 335 -427 224 201 -538 -509 202
2342 202 -109 -286 270 -146 -466 322 171 -146 388 189 -539 507 108 -3 -100 721 -311 -23 438 -117
2362 -117 234 16 -355 -393 107 -395 -60 255 -381 -12 606 164 -259 342 -124 -587 654 124 -325 270
2382 270 199 -494 -154 450 -115 -267 -53 -603 73 382 -167 66 -48 -454 -117 280 -239 -82 109 -220
2402 -220 -206 592 219 -560 526 144 -661 -26 -110 24 545 174 -5 398 362 -231 -10 117 -124 -727 495
2423D95n24L84K53p63R9oK31n07L41k41J57M07m27l24P43r15K43N47j64O9L16
2444D14n12j7R4J16j5r9P25q66O1Q3r5L83k06m63m2L76k14J39N30n48j33N89j97
2467A03l7j71J28k69N42r2m42K94J99k60L02P9l19K57N09j146j33L55j84j14N04
2488A05K23k75L80l61k00O92n38k15K41kk62L52j52k80L81Qo93J31K91J52K93
2509B71o9n71Q88Q7o99k39Q22r58O43K41o56K84M55j73p54J272m86l48J98nk62
2530e9N00m72m80M45N20o67J32M81r37L03O80o16L07J65j96q0K70j08o38L54j15
2551b11M3K71n12L28K45k54k72J97j79K43j18L12k15l03J155o23k08M00k38r2
2571c1N36p41K47M52o10o0N60k84m94Q37n67j71M40j46j97J92K51q40L66O86n67
$$ plain form
2423 495 -29 355 608 -155 -56 -62 169 -338 3 -238 -81 326 -101 -425 318 -597 -354 193 29 98 414
2444 414 -98 -115 -21 95 80 -19 706 -160 -99 -16 -111 272 66 -397 -439 -63 -277 -138 392 -156 -289 300 103
2467 103 66 -105 23 -246 296 204 -238 56 255 -5 297 376 57 314 823 -323 -456 -101 -285 -399 105
2488 105 328 53 433 72 -128 564 26 -189 52 50 -212 140 -12 -292 89 97 -596 -465 -174 -22 271
2509 271 202 -369 519 606 -93 -332 490 -468 175 416 -240 44 499 326 -428 844 358 10 208 203 -59
2530 -59 441 -31 -511 -66 454 -213 -81 400 -537 -234 446 -170 137 302 106 26 296 188 -450 -96 -211
2551 -211 -168 103 -409 -81 164 -90 -362 -165 -344 -101 -219 93 -122 -425 730 107 -101 299 61 -31
2571 -31 505 -236 11 463 -147 -207 353 69 -425 412 -155 -326 114 -32 -229 -37 214 -626 -260 426 -141
2592a41K74k65l32N70O37q86n5M59r0o4J1k31k74O60j46r7J27m45l96P23M37q76
2614d00P60l62M1L90q8o38P90j35p26N76N8k18k6L79j242Q19L26r02K39L22n91
2635f28O79J23m72r6M89K19j64J27l25J13L21J25m17r2K76k66j37J20R1k51L31
2656A66j86k36O92q15j64Q90k17p55R73o48pN21l15n57J092L6r42P71k80m6J62
2677A35J11j071Q50j46l80J26N73m1J00l84q8M92J14m44j67O70o56K47K97J81
2697E19r02Q92m23p6L33k51n95R08k99p74N60J59m70P69J29j149Q55L7m49M83
2717B56N8m67K94l82N55k90M08n69k00P22o17m9O29o90J80m4J56n47O68k52l96
2738e77P02N28r40L33L64n24K97L32n44K14J62p30M80L20n16j76L34m38m5O18
$$ plain form
2592 -141 133 -132 -464 106 743 -143 -198 261 171 107 118 -113 -387 273 127 30 157 -288 -684 39 476 -400
2614 -400 360 -2 39 429 341 -297 493 358 -368 208 266 48 22 401 -841 -22 304 -598 -359 -37 -628
2635 -628 51 174 -298 -394 95 314 150 277 -48 65 386 511 94 2 278 12 -125 -5 86 -165 166
2656 166 -20 -256 436 -379 -543 347 130 -625 348 -300 -307 214 -101 -658 434 470 -472 299 19 -27 135
2677 135 246 -825 25 -121 -501 -375 198 157 257 -127 -215 277 391 -53 -220 450 -206 41 338 519
2697 519 -383 509 86 10 343 92 -503 405 106 -668 -108 51 -419 350 479 -670 185 222 -227 256
2717 256 314 -153 141 -241 314 24 432 -137 -337 385 -232 -281 348 -342 -162 -206 -50 -597 71 -181 -577
2738 -577 125 653 -287 46 410 -114 183 515 -29 185 347 -383 97 417 -99 -275 59 -379 -424 194
2758A94o3r14M96M19l95P42k6q18P96L45n84J50m73L05m23R47r79N65l39k61M7
2779b69P73l13n95L69l6j19M5N32r00R42q5r1K78p55L03Q0J89p05L09K74m04L97
2801B19K52p32L40r2n24K29M88q6k62K86m63j95J063r23L40N93l82k41K84N28
2821G22q50M08n27j28P38L88j108N04m07n97L06P86l78o57J092o07L73Q9l72J09
2841a16N66o57k33J024j074J08Q19l42m35L27P2o85N59L52q78N18K63m82K98K12
2861B16j23QL57m46p4N59p92N3L66l87K8P05k06o55R07o91m35M98j35R4J70k62
2883b45j4M01K53j012Q03K16o01M98M38o51K4P00k37m16O3m51K94p1O7p38O70
2904il36j77P15l02r3M55l67j54N24k83l61P79j13M8M3O7k52p5N16p95J06K08
$$ plain form
2758 194 131 -783 -287 132 -263 479 453 -365 431 776 192 342 -131 174 -249 698 -281 284 -55 -316 -269
2779 -269 504 191 -404 -35 -71 -190 -145 387 -513 429 344 253 531 -224 79 159 348 -357 -48 226 -178 219
2801 219 471 -261 79 -13 -537 -308 180 94 -168 118 -345 -540 523 -400 -60 533 151 -90 194 722
2821 722 -128 280 -247 -375 363 751 -357 147 -260 -857 -551 235 -143 -800 292 -315 58 147 -225 -116
2841 -116 450 -207 -440 584 -490 -382 437 95 -340 -13 59 -626 -67 285 -593 -75 188 -294 4 216
2861 216 93 101 458 12 -62 497 -295 -242 124 -263 -235 470 264 -391 516 -175 -610 -112 -247 -153 17 -245
2883 -245 -259 142 395 -617 186 402 -199 299 737 86 110 810 573 157 220 -231 63 -8 59 -679 -9
2904 -9 -345 -522 193 -109 -202 253 -114 -268 256 -27 -388 391 278 326 369 436 184 109 625 -170 -64 144
2926A44k23k83J06K66o25R92n73M7N74q05k47R31n7j237J139K29m13K49L5l77
2946a28K16J27L3n81Q09q07K89O5j94k41K82K23m74M95k69J85J5k53K14M64m95
2967b5M7M90q1m21M46k45q33R29o66R7J63K46l56N40R1p89K87N84l93j37J97O5
2989B36L0N50m67l62L02k3l65J93L5o70J015n39m46J63R86r73J40L03k12j40K91
3010D7M1k58L37k90L50Q37r00K03k27j70L10L32m41r85J028K83q43N91k29j196
3030a180P83P13j088M94J9j41M55L16n56M81L97r05O8P91q47%Q97q15L7K1K56
3051A96n00L00m9k22K45m54L89o5N42j056J019l19o05J015o3l53M8J24j87L97
3071D02j42n51J8M16o87M76p2P8l10M79m48p8O31k46p91R35k85n31J147m73J13
$$ plain form
2926 144 -79 -362 -256 10 -615 377 -196 -149 425 -380 -627 304 247 -990 149 378 -35 214 249 -128
2946 -128 88 215 248 -333 476 -331 -42 23 -171 -412 -130 93 -381 114 -155 30 45 -208 6 470 -25
2967 -25 22 512 431 10 456 211 -622 307 -359 -262 -99 147 -209 331 422 -367 -80 504 111 -26 171 236
2989 236 266 816 349 -13 289 266 -99 94 129 -541 474 -65 -511 -348 638 -335 -195 108 -104 -244 47
3010 47 88 -170 167 -123 227 1064 164 367 140 -30 280 612 171 -814 214 497 -346 245 16 -1180
3030 -1180 -397 316 -772 -278 -259 -400 55 371 -185 296 693 -212 -144 647 -200 -200 697 -118 -81 -60 196
3051 196 -304 -4 -53 -275 -30 -484 -95 -160 382 -674 345 26 -579 436 373 20 68 192 5 402
3071 402 260 -291 -273 143 -544 -68 -140 -62 -372 107 -341 -419 212 -34 -825 110 -175 -706 441 -32 81
3092H1L3M78r91P10k41m03N30k22p10Q80k71n01M95K29l97K08L64p34j6P64o02
3113c16P9Q83q24j49M46p5m94R00j28k50J70L60j134O16j51r24M16P77r14K53
3133d59J024j032P8Q75r32n6N78M72k8K69r62k31P80l84k77M60j22m05J58m3l69
3154f06N2O41o36J05R09r07J30Q40q29K34O16o82J34L77l79q5O37n85l17P12j25
3175B36p03J240j173k39O35K54p45J47M47n38P60k26j297J223L86l54J70L12q31
3194b96L69L43m71m51O66o77J64L07j98l96P03l05L88q1l57j36N52P2j89N50l24
3215B33m30M50k16q3K99r8j51o09Q21o25M9J032j444P31m43N22n24J305p32k10
3235a23L90K33o25P19k94n31M94K6m70N68J69q69L84m8j74N50m4m30l11Q35r58
$$ plain form
3092 81 114 592 -399 311 70 -333 197 -25 -735 145 -126 -627 -132 97 -300 -92 272 -462 -478 286 -316
3113 -316 -237 646 -178 -327 119 44 -450 450 322 72 242 602 -532 84 -67 -991 -575 202 -712 -459
3133 -459 565 -467 -389 486 -446 -502 76 548 520 789 -173 -404 376 -8 -285 175 53 -352 -194 -237 -606
3154 -606 -554 87 -549 -444 465 -442 -312 528 -301 -67 549 -133 1 378 -1 -86 551 -34 -351 361 236
3175 236 -467 773 -400 -639 -4 250 -495 -348 99 -439 321 95 -1202 21 407 53 223 535 -296
3194 -296 73 416 -55 -506 160 -517 -353 -46 -244 -640 63 -242 146 65 -292 -428 124 196 7 557 233
3215 233 -197 253 37 -46 253 155 4 -605 216 -409 -360 672 -772 -41 -484 38 -486 819 87 -123
3235 -123 267 500 -125 594 300 -231 263 289 -181 387 556 -313 71 23 -151 399 355 -75 -386 449 -509
3256e09j05J023m99k02O10o13j77J204p20k52O73m8o28P38n76p45J350o39l16
3275d31K12J01o69R37M44j294O97L71o75K83J34l56M65L84o00k37P63q75L61K73
3295B88j79q30J107K4q84M00L2m31Q50o97l88O18K67o01O22K24q37P00N3l18l19
3316b99J228q84J70J20K0p05P29p60j6L32L15o75N96j6j072R63k81K4P66j59n38
3337a42O06j87o24Q70K56j194O21L64r21J93K85o12o2O96r1q89O03k64N02J28
3357A38n41L07M80k14l69Q09K47j200O72N77j577J197j6j101L86P17p77M58m63
3376b70L90l67L27l32q7J045o72o5P88n35k87o9J93O65p77K5n13P24m41L95L91
3397E28l52k64RM25n69k66P81l55q6K99m50K35L59k84m24J275q83o8Q62o43k63
$$ plain form
3256 -509 -614 409 -90 -292 318 -295 -472 732 12 -240 433 385 -243 495 -81 -826 524 -115 -431
3275 -431 -219 -118 -787 150 594 -700 -3 368 -307 -24 110 -246 219 603 3 -234 529 -346 15 288
3295 288 109 -721 386 410 -474 -74 -42 -473 377 -320 -708 -90 177 -424 198 422 -415 285 338 20 -299
3316 -299 929 45 215 335 355 -350 379 -381 -397 -65 250 -425 171 155 -917 46 -235 -211 555 396 -142
3337 -142 464 277 -347 523 779 -415 206 570 -351 -158 127 -485 -547 149 58 -831 -228 -492 10 138
3357 138 -403 -96 384 170 -199 610 857 -343 329 906 -671 526 510 -591 -205 512 -265 193 -270
3376 -270 120 -247 80 -252 -339 706 34 -31 757 222 -65 -134 59 724 -53 -28 -541 183 -258 137 528
3397 528 176 -88 -79 346 -223 -489 292 -63 -149 150 -300 -65 294 10 -414 861 -22 -90 772 129 -134
3418a34M60m24J48L55o43L32l69K00l69P62j71p11J98N55p93K61N70K5j41N73
3438F84m52m28Q66q60j05N65Rk73M67n31q19J008p0q01K11L66n13N51j05l73J48
3459d55N41P0K41K14p87J91K48m53N06N72j211k80R23l01m6M23n01m00O30m61
3479c36k02K73L56j88J70Q0o25O14J6k51L06M26n21J50k67Q0l44M95k38k25M88
3500B57k72p57R79p95R8J161o91n28Q37j3p21Q52l25j83J76L71o04L82K50p44
3520b70L81J76n27K1M80r02M28O80r65k38N16m4K86L30n22o5Q36p54R7L82k3o14
3542c11N36j18k13O86m01j138O53J019j154n2N75m92K78K10r04M27O74m10r8M46
3562B13o66L34M81l97j90Q03m41n89R01l05j065Q34L17j296J376l02m71pN27n08
$$ plain form
3418 -134 326 -98 50 405 -238 94 -275 -75 -444 318 147 -564 -366 189 -604 -343 227 252 111 684
3438 684 232 -196 670 -190 -295 270 279 6 473 -58 -877 131 61 -740 -529 -163 -676 -125 -230 -603 -455
3459 -455 86 156 397 611 -176 15 263 -190 316 888 -323 -603 320 19 -27 396 -105 -505 125 -336
3479 -336 -538 -265 91 -97 73 153 -472 142 158 -93 213 639 118 268 1 81 -263 232 -6 -231 257
3500 257 -15 -772 207 -588 -490 671 -20 -548 289 276 -445 407 82 -101 75 446 -158 224 474 -270
3520 -270 111 287 -240 -219 261 -641 -213 467 -498 -736 -220 -264 22 352 -170 -235 601 -153 -56 326 303 -311
3542 -311 225 107 -106 580 179 -959 -306 713 -441 -493 82 -410 -132 78 -826 -399 275 -135 -233 213
3562 213 -453 -119 362 -35 -225 578 137 -452 449 144 -921 -87 230 -1066 310 8 -463 -470 57 -451
3582d51J73N02l97N9L18J78k37N1m62O90P6m52k2N39n63m12K37K20p37P98l99
3603b91k9L91k24Q3jL08l97j7L88o2n6K61o40M24O97j036L42m5J65j6K06n80J24
3626el06J53k61O18k33k59L45N68o48R1K98p52O93n3m54L69O88j125L58J41j21
3647A05j76O79j172k6N94q0m59N95L00p53Q38r62l71J259k75k50N73k98m27J34
3667a72L42m97l2Q27r21M89J28p62M48M30p20J38N61m18j43P96n96k09N73k33
3687B9p4O56l28M1K01l53q30N49L26q08M43O16q46P8O44o20L79K44q36L22O37
3708D70o71M35L69l60m39M56K51o18M23j04q5K59m07m83P33m35k58N44K09m66
3728a77N6R5m25K66N89p02M39K97m59L68K37p21J93L14m70m9P38l52k10M41l54
$$ plain form
3582 -451 -278 224 -173 -114 204 382 145 196 -266 424 500 48 26 565 2 -410 -173 47 -690 108 -291
3603 -291 -320 71 -153 -70 -71 237 -160 -177 211 149 93 354 -286 138 835 -201 141 96 261 245 451 -129 -5
3626 -5 -311 -158 -419 199 -34 -293 52 620 -28 63 361 -391 302 249 -205 164 852 -273 85 226 105
3647 105 -71 608 -564 -590 4 -76 -535 60 360 -393 445 -517 -888 371 96 -154 419 121 -306 -172
3667 -172 170 -327 -359 468 -453 36 164 -598 -150 280 -440 -302 259 -159 -302 494 -102 -311 262 29
3687 29 -45 611 283 324 525 172 -658 -109 217 -591 -148 468 -378 -300 344 -276 103 347 -489 -167 470
3708 470 -201 234 603 243 -196 260 511 -107 316 212 127 386 -21 -504 229 -206 -464 80 289 -177
3728 -177 -121 -26 -451 -185 404 -298 141 438 -21 347 584 -137 56 370 -100 -149 589 237 27 468 114
3749A14p69N81L17j140Q82N79o42J25K01j70k51N55r15M70N24l41q1L77m66J25
3769G5M93n73j32r7J33K91k82J18o49Q69n65MK16P8k56P71k60j031J628n65l94
3790a28K09Q47j589R04q5j8j06L33j120N17M42o2n42O83l50M1K38K6p29K48M57
3811B16n62N78M65j202K26N39o88P00j03j66m88O21p57M25N11n96m4N18n11J49
3831a69K18o22N77N53o25o4N51pn67N66l92m06P04p27K44M63j61k81j59j37KJ66
3853b73M02o24k0N22k2J21P43j142l80O70j75JL00k48k34O88m92K28j34M76n84
3874a77q4N21n30P5J45j46M88n11K36J3N69m26q9K69m47k00N68l93k64K36M29
3895B82n75P4L90n45K74l60L6J04K95l10N71L24n61k79K49j22Q77m35m14J02J48
$$ plain form
3749 114 -655 -74 243 -897 -15 564 -78 47 248 78 -173 382 -533 -63 461 120 39 416 -50 75
3769 75 568 -5 -137 -234 -101 190 -92 26 -623 246 -319 -315 -99 -21 -277 494 234 -797 831 266 -128
3790 -128 81 928 -661 243 158 140 34 367 -753 -236 206 144 -398 285 -65 -24 214 240 -489 -241 216
3811 216 -346 232 697 -505 -279 260 -428 272 169 3 -485 136 -621 -196 315 -281 -325 193 -318 -169
3831 -169 49 -573 4 557 -68 -132 419 412 -155 411 19 -387 317 -410 -166 297 136 -145 -304 -441 -439 -273
3853 -273 129 -495 -515 7 -15 106 849 -293 -673 -3 -178 -177 123 -125 -359 329 -163 65 -69 407 -177
3874 -177 -261 260 -270 -195 -50 -196 292 -219 17 30 599 173 84 353 -94 -294 274 -119 -383 -147 282
3895 282 -293 -219 171 -374 -100 -460 -424 -320 -25 -335 236 560 -1 -280 -31 -153 724 289 -125 -23 125
3916A25n7j07O27p63J80j09k12m44P10J74l13O90n45L46m0l57J2Q7P21o85Q1L72
3938D93o08O21k09m88n9N04p51J62N16m80j12L02p7K93j92J35l45R1O7j6K05L58
3960D10p60M69O6l20N84m45R6r8N13j134P25M61r78P19N0k92j35J47J67q51O98
3981I2m7l19M08o56M46O64n42n69R56l87q4K37m93J57K91P6o88M37K39l05l92
4002d79O62o75K65N39m40k07P19k63o64O48r4p1l30P44p05R45l81q00N63J31p11
4023f04K94n5K62J41l2k84K20R1P6J65n6n15j50P64r1N3m49j8k71N89m48J80K90
4046A52k68L5M01l58l25M70Q0o38O52k10n77J218n95k25L0M41m65K81J24m22J15
4067h4K7p10N00M53k09k01J20j77j81O26j86j40K3J57m00K58M40m94O92m8k92
$$ plain form
3916 125 68 -39 588 -175 5 -104 -316 -760 -50 124 -189 501 -44 302 262 -95 -83 4 725 40 121 493
3938 493 -115 506 297 -191 -250 254 -497 -335 181 -299 -411 -109 -186 107 -85 50 -295 -204 -137 -153 52 410
3960 410 -350 119 185 -135 449 4 100 2 515 -619 106 567 -411 308 358 66 -69 78 245 -606 92
3981 92 45 -274 134 -522 -76 588 46 -523 433 46 -38 199 -294 -137 154 230 -458 -21 218 -87 -479
4002 -479 183 -492 -227 312 -128 -335 384 121 -543 105 11 -60 -390 354 -351 594 213 -587 -24 107 -604
4023 -604 -310 -365 -103 38 6 -278 -58 33 109 274 218 -297 -447 317 226 279 -170 -188 -459 130 -318 -138 152
4046 152 -116 -81 320 -38 -363 107 187 -451 201 -9 -586 632 37 -188 -158 283 -182 99 223 -199 -84
4067 -84 -57 -767 -267 186 -23 -224 -104 -281 -462 164 -22 -162 -139 18 -382 -124 316 -178 514 466 174
4088A74J09l57m2q2K22k64L4j50N63l57O4L56m06M26k85j59K50j29r0J22M23j52
4110B70k83J84k5j10j07J06j6J44k82P3L11o91k51J134l08j29M46r15m5P69J41
4131D16m63L54l03m8L22l30j85M34j18k17n1O40r74O44m08L02k96J98P2j38N0
4152i9k4N43m0l39l10L49j22L61n02m5K87j11J63o15P89j23j09J18k78k05P97
4173D85n91J25P5P8q4J0L82p00M93R8N8n96j44P5N28k22m0K16l04K2k65J66M8
4196h7k80O17q77K91L84k88J6M32k49m72N57K59j88M45l96m3L52m59L2q8L95p81
4218d28N53k72l7K94L25m51j44m7M1M83k49K39n20Q13k61l82N86l21L1p5m61O20
4240C37n66L30j44L3n0j01L03j34K96q76O77k46j78M69l21M67k18K2n39P01J50
$$ plain form
4088 174 283 -74 -116 -198 24 -240 -206 -356 207 -150 -86 270 -136 290 5 -154 96 -33 -123 -1 422 270
4110 270 -13 171 146 36 -71 35 19 163 -119 -46 265 -426 -677 457 149 20 466 -449 -494 275 416
4131 416 -47 307 4 -44 278 -52 -237 197 79 -138 -189 451 -523 121 -287 15 -281 -83 -11 -149 -99
4152 -99 -123 420 380 41 -269 80 -42 319 -183 -228 59 -52 111 -504 285 162 53 171 -107 -312 485
4173 485 -106 19 94 172 88 98 480 -220 273 371 429 -167 -311 -236 292 70 30 246 -58 -36 -301 -135 -87
4196 -87 -367 250 -627 -336 48 -240 -224 208 -41 -513 44 303 115 560 164 121 473 14 46 -42 353 -428
4218 -428 125 -147 -184 110 435 -16 -160 -207 -166 317 68 307 -213 600 339 -43 543 222 253 178 -283 337
4240 337 -229 101 -43 -10 -60 -161 142 8 304 -572 105 -141 -319 150 -171 296 78 100 -439 262 412
4261D12n60K68Q9j7j00k87J53k5K60k87k11L51j91k81K19l37M05r9M77o6K02K40
4283F15n96r8j0l50P40J25o19L69J16n15N70m39l73M59j01L55m10J19K42m63O47
4304C83p56K41N47M0l67l64L17K07o8k00J3J09J69j62j90k4l0J27L72p25L40N86
4326E65p68J05N6P5J61Q3J28l70N25p89K11k91M77l76L38p8m2o4j95K06K21k35
4348e7q1M38p40K70O80q20O61pn35K65k52J73j56K84j65j67j3O57p7k92Q8J07
4370B61m57L64l74o9M16p7L2j67m24N68M45J14o99J74J39k01j77L5P6j70M81l26
4392c6m13N08r4l42O83q6o40M54k40j25P4J9J9N16j64l56M13q7J84k73k6n9P9
4415HM3j53R8P4m16l56P76l64J22k00m5J96M86j90L23l78J37L51p59L36l54K29
$$ plain form
4261 412 -148 120 209 192 92 -195 -42 -67 193 -94 -305 46 -145 -426 -207 -544 -139 -238 239 173 375 615
4283 615 19 -79 -89 -439 301 426 -193 176 292 -223 347 -92 -465 -6 -107 248 -162 -43 199 -264 383
4304 383 -373 -132 415 455 88 -276 41 248 180 -20 -7 102 271 109 -81 -105 -135 -8 364 -361 -21 565
4326 565 -203 -98 -42 33 194 277 405 35 560 -229 -18 -309 168 -208 130 52 10 -54 -249 -43 178 -57
4348 -57 -138 300 -440 -170 510 -310 351 344 -191 74 -178 -5 -161 123 -42 -209 -222 435 358 66 154 261
4370 261 -196 168 -206 -275 141 64 96 -71 -495 73 518 632 -67 107 246 45 -132 -97 -21 -191 290 -36
4392 -36 -449 59 -35 -377 306 220 -420 34 -206 -331 -257 -238 -219 297 133 -223 190 103 287 14 -12 -71 8
4415 8 51 -102 -4 70 -346 -702 74 -290 -168 -368 -413 -217 269 79 402 24 161 512 -247 89 -265 -36
4437c6K80n44O33n54K66K9N8j04K17p35P72n11Q8j82pN07q7J88j68K82q02J77
4459b33M61N9l83l85R67p11R9k26M51R7m6M20p26N5J61m5K35m29M52j51m01PN41
4482B69k37NK72q62L91K30q4k42J82j45P1n32O00K30k49r8J36q1n4J94J88k9l7
4505A18o3K37k89J42K72p09J85K1J03M4j16P3K07K4m23p9O59j79r2k40O3N4j10
4528i8K30k09K31j91l23J1L31j82K95m24P9J26k8J9L12K10o97L31N5r3L89l20
4550E4N06o47K72P6o36P98jJ31p25L88L4j60J17o97M23K8M19m15lp01R80m13L06
4573A34r9L13j87J4k61k72O31j40k35O80j087P38j27q8J26J9K8p08O96m24L6R0
4595a23l72K02K15J00l80R0P2o2K69J79qJ13j05J14k55j86N12q5k56j02m4n5K35
$$ plain form
4437 -36 244 -300 333 -221 45 74 132 28 245 -490 282 -229 -141 -323 -330 177 90 278 110 392 -410 -233
4459 -233 228 287 -96 -481 486 -225 -126 -352 99 196 150 570 -156 -101 60 15 250 -179 273 122 -279 -272 269
4482 269 32 37 309 -553 -162 68 -16 -258 -76 -221 -150 -682 -82 148 -101 -199 -63 -144 -198 -4 184 155 118
4505 118 55 292 3 145 417 -292 -107 -86 17 61 -55 18 225 249 -174 -253 406 227 135 -105 -42 12 -98
4528 -98 132 -77 154 -37 -360 -349 -18 -200 95 -329 -250 -124 -152 -133 179 389 -308 23 78 -15 374 54
4550 54 560 -87 185 261 -375 423 422 553 -172 216 250 90 207 -490 -67 -39 380 -35 -38 -739 241 -172 134
4573 134 35 348 161 175 -86 -358 273 133 -102 578 -509 229 102 14 140 159 187 -521 175 -249 -213 -123
4595 -123 -495 -293 -78 22 -358 -268 -196 -258 11 190 182 295 190 304 49 -137 375 290 34 -68 -112 -167 68
4618F8k4j54k40O93q22M02L19n43rM82m73K60K97k15J62l78J63J68k66L5oJ18
4640C7M38o92J25l92K43P25k85k40K97m63N68k74k7K41K84p91J34L00l47K31L71
4661D83K0o66K05p8J96n10N92L8o18J67K5J96J28m5l00m6J8L55K70n60p3L32j97
4684f8p3L72m21K54k89L47j41j70J85J10k29J37KN3K67o55J49J40J88k91M8K19
4706A34n49M89R3k48K35M62q97L11k7p3j01k61K51j99J99L00J60m52O16n43LQ6
4728a1K61J41k80o79M23L16O5l12j48J30J35l27P30k97p7J11j03K07m77q4K47
4749b9p0M75m34j19J7N7K97J22m9m31P4J65j49J24j3j66N03J40o93J48K65k69
4771c5K11m13K95J63j25l9k66N9L19k64L3n2L46j9j66J67j23j65M9J39J25l47
$$ plain form
4618 68 44 -110 -350 343 -479 -77 242 -301 -310 172 -301 -41 256 41 203 -175 -12 156 -110 -75 -81 37
4640 37 475 -217 -92 -484 -241 484 199 -41 256 -207 361 87 60 301 585 -206 -72 228 -119 112 483
4661 483 503 -163 42 -36 160 -350 242 280 -338 -171 -146 50 178 133 -167 -213 -195 160 430 -130 -203 129 -68
4684 -68 -141 231 -190 64 -225 122 -19 -189 -4 106 -123 14 16 69 336 -319 -170 -30 158 -133 -85 134
4706 134 -415 74 167 -81 154 616 -281 30 3 -70 -171 -432 -181 -380 -181 119 279 -173 443 -100 -97 -11
4728 -11 250 391 111 -568 -145 171 236 -76 -224 -94 41 -286 444 147 70 181 78 285 -192 -276 -29
4749 -29 -99 376 -58 -177 -160 -103 194 316 267 -164 -90 75 -74 50 37 -129 374 514 -179 -31 234 -35
4771 -35 176 -237 58 221 96 57 -209 -150 169 -95 -62 -114 232 213 47 214 91 -74 -25 114 239 -108
4793a08J90m48L0K80l28M68m17M57j0n12M39j81O84j14m51j4J92k25K09o13N78
4814A06j56L74J41p73J87M04l61j35J40L3M2J19k60O4n9J82m76K26J28O7J98l7
4836A54K68m47J40M25p35o8M84l9J26L39m57K98m71J04q1J05P8m11M93m12k45
4857c52K19J12m8N2M7p4q4Q8O0K91l87L18l58j45m04Q26j62J73k53l63o3M00j4
4880a21J4L60m27K81j99q2O0O9p2k3J13J90k15N6j1k80L96l37J92J74k05m8K59
4903A44j63m10J005o55r4M74n05j71J13K77J46k60J32J24j91J78l93K96K12J84
4923D43k12l42M22m80k05K13K63l03L90m25M23L43q82N09K21k82J4J9j39k66L2
4944b44J43J01K64p8o5J29k38m70J83K66N3j28J59j07k87P61o60J55M32n69k28
$$ plain form
4793 -108 82 -366 -336 -56 -384 84 -333 124 114 -398 41 -140 544 430 -21 -35 157 -68 141 -472 106
4814 106 -50 324 465 -308 -121 283 -78 -213 -73 -40 2 121 -139 -75 -134 48 -428 -202 -74 -7 191 154
4836 154 422 -25 115 540 -195 -263 221 182 308 647 190 488 17 121 40 145 223 -188 305 -107 -352
4857 -352 -133 -21 -69 -17 30 -44 -128 -40 20 311 -76 242 -116 -261 -665 161 -1 172 -81 -444 -507 -107 -121
4880 -121 -107 253 -174 107 -92 -174 -114 -45 -117 -140 -27 163 -52 4 -7 -287 109 -228 -36 138 -67 -115 144
4903 144 -19 -429 576 -79 -173 301 -204 -375 -262 15 161 -99 33 157 -34 144 -249 47 259 443
4923 443 231 -111 311 -169 -374 -161 102 -201 189 -236 187 530 -352 157 378 96 110 129 -10 -276 -244
4944 -244 -101 0 264 186 121 250 12 -458 -275 -9 44 -84 75 -32 -319 442 -218 -63 369 -200 -428
4965d28M87jk8p4K14l91O23k74l26L77k38k52J15J07j37n8K02j63K30K81k42o9
4987d5J53K75j35N55o53l5K7l89R5M49n94K2N06k09l86L30L26p62N76n76K34L17
5009H1k42K99R8J36j42J35m85L8P5K58l92P2Q01q30m0J94m26M78J59K02m56L07
5031C20l85o03Q42J28n10K14M78p38O69j11p17L38M07k21K95k55j2Q7j02j95l
5052g4J9r9l25M17j32J29J77J64m32L68n4l56J97K14l73N64l88k30L18P7j75N06
5074E12o22j06k97P40k62pnj80r5L02Q1o0m4J38k64j92J42J54j92L58l24L46l18
5097a95j48N31l42l22O90p2K33j79j77l74K57K27m92J24M42n48J78M35l56K4L24
5118B60k08m34P02n69j7K31K73n16J96J22l21R9n6M09J66p60K36N58l52l4LL38
$$ plain form
4965 -428 59 58 30 -44 170 -221 402 128 -198 179 -59 -311 -196 -89 -226 -284 -82 -245 -15 266 24 -45
4987 -45 108 383 248 803 150 115 142 -247 -152 297 -297 -275 231 22 -364 -34 292 -470 106 -470 -236 81
5009 81 -161 138 236 372 230 365 -120 -82 -7 251 -141 -69 732 -98 -138 56 -370 108 267 469 13 320
5031 320 -65 -668 174 302 -208 6 484 -254 415 304 -413 -75 332 111 406 151 139 226 124 -71 -74
5052 -74 -55 -154 -479 -62 -194 -65 112 276 -156 212 158 -198 -1 213 -160 404 16 -214 104 181 6 512
5074 512 -110 -216 -513 227 -35 -42 -47 -227 -322 -20 61 1 -43 95 -169 -361 -219 -65 -257 101 -223 123 -195
5097 -195 -343 188 -154 -476 214 142 375 196 19 -355 -98 129 -363 -239 203 -345 -167 268 -88 -64 260
5118 260 52 -382 320 -249 -266 -35 238 -278 -82 40 -281 -182 -238 171 337 -423 -187 371 19 -15 -12 326
5140C26m70M93l95k30L95k84J96J01j49k64K21N18n89Q5n5M7L46k77k08q4N41
5161B64J21k68l99N40n54J57M01m72l55M57K44P8J87m40J70J29o54P18k16k29
5181a21o6L46J7j82R0J5j20J93l22RQ9R3l67K28J46k59N44o3j13j52J61k12J09
5204F3j33P2K30n9j74q5j83J23o02P44k63L41p1J65l94N21l93l88N68k89M72M3
5226C08l83l24M62m18K62JJ82j67K69K90n16O3n3L39%k27K82N7l83k9l6J95l3
5249A41o14K96M34l71L05L3l34j55N96l87k74Q3j50K73L39o29K27M35l76J32L25
5270C29m18k61O98m16K80j68N28j072O35M6j49m69O22J42P8l65p1o6O5k81N12
5291A99j49j07J72L20j38k27L11mq91N32p0m07O13p3K14J73J55p72J72J06n35
$$ plain form
5140 326 -144 349 -46 -276 119 -165 31 132 -17 -281 -60 458 -131 -46 -101 -54 292 15 -193 -277 264
5161 264 385 117 -282 258 -296 -139 262 -210 -565 -108 136 214 401 -39 131 260 -394 324 108 -121
5181 -121 -187 159 176 -6 84 99 -21 172 -150 -141 -52 41 -326 -98 48 -211 333 270 157 5 166 -46 63
5204 63 -70 2 232 173 -1 -86 -269 -146 -748 -4 -267 74 3 168 -226 295 -98 -486 82 -207 265 308
5226 308 -75 -399 63 -355 -93 -92 90 -77 192 482 -34 29 -24 315 315 88 370 427 44 15 -21 174 141
5249 141 -473 -177 257 -114 191 224 -110 -265 331 -56 -330 -247 -397 -124 215 -414 -187 248 -128 4 329
5270 329 -89 -350 348 -68 212 44 572 -500 135 181 32 -437 185 327 405 40 -31 -97 -32 -313 199
5291 199 50 -57 115 435 297 70 381 377 -514 18 -52 -459 154 81 295 468 623 -149 23 129 -406
5312d06O61n84J038n96k96L22r6K26k41k31L89k29j01K14k40o5P03r37L21L00
5332A52N7n9mj84K90j05Q2q6o46O94j0l59N06n65K46M63q26K84J93M2n87J101
5354F79p93L75Q3m10J02J32l69J74J11P6l25R5J21K21J5n10N23O5l65J13l64J07
5376a44n4N81o10K71k13j10K1J18L24j41l55M30lq8q0k29j91M21Lk27J24L21l97
5399b28N80n98n4K67L17k32P1j13M69l94J05j5r9M15m58j01M0m33L51Q9N8J44
5421A81P5p77L77K11l3m9k70L73k82O67n42J07J06l86M07q14M19L95j5J21k54
5442A7R0M32o97L20j13k55p8M55j64m41M15K2k79K71P4n58N80J00M4L52o90P2
5464c1L84n75O2K0Q95r90J49J96l99O9N95n12K91J51n53K45N6K95l50L15J77J34
$$ plain form
5312 -406 255 -329 709 113 -183 139 43 269 28 -203 186 -43 -144 70 -170 -235 468 -469 -148 152
5332 152 209 150 146 -38 252 147 229 143 -503 191 181 -178 328 -237 9 472 -354 -70 123 165 -422 679
5354 679 -114 261 344 -66 36 168 -201 -27 84 160 -165 -70 51 272 287 -223 300 365 0 113 -251 -144
5376 -144 -198 383 -227 44 -169 -279 -258 -140 184 43 -312 118 115 27 -53 -282 -473 -52 -49 -276 -152 169 -228
5399 -228 352 -246 -300 -33 284 52 123 10 479 85 190 175 76 491 33 -68 -28 -461 -110 -21 37 181
5421 181 256 -521 -144 67 34 -15 -285 88 -194 473 -69 38 144 -242 165 -649 -230 165 150 271 17
5442 17 107 539 -158 162 49 -206 -284 171 7 -434 -19 3 -276 -5 69 -489 91 191 235 587 -103 -31
5464 -31 353 -222 -160 -140 755 -235 -86 110 -289 -220 375 -137 154 305 -248 -3 53 348 -2 313 490 624
5486F24m01J4l43L42J35o46L83k40l31O80n64M16k21O12n68k48L35L91r8n5n57
5507c40L84K45K8n37P35j94J4Q1m51J98j03L86l07l61Q63l01r8o70J11O68l5m33
5529a17m4L02n73J12M60m76M46QM8j61L72m39R2l65M9L18K05n58L98p1J08p3j80
5552a39J11j68J06P0k61O99j18j90m80Q59n26j47J51j27K12j21K58n33O92n32
5572a84K25RJ53n89L57J53Q0o10P52p49Q74p33N10l22m73P83k9j20K26n08Q98
5593G03m41l86rM25l18j84N13o53M46J36m2m49K69m59L08M51k50L15k36k11K24
5614A52J26q4n73N22l47l49P63k66M20l27J48o55R30o94j03L90P4k41M54j38n14
5635c12K61K19j54P40m58l18O29m95m17M58J29o16J75L4k0K43M56o38j80M09k13
$$ plain form
5486 624 223 237 -106 236 371 -275 108 -132 -463 217 -347 69 -152 460 -108 -356 -21 370 272 217 -340
5507 -340 44 289 317 -220 515 321 335 416 -35 163 60 446 139 -222 641 340 242 -428 -317 351 316 -117
5529 -117 -161 141 -432 -320 140 -336 110 118 166 5 377 -62 30 -335 -286 32 237 -321 77 6 114 41 -139
5552 -139 -28 -196 -90 -20 -281 418 300 110 -370 489 -37 -184 -33 -160 52 -69 189 -344 348 -184
5572 -184 41 50 203 -386 -29 124 204 -406 346 -403 471 -262 248 -74 -547 236 207 87 313 -195 703
5593 703 262 -124 -133 292 -26 -210 303 -350 96 232 190 -259 10 -449 -141 310 60 375 139 -72 152
5614 152 278 194 -379 143 -204 -553 210 -56 364 37 185 -470 460 -234 -337 53 127 -114 340 202 -312
5635 -312 -51 168 14 754 296 -22 607 112 -305 153 282 -334 -159 -125 -145 98 554 -84 -264 145 -68
5656f8k15L79j92Q3N48k91p18N40l0j27o7M92l97r2J29k91M3M42l48L73K99m70
5678B2J01J63l06o51M96J09R6r2J04m73Q96R2n16N1j37K45k73K1k19m1j93O73
5700A68j89N15m83k85k76K49K30K70j5KK34k31k20K79K13q85M22K25m90M45k05
5721b7l95N71Q6k45k95K25l55N58K0j48M1nL57j87N4m99K4L27O8m24O85n28KM93
5745D03o03l61R78l49l34Q95j25m09j36L4j37r8O40p10N9K56q1K41l57k10L65
5766c9l21M6j28O31n40J44J19j36KM80k08n55M59J01l67N90K01n23L82j2o82N68
5788B12m45K70J5L38m23N70l74o7l7K28m01m3M1J91l0J22j16l1j00k73J67K25
5810C9L66m38J38j97j23K80l51O55m02j22l2l0J11k64O68n3k13R2J61m74K3K96
$$ plain form
5656 -68 -283 96 -96 -13 535 244 -474 66 36 -91 -158 334 -63 -155 -26 -317 -274 168 -180 193 492 22
5678 22 123 286 -20 -671 -175 -66 30 -62 42 -431 465 557 41 92 -45 200 -73 -52 -271 -312 -505 168
5700 168 -21 494 11 -274 -550 -301 -71 199 184 186 420 189 -31 248 461 -424 -2 223 -267 178 -27
5721 -27 -422 149 235 -10 -305 -80 -435 123 143 -5 36 31 388 201 255 -244 -220 107 175 -249 436 -92 -90 403
5745 403 -200 -561 417 68 -266 629 504 95 -41 -7 -144 -242 398 -312 -253 3 -78 163 -194 -404 -39
5766 -39 -360 -314 -442 189 -351 -207 -88 -224 -222 258 50 -505 -46 55 -312 278 479 -44 338 326 -356 212
5788 212 -233 37 52 390 -33 537 163 96 59 287 -114 -157 -116 75 45 167 51 20 -80 -353 -186 39
5810 39 405 -33 105 -92 -215 65 -286 369 -33 -155 -187 -217 -106 -370 298 245 32 124 285 -189 -166 130
5832A30m98K32N91n46q8L01k35J88M80p73J49J58K49l85k97N71l22NK97o9j88
5853e0J43n19K23K50J13n0M42j064O80o6o04M48L75k63l82L90J69m84L09M01q53
5874c92M80q5o80L76M03J60M4L68q04J80N05k78k7p7l40l10J117n25k61M77j11
5895B20n25K22O7n40P90jn24K85j28Q0P3m4m07N71j97J09LL98j70n87N74k08M64
5918E25m54m03K48M89q10N57j94ml9K85j32o51P71j23l31M74J10j58J99K83j169
5939e27P97K10o23j69Q36j67n81M5OO0K61L64m88J08m37J20N01j82o8L50qo93
5961b85J92N4J35J70J54o26j77M29n50K85p3j18O93m05j46K73L69k73l42M58n08
5982b91M04O1m88N72J4K2l77L51m47M1K98J65p10K24K59l97j27J56q6N79l7n33
$$ plain form
5832 130 -368 -136 455 -91 -179 122 -113 75 555 -218 -69 89 338 -47 -344 227 -95 -90 207 138 -50
5853 -50 93 -426 -203 47 160 110 552 -512 168 102 -502 -54 321 58 -324 66 235 -249 60 461 -392
5874 -392 88 3 -677 -301 102 262 306 674 -130 50 555 277 250 173 -167 -477 640 115 -146 331 220
5895 220 -305 -83 -16 -556 234 233 -291 -6 -134 -54 19 -25 -432 139 -58 51 54 452 282 -305 269 61 525
5918 525 71 -332 -84 405 -405 152 -42 -46 -85 200 68 -583 188 65 -266 208 318 160 359 642 -527
5939 -527 270 480 -143 -312 524 357 -224 -179 -173 -113 148 512 24 132 -305 -185 316 134 66 416 408 -285
5961 -285 -93 -39 96 266 420 -206 -383 46 -504 -219 -292 -410 283 -122 -268 5 374 101 -241 217 -291
5982 -291 113 174 -314 258 272 294 -83 268 -179 -138 160 325 -385 -161 98 -299 -426 -270 -356 223 186 -347
6004c47M43J85l59k33O27n28l26P03J53o54O65o15l2M03j13n86Q70J25j180R23
6024A24J50l40l28J051p43R3M16o68N43k4m86L49N22l99l93M38j27o98Q22o56
6044c54L51l6L10k36k14K86n06M6K40k94N45J97m53J2N16n93K20L59m12M1L44
6065C69l88j05M57q13m1P09j78n79O26j60k46K19k69K66J84n0j34J54M15q06J12
6086b58P30j133N15P10o85L21m06L72n48O37l34l78K61o2O76p4m91K64L04l98
6106B3J54l17L57j67M00k28l53J13N31q06L78k22K89j20k9n43O51m82K32J20j92
6127b11J09l07N85j0p8N79q13l14O15K4k6J91k40q92P53J61J11p87P3j3N53N5
6149A18p99P74rM5j46r1j59L80Q4k88L42l0r5o36Q75q46K92M19j94j80j24M41
$$ plain form
6004 -347 96 281 -78 -311 316 -212 -538 165 318 -336 329 -286 -318 85 -28 -614 256 381 -799 124
6024 124 274 -66 -394 657 -86 7 423 -245 298 274 -212 137 659 260 -133 305 178 -520 302 -354
6044 -354 -3 -39 271 35 -179 107 -399 -353 -113 -407 138 335 -118 -106 410 -183 37 396 -16 25 369
6065 369 -19 -124 333 -480 -521 188 10 -569 57 -103 -349 -130 -399 -133 51 1 -133 21 436 -370 -258
6086 -258 472 -661 -146 564 -121 200 -206 166 -382 255 -79 -457 -196 -258 418 344 -147 117 421 23
6106 23 177 -140 217 50 450 222 -131 -18 513 -293 85 -137 152 32 3 -540 111 -371 -139 -19 -211
6127 -211 -102 -409 176 166 88 667 -146 -460 155 179 153 344 104 -788 -35 126 237 -550 -477 -490 63 118
6149 118 -681 93 84 129 -17 -108 -267 113 197 -91 251 221 126 -510 365 -481 -189 230 36 -144 -268 173
6171A73n15N18M09q32J03P1K64l28K71N8q9J45n86K09K31J38p1M2k61k86K43n07
6193f00L19L45L60n66M15m41m50L66K71j12K8R61j048K5M11m40O51k10m36K65
6213A14M38r17R0L57m16j28Q72n70l9O46n08j64L13k01m03M41N83m42k57N7J93
6234E9kL93p75J31N05o75K54j16J18k4L59l25l09P75j04l43L44p11L72p7K24Q4
6256A57n66P09o42M61n14K34L89j13k77o6M5l19N18l50L4K82L42m73J83j8p4j17
6278a75L00j95K98p2k47J52M35n30O7J21K91m14r2O9k94J67M37l80J18p9l73O41
6300B45J71j10QJ07J1o24Q17o83Q1j44Rj33M46m96J38k73J33J70Q0L7k00N16j24
6323A82n22L34L49J92l59k22j68p6J018q91K23K55j83k8k46k24J72L79o00L57
$$ plain form
6171 173 -342 176 585 -247 -144 -73 191 -137 134 192 103 248 -338 -129 102 240 169 211 -50 -336 -93 -600
6193 -600 -281 64 424 -142 273 -168 -618 -252 19 -93 -65 896 -152 -127 284 -156 495 285 -151 114
6213 114 552 -365 -275 82 -334 -462 410 -160 -199 447 -61 -225 88 -113 -516 -75 508 66 -191 -134 59
6234 59 57 450 -325 -194 311 -364 -110 -226 -108 -132 227 -98 -407 368 264 -79 265 -446 -74 -151 73 157
6256 157 -409 300 -342 119 -395 -161 228 115 -162 -228 -183 -502 16 -334 -300 -18 324 -149 34 16 -58 -175
6278 -175 125 -70 228 156 -91 61 496 -34 33 154 445 31 -61 8 -286 -119 318 -62 56 -23 -396 245
6300 245 416 306 314 421 432 -192 625 -58 23 -121 -112 -245 201 -295 -157 -430 -297 -127 -47 -10 -210 306 182
6323 182 -340 -6 343 535 176 -46 -214 -290 728 -163 60 315 132 104 -142 -366 -194 185 -415 -58
6343e8N51j22m99R9j34k97K75L33m50L35P7m69N64j84k48N00J3l76K62K47p82
6364c63L21J97l66K25J1J8J30J26m55j95K67m03k8O34r8j06M42j94J51k15M51
6385E50p33K01K97l61j45M69k66k96L05j05o5l00P22k45K23k89l72J17L59k90
6405b24L74J25l84O0l29M25l05K69j04j47N2k61j32J137j028M22K02p07O81L24
6425D50k34K84j23m90k75O15j35Q2k69L45j27K37k78m08O49q85M28k55P13n32
6445b08J1O0P5L1R1n8n2J87p3k68J87j17L91M33o41l54N05p29M85l43k88O36L86
6468C47L41q56P28q6n35M20k28j08J05L19j57o0k92j95NN4M54J22j46m76K27o
6490b3o10J31P20j074O68pL81p15M97K98j14k69K81m82M16k7l63M85R6k56o4L25
$$ plain form
6343 -58 493 371 -128 -29 -163 -460 -185 148 -302 33 110 -359 205 21 -227 273 286 -90 172 419 -363
6364 -363 -42 155 -211 14 25 43 173 299 -156 -351 -84 -487 -515 119 21 -85 357 163 314 99 550
6385 550 -183 18 315 -46 -191 278 12 -284 21 -84 -149 -449 273 28 251 -38 -410 -293 66 -224
6405 -224 150 275 -109 -49 -378 47 -258 11 -93 -240 -188 -449 -581 556 -472 -50 152 -555 126 450
6425 450 216 500 377 -113 -388 227 92 174 -95 250 123 360 82 -326 323 -562 -134 -389 324 -208
6445 -208 -197 -137 -62 -31 60 2 -50 137 64 -204 -17 -134 257 690 49 -305 200 -529 -44 -387 -675 -39 347
6468 347 688 -168 560 474 -61 359 131 23 128 447 290 230 -62 -257 -252 -198 256 378 232 -244 -17 -23
6490 -23 -633 -502 218 -856 -188 -195 186 -529 -32 266 152 -117 164 -318 98 71 -292 193 289 33 -31 294
6512B94m17m52M22k18J20P3MJ11j76J52m62O08R5n22K48K45o8j45K79l13J55n54
6534e21K65L81n55L76j89L24o90O52P8q9n18O93l6l71L22K7n11P72l23k17M04
6555B74J13n37nL49m0j49L75j96j29j99j10N25j85m21j67M32r9k97N06O1n5L44
6577C90j44q96M31J85j78N67n47L73Q2j2l83J50N3l37N92l34j70K94m20L5LJ41
6599a25j34L62L22j48n12Q33l83m25P2j19L22J98o03q1M88R1l84O46o16m6o0L59
6621E7j35m1L36k28K66k1l01n16R16l79j80M88l72m70K55N25m20P17q80k35O28
6642A0m6k84N66k24q3J58J39l01Q3l99K63L65L26m45m95P24o73L12M05m64m00
6663d63N11j11N7j24k27J85N64k55l00K07L2j86J95J44k65O0j86L9M84j08m27
$$ plain form
6512 294 -123 -575 -153 -371 -251 -178 -174 -63 -239 -87 -549 59 154 -368 -120 125 57 -88 191 -122 33 -521
6534 -521 -256 125 -430 -54 -243 81 -609 43 121 32 -486 207 171 -200 122 149 -362 410 87 -130 274
6555 274 387 -150 -155 194 154 5 380 184 55 -144 -254 271 86 -335 -502 -70 -169 -466 40 101 46 390
6577 390 246 -650 -219 -34 -212 355 -192 181 263 251 -132 18 71 -266 326 -8 -178 116 -304 -269 -266 -125
6599 -125 -259 103 425 277 -235 598 215 -210 -138 -257 65 263 -340 -421 67 158 -226 420 -196 -242 -302 57
6621 57 -78 -119 217 -11 255 234 -67 -583 333 -46 -226 262 -110 -580 -325 200 -220 497 -383 -618 10
6642 10 -36 -320 246 22 -61 97 236 -65 18 -381 -118 247 573 128 -367 357 -316 -4 401 -63 -463
6663 -463 48 -63 -6 -130 -357 -172 392 137 -163 44 76 -110 85 229 -36 24 -162 -123 361 253 -174
6684a74N12J08m63N13k25l30k44J94L34j00r1P3k5J65o63L48K83q5l45n2L05J60
6706A98j16k21L18k2L77l42k41L38n98LJ78l93O69j88o16L17O54m93n4j91P46
6727C23o11L85J25k88R7K00n03M48j49p35M63N9m09N38N78p89N35N6n29K21K04
6748B19k83L53l25J07L20M9n02K93J31p34J18N72p95j75O94K27n15K28K48R6m80
6769a54L10K25m41J19k73J47M93n01q4rn7M38j16j90R3j12k65Q3M96o22L5O59
6791B74m65r0O30l86j45K63j1k18r6O0J76m48P09p29M97P4k26k67L25M95m87M74
6813D09r73Q41m32N12J68k29j15k99J02j58K67J12J53l13P5P1k7p6K68m55j44
6834b43j00k8M19m4k39K02j29k72J28N21k98m0N76q55Q6N07J44o84O89p30L65
$$ plain form
6684 -174 338 446 -17 496 271 -59 -303 -109 225 125 34 107 82 247 -416 -68 215 130 -215 -267 38 198
6706 198 82 -139 179 157 534 192 -49 289 -309 -306 -128 -521 148 -40 -656 -339 315 -178 -232 -423 323
6727 323 -288 97 222 -66 31 231 -272 176 27 -708 -245 -186 -595 -57 521 -268 267 323 -206 15 219
6748 219 -64 289 -36 71 391 440 -62 231 362 -372 -254 318 -477 -652 42 269 -246 -18 230 326 -154
6769 -154 156 381 -60 59 -214 -67 426 -75 -159 -168 -225 213 97 -93 0 -112 -377 -294 202 -420 -385 274
6791 274 -191 -281 349 -37 -182 81 70 -148 -244 -184 -8 -456 253 -476 21 95 -131 -398 -73 422 -65 409
6813 409 -564 277 -155 357 525 296 181 -118 -16 -174 93 205 358 45 120 191 164 88 356 -99 -243
6834 -243 -343 -371 48 4 -235 -33 -162 -434 -306 215 -83 -123 453 -402 -316 191 335 -349 340 -390 -25
6855b5k63L35Q5J56k71m25P63k04m20M50K58m65p4L09m17L10K27n14P21m29j74
6876f7R3j20K9p30P49K13j4l76K77j89J7K42l23L39m6l66O7k18K17L03L29m28
6898bK52K5k04J28Q1l49M1K70q70K22J41K09o8J63j53m26O13K16l5m21K07j79
6920a39K72k43Q4j25M67m05J78l0kk29j17K41N43j07k76n71N95m66J69N28j96
6941A71l26p3O62j376J058n3l29M36j4l46K06k43J43j9M01k99k1J66k81k3J26
6962c4J51k59K17k11k74M21n5j07Q3J79l57J21L56m7K66l16k40j32L41R0o36L31
6984a12j69q7N05j99J59K70m89n1Q92p30N26n17K94m9m56j61Q4R96k80m60K01
7005A67l8j55n13Q13m82K14j53K13j70K15j58M37o5m20K94k5L6l48K09k04L87
$$ plain form
6855 -25 -288 47 132 288 17 -408 355 151 -269 181 439 -26 -100 209 -208 102 329 -185 536 107 -67
6876 -67 26 -94 -65 -795 -46 167 153 -223 54 -135 -118 124 -199 140 94 -272 -205 -423 -206 97 426 -2
6898 -2 250 275 71 199 280 -69 -28 242 -628 -406 -265 -56 -124 39 -114 -540 73 289 254 -167 40 -139
6920 -139 133 -110 -26 -151 316 -89 89 59 57 -172 -289 -48 495 388 112 -459 136 -330 -161 367 171
6941 171 -155 -228 434 -942 116 63 -266 170 156 -190 16 -227 -84 -103 298 -1 -22 144 -137 -160 -34
6962 -34 117 -142 75 -136 -410 11 -44 -151 -68 111 -246 -125 231 184 450 134 -106 -238 103 193 -443 -112
6984 -112 -281 -368 137 -62 97 367 -122 -173 719 -11 515 -2 292 243 -213 -374 -290 706 426 -34 167
7005 167 129 -26 -539 274 -208 6 -147 66 -104 111 -47 390 325 -95 199 174 210 -138 71 -133 254
7026B54N43r97j40N71j45n10N85k89K52K31m76O9J83L48k97J08N0l40n5K30m48
7047b73m6M45l78p8M95r9j61j29K87J33Mp63M39J7NK24L87l60l82Q88p52l1J00
7070b8J0K08j05M38m09O5j84K8k76N22j78m89P24L3n29K53Q8m74J63K05n46M51
7092c0J02L03l4o4l32l8M96n25j5M45n61N7K71J4K85l17k41L0J60L61n17Q8K80
7115B18j35m31M04l76L79J77m44L34q8L53j15l35J19J11J05l03p5K24j12J38n02
7136c54J11J08j81K08j75l94M10M97k70L1j59j36J62K4J6M56l05j50O61m58O0
7157A62N6k10l1N15l42k22j6k31o2M91m23o0P28r65N68J94l60J41K2J73Jm67J20
7180b18M24R8J47o05J15k7r8J25L3J40j94j90l56J96L82l3K02mk03M30j51m30
$$ plain form
7026 254 797 -200 -340 231 86 -424 161 -128 124 355 -121 -52 131 479 182 290 340 0 -55 175 -273
7047 -273 -319 126 -252 -330 165 66 -95 -224 63 196 200 -563 -124 -107 -102 122 509 149 -233 655 -97 -128 -28
7070 -28 -18 190 85 523 114 179 -5 23 -253 269 91 -398 326 359 -170 83 171 -303 -140 65 -481 -30
7092 -30 72 375 341 277 -55 -93 403 -122 -137 308 -253 -196 75 89 374 57 -184 -154 6 367 -150 -62 218
7115 218 83 -348 56 -320 59 236 -208 126 38 391 276 -59 60 171 276 -27 -102 122 10 148 -354
7136 -354 -243 -135 -316 -108 -283 -677 -267 230 -40 -9 -168 -304 -142 -118 -102 354 49 -101 560 102 162
7157 162 218 8 -23 492 150 -72 -88 -319 -381 110 -313 -373 355 -610 -42 152 -208 -67 -45 128 129 -338 -218
7180 -218 206 304 451 -154 -39 -66 -164 -39 -6 134 -60 -250 -606 -410 -28 -61 141 137 -66 364 213 -217
7202b17r8M67j52j56J41J42k65J87J07n25K89K43J0l8j45l64N32P8j85j09K65
7223B07j53N2k63j4N77n14K19m35J57k8k43K55p7J61L13k27l22M45M6k06P6L73
7245C99n93L76O8m82M53m93L64n17M95m36O79l57j96K59J34o86R7J056r75L12
7265d3J56l78O57n19K42m06L10k06J87l7n31N00l15L06j60K83P9l48k6J05l63
7286e07L65L21m57K7L30m4J79j98N75m88O8l26L39l07K68l34KM29l17L19o38N24
7308A30k86%k4K97k70l32K95RK6j67K18k2L73j44L22l04k31N79l49%r6o90L72
7331b94M37o39J30K00l28M63j09k5N2L38n6k84Kj01M06m75L47J07k35K79P3k22
7353F6m09l48P58l38k35M19M18o83N26k96J3k38K10K27K40k96KL93o5j50j87O4
$$ plain form
7202 -217 -315 152 0 -156 -15 127 -138 49 156 -369 -80 163 173 135 -10 -374 158 236 51 -58 207
7223 207 54 106 -157 -171 406 -108 111 -324 -167 -195 -438 -183 -260 -99 214 -13 -335 110 156 -50 26 399
7245 399 -194 182 250 -232 221 -272 92 -425 70 -366 313 -44 -240 19 153 -533 -436 620 -355 -43
7265 -43 113 -265 392 -127 115 -291 19 -187 0 -37 -568 -68 -383 -77 -237 46 125 -223 -249 -144 -507
7286 -507 -142 179 -278 -251 79 35 214 16 591 103 171 -155 184 -123 145 -189 -187 242 -75 244 -394 130
7308 130 -156 -156 -180 117 -153 -485 -190 -181 -155 -322 -104 -126 247 103 425 121 -110 469 120 120 24 -666 -294
7331 -294 143 -496 -366 -166 -494 -31 -140 -165 -113 225 169 -115 -113 -214 192 -283 64 171 -64 215 288 66
7353 66 -343 -691 67 -271 -506 -87 331 -352 174 -122 -109 -347 -137 90 330 34 36 429 364 214 27 91
7375I1l92M29j42O9r9K81n95M12k5j62K18j87K49mr2j31j93L24l71N38m20P56
7397E54q75K39lQ7K20n8L9k20q8J51n6J35k88k96Q41p00m5K30J18J92q3J61j91
7420F4o6j1j35J42K21l19O3J12n55M70Q47j052K31nk31L87k74k19J74N05n78J32
7442i7M87j71j89m0j17K40K21k65j64K28J56l01K04KQ1M3m68J18J40l4J32l97
7464a91L91L6l20M93n91L96K11n06K98N6o08L70K46j74p6k37J26j69n4L51j43
7485i5k23m7L34k55j22P3L95K5k11L17J52l72J9o7L05n65M9K99l23L11k82k7P02
7508C92n4m75N16k38J64pK05q84P15k80J05r4L6k45J38K20k81R7L82m74m96N83
7530B5N04p89L57k6n86N83k16j35j4N46j91O02J57j126M82j46K68J17o63P40j65
$$ plain form
7375 91 -301 128 -14 55 -44 237 -358 54 29 -133 85 -102 147 143 51 -80 -273 51 -320 218 -202 554
7397 554 -321 -82 -85 2 222 164 203 -17 -105 46 -10 125 -163 -459 382 -318 -363 -133 -15 177 94 255 64
7420 64 -2 -13 -148 -6 215 -104 -41 71 -484 -14 833 -219 12 7 -224 163 -111 -330 -156 349 -229 -97
7442 -97 390 219 30 -10 -127 113 334 69 -95 133 289 -12 192 194 275 318 -150 -32 108 74 206 -191
7464 -191 200 236 -84 409 -182 214 425 -81 217 273 -335 35 281 107 31 -206 -80 -249 -303 48 -95
7485 -95 -318 -365 -31 -286 -408 -335 60 85 -126 191 343 -29 -10 -77 228 -337 -288 11 -312 -1 -283 -310 392
7508 392 338 -137 379 141 305 298 503 -381 334 54 159 65 101 -144 -6 214 -67 30 412 -62 -558 25
7530 25 529 -260 97 71 -515 68 -148 -283 -297 249 58 660 817 -309 173 27 295 412 -251 489 324
7551C24j62j89J36p2J52n56M07l85N38n06N11o21Q59n93K35j3n75M10K95j32L82
7572D45m22L6M3k66L36n07N91q8j3q8J80m71q6K62J25j76L4L22r36P32k41N9K50
7595A21K94k42k51J38o88Q67l12L19k80j38J70k22L62k21j99K54k1r3j51r4M92
7616A05j27L78l38N4k8r9K08j07k43K56K28n04L26l08N90l57J91j85o9K5l28N95
7638B63j05j31q6k20J76J8K61R8l66M25j23J20m35M81m54l1K47l46k71J83l9K81
7660e4R0l37M80L32m73R4j41P49m54L4k46m17J4r4L76p37M76M38J92n77m2M48
7682A51R0l85M51l27L93r3m81M18l75o0J94k09J9j8R1j02K89m1M2l59p7N87n55
7705c57P16j07n71K43NK23j08K0oJ90K71q9m44k9R9n7J60J49l94M17p19M34N8
$$ plain form
7551 324 162 -27 109 37 189 -367 40 -345 193 -313 198 -423 436 -157 78 65 -510 -100 195 63 445
7572 445 23 59 102 -164 172 -335 256 168 155 67 247 -224 -310 -48 77 -99 -65 257 -679 53 -188 -129 121
7595 121 415 173 -78 60 -628 239 -73 246 -34 -172 -2 -224 138 -83 -282 -28 -49 -142 -293 -387 105
7616 105 -22 356 18 72 44 -55 153 46 -197 59 287 -217 109 -199 391 34 225 40 -29 -4 -332 263
7638 263 158 27 -59 -279 -103 -85 176 274 -92 333 210 330 -105 376 -78 -109 138 -208 -479 -296 -335 -54
7660 -54 36 -301 179 511 38 132 -9 740 286 320 74 -343 -329 -423 -47 -784 -308 130 322 -255 -297 151
7682 151 241 -144 307 -20 373 280 -201 217 -158 -218 -24 -233 -214 -232 -141 -243 46 5 47 -312 -389 198 -357
7705 -357 359 252 -319 -76 -71 152 44 64 58 248 519 430 -14 -43 56 -1 159 308 -86 331 -388 46 104
7728A04J89q03L70L41p83N45j31J72K67l6n6l2M3l63N22q0j43l02K85l40j7J09
7750a39j07K49J0l63K93J65l78o6N77k52M48j33l49k79L11n8n1J26N2P7l41N23
7772C15k28o77J168j071O92j05k23k63M51k99M42j67m7k8J62p7j85K78K21m63
7792a04P4J8J13m37M04r4m6N45p36K51k33K25k39J64pK26J62l11l0k5M59p88K69
7815a40j84J41L12K06k4m72K58l99L40p4J41l61J00J30L1l4L34j80q20M46M93
7836B44k9p1J40n12M2J17j82j6j63L05L32n13L92j78M1m9p5K30J87M0n26L7L1
7859a76J15lJ22k41M52j09l08K86k00j52M09J14o4l28m2o0J7Jl10L38k85M92k84
7882b16J07l0J73l84K14j97J49P0Ol23J14O67k87L50k13J76p3l09j68L25n01L90
$$ plain form
7728 104 293 -510 -140 201 -582 -37 -168 4 271 235 179 147 190 -173 349 269 126 -176 109 -231 -248 -139
7750 -139 -246 3 13 -350 -57 108 -270 -336 241 -11 437 304 -45 -324 -13 -71 -122 4 56 133 -208 315
7772 315 87 -590 578 -493 199 94 -129 -392 59 -240 202 35 -12 -40 122 45 -140 138 359 -104
7792 -104 -30 -12 101 -336 68 -26 -72 473 -263 -12 -245 -20 -259 -95 -102 124 286 -25 -55 -80 379 -409 -140
7815 -140 -324 -183 129 335 311 -161 97 -302 38 -36 105 -256 -156 -26 5 -29 305 125 -695 -249 244
7836 244 215 144 284 -228 -186 -69 -251 -267 -430 -125 207 -306 86 -92 -51 -100 -175 55 242 282 -244 -207 -176
7859 -176 -61 -64 58 -183 269 160 -148 138 -62 -214 195 309 245 -83 -125 -185 -168 -167 -477 -139 -424 68 -216
7882 -216 -109 -139 34 -350 -136 -333 -184 -114 -108 -431 -317 350 63 413 200 376 303 -6 -174 151 -350 40
7904D0j22L55N7l90N28q12L05n2J62j90j32K84j4M5J23n90M85k62K0L3J1K27j97
7927h6J93m45J33n5L5L98k47J46K13j23ro86Q63q8o0j62j58k22L96J8k33q0J22
7950a37j6L95n74J12K63N22m61m32L70j2l88P20p89O9R8k53M86N4m46J44K45k67
7972b97K41lj16L28J48m43M46k87j05L99k88k63j3P45p55J27M13j40j27J24j98
7993f4n4R0j14N36p95J95P21p02j68L63k33J30o61P80ro65O56K72m53K95m14M18
8015A24K55j95m70N79k77j10oj66q3J6L35K43m52K40l67K30J65K71q46K61O64
8036D11m84m5L9K21m31L16N14m61l29N1K67J67m06J90m1k43M48n1k13l60O35k76
8058h1R2k35O45n5K65m58n9L5k0m7k55N52o19o2R8J81N38k27l97r7k09K54l74
$$ plain form
7904 40 -82 273 330 -60 468 -344 -39 -91 71 -119 -251 33 19 64 187 -403 82 -180 -160 -127 -116 111 -86
7927 -86 107 -338 -205 -260 -225 173 -74 72 285 162 153 -533 330 242 182 20 -138 -360 36 54 -179 -259 -137
7950 -137 -153 242 -332 -220 43 565 104 -328 42 30 -358 362 -427 -358 -260 -513 -27 27 -419 -275 -30 -297
7972 -297 -56 -59 -175 153 301 -142 304 17 -88 311 23 -240 -253 492 -263 -136 277 137 10 134 -64
7993 -64 -118 -28 -142 394 -401 -206 515 -187 -355 8 -225 -95 -756 24 15 -650 6 278 -175 120 -294 124
8015 124 379 184 -286 293 16 -94 -100 -266 -349 -333 2 245 -207 33 -334 -104 61 332 -514 -253 411
8036 411 -73 -118 -79 142 -289 27 541 80 -249 -198 69 236 -170 20 -21 -264 184 133 -80 -440 195 -81
8058 -81 11 -224 421 366 631 173 114 149 129 82 -173 379 -240 -302 -204 -23 515 288 -109 -206 -415 -161 -535
8081e35L02O18n24k0R8l45O69J84k90k65N73o71L38L48l86j61L61n31J55O2J8
8102bK36j09L9l88j9J00N53k37l24k77P51k62m71P27n4m36l51L84K16L8J41ok45
8125Dm60L89R8R1m03K42L96o60L76P4Q0o13O46o57K13N6N7q0J23j69K39m69K71
8148a56J14K1r0J3J68L4k19l99R41n59n7J15K53NN19o13r5j71K58m3j48k6O1M80
8172D06m41J84J1k06r4j7K63p63Q00J02m28J15K44J52j2j89j19k71j47
$$ plain form
8081 -535 -233 385 -139 -159 -61 -406 263 447 157 -108 465 -206 132 480 94 -67 294 -237 -82 -20 -2
8102 -2 234 125 164 -224 -243 -143 410 173 -151 -428 323 61 -410 317 263 -173 -524 -140 76 114 255 249 4
8125 4 -456 -67 31 122 -281 -39 357 -303 73 147 227 -386 260 -397 -184 -128 -71 -151 -28 -197 42 -427 -156
8148 -156 -42 -21 -111 -98 70 104 -115 -514 427 -132 -189 -74 179 184 703 90 -5 -176 82 39 -109 -135 -74 406
8172 406 -35 149 160 -46 -140 -157 106 -657 143 245 -183 -68 176 328 316 127 8 -263 -410
8191d10
$$ Imaginary data points
##PAGE= N=2
##DATA TABLE= (X++(I..I)), XYDATA
0@%%%%%%%%%%%%%%%%%%%%%j2M4o4O4o4O4o4P1j00J25j28J40j69J89k10K41k67
38a40K98l34L72m17M62n07N62o24O91p64Q39r22J019j124J239j368J511j670J854
57I77k063K301k587K929l341L861m532N438o741Q769j2419K1008q4781k3312J18016
72B3523k7399j9816M9954q92l3812M0062q211k0728K7814p562k0409M0228k1332
85B1420m1446M3258O44n4972M1608K1935n8159K1261M0809n2194M332M6728l2142
98C082q372M0050k5391j2308L1392k0282o795K9805l4659j2859M5986l4259l5710
111d0320N6868r378n1564M4783J2342n7275K6038L2363l5593J4399K6894k7987
123h430P759J5644k9442K2902K4586m4045J4743L9841n3191j3175N2257l7433
$$ plain form
0 0 0 0 0 0 0 0 0 0 0 0 0 0 0 0 0 0 0 0 0 0 0 -12 32 -32 32 -32 32 -32 39 -61 64 -64 76 -93 96 -114 127 -140
38 -140 158 -176 196 -221 241 -266 296 -328 363 -401 438 -484 535 -589 650 -718 793 -877 977
57 977 -1086 1215 -1372 1557 -1784 2077 -2455 2983 -3758 5011 -7408 13600 -71181 -94493 23523
72 23523 -3876 -23692 26262 25370 -8442 31620 23409 2681 30495 22933 2524 42752 21420
85 21420 -20026 23232 23876 -31096 10512 32447 -25712 -4451 36358 -15836 -11504 35224 3082
98 3082 -5290 34760 9369 -2939 28453 8171 1376 31181 -3478 -16337 29649 -4610 -40320
111 -40320 16548 7170 -44394 389 12731 -44544 -18506 13857 -21736 -7337 19557 -8430
123 -8430 -671 14973 -14469 8433 33019 -11026 3717 43558 -9633 -22808 29449 -7984
135g984k8347N7945j2153m3407L4643Q20l3969K8189O712k1494L0326o88k8391
148a7798L5243L346m3427L6906K4233n2832J6731L6252m9968l597M3408l5448
160f951j6024L8402k1464k0200L0011j4363j0626L2902j7265j6328L9305j6022
172A377k5298M7624l117m0121M1683J1159n3424K2030K8141m3717P598L0651l3159
185h573l805J9492k8453L964K5005k8188P341L4405l6061o936M5453k9122k0843
198b6321N6023q494l8444L9559L215m1316K3417J1350l1448J8598Q220l0128J6004
211B35N892l5386K3168J7801m1493J8500L3726m3440R34M6346k9528j4293M4717
224B7179j5851k4769L3113n546k1789K5622o986k0898K4388j3395k5090L3176
$$ plain form
135 -7984 -36331 21614 9461 -33946 697 1517 -32452 -4263 2449 -19045 11281 10593 -17798
148 -17798 17445 20791 -22636 14270 38503 -14329 2402 38654 -11314 -14911 28497 -6951
160 -6951 -22975 15427 -6037 -26237 3774 -10589 -21215 11687 -5578 -21906 17399 1377
172 1377 -23921 23703 20586 -19535 22148 33307 -20117 1913 30054 -13663 -6065 24586 -8573
185 -8573 -12378 7114 -21339 -17375 7630 -20558 -13217 21188 -14873 -21809 23644 -5478 -26321
198 -26321 29702 21208 -17236 22323 25538 -15778 7639 18989 -12459 6139 14359 -15769 235
211 235 6127 -29259 -6091 11710 -29783 -11283 22443 -20997 -20063 26283 -3245 -17538 27179
224 27179 11328 -13441 19672 14126 -7663 17959 10973 -9925 14463 1068 -24022 9154
236I154m716l5707L4709J0430m6827K2321K7877m1110R360M0447k6776o552K8837
249B1447k0643o656K5228j7248j137K5543k6882r928L2253k8855k2875M4192j0951
262C488l5239L8367N467m3801K1753K0657k9762J5918J9396k3737J1326J4661
274A8494k6079J3596J6867l1615J1939K7029l9657k943L8055l1345j8205L9633
286A5769j6172k8427L2115k361k5889K5793M752k0142K1052J81k1834K6202L469
299A4508k6115K8220J0326m0319J6723K3179m0049L100L3328k9771q979L0544
311A4695k1438j7508K4891r255p684K4860j1985j0013K7725j5561j6893L6161
323A7995n855k7756L5858N773m0735J9901J7128l5638Q133K3430k7226N15J6867
$$ plain form
236 9154 4438 -31269 3440 13870 -32957 -10636 17241 -23869 -14509 25938 -838 -7390 21447
249 21447 804 -5852 19376 2128 991 26534 -348 -10276 21977 -6878 -29753 14439 3488
262 3488 -31751 6616 12083 -31718 -9965 10692 -19070 -3152 16244 -7493 3833 18494
274 18494 -7585 6011 22878 -8737 3202 30231 -9426 -12369 25686 -5659 -23864 15769
286 15769 -403 -28830 3285 924 -24965 828 5580 -14562 6490 6671 -15163 11039 14508
299 14508 -11607 16613 26939 -13380 3343 26522 -13527 -10427 22901 -6870 -15849 14695
311 14695 -6743 -24251 640 -8615 -16299 8561 -3424 -13437 14288 -1273 -18166 17995
323 17995 12140 -15616 20242 26015 -14720 5181 22309 -13329 -5196 18234 -8992 -8477 8390
336H390k3381K121J7691k1422N101K4532k6837o04L4491k2710j3566L9797j2344
349A1259k5664L2641j784k9701K4320P045k7635J3508O104k4530J1046O053k2985
362b0323J8377J0934l0142J4065K0045l3868P537L4507k5622o187L5191j5682
374H832j9315K6376o643j6871K1687m064j5153J6694j1284j9480K4825n901k4302
387b4599K8857N161l4264K0297J8283l4442R959K9698k3521j440K4938j6713m300
400b086J9061j5279k718J9484j9734o451K4402k1161j4069L1948j3330k5964K9844
413C947P78l0386K2553J2654k4720J4429J4261k1675Q332J2888j7680J0879J2920
426A9180k2652Q712J5732l0635N42K6780k4422r514L1145j6325k1622K6447m804
$$ plain form
336 8390 -14991 -12870 4821 -16601 -11500 13032 -13805 -14409 20082 -2628 -16194 23603 11259
349 11259 -14405 18236 16452 -13249 11071 18116 -9519 3989 10093 -14437 -3391 2662 -20323
362 -20323 -1946 8988 -21154 -7089 12956 -20912 -13375 21132 -4490 -10677 24514 8832
374 8832 -10483 15893 9250 -7621 14066 10002 -5151 11543 259 -19221 5604 -297 -24599
387 -24599 4258 9419 -24845 -4548 13735 -20707 -10748 18950 -4571 -6011 18927 2214 -2086
400 -2086 16975 1696 -1022 18462 -1272 -7723 16679 -4482 -18551 13397 67 -25897 3947
413 3947 4725 -25661 -3108 9546 -15174 -745 13516 -8159 173 13061 -4619 6260 19180
426 19180 -3472 5240 20972 -9663 -9121 17659 -6763 -16277 14868 -1457 -23079 3368 -1436
439a436k1016K2056M961j4957J6085L3j4965J7475O37j8295K2645P276k9161J5415
453F753J4261l3022N320K4954k6152n292K5227j7852j0998K0016j0614o934J9586
466E253r740o488K1460j0671j0690K7217p251k0064K6798M73k9066J9199J2332
479A8762k8983J0269J5678k4952K15J4486j7971J312J5557j4974L793J5814k1005
492a1999O38K4402j8642m190L0225j1725j8496K6151l643k5244K0333O197k1070
505g063J1620M218j9429P979K921j7147J4429P422k1585J3196J4151k6806O462
518i632K5246k2075k712K9036j4471j2877K2290o620j4261J7648n132j2563J4153
531H030o467j4390J8128n432j7935K1157N69k5329J8325J2980k5650J1459K0579
$$ plain form
439 -1436 -22452 -396 4565 -10392 5693 5726 -9239 8236 8873 -9422 13223 20499 -8662 6753
453 6753 21014 -12008 -6688 18266 -7886 -13178 12049 -5803 -16801 3215 -7399 -14333 5253
466 5253 -4487 -10975 10485 -186 -10876 16341 9090 -10974 15824 16297 -12769 6430 18762
479 18762 -10221 48 15726 -9226 -9011 5475 -12496 -11184 4373 -10601 -6808 9006 -11999
492 -11999 -11361 13041 -5601 -9791 20434 8709 -9787 16364 12721 -12523 7810 14007 -7063
505 -7063 4557 8775 -10654 -2675 246 -16901 -2472 4950 -16635 -3439 10712 -16094 -9632
518 -9632 15614 -6461 -9173 19863 5392 -7485 14805 8185 -6076 11572 6440 -6123 8030
531 8030 1563 -12827 5301 -131 -18066 3091 3660 -21669 -3344 9636 -16014 -4555 16024
544A6024k1046L96J9740j6476k783J8933j1039k790J3854j5183n577J6505j5946
557e388r098K5605j1144j8534K4548l607k4433J9656R372k0657J3642J2185j7288
570e141N692R873j4109P877R868j6974P902J1659k3527J975J9042k1225n610K4541
584A1843j5258j4624K2346m794j6483J7974J638j3714J3605J970j2142J4521J904
597H786j4191J5903L261k1670J3245R944k5139P669J8034k2506l231J8709j6233
610g419q279J8675p686o341J6425p374o702J4484q065o731K1979n856j4298K2084
624A4896k098k3850J6683P246k3103J0519J2951k0934J379J1357j5142J87J2628
637B719j2163L414J2801j5662J060J8450j5321l568K4168j0926j2946K1985m379
$$ plain form
544 16024 -5022 -4626 15114 -1362 -4145 14788 3749 959 14813 -370 -5947 10558 -5388
557 -5388 -14486 11119 -25 -18559 5989 2382 -22051 -2395 6977 -13680 -38 12147 -5141
570 -5141 551 10424 -3685 4192 14060 -2914 4988 16647 -6880 -4905 14137 -7088 -12698 11843
584 11843 -3415 -18039 4307 -487 -16970 1004 2642 -11072 2533 4503 -7639 6882 8786
597 8786 -5405 10498 13759 -7911 5334 15278 -9861 -2192 15842 -6664 -9895 8814 -7419
610 -7419 -15698 2977 -4709 -11050 5375 -1999 -8701 5783 -2282 -9013 12966 7110 -7188 14896
624 14896 12798 -11052 5631 12877 -10226 293 13244 -7690 -6311 5046 -10096 -9909 2719
637 2719 -9444 -6030 6771 -8891 -7831 10619 -4702 -8270 15898 4972 -7974 14011 9632
650I632j8754J7188K726j7820R101M226j5611Q400L310j4453J0084N343j7437
663a4065J0174R818j8664P445J8771j7529j433K1911j4696r262J9277n849j0564
676d666J5798m175j2005J0480n845j1246J4909l932j2664J7534q64k0402J5321
689a757Q599k0826J0276J7261j7767J945J5531j3168l462J4922r365k481J2144
702A1852j1775m583J3305j2926o805J8044r549j2237J9035l467j7853J7689N445
715F175j7990J1222J0289j5087N413R796j1772O020P644j3343M293Q225j7595
728f710K965J5709j7283m175J9490j4418j1119J9016n788j2056J7051Q61j2032
741h489J1857P54j1226J1144K662j0405J3234J577j7201J1141O682k0972P316
$$ plain form
650 9632 -9122 8066 10792 -7028 2073 6299 -9312 -912 2398 -12055 -1971 3372 -14065
663 -14065 -3891 5927 -12737 -5292 13479 -4050 -5483 16428 1732 -7530 11747 5898 -4666
676 -4666 11132 6957 -5048 5432 -413 -11659 3250 -682 -13346 4188 3324 -17078 -1757
689 -1757 6842 -13984 -3708 13553 -4214 -2269 13262 94 -3368 11554 2189 -292 11852
702 11852 77 -4506 8799 -4127 -10932 7112 -2437 -14674 4361 894 -16959 730 6175
715 6175 -11815 -593 9696 -5391 22 9818 -1954 4066 11710 -1633 2660 10885 -6710
728 -6710 -3745 11964 -5319 -9494 9996 -4422 -15541 3475 -2313 -14369 2682 3543 -8489
741 -8489 3368 4122 -7104 4040 6702 -3703 9531 11108 -6093 5048 11730 -9242 -1926
754a926J3710j8751j61J5548j5292n442J5469p726n796J4031n091n411J2648n821
768a1o080J6183m987j0878J7092k131j7430J4768M101j8663Q474R394j8280K379
782f069J0589j2029O33J0173j0163J088J0149j1334R82J4347j0813j558J8664
795A4659j1158j0388J8342m898j4271J5304K048j5466R054K183j4731O467L964
808A109j1381Q658N390j3230O616Q073j6039O391J5333j4760P27J7595j2776p100
822e394J6990p319r544J3732l203r883Q958l644q986J0297l143j0337J2953j80
836A297j4942J2756O968j6477Q942J2006j5350K020J4180j1937j408J2994q359
849B690l263R710r559l894J0047q846m789J4730q700r726J4637l867j3845J5443
$$ plain form
754 -1926 11784 -6967 -7128 8420 -6872 -12314 3155 -4571 -10367 3664 -1427 -6838 5810 -11
768 -11 -6091 10092 5105 -5773 11319 9188 -8242 6526 10627 -8036 438 9832 -8448 -6069
782 -6069 4520 -7509 -6876 3297 -6866 -5778 4371 -6963 -5981 8366 -2447 -4005 14659
795 14659 3501 -6887 11455 6557 -7714 7590 9638 -5828 3226 5409 -9322 -2855 1109
808 1109 -10272 -1614 3776 -9454 -2838 5235 -10804 -4413 10920 -3840 -3113 14482 1706 -5394
822 -5394 11596 4277 -5267 8465 5262 -4621 4337 693 -8293 2004 -1139 -11476 1477 1297
836 1297 -13645 -889 6079 -10398 -1456 10550 -4800 -2780 11400 -537 -1945 11049 2690
849 2690 -573 9137 -422 -4316 5731 -3115 -7904 6826 -1874 -11600 3037 -830 -14675 768
863G68M675j3942R960O732j3391N584Q037j0993M916Q356j1356L576O088j4278
877e268K453J1226j3835j643J5297j2087p669J5775o181j0565J4960pj0396J1287
891C347Q67r426J0103J254r321J0067J357j2925Q471N385j5837O394J0396j6425
905f293K26J2399j2949l856J4750p024n306J1786m553o420J1660l899m707J3053
919H867m153q349J2527k693j3305J1907L307j5297R131O753j5334J803Q232j0957
933g561J445R779r374J301Q791r564O33J1050q956j536J5413r043p119J4749n285
948D723j1630J3238K46j3031R090K391j1939N124L553j0024O459L421j0472O977
962a874N970j1861N707J0531j2103R98J3467j1369m238J4610o436p448J1934m191
$$ plain form
863 768 5443 -8499 1461 8193 -5198 386 8423 -2570 2346 10702 -654 2922 9010 -5268
877 -5268 -2815 8411 -5424 -7067 8230 -3857 -11526 4249 -1932 -12497 2463 2456 -7940 3347
891 3347 4214 -5212 4891 6145 -3176 6891 8248 -4677 3794 9179 -6658 -264 10132 -6293
905 -6293 -6067 6332 -6617 -10473 4277 -2747 -8053 3733 -820 -7240 4420 521 -4186 8867
919 8867 4714 -3635 8892 6199 -7106 4801 8108 -7189 1942 8695 -6639 -4836 3396 -7561
933 -7561 -6116 3663 -5711 -4410 4381 -5183 -4550 6500 -2456 -3992 11421 2378 -4741 10008 4723
948 4723 -6907 6331 6577 -6454 2636 5027 -6912 -1788 1765 -8259 -1800 1621 -8851 -1874
962 -1874 4096 -7765 -2058 8473 -3630 -2632 10835 -534 -4772 9838 3402 -4046 7888 3697
976C697r111Q758l391p454R788j790r141R500n31j1466J0582L520j1677Q948R216
991I448j3624K704J1117j0906m98J0878p102k650Q760p830m095Q901p654m502
1005g053J1581o595p707J3421m493j0278J2717K095j2206R754N813j2114O330
1018A265O778j0133L688O885j0342L310N921j1213K312Q760j1844q70J1061j0460
1032d882n300J3379n354p558J3232j035r522Q883J844q425Q484K068p311P678
1046F181Q16j1676P117L744j2153N969P541j3226R07J0351j1452k644J1332o042
1060c235l368J0380m185m824R296m025m045J0319k352o628J0522k470j1168J0334
1074D551K006j2866P583N408j3521L502P775j0394R93Q199p964L22P395p556J131
$$ plain form
976 3697 -5414 3344 -47 -7501 2287 497 -8644 856 325 -11141 -559 2961 -8716 232 9448
991 9448 -4176 -1472 9645 -1261 -1759 9119 2017 -633 8127 297 -3798 5103 -2551 -7053
1005 -7053 4528 -2067 -9774 3647 -846 -11124 1593 3688 -8518 1236 7049 -5065 1265
1018 1265 8043 -2090 1598 8483 -1859 1451 7372 -3841 -1529 7231 -4613 -5483 5578 -4882
1032 -4882 -10182 3197 -2157 -9715 3517 2482 -7040 1843 3687 -4738 3746 5814 -1497 6181
1046 6181 6997 -4679 2438 6182 -5971 -2 7539 -5687 -4780 5571 -5881 -8525 2807 -3235
1060 -3235 -6603 3777 -408 -5232 4064 39 -4006 6313 3961 -2667 7855 5385 -5783 4551
1074 4551 6557 -6309 1274 6682 -6839 -3337 4438 -5956 -4963 3236 -4728 -4406 2989 -4567 -3436
1089c436R294p591q64J1645p502n840J2452m631q990J2001j074j1096P597J995
1103C960j1546N762L923q182N105L640j0091N208N152r244M601Q992r822J338
1117a204J0580r517l355J1532n861o164J0701l670p739P597k850p101Q551j642
1131a42o599P931m61r459R289K458j0493P729P238j1412L104R088r616J93Q934
1146G782p143k501Q219o860k755P493o153l189R300o495n699J0299l219q074J0674
1161A679J928r910P722L802r771M761O216p981L348N477p947J419M835q941J125
1176b238P465q720o20R097q582m148J0325m617o059J1255j127p420Q025Q84p763
1191d243O946J573o555O525Q39p921M950K896r841N166N820j1585J787Q153r251
$$ plain form
1089 -3436 5858 -1733 -2597 9048 1546 -4294 8158 3527 -5463 6538 5464 -5632 1965 3960
1103 3960 -7586 -1824 2099 -6083 -978 2662 -7429 -2221 2931 -6313 -1712 7280 -2542 -1204
1117 -1204 9376 -141 -3496 8036 2175 -3989 6712 3042 -4697 2900 50 -7051 1500 -142
1131 -142 -6741 1190 729 -8730 559 3017 -7476 253 7491 -3921 -817 8271 -1345 -1152 7782
1146 7782 639 -1862 6357 -503 -3258 4235 -1918 -5107 4193 -2302 -8001 2298 -921 -8995 1679
1161 1679 3607 -6303 1419 5221 -4550 211 6427 -1554 1794 7271 -676 743 5578 -3363 -2238
1176 -2238 5227 -3493 -4113 4984 -3598 -7746 2579 -2038 -8097 3158 2031 -5389 2636 3520 -4243
1191 -4243 2703 4276 -2279 4246 5085 -2836 2114 5010 -4831 335 6155 -5430 -3643 4510 -4741
1206d741j440R540o237k627Q585m141l900P852k153l407Q500k788n985Q874k502
1221C430q018Q914J171j0498O796L018j0555K713O155q952K323P139o688m66O222
1236B704o079L35P848o019k09R142o045m416R589m584o820R279j128q071O257
1251A783Q97q254L785L488o692L254L847p205L447M490o991L142O442p912J401
1266a078Q596p955j722Q917n113m474Q199l328o307O804k317n236O206r66n742
1281e516N980p61o536P242K452q135O090N083r385L375O340p742P63P882o741
1296C91j181N741n091l081N959m537k288O816m184l847P334l629n784Q607J017
1311B243p129O139L256q221M268M324o370K295M546o226J285M211p273J447M573
$$ plain form
1206 -4741 -6181 3359 -2878 -5505 3080 -1061 -4961 2891 738 -2669 5831 3043 -2942 5932 3430
1221 3430 -4588 4326 5497 -5001 1795 4813 -5742 -3029 3126 -5826 -3503 3636 -3052 -3518 2704
1236 2704 -3375 -3040 4808 -1211 -1420 7722 1677 -2739 6850 2266 -4554 4725 3597 -4474 1783
1251 1783 2680 -5574 -1789 1699 -4993 -1739 2108 -5097 -1650 2840 -4151 -1009 5433 -2479 -1078
1266 -1078 7518 -437 -2159 6758 1645 -2829 5370 2042 -4265 2539 222 -5014 1192 226 -5516
1281 -5516 464 -297 -6833 409 2861 -5274 816 5899 -3486 -111 6229 -1513 -750 7132 391
1296 391 -790 4951 -140 -3221 2738 -1799 -4087 2729 -1455 -5302 2032 -1597 -7381 1226 2243
1311 2243 -4886 1253 4509 -3712 556 4880 -1490 805 5351 -875 410 4621 -2652 -1205 3368
1326C368o428j22O603o667k245Q652m832l942Q369j335n847O514K27n298N384
1341B401J603n316M478P86p032M288K375o485L287M316q980J400N294o903m76
1356d964P593m948j840O998l522l277O261j718k196O181k358l970O066j875n345
1371b914O205j94o576M777K178p998K990L962p066Q84N776n056L21M756l875j32
1387a962N124l757o30N614m159j873O261k918m823O981r45o551M767N02o570M207
1403g32J985n346L012K351n020K272L348n442K906N000n569N64O002o096q44O586
1419D977l556l057O051l330m518N166j342m538M530m09m080M895p46m622M965
1434C86J049n060M544L603o744K387N094o333K75N565m699q93M722m204j952M542
$$ plain form
1326 3368 -3060 -3182 3421 -3246 -5491 3161 -1671 -5613 2756 1421 -4426 2088 2315 -2983 2401
1341 2401 4004 -1312 3166 3952 -3080 1208 3583 -2902 385 4701 -4279 -2879 2415 -4488 -4964
1356 -4964 2629 -2319 -4159 2839 -683 -3960 2301 583 -1613 4568 2210 -1760 4306 2431 -2914
1371 -2914 3291 3097 -3479 1298 3476 -4522 -1532 2430 -4636 -3752 2024 -3032 -2711 2045 -1830 -1962
1387 -1962 3162 -595 -1225 4389 230 -1643 4618 1700 -3123 3858 2913 -3638 1129 1631 -4939 -732
1403 -732 1253 -4093 -1081 1270 -3750 -1478 1870 -3572 -666 4334 -1235 -671 5331 -765 -1609 4977
1419 4977 1421 -1636 4415 1085 -3433 1733 391 -4147 383 -26 -4106 789 43 -4579 386
1434 386 1435 -3625 919 4522 -2222 165 5259 -1074 -799 4766 67 -826 3896 -308 -2260 2282
1450B282l294j666M432k976k814N154j611m513P062o62n131M947J303m944L365
1465I34L303n019K234K671n116R14L047m837J121L551m877r6M788n606j185N927
1481A754l051k708O263j752l573M110L28l846M439P92l092K701M77m424L311P48
1497B477n665L474K359n304P26M352n517q5N444m563p46M814k164k293M666j231
1513G44j596L602j319k800M450j606l008L946M9n319L685J031n822K631K990m480
1529b822J240L451l805r2L620k919m15M100k562m90L982k946j627M713k714k647
1545a933M685q50n131M607J04n325K804K008l838J882J634l263J852J940l508
1560b332J855L293m328J321L856m008k56M312l070j981M682k998k428L376q08
$$ plain form
1450 2282 -1012 -2678 1754 -1222 -4036 1118 -493 -5006 2056 1394 -3737 1210 2513 -2431 934
1465 934 4237 -782 1452 4123 -993 -79 2968 -1869 -748 2803 -2074 -2170 2618 -2988 -4173 1754
1481 1754 -1297 -4005 2258 506 -3067 1043 1371 -2475 1964 2756 -336 2365 2842 -1582 1729 2477
1497 2477 -3188 286 2645 -2659 -1933 2419 -3098 -3183 2261 -2302 -3048 1766 -398 -2691 1975 744
1513 744 -852 2750 1431 -1369 3081 1475 -1533 2413 2462 -2857 828 1859 -3963 -1332 1658 -2822
1529 -2822 -1582 1869 -1936 -2028 1592 -1327 -1742 2358 -204 -694 3288 342 -1285 3428 714 -1933
1545 -1933 2752 1902 -3229 1378 1482 -3843 -1039 969 -2869 -987 647 -2616 -764 1176 -2332
1560 -2332 -477 2816 -1512 -191 3665 -343 -599 3713 643 -1338 3344 346 -2082 1294 486
1575D86k851L186o15l299L129j68k991L087J778m347L537J141m395K576L006l801
1591e41M13L843l571p67K752k242j438L217k112j097L055k841j534L923j858k347
1607c145N160j375l155L750Q29l996K961K093l929J796K082l875R18K039l560
1622a407M05K400k855O9K804l139q49L956k652j983N005j756k419L912J80l491
1638a820L233M19k665K170M67k768J415J505l408J993J281m096R57K719m215R75
1654a838L403k842o80L475j715k030L825j232j192K849o67j835K070m87k660L340
1670A784p25l101L023O03m537J933J793k888J243K150k849M7K796j716n43K818
1686A831k116M5K561j983n91K696j683k056L614j040l120K480K14l335K671l0
$$ plain form
1575 486 -2365 821 206 -3093 36 -132 -3123 -36 1742 -2605 932 2073 -2322 254 3260 -541
1591 -541 -128 3715 144 -623 2129 -113 -1551 1666 -446 -1543 1512 -1329 -2863 1060 -798 -3145
1607 -3145 2015 640 -2515 1235 2064 -1932 1029 3122 -807 989 3071 -804 114 2153 -1407
1622 -1407 -1002 1398 -1457 -1388 1416 -1723 -2572 1384 -1268 -3251 1754 -2 -2421 1491 1671 -1820
1638 -1820 1413 1832 -833 1337 1804 -964 451 1956 -1452 541 1822 -2274 -1317 1402 -2813 -1838
1654 -1838 1565 -1277 -1957 1518 -197 -2227 1598 366 -826 2023 1356 -479 1591 1104 -1556 1784
1670 1784 1059 -2042 981 1584 -2953 -1020 773 -2115 -872 1278 -1571 -1524 1272 -444 -987 1831
1686 1831 -285 -240 2321 338 -253 2443 760 -1296 2318 1278 -1842 638 852 -2483 188 158
1702A58k007J192J211k115Q52J570k015J085K320l021M15K761k875j51L516k441
1718D55j248L163j762k915K976m05k024K238l64k227K561l24k386K490O45k327
1734a454K238P16k544J011K421k959N23K688k774o22K750k240j170K262j018j162
1750a334K405j879p50K180q04k033K814l02k184K966L20k651K176J250k737J382
1766H19J226k414L33J738k130L98P37j837O9K043k593p3K566j200j288L087j374
1783A07j816K570k62j422J838L36k068J855M34k069J139J66j794J144P18k326
1799a450K13K088k312J06K417j751p95K128j037j137K612n33r85K050l42j789
1815e17J474k83j349J762k93j994J818l1k301J283J475k581L87K105k087L1J994
$$ plain form
1702 158 -1849 -657 554 -1561 -709 861 -1154 -69 2251 -770 -355 2406 -469 -620 2896 455
1718 455 -793 2370 608 -2307 669 264 -1760 478 114 -2113 448 124 -2262 228 873 -1454
1734 -1454 784 1500 -1044 -33 2388 -571 -48 2640 -134 -756 1994 -246 -1416 846 -172 -1334
1750 -1334 1071 -808 -1558 622 -182 -2215 599 297 -1887 1079 1399 -1252 924 2174 -563 819
1766 819 2045 -369 -36 1702 -428 -30 707 -1130 -1061 982 -1611 -1684 882 -318 -1606 1481 107
1783 107 -1709 861 599 -823 1015 1351 -717 1138 1572 -497 642 808 -986 158 876 -1450
1799 -1450 -1237 851 -1461 -1355 1062 -689 -1484 644 -393 -1530 1082 549 -436 1614 1272 -517
1815 -517 957 674 -675 1087 794 -1200 618 587 -1714 -431 1044 -1537 -1150 955 -1132 -1101 893
1832H93j368l5J666j095K29J539j703q01K343j161o35J980j440k122J963N73k759
1849a933K354K18j824O66J138k166P42J104j470J271J303j631L95J588j767j89
1865b01J717j888n98K401j364j612K269o20j714J928m86j179R57M43j468J373
1881d2O85j823J537N61j866J147J411k302R22J258j471n87J567j160q43J654p68
1898a20r11J293n45j033J507o14o01J506m61j159J334J053j708R57Q10j406M41
1915C43J222j765q8J001j149j88J562j850O56J024j758J66J371j025m84K006j045
1932ar74J806j1j602J651k10r93J070j83p78M34L27q37L03Q62k487J506P53k166
1951a530P13K237k065k09J289q13k82J172j17j072J593j97j280J104M1j176J361
$$ plain form
1832 893 -475 -510 1156 61 290 1829 126 -675 1668 507 -128 1852 412 -1710 253 826 -1933
1849 -1933 421 639 -1185 -519 619 -1547 -805 299 -1171 100 1403 -228 167 1755 -12 -201
1865 -201 1516 -372 -970 1431 67 -1545 724 104 -1610 318 -168 -1347 -390 53 -1415 -42
1881 -42 643 -1180 357 918 -948 199 1610 -692 230 1488 17 -570 997 -163 -1006 648 -120
1898 -120 -1031 262 -283 -1316 191 -423 -1024 482 21 -1138 196 1249 -459 498 1308 -98 343
1915 343 1565 -200 -288 713 -436 -624 938 -912 -256 768 -990 -824 547 -478 -962 1044 -1
1932 -1 -975 831 820 -782 869 659 -334 736 553 -225 209 536 -301 2 864 -1623 -117 636 -1530
1951 -1530 -817 1420 -645 -854 435 -378 -660 512 395 -677 916 719 -561 543 584 -592 769
1968G69k94j115Q86L8j827P35J130j261J15J766j649J81J148j086j20J198m52
1985A62m84J438j047R0R98j180j27J308o48j046R21m66q58P09O25j413O09J197
2003G88j789P66J56m53N60J163j354j22J145o86l60J432j046q41J406l96j288
2020i19J702l70j249J106m97l04q5L21m74R66M04j113Q79K50j301Q70P18j378
2038d74L75J286r99m75J497j287p46J379o44j41P79m35r38R78m01l88J358j89
2056E35j066J012K76j265P95N73j594N39J238j187PO09q04J93O81j000J72P28
2074D42p23m44J698j234n37J268l95q15J204K39j252R36M35j160L00L06m70M06
2092B04K31j119K99Q82j301N68Q66j441k9J153q38j56J222n81l52J371j234j51
$$ plain form
1968 769 475 -640 246 284 -1543 -808 322 -939 -824 942 -707 -526 622 -464 -584 614 162
1985 162 -322 1116 69 159 1157 -23 -150 1158 510 -536 385 -81 -939 -230 395 -1018 -409 788
2003 788 -1001 -235 -79 -532 28 1191 -163 -285 860 174 -186 1246 200 -641 765 369 -919
2020 -919 783 413 -836 270 -227 -531 -616 -295 -769 197 601 -512 367 617 -684 186 904 -474
2038 -474 -99 1187 188 -287 1210 -77 -823 556 -88 -229 550 115 -823 155 -246 -634 724 535
2056 535 -531 481 757 -508 287 860 -734 -195 1043 -144 -137 472 -332 -139 542 -458 -286 442
2074 442 -281 -725 973 -261 -798 470 75 -740 464 703 -549 387 822 -338 -38 268 -202 204
2092 204 435 -684 -385 497 -804 -236 630 -811 -840 313 -525 -681 541 -40 -392 979 -255 -406
2110d06J285k85j101J99M86p19J146k87p40N98J7j174P19N77r23J77J080q04k51
2129d06P65m29l51M45P9l12P81k51q9K91Lr25P84o2r78N41k05l94L11N76r76M49
2151c53N78n97Q7P29k62L30J17p11O5P36p11k40R10n04n23P40n18o88J458j016
2171c73l15P75M81j071M95r3p81R11J27n26P39k15l43n1J252j330N06K04n16M64
2191C40K96o94m12R08q64L40n8p7k54Q46l30r8M18n24j42P91n67k70P16L7p02
2212c00J29N00p67J93J014r10l89R93q09m00J185q32P6J148q45l65Q00j12m92
2231a83P86k63p04O52N7j062R56O26q54k71Q47q98j05O80p62O52L17n75n3Q26
2251F69p50J6N12o24p2M63P4p50R49q2q81P26J59p53Q89n37n02M81M77j081P07
$$ plain form
2110 -406 879 594 -507 -308 178 -541 605 318 -422 176 193 -981 -262 315 -608 -431 649 -155 -406
2129 -406 359 -70 -421 24 103 -209 572 321 232 523 526 -399 385 323 -655 -114 -319 -713 -402 174 -802 -353
2151 -353 225 -372 -285 444 182 512 629 -82 -17 719 8 -232 678 174 -349 391 -127 -815 643 -373
2171 -373 -688 87 568 -503 -8 -101 -882 29 156 -370 369 154 -189 -240 1012 -318 188 392 -124 340
2191 340 636 -58 -470 438 -426 -86 -144 -221 -475 371 41 -57 361 -163 -305 486 -81 -351 365 402 -300
2212 -300 -171 329 -438 -245 769 -141 -530 463 -346 -746 439 -393 -317 831 -14 -379 421 309 -183
2231 -183 603 340 -364 288 345 -717 239 865 11 -260 587 -311 -416 264 -498 154 471 -104 -157 669
2251 669 -81 -65 447 -177 -249 214 288 -462 487 405 -476 250 409 -344 545 8 -494 -13 464 -617 90
2272I0L29n74J52P06p51m78J201p96k56J099j133k3J359p24k22J25J43p91R39
2291C95j25r35L85L18m07L66J31j48J11L94q29M80K3p29N64O46o56k92Q08j67
2311C33p40J213j076l4N23l68k28L77M64r72O87l46j24K73N95j049O43M81q04
2330a52L29L0p63M83N00l75l27N39l96O5Q13m98l18M99n70p2O18k57p10K89P71
2351D98r47Q85j2m31J7O11o98K35k13m08P29J21p66n65Q40n7q6L47L5k26P07m18
2373A98l13N79k10p54J165k38o56M93N79j077J9M14k61j85J31m07N27j8K77l41
2393g8q2k31QQ45j003K89M23k48m07N09K77k03M61k63q63R07J28r83O40N8m08
2414b24j12M57o95K31Q07j189K35M88k32J57L97l36L69P0n56l1M63k2n18L81L63
$$ plain form
2272 90 419 -155 -3 703 -48 -526 675 -121 -377 722 -411 -434 925 201 -21 104 247 -544 395
2291 395 270 -665 -280 38 -369 -3 128 -20 91 485 -344 136 159 -570 -6 640 -16 -308 500 333
2311 333 -407 806 -270 -304 219 -149 -377 0 464 -508 179 -167 -291 -18 577 -472 171 652 -152
2330 -152 177 207 -556 -73 427 52 -275 264 -132 -67 746 248 -70 429 -141 -213 405 148 -562 -273 498
2351 498 -449 436 424 -7 10 621 -77 158 -55 -463 266 387 -379 -944 -104 -161 -247 100 135 -91 616 198
2373 198 -115 464 254 -500 665 427 -229 264 843 -234 -215 199 -62 -247 -116 -523 4 -14 263 -78
2393 -78 -160 -391 -383 462 -541 -252 171 -77 -484 25 302 99 560 297 -566 341 469 -514 126 184 -224
2414 -224 -336 121 -574 -343 464 -725 -490 -2 -234 -77 320 -16 353 423 -133 -164 299 277 -241 140 503
2435E03q71j29N75L6k34L09k88L67j11m83J70M98o6n78R57j025L14N13n03j10
2455a56M24l3l35M40l19l08P83p04Q1N29j25n86L36l6J14k54J58L57k55N93m77
2476B27l53N46m98k60P59j90l8J62l21m71Q99o68l4j36J63l64M36L45q39N70J85
2497A20q23O21j44r2N56N10p32J09J32l95L59k3k32k17K82l5k49M73p11L07N6
2518a28M1m89J199o91K08J91m19l80N58K24l82O83n30l26O44m28l14O19J52r72
2538e40Q7J000o99j87P42o38K11K02k77P4K01q4k36L56J61m21J60L76o07j60O66
2559C87o12J50K04Q4j4J23p06K53M61p81J82L98L88o93J63J31j60Q22q75j93N03
2580B15N89l85o46N96o77L65K90q75P32l29j73J32o9N2r2M19n00l0Q75n30P8M97
$$ plain form
2435 503 -368 -497 78 114 -120 189 -99 268 157 -326 -156 342 276 -302 655 -370 -56 457 -46 -156
2455 -156 268 235 -100 340 21 -287 496 -208 -127 402 277 -309 27 -9 105 -149 9 366 111 704 227
2476 227 -126 420 -78 -338 421 231 193 355 34 -437 462 -206 -240 -376 -213 -577 -141 204 -635 -65 120
2497 120 -703 -82 -226 -318 238 748 16 125 257 -138 221 198 -34 -251 31 -4 -253 220 -491 -184 -128
2518 -128 -87 -576 623 -68 140 331 -88 -468 90 314 -68 615 85 -241 403 -25 -339 280 432 -540
2538 -540 -453 547 -152 -339 403 -235 -24 178 -99 -25 176 92 -144 212 373 -48 112 488 -119 -279 387
2559 387 -225 -75 129 213 199 322 -384 -131 330 -451 -269 129 517 -176 -13 118 -42 780 -95 -288 215
2580 215 804 419 -227 369 -308 57 347 -528 204 -125 -298 -166 -235 -183 -275 144 -356 -386 489 -41 37 534
2602E34n38j26J05o4k15K49L76q68N12J78k60j54O66n39J04q1J77j04K96p16L38
2623a30M09o1J27q5m46K39KJ99q0M09p7r01K40k77k12N38J02J4j49N13o36Q9Q33
2646F60r15O02K41q32M36K07m77L52L13q90l3M42K60r80R24l34n30Q09k33n91
2666e69N26q3j69N77m69k09K84J71l79O31J3k05K87M51m09k54n6l27j36M41p41
2687f25R7M96k99M41M37p11j09N62K15n77L25J61q65R38k03j91J20K14q93O62
2707A95k05j58k34K92Pp78J047k66k52R71r41L65J96j45l61O65j73n40R89J77
2727H51j220L19M34m43R9Q1m65j34L61l10L87M10o87j12M34Q8k52N99l35l92K15
2748g2K26j62O63m73m32N49J40n20N4L35o68K06J83j07K46J2m99M14m28J64K06
$$ plain form
2602 534 -4 -130 -25 -89 -304 -55 321 -547 -35 143 -117 -271 395 -144 -40 -121 56 -48 248 -468 -130
2623 -130 279 218 345 260 -186 53 55 254 174 583 506 -395 -155 -432 -644 -106 -4 10 -139 374 -262 -173 660
2646 660 -255 347 588 -244 192 399 -78 274 587 -303 -336 106 366 -614 310 -24 -554 255 22 -569
2666 -569 -43 -126 -295 282 -187 -396 -112 59 -320 311 324 119 406 857 448 194 138 -189 -325 116 -625
2687 -625 -528 -32 -331 110 547 -164 -273 289 504 -73 252 413 -452 486 283 92 212 426 -467 195
2707 195 -10 -168 -402 -110 -103 -881 166 -100 -352 619 -322 43 239 94 -267 398 225 -315 674 851
2727 851 -369 -50 384 -59 40 121 -344 -478 -117 -427 -40 370 -317 -429 5 93 -159 440 105 -287 -72
2748 -72 154 -8 655 182 -250 299 439 -81 -27 308 -360 -154 29 -78 168 180 -319 95 -333 -169 37
2769C7L21k69m2Q0K45n61N65j08m19J75L91n77L02k37k45N79o66k18N93L88j110
2790g76R04R3p48L05N42m1k32K72m7m81R12p41j9M27o53j43P08n16l35N20m87
2811e36oO37L45j004P78l18M1Q5K29j080Q84M74o60Q42k69j82k35N72l98m38P67
2832E28p28K1N72q39J22M58m25kM35j95q1R38n53j39m9J46o67J050k30m47J37
2853E2O20q75L23M20j083Q0R33m93l68L15J43j44Q01o01m29O40j20p14R13P3j032
2874e46P67j24j20K99M39o70l2N53j100M32K20k55r2O29o59J60K37k88m28N25
2894e3jj31M41m83K45K92J55r50J210m40l45J5M1m17M66j83k64N27M04r83N84
2915A30Q8j37Q9P16r73J6N29p61K46P33m71l41P63p38m24O16j01p76J281o01m30
$$ plain form
2769 37 358 89 47 127 372 -189 376 268 -151 24 415 -162 140 -97 -342 237 -429 -647 -54 334 -776
2790 -776 128 221 -527 -222 320 279 47 319 272 -209 703 -38 -57 370 -283 -426 282 -234 -569 -49 -536
2811 -536 -542 95 440 -564 214 -104 -63 22 251 -829 55 529 -131 711 442 260 25 597 199 -239 528
2832 528 -200 -179 393 -446 -324 134 -291 -293 142 -53 -134 804 251 112 63 209 -458 592 362 -85 52
2853 52 672 -203 120 540 -543 -463 470 -23 -391 -76 67 -77 724 123 -306 334 214 -500 413 486 -546
2874 -546 221 97 -23 276 715 45 13 566 -534 -102 118 -137 -229 400 -259 -99 138 -150 -578 -53
2894 -53 -54 -185 256 -227 18 310 465 -485 725 285 -60 -45 -4 -421 45 -138 -402 125 529 -454 130
2915 130 218 81 170 886 -87 -71 458 -303 -57 676 205 -136 627 -111 -535 81 -20 -796 485 -116 -546
2936e46O11k48n28N16O16q93N00J28m16M24J79J6j13K33p02L96K65n48k94N98
2956A94k30m50M74J2o07O92j36m52P40k3r90Q78m00k19P11K62l66O15l53p52L88
2977a2M85m57l42O10k46o7K48qp28P73n13m3N04l12k23M17rJ94K37j61n53M2N48
3000C84q02J187m53l86kL1l41j87M87N3p14R56m01n5L55o1n98P60o4n76M38J67
3022A78k98R10n63o58R71j70k74l85Q01q66P30p08n2j31J172j053m2Q28p58K84
3042h4N55q74J77Q24q16L96N42k45k47M55p43j83O76l16n95O63J90j164J124j99
3062A36O4m50O84p91K52K17K9l95Q56n94M15J24m56nm7j78O5N31l73o97O60J68
3084B15r75R63n17l37P80M1p32K86O08J39l13K40m19j6O33p89M15K32l97k24O67
$$ plain form
2936 -546 65 -183 -711 -195 421 -472 28 156 -260 164 343 359 246 479 -223 173 438 -110 -404 194
2956 194 -36 -486 -12 0 -607 85 -51 -503 237 214 -776 102 -298 -517 194 456 90 705 352 -400 -12
2977 -12 473 16 -326 284 38 -29 219 211 -517 256 -257 -300 204 -108 -331 86 77 271 508 347 -206 -164 384
3000 384 -418 769 316 -70 -72 -41 -382 -569 -82 -29 -743 213 -188 -243 112 51 -547 213 149 -427 11 178
3022 178 -120 790 227 -431 540 370 96 -289 512 -354 376 -332 -384 -515 657 -396 -438 390 -368 -84
3042 -84 471 -403 -226 598 -218 178 720 475 228 683 -60 -243 433 117 -478 185 375 -789 335 136
3062 136 200 -250 434 -357 -105 112 141 -254 602 8 423 547 91 86 39 -139 -74 457 84 -613 47 215
3084 215 -760 203 -314 -651 129 170 -562 -276 332 471 158 398 -21 -37 596 -193 222 454 57 -167 500
3105E00n24k0r5O45j102P42j65n08L97j94l96Q48j37m17L22L14l42N58j67o19
3125c60j68J005o60jK09k53j67N42n28PM86j6l68M62m61l0O55o87L47L61K39q82
3147b68M40l4m38J30M65o55L12J74m02k90P89l43l05Q03l47J1O73o66k26M20p17
3168d74j32P68J09m50L79o1n89Q21J75q51M55K14m88L3M72j275P35Q8k96l4J179
3189G78j209J31L81k94M24o0M63q76P28k91m6j25O97j137M54l70m73P76M40j164
3209g73O96J7q56L27N36m62P27M34p55q9O46o15L41L41j83n23N50J4o86Q19n02
3230Dj82M76m89K7J5M64n71L96m91p5L89L8k06J62K64l51K55L95k38o0M57o71
3252Ho69R87k15m42R63n13r50Q45p1j96L07j88l46N50J42j5J91o90K76J88O26
$$ plain form
3105 500 -24 -44 -139 506 -596 146 -19 -527 -130 -324 -720 128 -9 -426 -104 210 -132 426 259 -360
3125 -360 -528 477 -183 -184 25 -228 -395 147 -381 -374 112 96 -272 190 -271 -301 354 -333 14 375 614 -268
3147 -268 172 138 -300 -170 295 -360 -48 126 -276 -566 223 -120 -425 378 31 42 715 49 -177 243 -474
3168 -474 -606 162 271 -179 200 139 -450 371 546 -305 150 364 -124 -91 381 -894 -159 -71 -367 -401 778
3189 778 -431 -300 81 -213 211 151 614 -262 466 175 129 4 701 -436 18 -352 -825 -49 391 -773
3209 -773 -77 -60 -916 -589 -53 -515 212 646 -109 -198 448 -167 174 515 332 -191 359 373 -313 506 4
3230 4 -178 298 -191 -164 -149 315 -256 140 -351 -426 -37 1 -205 -43 221 -130 125 520 282 222 679 8
3252 8 -661 326 111 -331 632 119 -831 14 -57 -253 54 -134 -480 70 212 197 388 -302 -26 162 788
3273G88q92N12j86p13O32P19j017n63Q82m04L4O16o49j47R53n88n11Q45k33l53
3293b75J005m49n00R28p37m06Q25M30r76J14O58p18k79J21n77J60M72K96k62J83
3313A3m25M06M90o82K4R60j082m5L51M46m01M51k74o15P33k49k69l07M21o06J29
3334e31J006p40k03M61l98M18L48m21L9M61M4p67N62L64p23O68m49n63r0L96o80
3355g98Q22P2k26N7J6m69O75pq19L01Q32j138M06L33j6l24P55o97J47L86p1l58
3377a21L68m53k43M58Q4J57j92J63n57O71K36j515Q21N95n82J22N05j48m53K09
3397A25j27l96Q77q16j46N81l05k19J182j220j23P43l54R6N88m60o09R06l4p42
3417d53O51N4l58M87J85j039R68J28q52K58L97k81m54J052j166O5J270r93l26
$$ plain form
3273 788 -104 408 222 -491 141 860 -157 -720 162 -242 -208 408 -241 -388 565 -23 -534 311 78 -275
3293 -275 730 281 -219 709 -28 -434 391 821 -155 -41 617 -101 -380 -259 -836 -676 -204 92 -170 13
3313 13 -412 -6 484 -198 -174 786 -296 -341 10 456 55 506 232 -383 350 101 -168 -475 -54 -660 -531
3334 -531 475 -265 -468 -7 -405 13 361 -60 -21 440 484 -283 279 643 -80 588 139 -424 -514 -118 -798
3355 -798 24 96 -130 -73 -57 -526 149 142 -677 -376 456 -682 -276 57 41 -283 472 -225 -78 308 237 -121
3377 -121 247 -206 -449 9 93 250 58 221 -336 335 571 -944 -123 472 -110 12 517 369 -84 125
3397 125 -2 -398 479 -337 -483 98 -207 -426 756 -464 -587 156 -198 -102 486 26 -583 323 289 -453
3417 -453 198 252 -106 381 566 -473 495 623 -229 29 426 145 -309 743 -423 -358 912 -81 -407
3436d07O30m41l12Q80l89r8M97k29r43J303Q7j022N88O6o47J56k7j17L5N17p03
3457e76N37J15K4m85J37l45K04R18p39j6O04l20n86Q72m98J60O01j51o59Q46j83
3478D60o64N69m2p16N07K84r58L97M52o32L29O7n30k02Q64l2l60P58l88l16N89
3499D36n62j17Q89m56m79P46m85m76L18J78j6J02j70l54J10L78k43N89Ko02N64
3520C52P3m48K19P25r47L8N88q23K06Q60p88o37N17r8m64J53K94J40k43L49J67
3541B33k26P36j270R06N44j368N58M1m78J91L51k39m43P48j96n14P99o91J43N38
3561C63j60q66P06m49k69O18O58q05M18J9j95J69J93m17k57O70n06O21q05m1l
3582c38R71j198m09J422l52o11P31l1m86N96K66m74P66k93r96Q78k52k90J70L0
$$ plain form
3436 -407 223 -218 -530 350 -39 -137 360 131 -812 491 578 -444 144 210 -437 -281 -308 -425 -390 127 -576
3457 -576 -39 76 100 -385 -248 -593 -389 529 -210 -226 378 58 -528 344 -154 6 607 456 -203 643 460
3478 460 -204 365 323 -393 114 398 -560 -163 289 -343 -14 53 -477 -679 185 153 -207 551 163 -153 436
3499 436 -126 -243 646 190 -289 457 -28 -504 -186 -8 -24 78 -92 -446 -336 42 -201 388 390 -212 352
3520 352 425 -23 196 921 -26 12 600 -223 -17 843 55 -582 -65 -163 -627 -474 -180 -40 -283 66 233
3541 233 7 743 -527 379 923 -445 113 154 -324 -133 218 -21 -464 284 88 -426 373 -318 -175 363
3561 363 203 -663 43 -406 -675 -57 601 -204 214 233 38 207 400 -17 -274 396 -110 511 -294 -335 -338
3582 -338 633 -565 -974 448 96 -515 216 185 -301 295 561 87 853 560 -436 442 190 -100 70 100
3602A00m42J52L29o31J94N97j55l30M17o17n2P63k44l77O94l07j35P90m26p28
3622d08O77k89j34O75o27l38K04N14r49M26L21k81J3N39m46l6M23l83o0P77q1
3643E37p77R08o30n54J041q43n3Q89n8p34O93l78n38L70K00m4K37P0q45M84M16
3664C91l60jK86l72K48L26k85l78O42q38O08J17j58p27O20k0l99L06j43m01M33
3685a05R7q59J002K29j528J508j98l06j51Q48r52L92Q2j89K27K42m74J84N27n96
3705b0n22J049m52q81J151l50q3J83P3n52O94j6k64N20k83r5N18Lo96N2O24j162
3727e09K86N57p17j22M79k9k40K72J82m51P32p7k25M10p14j32O66k71J20k86L23
3748B54m94J36O48r31K06K30k39J21N25r78L75R43j197M70K17m37jO46j82l85
$$ plain form
3602 100 -342 -190 139 -492 -298 299 144 -186 231 -386 -438 325 81 -296 398 91 -44 746 320 -408
3622 -408 269 -20 -154 521 -106 -444 -240 274 -675 -249 72 -209 -196 343 -103 -139 284 -99 -159 618 537
3643 537 -240 668 38 -516 525 -318 -371 518 460 -274 419 41 -497 -127 73 29 266 336 -509 -25 391
3664 391 31 30 316 -56 192 518 233 -145 497 -341 267 384 226 -501 119 99 -300 6 -137 -538 -105
3685 -105 -8 -867 135 364 -1164 344 146 -160 -311 537 -415 -23 59 -130 97 339 -135 49 576 -20
3705 -20 -542 507 55 -826 325 -25 -108 75 148 -404 290 274 10 530 247 152 670 673 -23 29 653 -509
3727 -509 -223 334 -383 -505 -26 -55 -295 -23 159 -292 440 363 138 548 -166 -298 368 97 217 -69 254
3748 254 -240 -104 544 -387 -181 49 -190 -69 456 -522 -147 796 -401 69 286 -151 -152 494 312 -73
3768g3P60m77m64N79k4l61O09m70j89Q5j19m84N22K53l46J32l25n71J298j04o20
3789c89L38N34j92m16N23k57l25L85J7l92K30n1N8K76n22l04O83j10o64O02L3
3810E7l20N81J61p16K85M65m23J84Q6k3l89J45Mk60J91M6j92J08o42j05J248n98
3832a07m90K22K97q2j6L99l49K8M14j86m59J16K97l03J179q22O0K90m01q45J004
3853B46m73J0P65j054O15ql71n40Q45l67M6K09O7M23j98N20p72j92P58p97O07
3874C39j67j30J15l31k32J26l00K16k18Q68P8p86L26nJ48K3J93k59Q9k7k07L24
3896A83q9q00J158n08n17L58N04l86Mkl64L22K67k17Q6L47m53l56N95n60J21O02
3918B95R3l32M25n98J32j0J24l76L74j41k30L70j95l50J21J33j68K75M05r83O54
$$ plain form
3768 -73 687 210 -254 325 301 -60 549 79 -110 -25 -144 -628 -106 147 -199 -67 -392 -963 335 231 -389
3789 -389 -51 483 291 -125 398 141 -184 201 218 -174 56 5 63 339 -183 -487 196 86 -578 24 57
3810 57 -263 318 479 -237 48 513 90 274 360 337 -52 93 97 -163 28 74 -118 -10 -652 -757 491 -107
3832 -107 -597 -375 -78 -160 -176 223 -126 -98 316 130 -329 -213 84 -219 960 138 198 488 87 -758 246
3853 246 -227 -217 548 -506 109 101 -270 -810 35 -332 -286 -77 -10 413 215 735 -37 -229 529 -268 339
3874 339 172 42 157 -174 -406 -280 -580 -364 -582 286 364 -422 -96 -101 47 70 263 4 93 66 -141 183
3896 183 94 -706 452 -56 -573 -215 289 -97 -93 -95 -459 -137 130 -87 -1 346 -107 -463 132 -428 -307 295
3918 295 388 56 481 -117 15 5 129 -247 127 -14 -244 126 -69 -419 -298 -165 -333 -58 347 -636 18
3939A8O05q69N31J55o43L14K28j75m90Q37n2n57M23J1n11J29j7l79N85n3l84K65
3961b9n2k60N15k58k83o3M33J18J58L5n70J24M40j58m99K79n7n26R16l61n48P45
3983I9n2l35J58K03o63Q25j01M4k08N25n85M86l5k41k1J66l76m51R35o18J11L9
4005i5L72m52K85l85K2O7O88n14M92q1p54K5Q70q47J74M61n47K11O94q61J49N25
4027D99p78O2P58m68m26K82k42J63L70j00k86N75l54j65K10N53p89O18k91l02
4047a11O12k41J98l85M68m45m6K86m10J95L59n54N61l10J90l63Rj62k18N53j7
4068A69p0O2l16l81P12m38l35N81l8J70m27J76j50M93k14p27J034l82L51n15N78
4089C33m02L36o33R7L91J63n0l94o9Q8J63k49J37j64j7L88l08J11j04M0n1K63
$$ plain form
3939 18 623 -246 285 440 -203 111 339 164 -326 511 459 -98 325 336 -175 -46 -63 -442 143 90 -294 -29
3961 -29 -81 -341 174 -84 -367 -430 3 121 279 314 -256 -132 308 150 -349 -70 -127 -653 263 -98 -646 99
3983 99 47 -288 -130 73 -590 235 134 178 -30 495 -90 396 361 120 99 265 -111 -562 373 -245 -134 -95
4005 -95 277 -175 110 -275 -253 -186 502 -12 480 399 -355 -330 540 -307 -133 328 -219 -8 686 -175 -26 499
4027 499 -279 -217 541 73 -353 -71 -313 -150 220 120 -166 409 55 -110 100 653 -136 482 191 -111
4047 -111 501 260 458 73 541 96 50 336 -74 121 480 -74 487 177 367 4 13 -149 -367 186 169
4068 169 99 161 -155 -536 176 -262 -597 -16 -54 116 -311 -135 -285 208 -6 -733 301 -81 270 -245 333
4089 333 -69 267 -366 -269 122 285 235 -159 -228 -140 23 -226 -89 -253 -270 118 -190 -79 -183 -143 -194 69
4111F9k30J21j21j3R8K48R8l22M10l97j2N36m61O0j61m34M32K96j78k25K53l75
4133c08M47m33K03K13K54n42K12L54k26k66K48m46J21O01m75P5o17O25k52j50
4153c62M21p0l22J92J65k64k1M35j05N20k54q99O04j63J20K8l09J2p8N98k63r9
4175a14L80m59n1M02n93N72j86l00j0N87k36K74R8j85m04O86k99J81k38j13J77
4196A69m60M93k4k99N91k95n49N14j05j60J67k83P52k43o89L71m53O26J08K11
4216D42m12n2J49J12l70K18N6l2k17n05M33n2M75k58k91n5L56l56O57r99N52L51
4238B02j87M00j28m39J16k19j78P5K11r8K80N61m33l89M30j03m49M32K41o03R7
4259a81O3M2m20R30k72l8j24m3j1L05l97K12jR4r2m17P4J03L43j44j82K6K10l97
$$ plain form
4111 69 -161 -40 -161 -174 -76 172 270 -52 358 -39 -51 485 24 84 -77 -511 -79 217 39 -186 67 -308
4133 -308 139 -294 -91 122 376 -166 46 400 174 -92 156 -290 -169 432 -43 32 -585 40 -212 -362
4153 -362 59 -11 -333 -141 24 -240 -261 174 69 589 335 -564 40 -123 -3 25 -284 -272 -350 248 -15 -114
4175 -114 266 -193 -244 158 -435 137 -49 -349 -359 228 -8 266 364 179 -225 461 162 343 105 -8 169
4196 169 -291 202 178 -121 470 175 -374 140 35 -125 42 -241 511 268 -421 -50 -503 123 231 442
4216 442 30 -22 127 239 -131 87 143 111 -106 -611 -178 -230 245 -13 -304 -359 -3 -359 298 -701 -149 202
4238 202 15 415 287 -152 -36 -255 -433 -358 -147 -245 35 596 163 -226 204 101 -348 84 325 -278 -181
4259 -181 -118 -76 -496 434 162 124 0 -43 -54 251 -146 66 65 159 67 -350 -276 -173 170 26 -156 -130 80 -317
4283c17L60K62l26K29J80k16p14O08n34P68o3k14RM19m17o98O17l8Q2O9k01r8
4305b33N30m16K48o9M5Q1k00Q5j18J69J7q8M95m27k85K66K6j24j25J39j15K94
4327A95m58j01L53L32l86M10l15K22o51M35%M5n5K03j16K6l21k69R01m62L3rJ02
4350A14l80k03O30j110J033K96l71J86j63k43Q5O1K95j82K04Q7n33Q21n80k97
4370b50K03Jk89L3J44J09J65m48M83k22J65k68K40k67J5J93P9l81%P19n52Q5k0
4393f3L13l20M0j60j02K94L11m55L94l46L79j96n5j24L39k10m33J014n22j08J47
4414A37J75j290M93N86j80j84k30O64k14J27nl04N4M75m83L48j71j54K84j81k43
4435b96j65J89J52L21j59k51K64J95o3J33Kq38P30o81M62L1k24K29j81O5l16R33
$$ plain form
4283 -317 43 305 -21 208 388 172 -542 66 -468 300 237 23 32 451 34 -664 -47 -85 -3 66 -135 -233
4305 -233 297 -119 129 60 105 186 -14 71 -47 122 139 51 546 119 -166 100 126 2 -123 16 -99 195
4327 195 -263 -364 -11 321 -65 345 30 252 -399 36 36 81 26 229 113 139 -182 -451 450 -12 21 12 114
4350 114 -266 -469 161 -949 84 380 9 195 32 -211 -126 -65 230 48 252 339 -194 627 47 -250
4370 -250 -47 -46 -335 -302 -158 -49 116 -332 151 -71 94 -174 66 -201 -186 7 86 -295 -295 424 -128 -43 -63
4393 -63 250 -70 -30 -190 -292 2 313 -142 252 -94 285 89 34 -90 249 39 -394 620 98 -10 137
4414 137 312 -978 -485 101 -79 -263 -493 171 -43 84 79 -225 -171 304 -179 169 -2 -156 128 -53 -296
4435 -296 -461 -272 -120 201 42 -209 55 250 187 320 322 -516 214 -467 -5 26 -198 31 -150 -85 -401 532
4457E32p71K33l9J33n7K83l92M06m27Q6r5J39k45K80o98N02L82j25l51N21l22
4478b5m45R40n36J02J48o05j48R33l93l31M11M55p94L38M1J39l92j33K63m68N79
4499G9j98P25o92J3J20l62N97m74K61k39Q5K42o0n19M10K93o58P82k04l12O7K71
4521B27p37M61R3k58Q8P16p13L80k87k31P6L86k37p4Q0m4R7k6r8O21p01L17k48
4544a12K53j23p8K82j29l27J01L14l98M97n95Q00o86R1J72k0O8R2l97L83m82J67
4566a27K06j19k2M23m17K04j93J82K99o81M52l87Q7l7k43O21o13N06m44M03p9
4587B1n54O16L92n29K21l03K0N07n74j79J40N10o76J71K81p3L02o27K83K92m38
4608a97N6M22n0j55k09L85K19l65k79R9k89J52o1l55O66J72m96L83k48J39j31
$$ plain form
4457 532 -239 -6 -45 88 31 314 -78 328 -99 -13 -108 31 -214 66 -632 -130 252 127 -224 297 -25
4478 -25 -470 470 -66 36 184 -421 -569 364 -29 -360 51 506 -288 50 91 230 -162 -295 -32 -500 79
4499 79 -119 606 -86 -73 47 -315 282 -192 69 -170 -85 157 97 -422 -12 281 -377 405 201 -111 -44 227
4521 227 -510 -49 44 -214 -126 590 -123 257 -30 -261 -185 201 -36 -110 -30 -74 23 -3 -101 520 -181 136 -112
4544 -112 141 18 -60 222 93 -234 -133 181 -217 280 -315 485 -201 -110 62 42 110 202 -195 188 -294 -127
4566 -127 79 -40 -62 361 -56 148 -45 137 436 -245 207 -180 -93 -130 -373 248 -365 141 -303 100 21
4587 21 -533 83 475 -54 167 -136 -116 391 -183 -362 -222 288 -388 -217 64 -9 293 -334 -51 241 -197
4608 -197 -141 281 231 76 -133 252 471 106 -173 -74 -363 -211 -272 -627 39 211 -285 98 -150 -11 -142
4629a42M35l53o8m5L25J62m49J06k09M62k31Q0m00J66J99K01n0n07N39l62l3O01
4651D27j38O5j31l59O68l92l21N12k73p9N58l65K42m48K90l69pK42r0J06K56n43
4673a49L46j70J82n9j19R0m38K17m8P9m4O6n33N03J87J45L24n39l8J84J54m27
4695h7J85J11m09N99o45K91L00k93K58m10M9K10m3j3J36Pj11l02j02O07j36j99
4717CK61l59M9O6K02k09k25k0K29P03o76M73l27k97O13l37q81Q26M08o51P7Q0
4739HK24J08m08j13J12J96R7j00m4j53M92j47m16L87m39J36o8j83N9L51p2k39
4761b12K81l50M58l92L53j40l41oN90k26l36M10j71M71m02l84l14M00K71Q0J17
4782A57N80n65m06L18J70k50m5m83R74m88K54j82K32o60N23j89N95k04m21r3L78
$$ plain form
4629 -142 293 -60 -128 -173 152 314 -135 -29 -238 224 -7 73 -327 -161 38 239 189 -318 221 -141 -174 427
4651 427 289 354 223 -136 532 140 -181 331 58 -21 537 172 414 -34 256 -113 -120 122 32 138 394 -149
4673 -149 197 27 209 150 31 121 -317 -100 -148 -69 -113 -47 -580 -77 110 255 579 40 2 186 340 -87
4695 -87 98 209 -200 399 -246 45 345 52 310 -100 -51 159 116 103 239 246 135 -167 -269 338 202 3
4717 3 264 -95 -46 20 222 13 -212 -232 -3 700 24 497 170 -127 486 149 -732 94 502 -149 -72 8
4739 8 232 340 -68 -181 -69 127 224 124 80 -73 419 272 -144 243 -196 -60 -128 -311 -252 99 27 -212
4761 -212 69 -281 177 -215 138 -2 -343 -349 241 15 -321 89 -82 389 -13 -397 -711 -311 -40 40 157
4782 157 737 172 -234 84 254 4 -41 -524 450 -38 216 34 266 -394 129 -60 535 331 -90 -183 195
4803A95j94k40K46L84l84n4K45k33r9L8J49K9R5m41Q6J53N69p26J3L32j80k54
4825b71L58O9j69N15j071M49M22k02O1Kk95L80m76J41M99o54K43K1K09l60K96
4846A67K17k26j51m9O5k94P08l92k74m5M95k55Q2j76P9K97k11l75M00L15n01L32
4868B08k68L26o40L48N7n56P14m42j91N19O7J16K69n08r8L6n3R9k62O61p05o6
4890c69P86n55J80J60n2o2m14M63m49k11P48l68Q1K37k46K31n27J75J76K14j42
4911E6M03n96J12J80l8%m08L34l49M63m82K36L63n56k34K73P76n02k07L64l28
4932a40K20L2K73o79j39M97k77J93K90k75K10o22M57K72l82j1m2j5P7M30o2m99
4954a92L22K91q14N29J95m11k75N60j45k46N14m35l51N73m51P6K14k51K57N1N7
$$ plain form
4803 195 1 -239 7 391 7 -47 198 -35 -134 -96 53 82 177 -264 -178 -25 544 -182 -169 163 -17 -271
4825 -271 87 156 -13 502 -569 -120 302 100 161 163 -132 248 -228 -87 412 -242 1 22 231 -129 167
4846 167 384 158 7 -42 23 -271 437 45 -229 -274 221 -34 48 -128 -49 248 37 -338 62 377 -124 208
4868 208 -60 266 -374 -26 31 -525 189 -253 -444 75 142 258 527 19 -79 -43 -96 3 -259 402 -303 -369
4890 -369 417 -138 42 202 150 88 -326 137 -312 -523 225 -143 -62 175 -71 160 -367 -192 -16 198 56
4911 56 459 -137 -25 155 117 117 -291 43 -306 157 -325 -89 274 -282 -516 -243 533 31 -176 188 -140
4932 -140 80 112 385 -294 -433 64 -213 -20 270 -5 205 -417 40 312 -70 -81 -123 -138 -61 369 307 -192
4954 -192 130 421 -393 136 331 -80 -355 205 60 -186 328 -107 -458 115 -336 -260 -46 -297 -40 11 68
4975F8l55j51L11k22M5M26J00n80J00J61n1K63l7m2k72N7k25M62l85K98M29m04
4997dj29L3Q15o24p3M4l77M00m8l4L84m19r0M64k60J58m78J46J9J14J06l94r0
5020c37L21j10K28J13m61k05P48m07L85j9k47j1r1l30M57m4J75k87N50j48l92
5041a12M16n5l88k70L49K54m4j88O73o02L64m62k13J07K41o15N21J25l80M17J09
5062B47k62J06N7l8N8M2m09R2L76l43J60j01p05O37M87l18o7K25j17m9R3M0m45
5085b34R12n52J62k87J26O4m0P68j382P06l70l06l3O42n67N95k43K87m08M55j50
5106A45j75J48p01O25M96o96J62K71n39K64j58J94n17J86J057o21J4j95J02L5
5126I7k38l97N47n28M06L97J2k69K59k22J06n32J99K74k88L28J30k18N1J4j48
$$ plain form
4975 68 -287 -438 -127 -349 -304 122 222 -358 -258 -97 -148 115 78 36 -236 -179 -404 58 -327 -29 400 -4
4997 -4 -133 -100 715 91 18 62 -315 85 37 3 387 -32 -122 342 82 240 -238 -92 -73 41 147 -247 -337
5020 -337 -16 -126 102 215 -246 -451 297 -110 275 256 9 -2 -93 -423 34 -10 165 -122 428 280 -112
5041 -112 304 249 -139 -409 -60 194 150 -38 635 33 397 -65 -278 -171 70 -545 -24 101 -279 138 247
5062 247 -15 91 148 110 168 210 -199 -107 269 -74 86 -15 -720 -83 404 86 19 244 127 78 171 211 -234
5085 -234 678 126 288 1 127 191 151 919 -463 243 -127 -433 -466 176 -391 204 -39 248 -160 295 145
5106 145 -30 118 -583 42 538 -158 4 275 -264 0 -158 36 -481 -295 762 141 155 -40 62 97
5126 97 -141 -538 9 -519 -113 284 296 27 286 64 170 -362 -163 111 -177 151 281 63 114 128 -20
5147b0M9j04J81l97P40r34J45m1J25J5K74m40M84J50p56N23J25p1j96L65k61L54
5169C10k35o12L6Qn2M51K22j2K7J55k43l85M57m3j48q7J57k98O26n48M41o46O74
5192B55k01J5L57n7l6J30q80K73K53j6l44P02q4n78M7J04m18K31J8j00P5N93j49
5215A90k01M0l25Q44k17l19j39O63n17J76Lo6m3j08O19p44K8M14kJ84k78l60k51
5238d09M61m33K57p9K70L90l3o09K0N23j79O2K9n19j07L75l4K87n69J78N5n7M0
5261h1M25k39L55p84M58L7n49O31n00l48J361o34j33l65O49n49M85o1k08M14j53
$$ plain form
5147 -20 29 -75 106 -291 449 -485 -340 -381 -256 -241 33 -407 77 227 -529 -6 119 48 -148 217 -44 310
5169 310 75 -537 -501 -493 -545 -94 128 116 143 298 55 -330 127 84 -64 -151 6 -292 334 -214 227 -419 255
5192 255 54 69 426 369 333 463 -417 -144 109 93 -251 451 367 -211 -164 -60 -478 -247 -229 -329 -254 339 190
5215 190 -11 29 -296 548 331 12 -127 536 19 195 198 132 89 -19 600 -144 -116 298 296 480 202 -158 -409
5238 -409 52 -381 -124 -203 67 457 424 -185 -165 358 179 241 270 -249 -356 19 -15 272 -297 -119 -64 -121 -81
5261 -81 344 105 460 -324 134 171 -378 253 -247 -595 766 132 -1 -366 283 -266 219 158 -50 364 211
$$ [...]
8191a00
##END NTUPLES=NMR FID
##END=
