##TITLE=1H_TG-2235-5
 CDCl3, 8 sc, 
 15.3.2019
##JCAMPDX= 6.0         $$ Bruker NMR JCAMP-DX V2.0
##DATA TYPE= NMR FID
##DATA CLASS= NTUPLES
##ORIGIN= UXNMR, Bruker Analytische Messtechnik GmbH
##OWNER= root
$$ XWIN-NMR		Version 3.5
$$ Fri Mar 15 14:06:03 2019 Russian Standard Time (UT+4h)  she@DPX200
##.OBSERVE FREQUENCY= 200.1315
##.OBSERVE NUCLEUS= ^1H
##.DELAY= (6, 6)
##.ACQUISITION MODE= SIMULTANEOUS
##.ACQUISITION SCHEME= undefined
##.AVERAGES= 8
##.DIGITISER RES= 18
##SPECTROMETER/DATA SYSTEM= spect
##.PULSE SEQUENCE= zg30
##.SOLVENT NAME= CDCl3
##.SHIFT REFERENCE= (INTERNAL, CDCl3, 0, 15.7039)
##AUDIT TRAIL= $$ (NUMBER, WHEN, WHO, WHERE, WHAT)
$$ ##TITLE= Audit trail, XWIN-NMR		Version 3.5
$$ ##JCAMPDX= 5.01
$$ ##ORIGIN= Bruker BioSpin GmbH
$$ ##OWNER= she
$$ F:/spectra/data/she/nmr/H-F/1/audita.txt
$$ ##AUDIT TRAIL=  $$ (NUMBER, WHEN, WHO, WHERE, WHAT)
(   1,<2019-03-15 14:04:01.51 +0400>,<she>,<DPX200>,
      <created by zg, POWCHK disabled, PULCHK disabled
       configuration hash MD5:
       00 E9 B6 7A A2 85 ED C7 34 08 36 98 17 FE 4E 26
       data hash MD5: 16K
       FB A3 CE 5C 8A D4 20 DD B1 B3 E5 5F 3E A3 61 66>)
$$ ##END=
$$ 
$$ hash MD5
$$ 91 F2 FA 6D 48 64 C4 0F B2 0C AD CF B3 38 84 A0
##$RELAX= 
##$RELAX= 
##$RELAX= 
##$RELAX= 
##$RELAX= 
##$RELAX= 
$$ Bruker specific parameters
$$ --------------------------
##$DU= <F:/spectra>
##$EXPNO= 1
##$NAME= <H-F>
##$PROCNO= 1
##$TYPE= <nmr>
##$USER= <she>
##$AMP= (0..31)
100 100 100 100 100 100 100 100 100 100 100 100 100 100 100 100 100 100 
100 100 100 100 100 100 100 100 100 100 100 100 100 100 
##$AQSEQ= 0
##$AQ_mod= 1
##$AUNM= <au_zg>
##$AUTOPOS= <>
##$BF1= 200.13
##$BF2= 200.13
##$BF3= 200.13
##$BF4= 200.13
##$BF5= 200.13
##$BF6= 200.13
##$BF7= 200.13
##$BF8= 200.13
##$BYTORDA= 1
##$CFDGTYP= 0
##$CFRGTYP= 5
##$CHEMSTR= <none>
##$CNST= (0..31)
1 1 145 1 1 1 1 1 1 1 1 1 1 1 1 1 1 1 1 1 1 1 1 1 1 1 1 1 1 1 1 1 
##$CPDPRG= <>
##$CPDPRG1= <>
##$CPDPRG2= <>
##$CPDPRG3= <>
##$CPDPRG4= <mlev>
##$CPDPRG5= <mlev>
##$CPDPRG6= <mlev>
##$CPDPRG7= <mlev>
##$CPDPRG8= <mlev>
##$CPDPRGB= <>
##$CPDPRGT= <>
##$D= (0..31)
0 1.2 0 0 0 0 0 0 0 0 0 0.03 0 0 0 0 0 0 0 0 0 0 0 0 0 0 0 0 0 0 0 0 
##$DATE= 1552644240
##$DBL= (0..7)
120 120 120 120 120 120 120 120 
##$DBP= (0..7)
150 150 150 150 150 150 150 150 
##$DBP07= 0
##$DBPNAM0= <>
##$DBPNAM1= <>
##$DBPNAM2= <>
##$DBPNAM3= <>
##$DBPNAM4= <>
##$DBPNAM5= <>
##$DBPNAM6= <>
##$DBPNAM7= <>
##$DBPOAL= (0..7)
0.5 0.5 0.5 0.5 0.5 0.5 0.5 0.5 
##$DBPOFFS= (0..7)
0 0 0 0 0 0 0 0 
##$DE= 6
##$DECBNUC= <off>
##$DECIM= 24
##$DECNUC= <off>
##$DECSTAT= 4
##$DIGMOD= 1
##$DIGTYP= 9
##$DL= (0..7)
0 120 120 120 120 120 120 120 
##$DP= (0..7)
150 150 150 150 150 150 150 150 
##$DP07= 0
##$DPNAME0= <>
##$DPNAME1= <>
##$DPNAME2= <>
##$DPNAME3= <>
##$DPNAME4= <>
##$DPNAME5= <>
##$DPNAME6= <>
##$DPNAME7= <>
##$DPOAL= (0..7)
0.5 0.5 0.5 0.5 0.5 0.5 0.5 0.5 
##$DPOFFS= (0..7)
0 0 0 0 0 0 0 0 
##$DQDMODE= 0
##$DR= 18
##$DS= 0
##$DSLIST= <SSSSSSSSSSSSSSS>
##$DSPFIRM= 0
$$ [...]
##$SUBNAM2= <"">
##$SUBNAM3= <"">
##$SUBNAM4= <"">
##$SUBNAM5= <"">
##$SUBNAM6= <"">
##$SUBNAM7= <"">
##$SUBNAM8= <"">
##$SUBNAM9= <"">
##$SW= 24.9337058887773
##$SWIBOX= (0..15)
0 0 2 0 0 0 0 0 0 0 0 0 0 0 0 0 
##$SW_h= 4990.01996007984
##$TD= 16384
##$TD0= 1
##$TE= 0
##$TE2= 300
##$TE3= 300
##$TEG= 300
##$TL= (0..7)
0 120 120 120 120 120 120 120 
##$TP= (0..7)
150 150 150 150 150 150 150 150 
##$TP07= 0
##$TPNAME0= <>
##$TPNAME1= <>
##$TPNAME2= <>
##$TPNAME3= <>
##$TPNAME4= <>
##$TPNAME5= <>
##$TPNAME6= <>
##$TPNAME7= <>
##$TPOAL= (0..7)
0.5 0.5 0.5 0.5 0.5 0.5 0.5 0.5 
##$TPOFFS= (0..7)
0 0 0 0 0 0 0 0 
##$TUNHIN= 0
##$TUNHOUT= 0
##$TUNXOUT= 0
##$USERA1= <user>
##$USERA2= <user>
##$USERA3= <user>
##$USERA4= <user>
##$USERA5= <user>
##$V9= 5
##$VALIST= <valist>
##$VCLIST= <CCCCCCCCCCCCCCC>
##$VD= 0
##$VDLIST= <DDDDDDDDDDDDDDD>
##$VPLIST= <PPPPPPPPPPPPPPP>
##$VTLIST= <TTTTTTTTTTTTTTT>
##$WBST= 1024
##$WBSW= 4
##$XGAIN= (0..3)
0 0 0 0 
##$XL= 0
##$YL= 0
##$YMAX_a= 329884
##$YMIN_a= -553551
##$ZGOPTNS= <>
##$ZL1= 120
##$ZL2= 120
##$ZL3= 120
##$ZL4= 120
##$ABSF1= 10
##$ABSF2= 0
##$ABSG= 5
##$ABSL= 3
##$ALPHA= 0
##$AQORDER= 0
##$ASSFAC= 0
##$ASSFACI= 0
##$ASSFACX= 0
##$ASSWID= 0
##$AUNMP= <proc_1d>
##$AZFE= 0.1
##$AZFW= 0.1
##$BCFW= 1
##$BC_mod= 2
##$BYTORDP= 1
##$COROFFS= 0
##$CY= 11.3945322036743
##$DATMOD= 1
##$DC= 2
##$DFILT= <>
##$DTYPP= 0
##$F1P= 18.9103706918063
##$F2P= -1.10871071338519
##$FCOR= 0.5
##$FTSIZE= 0
##$FT_mod= 4
##$GAMMA= 1
##$GB= 0.15
##$INTBC= 1
##$INTSCL= 1
##$ISEN= 128
##$LB= 0.24
##$LEV0= 0
##$LPBIN= 0
##$MAXI= 10000
##$MC2= 0
##$MEAN= 0
##$ME_mod= 0
##$MI= 1.114404
##$NCOEF= 0
##$NC_proc= 0
##$NLEV= 6
##$NOISF1= 3.799351
##$NOISF2= 2.8
##$NSP= 1
##$NTH_PI= 0
##$NZP= 0
##$OFFSET= 15.70392
##$PC= 1
##$PHC0= -9231.964
##$PHC1= 12.60026
##$PH_mod= 1
##$PKNL= yes
##$PPARMOD= 0
##$PSCAL= 0
##$PSIGN= 0
##$REVERSE= no
##$SF= 200.130013532006
##$SI= 16384
##$SIGF1= 3
##$SIGF2= 2
##$SINO= 400
##$SIOLD= 16384
##$SREGLST= <1H.CDCl3>
##$SSB= 0
##$STSI= 0
##$STSR= 0
##$SW_p= 3612.71676300578
##$SYMM= 0
##$S_DEV= 0
##$TDeff= 0
##$TDoff= 0
##$TI= <>
##$TILT= no
##$TM1= 0
##$TM2= 0
##$TOPLEV= 0
##$USERP1= <user>
##$USERP2= <user>
##$USERP3= <user>
##$USERP4= <user>
##$USERP5= <user>
##$WDW= 1
##$XDIM= 8192
##$YMAX_p= 0
##$YMIN_p= 0
$$ End of Bruker specific parameters
$$ ---------------------------------
##NTUPLES= NMR FID
##VAR_NAME=  TIME,          FID/REAL,        FID/IMAG
##SYMBOL=    X,             R,               I
##VAR_TYPE=  INDEPENDENT,   DEPENDENT,       DEPENDENT
##VAR_FORM=  AFFN,          ASDF,            ASDF
##VAR_DIM=   8192,          8192,            8192
##UNITS=     SECONDS,       ARBITRARY UNITS, ARBITRARY UNITS
##FACTOR=    0.0002004,     1,               1
##FIRST=     0,             0,               0
##LAST=      1.6414764,     0,               0
##MIN=       0,             -553551,         0
##MAX=       1.6414764,     329884,          0
$$ Real data points
##PAGE= N=1
##DATA TABLE= (X++(R..R)), XYDATA
$$ [...]
3725C5K48k057p95R93K127l28k093o31K114J370j420j762J009J779K58j548o49
3742a350N57J647K28j855o92J695J732j250j543M62J709O24j356j454J162J942
3758B258l43j885k12J488J274j092j686O67J574N28j569j061Q67J750l04j639
3774F15j97J443P11q11j498L3J848O06j644j036J060J124j17j419o09J277J040
3791B426p86j755j7J952L84j780q50R88J085n86q47p51J254P15o58j608M70J197
3809H33L8j198p62L53J228p7j575n22J191J189j360r86K50J050M04p83j451P25
3827a453J444n70j171n23J234M99o28r28O9J140L44p99j246P43J524k56j661P9
3845b159Q05P18l94j184J94J393L53j313p04J146R10j89j244p1J181N81l84j289
$$ y = [35, 283, -1774, -2569, -1576, 551, 223, -1870, -2501, -387, 983, -437, -2199, -1190, 589, 847, -701, -1350, -793, 854, 1082, -773, -1465, 230, 1962, 712, -831, -369, 1340, 1964, 608, -846, 316, 2258, 1915, 30, -182, 1306, 2580, 1488, -198, 469, 2043, 2571, 1002, -59, 808, 2558, 2254, 615, 418, 1861, 2572, 1761, 263, 296, 2144, 2750, 1106, 70, 1130, 2254, 2137, 718, 109, 1386, 2426, 1640, -115, -132, 1820, 2204, 424, -426, 562, 1647, 1061, 214, -537, 717, 1432, 774, -834, -364, 833, 871, -327, -1089, -736, 492, 415, -1160, -1682, -491, 698, -662, -1648, -1398, -348, 56, -727, -2178, -1453, -9, -579, -1750, -2273, -1039, -540, -1168, -2096, -2027, -887, -543, -1342, -2588, -1845, -321, -577, -2238, -2159, -1354, -636, -1030, -2214, -2020, -627, -274, -1587, -2291, -1145, -235, -424, -1668, -1739, -558, 23, -361, -1650]
3863a650P01R25K63r17o30Q89Q31l7r83l58R62J247r64j049L65J370Q3j075l75
3882d02R05R84j40j430J47J333P02r37j054L66J342K5r33p04J201O67k50j350
3900D72j60J526L38n58j262N92J126n0q98j141J076J433l73j396j64R28O93q67
3918A315j207K95J442K0j394p72J415O30q27j147K64P75N91p18j499N96J303j33
3936I49j136p27R54O80n48j369J12J132O16r88j512O64J478Mj339q28R30J065
3954A37l15j675n3J674L43j393j234Q59J171J17j513n63J204J142n79j516j25
3971b319J731N28j317j177L51J965M46k032r53J681J238m48j885J74J746L75p60
3988f56j232Q8K079M75j866p08J189J631n31j537o07J620J265r50j743J000J793
$$ y = [-1650, -949, -24, 239, -678, -1308, -419, 412, 375, -608, -966, -4, 1243, 279, -770, -405, 965, 1048, -27, -402, 503, 1487, 1347, -83, 64, 1397, 2099, 1162, 108, 474, 1816, 1841, 908, 204, 1405, 2072, 1822, 472, 312, 1838, 2176, 1618, 356, 948, 2074, 2024, 1126, -15, 1061, 2494, 2121, 725, 561, 1489, 2182, 1315, 108, 403, 1845, 1865, 471, -301, 1114, 1744, 917, -230, 34, 809, 1400, 682, -817, -221, 1082, 949, -187, -914, 40, 720, 172, -1197, -1085, 47, 663, -325, -1837, -1173, 305, 309, -1030, -1858, -928, 137, -178, -1853, -1906, -232, 111, -1282, -2516, -1657, -486, -369, -1882, -2445, -1241, -99, -678, -2194, -2319, -588, -60, -1377, -2554, -2203, -238, 208, -1824, -2777, -1096, 142, -306, -2191, -2017, -271, 104, -656, -1888, -1800, 279, 754, -1112, -1820, -631, 1000, 469, -1068, -1675, -55, 1210, 260, -1483, -483, 1310]
4005A310L16j935p72J560J485n51j703l61J802J094j426j505O51J947L79j514
4021G77j337J097K104p67j812l93K330Q25j296j981P37K160M04j736j758J450
4037H04J947m53k331l47J982Q46q43j859J64K233N00k304r29R47K115m63k572
4054e63m03J743J636j416k293M04K337O77k570j268J446J667j64k415m75J786
4070A29J639j164k857M98K146J063k444j627J611J742k52k192r94K073J788j695
4086e36k143M29J995Q26j705j788R67K352l2k909o37K218J823j017k623K22K075
4103d83J300j710k323J129K701j25k508j104K040K074r65k236k21K344J854k361
4119e94k030Q80K896J35k512j147J533K563n20k946k27K582J362j892k090Q91
$$ y = [1310, 1626, -309, -1081, 479, 1964, 1413, -290, -651, 1151, 2245, 819, -686, -35, 1912, 2291, 777, -560, 537, 2641, 1874, 62, -331, 1999, 2824, 1528, -453, 284, 2444, 2848, 1112, -646, 804, 2751, 2298, -33, -380, 1602, 2448, 1605, -254, -90, 2143, 2643, 339, -590, 357, 2472, 2009, -563, -966, 777, 2413, 997, -1296, -892, 1445, 2122, -448, -1716, -270, 1397, 1233, -1182, -1657, 129, 1768, 604, -2253, -1755, 391, 1454, -990, -2617, -1006, 736, 484, -1708, -2702, -629, 1159, -536, -2679, -2250, -255, 571, -1134, -2922, -1955, 397, 365, -2544, -3181, -963, 860, -157, -2780, -2558, -483, 817, -893, -3216, -2087, 614, 489, -2019, -3123, -1083, 991, 26, -2210, -2431, -87, 1767, -594, -2624, -1744, 1152, 1287, -1225, -2372, -839, 1724, 1204, -1742, -1969, 613, 1975, 83, -2007, -1116]
4135a116L087J55k296j421J884K258q01k470n18K763J596j708k545P15K772O34
4151B989k398k145K179K492n19k927o49K584J897j706k500ML227Q55k623k110
4167a350J855K879o59k707j126K503K441j741l035K56K941J083k740k198J295
4182c03K997r2l362r40K396K128j546l075m5L582P40k569k223J101L077K93l559
4199a400j632K770K501j883l034J64K916J526k439k685J028L535J38l387j470
4214c352K202K533r01l454m20L304J653k069l563J325L649L06l417j910K775L016
4230A677j188l747m56L340K200k255k946O41L660M70k709k498K329L231n39l787
4246b577r82L449K681k369l450J011L520J208k768k651J718L930o03l960q41L064
$$ y = [-1116, 1971, 2126, -170, -1591, 293, 2551, 1750, -720, -1238, 1525, 3121, 1413, -1132, -417, 2355, 2989, 591, -1554, 625, 3117, 2598, -329, -978, 1606, 3503, 1797, -703, -699, 2528, 3383, 760, -1350, 505, 3384, 2725, 18, -1108, 1395, 3836, 2095, -940, -684, 2257, 3340, 600, -1598, -303, 2694, 2602, -760, -1700, 696, 2824, 1278, -1797, -1842, 1740, 2480, -89, -2312, -1211, 1866, 2159, -1400, -3032, -262, 2239, 356, -2678, -2514, 402, 1928, -511, -3196, -2168, 1367, 1505, -1882, -3352, -1150, 1383, 482, -2972, -3392, -88, 1565, -504, -4067, -2742, 907, 1213, -2204, -4114, -1339, 1677, 489, -3258, -3714, -374, 1826, -429, -3375, -2734, 926, 1396, -1313, -3811, -1482, 1749, 1210, -2577, -3559, -110, 2571, 202, -3248, -2237, 1283, 2491, -277, -2928, -1210, 2720, 2117, -1843, -2684, 380]
4262C80K582j882l300L85L865J364l441k787K404L659m46l790j216L251L004j836
4278B196m045K09M136J695l259k836J974L366k02l364j712K739L592k321l443
4293a275l53L938J994k963l116J311L989K3l825j869K850L460j535m479k93L841
4309A698K186k966l267Q47M348N50l847k341K384L902j503l840o92L459K697k915
4325G00l935Q56M019J315l828l053K442M128j154l964j175L324L230k887l838
4340c820P31M336J149l816k886K203M179m41m479j598L969K795k206m390O27M203
4356E56K007m217k822K106M133Pm501j386L128L647k209m005m90M566K339l723
4372h64l408J771M724r4m122k194L424L857j619m367l67M236K620l517l702J546
$$ y = [380, 2962, 1080, -2220, -1835, 2030, 3394, -47, -2834, -430, 3229, 2783, -1007, -2223, 1028, 4032, 2196, -1849, -1640, 2496, 4191, 932, -1904, 70, 3436, 3234, -130, -1842, 897, 4489, 2168, -1275, -1628, 2310, 4304, 1341, -1775, -464, 3525, 3548, -277, -2146, 704, 4164, 2629, -1850, -2143, 1698, 3884, 918, -2349, -1502, 2846, 3396, -451, -2792, -408, 3494, 1991, -1849, -2541, 918, 3615, 700, -3235, -2379, 1640, 2955, -873, -3926, -1484, 2644, 1490, -2474, -3649, -325, 2905, 18, -3820, -3089, 1247, 2396, -1420, -4306, -2103, 2076, 1635, -2844, -4442, -473, 2322, 116, -4274, -3647, 556, 2563, -1654, -4476, -2370, 1763, 1770, -2731, -4117, -989, 2658, 449, -3556, -4046, 520, 2859, -864, -4272, -2501, 2223, 2129, -1993, -4187, -763, 3094, 1475, -2892, -3259, 977, 3597, 80, -3622, -2076]
4388b076M704N03m145k470L433L537q84m784q95M742K307k996l709J329M565J081
4404D242m584l068L423M244r86m955n91M008L351k843m442Q93M966J089m388l086
4420b727K796M354p54m742j422L895L445k436m934M84N236J390m067l688K553
4435f17M872n23m738k173L861L634k217m857K93M943K075m290l583J734M942k68
4451C088m752k208L534M032j857n144j56M723K494m173m032J752N059O73n247
4466b214k435L559M097j574n055q61M734L199l754m637J404N690M84m632l064
4481e059L139M819j443n165r62M513L298l272m652J336N043J291m944l333L480
4496a911M709p77n145j627M684L789k868n011P71N093J936m614l567K507N264
$$ y = [-2076, 2628, 3131, -1014, -3484, -51, 3486, 2602, -2182, -3077, 1665, 3972, 976, -2733, -1404, 3161, 4242, -342, -3410, 13, 4257, 3271, -1684, -2275, 1733, 5084, 2241, -2201, -1308, 3658, 4747, 359, -2727, 69, 4423, 3669, -1073, -2495, 1400, 4845, 2409, -2525, -2041, 3195, 4585, 518, -3170, -617, 4255, 3732, -1006, -3179, 682, 4316, 2099, -2758, -2465, 2478, 4553, 263, -3320, -1586, 3356, 3088, -1664, -3872, -338, 3694, 1837, -3307, -3463, 1260, 3754, -419, -4451, -2699, 2360, 3033, -2214, -4649, -1090, 3007, 1433, -3622, -4483, 251, 3450, -304, -4941, -3537, 2153, 2637, -1995, -5059, -1920, 2899, 1456, -3709, -4671, -158, 3140, -132, -4784, -3448, 1595, 2886, -2058, -5391, -1911, 2798, 2021, -3124, -4751, -67, 3722, 854, -4157, -3386, 1707, 3643, -971, -4538, -2031, 3233]
4511C233j39n684j932M964L837k671n130M33N381K006m116m149K443N325k41n369
4527a809k031M466M235k296n377l9N802J919m218m046K199N096O46n392k577L938
4543E16M623j763n629o37N542K387l497m747J696N630Q56n266l299L738M824j300
4559C674o024n59M969L219l770m953J301N620J331n242l593L374N023j154n510
4574b294j485M836L777l231n697J074N618J816n090l916K956N204m85n946j667
4589d530M370M644l364n672Q35N416K170m764m283K440N718k74n606k484M484
4604i00M701k652n926J71N780K645m729m784K606N662J50n613k482M319M651k015
4620A584o062l11N704L004m253n356K315N999P85n805l137M336N068j721n852
$$ y = [3233, 3094, -2590, -4522, 442, 4279, 1608, -3522, -3089, 2292, 4298, 182, -3967, -1524, 3801, 3560, -1809, -3840, 626, 4861, 2565, -2812, -2851, 2951, 4870, 652, -3394, -1195, 3901, 4547, -845, -3422, 516, 5139, 3376, -2253, -2890, 2652, 5039, 1542, -3205, -1509, 4121, 4977, -289, -3588, 150, 4974, 3674, -2350, -2909, 2060, 5279, 1509, -3444, -2143, 3477, 4808, -434, -4027, -653, 4370, 3216, -2294, -3779, 1057, 4834, 1603, -4094, -3020, 2598, 4414, -676, -4592, -1636, 3568, 3083, -2863, -4530, -160, 4484, 1120, -4552, -3717, 1699, 3869, -895, -5178, -2738, 2980, 2706, -2900, -5384, -900, 3801, 1149, -4777, -4606, 1174, 3819, -910, -5694, -3088, 2574, 2724, -2889, -5371, -1052, 3599, 1584, -4478, -4789, 915, 3919, -334, -5690, -3375, 2624, 3409, -2396, -5533, -1197, 3871, 2150, -3702]
4635c702q20N387L648l987n242J326O236J571n705l358L569N147q03o123j521
4650d377N706M117l702n594J115O171J659n287m061L150O106r60n789k307N525
4665A472L982k978n946R09O111K482n684m565L278N834j18n992k789M856M870
4680E722k561o386J23O310K441m789n050K745O053M36o576k540M512N048k457
4695C031o141l11O027K856m390n778K354O186P95o100l427M431N418k221o281
4710c551q41N748L624m383n538J481O742Q43n618m247M105O056j673o581j423
4725e256N541M134l811o013J195O648J814o106m110L614N774o15o665j955N556
4740b55M571l130o064J19O598K304n450m786L137O690m86o642k616N633M937k862
$$ y = [-3702, -4522, 865, 4513, 526, -4716, -3390, 2846, 4417, -1288, -4646, -1077, 4070, 3267, -2856, -4377, 1329, 5446, 1744, -3850, -2735, 3436, 5095, -192, -4253, -1103, 5003, 4043, -1746, -4053, 1472, 5454, 2476, -3470, -2561, 3550, 6032, 348, -4217, -939, 4895, 4777, -1215, -4004, 852, 5722, 3161, -3225, -3102, 3208, 5649, 860, -4190, -1445, 4608, 5044, -1532, -4072, 440, 5488, 3031, -3110, -3421, 2606, 5462, 1072, -4706, -2352, 3834, 4629, -1471, -4898, -467, 4951, 2730, -3551, -4392, 1356, 4980, 597, -4941, -3460, 3282, 4125, -1493, -5740, -1635, 4421, 2748, -3833, -5256, 285, 4419, 608, -5405, -4210, 2438, 4252, -1854, -5964, -2350, 3424, 2809, -3856, -5811, -255, 4316, 1186, -4878, -4759, 1839, 4143, -1307, -6093, -2956, 3734, 3248, -3394, -6010, -377, 4560, 1698]
4756A698o677M60O302K848m824n403K431O828K02o463k891M918N507k471o522
4771d057m42O393L351m752n717K542O788N99o329l679M976N710j999o632j085
4786d333O548L666m237o130J795P073J068o188m137M383O392j846o680j520O112
4801A966M353m245o148J546O517K161o238m597L806O435r73o916k082N967M634
4816F186l512o362N18O858K547o225m997L531O462m89p105k245N594N037l228
4831B570o886M06O531K861n490n568L176O795n4o599l269N147N415k558p063l95
4847d981O651L511n234n522K025P077Q48o782l687M755N874k376o873q77O418
4862H27M115m738o034J656P077J327o528m444M841O259j776p040j600O514M402
$$ y = [1698, -4979, -4519, 1783, 4631, -193, -5596, -3165, 3663, 3865, -2598, -5489, -571, 4936, 2465, -4057, -4499, 1894, 5245, 493, -5224, -2682, 4106, 4705, -1624, -5303, -327, 5383, 3384, -3248, -4333, 2215, 5881, 1644, -4486, -2691, 4382, 5450, -738, -4875, -492, 5900, 4054, -2626, -4146, 1966, 6319, 2074, -4074, -2528, 3989, 6150, -88, -4685, -879, 5556, 4583, -2333, -4415, 1552, 6186, 2674, -3688, -3170, 3688, 6235, 10, -4987, -1456, 5006, 4517, -2588, -4833, 761, 5798, 2570, -4316, -3910, 2621, 5482, -8, -5576, -2400, 4395, 4341, -2258, -5527, -380, 5035, 2477, -4586, -4981, 1670, 5181, -53, -5575, -3550, 3527, 4375, -2407, -6094, -1339, 4535, 2159, -4714, -5591, 827, 4942, 204, -5830, -4174, 2903, 4230, -2298, -6742, -1901, 4358, 2582, -4458, -6058, 456, 4858]
4877D858m000o694J576O845J996o160m920M275O618j085p050k291O346M898l869
4892A343o931R33P712K251o300n099L755O789n03o896k661O098N363l232o965
4907d343o6P179L340n775n819L102P212N16p518l350N839O089k839p369q4O699
4923B813L746n498o062K629P482P52p347l881N216O359k230p026j255O953M014
4938F665n088o113J950P107J635p101m321M750O531j734p304j725O495M825m766
4953A806o610J172P873J697o812m778M230O597q07p462k287O157N176m044o935
4968e027O72P321K703o171n601L607P207m51p485l076O367N365l763o856n3P437
4984B196L143n953o021L258P368N65p724l448N941N953l002p856q0P042L849n692
$$ y = [4858, 858, -5836, -4260, 2585, 4581, -1579, -6499, -2224, 4394, 3309, -3741, -6032, 314, 5212, 1343, -5588, -4655, 3057, 5308, -992, -6091, -2336, 4453, 3950, -2946, -5607, 491, 5854, 2622, -4343, -4409, 2770, 6110, 335, -5484, -2382, 4830, 5346, -2172, -5522, 317, 6406, 3567, -3802, -3886, 2813, 6559, 1061, -5001, -2372, 5110, 5862, -1485, -5366, -150, 6209, 3979, -3047, -4302, 2651, 6665, 1577, -4536, -2586, 4521, 6156, -945, -5266, -516, 6015, 4281, -3023, -4748, 1747, 6572, 1806, -4804, -3632, 4241, 5938, -874, -5652, -1422, 5175, 4368, -3094, -5381, 776, 5952, 1908, -5027, -4355, 2966, 5669, -502, -6103, -2496, 4711, 4260, -3225, -6301, 66, 5431, 1668, -5188, -5241, 2196, 5339, -614, -6635, -3377, 3991, 4556, -3168, -6616, -675, 5278, 2276, -5580, -5660, 1382, 5231, -461]
5000d61o000K448P702Q34p104m213N321O584k548p467j233P436M151n021o640
5015f211K025P389K003p246m401M713O987j607p794j620O448N422m423p065J366
5030d014P559K074o550n250M542P068j029p663k439O854N065l929p019P23P451
5045C443K832o226n588L991P512m29p809l195O292N915l329p575Q5P632L196o055
5061F92o155L459P648m3p367l776O100O126k941p741l89P440L835n654o665K400
5077c031P965Q45p291m406N798O649k820p697j133P188M605n358o718J777P751
5092D124J447p113m909N163O886j710q116j750P046N009m808p257J446P718K521
5107E697p086n215M491P171j156q015k543P010N438m207p720P78Q065K468o440
$$ y = [-461, -6461, -4013, 3689, 4523, -2581, -6794, -1473, 5111, 2563, -4904, -6137, 1299, 5450, 429, -6211, -4186, 3203, 5206, -2040, -6441, -1728, 5259, 3652, -4142, -5762, 686, 6108, 1685, -5380, -4014, 3545, 5619, -931, -6181, -1639, 5429, 4400, -3263, -5702, 1152, 6217, 2288, -4731, -4008, 3443, 6275, 49, -5539, -1548, 5964, 5535, -2274, -5469, 823, 6738, 3409, -4166, -4081, 3551, 6747, 692, -5463, -2004, 5644, 5601, -1766, -5542, 558, 6684, 3743, -3998, -4387, 3053, 6888, 1234, -5431, -3031, 4934, 5779, -1512, -5918, -120, 6529, 3709, -3988, -5121, 2067, 6672, 1314, -5404, -3627, 4124, 5571, -1542, -6451, -1288, 5598, 3888, -4228, -5978, 1068, 6077, 1269, -5988, -4542, 3176, 5697, -1389, -6604, -2113, 5058, 3902, -4113, -6656, 354, 5792, 1585, -6135, -5357, 2708, 5176, -1264]
5122a264n987L990P811o62p853l083O523O028l639p717K33P877L306o098o459
5137f994L647P538L16p633l544N497O690l018p502q11P646M223n961o314K868
5152c352P533J020p408m308N590P197k546q298j137P514M672n214p027K128Q076
5167D440J847p497n121N255P261j843p797j905P210N214m916p406J757P804K313
5182F616o940n622M768P393r75q236k370O716N849m137p626M45P746L008o317
5197C18o036L982P388k45p912k973O518N938l691p768k80Q053L778o550o408L255
5213b633P755K63p645m006O147O530l035p956p31P547M184n920o698K807P766
5228D375J018p366m776N665P212k494q684j037P263N379n531p589K140Q251J585
$$ y = [-1264, -7251, -3261, 4550, 3888, -3965, -7048, -525, 5503, 1864, -5853, -5620, 2257, 5563, -535, -6994, -3347, 4191, 4507, -3126, -6670, -1173, 5517, 2499, -5003, -5814, 1832, 6055, 94, -6220, -3352, 4181, 5201, -2207, -6515, -925, 6272, 3726, -4572, -5709, 1805, 6477, 1263, -5764, -3636, 4440, 6287, -1210, -6331, -1076, 6185, 4342, -3455, -5360, 1850, 7064, 2148, -5258, -3501, 4303, 6616, -324, -5946, -1178, 6215, 5240, -2996, -5366, 1350, 7199, 3062, -4564, -4119, 3627, 6635, 318, -5718, -1736, 5652, 5407, -2505, -5478, 1040, 6978, 3287, -4481, -4761, 3292, 7070, 520, -5888, -2633, 5122, 5385, -2260, -6266, -119, 6411, 3376, -4580, -5311, 2236, 6420, 500, -6198, -3391, 4375, 5393, -1973, -6749, -1084, 6128, 3634, -5050, -6087, 1176, 6555, 1024, -6565, -4425, 3826, 5411]
5243E411p475n162N090P600j810q140k258P167N361m666p677J514P944K474o969
5258a596n744M446P772j073p915k894P219N993m495p700O64Q136L054o680n939
5273f752L827Q126o05q377k960O642O255l627p871j80Q012L936o435o666L558
5288c117Q076N69q007m209O534P018l196q383n38P796M597o250p092L031Q273
5303E102J168q247m037N442O731j758q416j378P587N110n596p241K220Q122J612
5318F421p055n458N110P555j652q255k017P321N171m566p964J476Q052K943p569
5333d87n661M305Q073p33q792k417O844N958m253q091N04Q631K703o937n987L789
5349b551Q033r4q606l575O770O843m043q322J31Q005L930o536o680L317P966P25
$$ y = [5411, -2064, -7226, -2136, 5464, 3654, -4486, -6744, 423, 5784, 1118, -6559, -5045, 2899, 5373, -1596, -7340, -2894, 4878, 3805, -4110, -7004, 215, 6208, 1713, -5987, -5323, 2813, 5867, -813, -6752, -2925, 5201, 4596, -3781, -6741, -99, 6156, 2529, -5342, -5522, 2490, 6426, -9, -6675, -3117, 4959, 5528, -2479, -6688, -154, 6864, 3668, -4715, -5253, 2543, 7140, 890, -6202, -3171, 5102, 6270, -1977, -6014, -572, 6159, 4401, -4015, -5393, 2194, 7304, 1708, -5533, -3313, 4809, 6421, -634, -6092, -982, 6573, 4921, -3334, -5351, 1970, 7141, 2575, -5389, -3913, 4139, 7082, -487, -6148, -1843, 6230, 5497, -3295, -5712, 1132, 7090, 2837, -5254, -4750, 3881, 6584, -353, -6340, -2551, 5482, 5388, -3218, -6793, -23, 6820, 2777, -5545, -5414, 2591, 6521, -15, -6695, -3378, 4588, 5313]
5365E313p864m650O275O950l057q268q36Q060M168n595p253K712Q244J213p956
5380b544n126O076O911k091q334j339P395N130n293p491J930Q617J647p683n256
5395g451N212P680j705q339k058P521N558m942p933J464Q672K322p167n677M264
5410b579P835o37q426k918P291O312m498p886M17Q402L171o583o487L949Q377
5425E740k15q244l801O715O641l482q303nQ253L941o547o505K793Q316R46q467
5441b224l871N884P350k936q445j003Q074M573n958p161K504Q546J182p893m904
5456f282N822P193j912q702j509P751M749n329p129J743P770K261p415n746N284
5471a451Q005j469q813k294P318N405m424q039J122Q434K471p059n866M433P913
$$ y = [5313, -2551, -7201, -926, 6024, 2967, -5301, -6137, 1923, 6091, 496, -6757, -4045, 4199, 5412, -2544, -7670, -1594, 5317, 3226, -5108, -6447, 948, 6078, 785, -6706, -4776, 3841, 5488, -2195, -7451, -2239, 5441, 3736, -4603, -6661, 860, 6418, 1476, -6457, -4993, 3679, 6001, -1166, -6843, -2579, 5256, 4619, -3807, -6725, 566, 6878, 2380, -5506, -5089, 3313, 6484, -99, -6586, -2637, 5740, 5525, -2719, -6520, 195, 6836, 3354, -4949, -4954, 3299, 7240, 693, -5812, -3019, 5297, 6243, -2224, -6095, -211, 7139, 4203, -4242, -5245, 2829, 7402, 1444, -5717, -3213, 5333, 6515, -1378, -6282, -460, 6733, 4821, -3881, -5390, 2361, 7110, 1781, -5348, -3605, 4165, 6426, -989, -6735, -1451, 6554, 5085, -3728, -6022, 1296, 6701, 2277, -5762, -4640, 3794, 6265, -794, -6660, -2227, 5686]
5486E686r00q556k670O762O235m392q024L03Q511L245p100o118M039P886k51p918
5502c262l706O600O581l701q145j41P961L970o510o544K881Q484O47q318m441
5517g644O499P160l416q127o49Q125M123n732p200K956Q006J197p700m717N467
5532a652P727k467q286j554P845N126n439p368J480Q751K026p844n081M768Q090
5547F122j585q360k573P368N905m791p666Q94Q810K533o946o155M403Q079q97
5562E141q108l289P098O441m154q046N08Q083L440o498o862L709Q394j70p788
5577b101m025O529O807l380q521j79P872M169o138o985L166Q275N79q206m013
5592f151N611P296k429q548j303Q022M603o057p118K617Q299J157p805m796N432
$$ y = [5686, 4786, -3770, -6440, 322, 6557, 2165, -5859, -5556, 2955, 6200, -900, -7018, -2979, 4907, 4656, -3262, -6968, -368, 6213, 2512, -5633, -5774, 2187, 6157, -353, -6897, -4016, 4468, 5115, -3203, -7644, -1145, 6015, 2599, -5528, -6177, 1948, 6071, 339, -6861, -3905, 4101, 5298, -2402, -7119, -1652, 6075, 3608, -4678, -6232, 1613, 6739, 1300, -6068, -4588, 4163, 6189, -1655, -6736, -1968, 6122, 4537, -3823, -6396, 972, 6877, 2086, -5580, -4686, 4124, 6657, -289, -6444, -2041, 6038, 5141, -2967, -6256, 842, 7283, 3129, -4917, -4409, 3674, 7114, 616, -6246, -2537, 5857, 5687, -2101, -6126, 403, 7210, 3830, -4691, -4870, 3002, 7171, 1033, -5952, -2786, 5489, 6068, -2138, -6151, -540, 6756, 4327, -4221, -5524, 2498, 7101, 1044, -6074, -3457, 4842, 5999, -1806, -6602, -1170]
5607a170P638k222q563j946P827N339n570p458J581Q408J913p127n666N135P331
5622E450j197q488k523P354N620m438p512K40Q635K853p279o125M559Q154p08
5637D595q644l006O933O258l845q356L40Q150L613o841o319L698Q133J02p878
5652c067m283O623O689l112q483m54Q213M063o262o771L223Q068J089p934m570
5667f968O176P220l001q272j410Q194M731n533p704K660Q557J687p995n024N352
5682a330P401j751q174j869P295N274m941p678J647Q461K103p432n352N027P449
5697F130q96q419k697P238N719m496p842J108Q307K675o890n931L725Q316k93
5712E754q261l715P142O445m014q051J43P925L685o431o669L214Q419J33q012
$$ y = [-1170, 6468, 4246, -4317, -6263, 1564, 6903, 1333, -6125, -4544, 3864, 5777, -1350, -7016, -1881, 5450, 4253, -4235, -6758, 596, 6216, 1778, -5734, -5494, 3141, 5994, -1285, -7410, -2851, 5303, 4595, -4049, -7055, -122, 6136, 2291, -6065, -5725, 2425, 6038, -803, -7122, -3424, 4709, 4811, -3067, -7350, -727, 5962, 2850, -5633, -6087, 2126, 6189, -73, -6844, -3621, 4447, 5536, -2398, -6968, -792, 6428, 3427, -4845, -6255, 1939, 6670, 1137, -6567, -3907, 4650, 6337, -1658, -6682, -1330, 6071, 4320, -3854, -5723, 1572, 6846, 1905, -5773, -4126, 4335, 6438, -994, -6346, -1319, 6130, 5234, -3185, -5882, 1356, 7075, 2579, -5263, -4155, 4152, 6827, -63, -5994, -2269, 6047, 5754, -2507, -6222, 920, 7365, 3351, -4700, -4557, 3368, 7053, 622, -6047, -2833, 5586, 5719, -2293]
5727b293m098O517O642l081q419o78P985M372o372p207L294Q138N75p529m517
5742f671O012O789k363q189j741P681M939n557p445K260Q570J406p740m973M936
5757b086P864k203q109k032P744N198n199p655J839P813K817p533n749M752P979
5772E440j342q229k810P551N749m421q049Q96Q141L103o975n957L893Q387q67
5787D510q030l096O132O993m001q242M6Q252L738o537o576L665Q021M72q072l745
5803f470N836O938k798q224p34Q048L992n804o897K800Q124J209q051m502N796
5818g37P279k554q287j169P470N144n213p427J734Q417J869p290n539N069P610
5833F376j631q251k200P496N234m600p991J301Q767K176p361n403M413P555q61
$$ y = [-2293, -6391, 126, 6768, 3687, -4732, -5410, 2575, 6947, 575, -6632, -3338, 4800, 5375, -2154, -6671, -659, 6130, 3767, -4422, -6163, 1518, 6457, 900, -6545, -4285, 4285, 5691, -2049, -7022, -2086, 5778, 3575, -4534, -6566, 1178, 6376, 1177, -6478, -4639, 3174, 5991, -1542, -7291, -2539, 5440, 4098, -4131, -6941, 610, 6359, 1938, -6111, -5215, 2926, 6029, -946, -6903, -3010, 5377, 4510, -3520, -6616, -484, 6509, 2508, -5734, -5688, 2564, 6302, -235, -6811, -3146, 4875, 5347, -2725, -6470, -634, 6304, 3506, -4718, -5452, 2596, 6588, 784, -6113, -3313, 4811, 6020, -2031, -6533, -737, 6542, 3988, -4299, -5468, 2002, 7146, 1933, -5494, -3760, 4657, 6526, -764, -6303, -1234, 6376, 4745, -3506, -5706, 1790, 7024, 2424, -5567, -4266, 4501, 6677, -684, -6087, -1674, 5881, 5020]
5848E020q148k484O539O057m355q047R59Q152K819o489o256L898Q000l24q270
5863b929l444O714O210l639q111N2P958L659o193o895L352Q391M2q091l815N963
5879g76O831l048p992j155P887M560n811p138K724P890J382p682m667N465P042
5894E512k076q274j480P596N175n444p498K084Q144J559p177m878M881P293j333
5909D084q468j883O848N836n082p439J360Q056K767p195n769M884P477q30q224
5924c578l043P020N743l523q284N59Q117L171o551o185L791Q265k41q220l386
5939f345O484O378l103q169o36Q372L954o458o509L260Q062L51p615m327O052
5954b49O849k812q303l60P511M372n607o918K524P869J267p499m985N448P517
$$ y = [5020, -3128, -5612, 927, 6984, 2629, -5418, -4459, 3693, 6512, 23, -6233, -2335, 5665, 5341, -2929, -6373, 341, 6551, 2912, -5199, -5147, 2811, 6470, 277, -6618, -3266, 5125, 5167, -2924, -6739, -776, 6055, 3007, -4985, -6140, 1747, 6307, 496, -6642, -3918, 3972, 5354, -2328, -6995, -1530, 5512, 3436, -4838, -6318, 1278, 6453, 1009, -6489, -4405, 3739, 5298, -1879, -6757, -1876, 5417, 4084, -4384, -6267, 581, 6417, 1335, -6104, -4744, 3312, 6079, -1116, -6885, -2001, 5476, 4646, -3578, -6621, 399, 6142, 2619, -5665, -5106, 3011, 6182, -369, -6554, -2763, 5502, 5261, -2959, -6345, 139, 6517, 3414, -4755, -5391, 2981, 6935, 477, -6032, -2772, 5290, 5641, -1974, -6301, -249, 6600, 3788, -4515, -4875, 2636, 7008, 1401, -5517, -2993, 4876, 6143, -1356, -6341, -893, 6624]
5969F624k666p801j421P256M903m954p531J594Q444J916p488n030M843P282j165
5984D806q362k117O956N505m578p775J046Q305K767p494n629M518P574r55q032
5999c465k702O629N717l771p883L10Q344K918o525n886L212Q073j71p984l521
6014f705O593N987l470p935m4P865L992n903p034K878Q264N13p915m048O038O623
6030E699k701p802j200P663M362n736o803K535P934J253p542m474N195P043j709
6045C717q085j783P272N325n341p240J784Q102J773o764n143M365P643j306q609
6060d290j518P060N282m812p060J028Q021K656o741o064M242P652l53q078k913
6075e888O646N818l744p851L96P995L349o278o275L711P598k06p418l820O168
$$ y = [6624, 3958, -3843, -5264, 1992, 6895, 1941, -5590, -3996, 4448, 6364, -1124, -6154, -1311, 5971, 4806, -3556, -5673, 1283, 6788, 2210, -5565, -4519, 3786, 6553, -941, -6570, -2052, 5522, 4567, -3465, -6167, 462, 6179, 2408, -5475, -5165, 3179, 6097, -428, -6314, -3102, 4971, 4800, -3184, -6705, -112, 5875, 2405, -5530, -5574, 2291, 6283, 380, -6654, -3776, 4488, 5001, -2914, -6962, -924, 5699, 2998, -4804, -6004, 1659, 6021, 285, -6518, -3983, 3951, 5204, -2338, -6812, -1617, 5426, 3717, -4368, -6151, 1121, 6446, 1105, -6135, -4351, 3751, 5524, -1240, -6383, -2018, 5625, 4319, -4290, -5808, 1252, 6534, 1722, -5338, -4310, 3711, 6367, -374, -6438, -2196, 5456, 5103, -2975, -5888, 758, 6576, 2832, -5019, -4623, 3372, 6721, 443, -5832, -2121, 5477, 5271, -2147, -5967, 201]
6090B01O377l040p981n63P909L881n939o756L097Q034N37p551m261N592O746k506
6106C777p972j256P797M357n368o795J910P852J624p454m856N400O953k097p856
6121c984j634P070M866m896p094J605P891J940p093n296M786P181j350p501l086
6136f595P324N485m470p740J193Q250K401o887n590M309P165n20p583l121O458
6151G9O006m063p778M07Q025L337o621o042L423Q186k00q084l490O420O233l492
6167B346p673k57P538L900n478o993K917Q334N91p666m058N587O561k369p808
6182d528j011P281M646n509p015K241Q162J434p237m946N250O872j402p847k115
6197e724P289M906m920p337J916P628K072o768n029M439P377j374p887k354P014
$$ y = [201, 6578, 3538, -4443, -5006, 2903, 6784, 845, -5911, -2814, 5220, 5757, -1794, -6055, -463, 6283, 3777, -4195, -5451, 2346, 6703, 1335, -5460, -3550, 4302, 5926, -1528, -6384, -984, 5969, 3872, -3984, -5618, 1452, 6318, 1422, -5672, -4067, 3824, 5764, -1329, -6625, -1839, 5342, 3992, -3509, -6595, 729, 6214, 1744, -5996, -4803, 3447, 5848, -1039, -6629, -2320, 4845, 4325, -3258, -6379, 79, 6085, 2022, -5756, -5349, 2676, 6013, -608, -6650, -3227, 4959, 4759, -3325, -6815, -395, 5838, 2346, -5327, -5584, 1954, 5854, 376, -6617, -3700, 4634, 5225, -2441, -6499, -912, 5649, 3280, -4528, -5539, 1742, 6388, 879, -6136, -3895, 4267, 5701, -1536, -6482, -1232, 5640, 4238, -3609, -5724, 1565, 6471, 1551, -5786, -3870, 3758, 5830, -938, -5967, -1528, 5849, 4475, -3412, -5766, 1248]
6212A248N274m223p307Q14P719K884o557n704L997P559r15p534k714O244N525
6227F310l317p602j09Q016L211o223o413L815P720l84p407l466N769O380k995
6242C305p702n76P485M134n903o653K972P435J027p517m083N165P071k438q233
6257d511j111P355L998m738o787K040P594J370o941m683M915P020j989p633j959
6272f060P015N163m852p422J462P966K231p072m850M276P133j024p666k304O138
6287A34N525l869p485R65P924K102o179n396L636P312m30p677k972O157O157l534
6303B370p481M4P456L204n613o135L121P461P10p784l551N730O530l161p362m95
6319d956P028L871n361o358K394Q002O89p262m210N535O404j824p721j765P420
$$ y = [1248, 6522, 2299, -5008, -4194, 3525, 6409, -148, -5852, -1855, 5704, 4789, -2745, -5459, 785, 6310, 2993, -4609, -4718, 3298, 6509, 286, -6127, -2312, 5408, 5024, -2383, -5849, -80, 6300, 3305, -4397, -4973, 2512, 6646, 743, -5910, -2938, 4497, 5524, -1993, -6076, -911, 6160, 3722, -4511, -5622, 1733, 5731, 993, -5794, -3754, 3840, 5210, -1731, -6414, -1499, 5521, 3532, -4101, -6060, 955, 6118, 1266, -6156, -4694, 3272, 5503, -1569, -6419, -2143, 4990, 3966, -3700, -6004, 134, 5659, 1790, -5695, -4730, 3194, 5296, -883, -6279, -2643, 4669, 4239, -3438, -6410, -253, 5904, 2370, -5111, -5067, 2389, 5593, -20, -6155, -3034, 4427, 5137, -2647, -6198, -468, 6062, 2901, -4461, -4956, 2072, 5943, 582, -5776, -3382, 4620, 5309, -1953, -6163, -628, 5776, 3952, -3769, -5534, 1886]
6334A886M746n226o808J736Q027J286o684m640M958O336j608p600j814O870M932
6349F397m478o997J431P410K005o186n353M155P060q20p528k790O985N107m268
6364B130p194R55P343K869o277n875L806P644o00p594k986N820N889k951p945
6379d966lP644L533o379n963L459P154L36o991l644N034O544k613p783p82P284
6395A864M366n830o079K485P111J173p217m309N356O566k221p897q99P029M199
6410E697m905o793J947P741J283o598m920M484P093j446p778j568O450N224m392
6425A519p119J106P682K044o577m853M041P186r48p173k706O028N634l928p005
6440e069K93P676K827o335n361L919O991k95p327l118N772N937l174p354l4P295
$$ y = [1886, 6632, 1406, -5402, -3666, 4361, 5647, -1037, -5677, -719, 5617, 4009, -3591, -5405, 1465, 6397, 1919, -5078, -3647, 3763, 5768, -418, -5771, -1616, 5444, 4624, -2904, -5694, 1291, 6398, 2130, -5064, -4109, 3234, 6103, -174, -6049, -2243, 5401, 4801, -2793, -5779, 41, 5930, 2979, -4966, -4969, 2675, 6208, -171, -6134, -2675, 4479, 4815, -2176, -5820, -786, 5758, 3145, -4638, -5420, 1864, 6230, 400, -5679, -3194, 3917, 5090, -2127, -6436, -1080, 5486, 3265, -4632, -5531, 1498, 5697, 792, -6001, -4054, 3687, 4970, -1628, -6548, -2064, 5029, 3583, -4195, -5763, 687, 5911, 1519, -5600, -4494, 3188, 5232, -1345, -6198, -2157, 5029, 4081, -3092, -5798, 230, 5864, 1936, -5069, -4776, 2900, 5727, -608, -5969, -2050, 4941, 4646, -2681, -5799, -27, 5910, 2736, -4618, -4652, 2643]
6456B643L430n648n842K242P855O54p343l617N792N675k717o947o35O988L836
6471F366n383o257K360P504J050p466l845N053O352j685p683j385O674M762m669
6486A748p136J878P741J272o284m777M531O587j253p568k160O669N066m551o887
6501e124J282P154K290o049n498L867P097o48p401k820O244N359l426p075J65
6516d583P092L425o234n841L255P574l44p171l081N600N857k875p550J36O903
6531B163L477n635n860K769O905O23o666l907N277O210k605p280j171P247L932
6546E479n041o311K302P000J414o750m417M793O831k041p530j225O818M407m644
6561A085o553J330P362K177o793m678M606O621j530p017k157O270N132m140o818
$$ y = [2643, 6073, 425, -5417, -3175, 4680, 5334, -2009, -5626, 166, 5841, 3124, -3823, -4458, 2530, 6366, 983, -5274, -2914, 4590, 5640, -1826, -5671, -618, 5734, 4049, -3634, -5019, 1655, 6417, 1748, -5388, -3510, 4231, 5503, -781, -5558, -1027, 5560, 4307, -3261, -5421, 1248, 6314, 1763, -5124, -3842, 3312, 5602, -447, -5945, -2078, 5019, 4371, -3030, -5850, 394, 5753, 2327, -4748, -4583, 2509, 5934, -300, -6141, -2886, 4688, 4344, -2827, -5908, -308, 5549, 2674, -4876, -4740, 2163, 5640, 5, -5855, -3086, 3819, 4442, -2224, -6131, -854, 5356, 2751, -4529, -5700, 1547, 5479, 438, -5873, -3571, 3429, 4843, -1907, -6324, -1531, 5300, 3259, -4271, -5496, 1322, 5729, 1085, -5468, -4138, 3224, 5401, -1392, -6070, -1464, 5157, 3627, -3390, -5547, 723, 5855, 1715, -5103]
6576e103Q17P522K439o187n145L868O782m82p126k812N751N569l524o880N3P699
6592C241K359n292n633K862O880M16o727l353N582N744k979o905m58O745L569
6607F051n313n826K117P360P21o754l706M965O181k565p049q17O396M264m742
6622A283o380J773P308J557o762m300M617O311j596p241j817O699M385m257o770
6637e190J602O950J970o178m891M040O551r81p029k475O254M888l868o292O06
6652d043O853K503n959n124L429O883k33p465k435N549N362l314o724J99O882
6667B363K889n487n682L188O555K91o602l148N197N714k582p004p95O932L652
6682E481n530n621K434P014P20o626l643N133N774k325o806q80O466L897m932
$$ y = [-5103, -4286, 3236, 5675, -512, -5657, -1789, 4993, 4511, -2615, -5427, 324, 5893, 2369, -4511, -4458, 3241, 5600, 308, -5325, -2463, 4417, 4833, -1894, -5247, 335, 6079, 3100, -3805, -4263, 2482, 6051, 738, -5088, -2971, 4389, 5110, -1644, -5350, -385, 5796, 3231, -3818, -4635, 1761, 6025, 1283, -5097, -3324, 3984, 5541, -1221, -5521, -904, 5407, 3811, -3430, -5247, 1452, 5837, 1580, -5190, -3588, 3362, 5332, -846, -5737, -1697, 4854, 3873, -3156, -5631, 623, 5511, 1643, -4649, -4043, 2810, 5313, -646, -5770, -2341, 4542, 4309, -3156, -5591, -42, 5320, 2006, -4718, -4519, 2363, 5252, -235, -5917, -2729, 3826, 4117, -2485, -5633, -436, 5278, 2696, -4308, -5103, 1829, 5481, -49, -5670, -3236, 3778, 4498, -2128, -5771, -638, 5136, 2811, -3995, -4875, 1591, 5488, 556]
6697E56n736J593P207J353o222m433M389O301j442p122j415O136M379l832o482
6712d770J227O712K052o069m567L816O546j103o789j881N809M694l462o853N47
6727d091P456K165n673m769L042O604j60p014k577N406N427k896p132j53P131
6742B766K793n140n380K810O761K81o628l479N014N657k261p060n22O400L648
6757E660m888n590J828O970Q05o770l312M834N629j963o688j327O179M008m230
6772A145o074J564O520J737o369l981M014O055j156p004j625N748M708l948o511
6787e177J233O933J760n608m600L404O510r44o523k623N974M785l488o472P59
6802d077O187K863n625m939L006O694j3p016k508N003N331k733o328l54O286L712
$$ y = [556, -5180, -3587, 3620, 4973, -1249, -5682, -1293, 5008, 3566, -3556, -4971, 1165, 5544, 1712, -4770, -3543, 3169, 5221, -848, -5415, -1599, 4947, 3844, -2945, -4826, 983, 5677, 2215, -4638, -4091, 3365, 5530, -143, -4912, -1870, 4734, 4574, -2440, -5017, 389, 5816, 2920, -4212, -4365, 2766, 5559, 419, -4961, -2151, 4610, 4891, -1737, -5216, -202, 5455, 3194, -3866, -4388, 2012, 5660, 772, -4818, -2990, 3980, 4785, -1985, -5297, -463, 5166, 3203, -3485, -4812, 1367, 5375, 1145, -4929, -3365, 3155, 4892, -1477, -5458, -1444, 4611, 3455, -3549, -5174, 574, 5282, 1334, -5177, -3944, 2989, 4749, -859, -5459, -2055, 4455, 3511, -3012, -5635, 339, 5124, 1636, -4836, -4077, 2110, 4973, -652, -5591, -2585, 4109, 4096, -2920, -5428, -425, 4906, 2173, -4155, -4509, 1777, 5489]
6818E489n481n391K810O270M81o290l343M894N703k042o973p74O127L952m877
6833E55n761K258O745P66n800l936M361N778j456o922j212O079L926m282n819
6848d720J615O461J646n718m672M185O244j071o784j798N554M382l483o094P65
6863c488O548K231n537n006M191N862p54o253k603N382M760k977o266K63O606
6878B959K517n396n271L261O218L69o777k992M989N232k446o616k65O454K877
6893E113m580n557K354O414P11o167l821N344M943k203o170j052N893L704m304
6908F22n697K195O348J044o003l872M367N482j795o187j419N639M336l824o086
6923d850J080O733J208n101m249L746N567p99o565j893N288N064l818o137Q18
$$ y = [5489, 8, -5383, -2573, 3697, 4178, -2112, -5455, -561, 5142, 3100, -3873, -4647, 1480, 5432, 555, -5206, -2948, 3797, 4563, -1237, -5173, -812, 4966, 3510, -3412, -4624, 1455, 5381, 1099, -4720, -3105, 3356, 5002, -716, -5388, -1203, 5041, 3970, -2814, -4612, 942, 5324, 1841, -4253, -3488, 3060, 5291, -246, -5252, -1061, 4801, 4047, -2206, -4809, 573, 5333, 2356, -3910, -3647, 2959, 5476, 80, -5191, -1930, 4288, 4657, -2120, -5112, -123, 5109, 2663, -3953, -4218, 2236, 5113, 533, -5024, -2670, 3744, 4455, -1712, -5533, -189, 4754, 2551, -3619, -4671, 1222, 4926, 622, -5075, -2880, 3468, 4512, -1491, -5363, -996, 4486, 2691, -3496, -4915, 724, 5060, 1236, -4850, -3770, 2963, 4171, -930, -5179, -1433, 4134, 3335, -3230, -5123, 165, 5229, 1411, -4726, -3908]
6938c908O331K021n150m495L024O185m86o010k654N427M560k792o481N60N863
6953A995L023n066n236K826O306K16o359k722M823M984k527n788o62O026L423
6968E262m660n492K285O277O10n958l306M496N588k221o152r28N833L837m428
6983A043n576J956O556N72n187m177L822N788r79o649j774N865L671l394n451
6998c914R27O062J889n338m399L562N909r19o160j881M996M274l390n561K96N949
7014B302K890n425m684L034O061l84o003k388M554M825k546o043j18O100K713
7029D888m965m438K294N895j13n520l293M698N613k707o274l55N668L231m286
7044C36m910J779O030Q61n670l591M299N225j843n993q41N301L409l440n631J163
$$ y = [-3908, 2423, 4444, -706, -5201, -2177, 4008, 3522, -2488, -5142, 285, 4845, 2053, -4428, -3868, 1995, 5018, -48, -5284, -2458, 3848, 4064, -2295, -5017, -194, 4790, 2263, -3525, -4187, 1839, 5262, 602, -4890, -2605, 3672, 4282, -1676, -4982, -486, 5102, 2881, -3271, -4199, 1634, 5471, 1043, -4533, -2577, 3979, 4551, -636, -4813, -991, 4797, 3818, -2831, -4605, 1260, 4931, 1537, -3914, -2987, 3075, 4964, -374, -4773, -1211, 4698, 3779, -2381, -4262, 734, 5008, 1618, -3943, -3647, 2302, 5192, -233, -4917, -1883, 4178, 3794, -2209, -4597, -43, 4782, 2236, -3807, -3925, 2175, 4888, -77, -4515, -2221, 3674, 3561, -1959, -5252, -554, 5059, 2352, -3922, -4277, 1391, 4622, 336, -4574, -2795, 3235, 4096, -1574, -5165, -866, 4359, 2516, -3477, -4318, 983, 4392, 952, -4679, -3516]
7060c516O418J339n615l691L624N528j184n729k010N361M075l543n784J258N889
7075B420J895n053l940K647O029o89n632k634N207M655l555n183K23N801K641
7090D832m914m302K381O097k55n739k735M671M736k908n487j7N743K665m484m767
7106d483K406N805L58n817k928M456M979j828o175p00N557L492m502n364K138
7121b606O283N65n471l396M083N206j618n865j231N622L284l981m841J270N776
7136C080J263n218l348L245N283j141n648j700N054L739l292m975N38N818K000
7151D698n090m156K762N651p19n413k180M614M273k634n523k34N717K516m633
7166c51m588K589N849k0n833k297M278M657k155n917j17N559K773m538m432J797
$$ y = [-3516, 2902, 4241, -1374, -5065, -1441, 4087, 2903, -2826, -4836, 525, 4600, 1057, -4727, -3469, 2420, 4315, -738, -4678, -2031, 3998, 3309, -2323, -4957, 250, 4905, 1350, -3833, -3610, 2191, 4832, -82, -4384, -2003, 4094, 3839, -1900, -4635, 36, 4772, 1864, -3623, -3640, 2103, 4768, 284, -4483, -2077, 3728, 4086, -1731, -4659, -203, 4776, 2948, -3227, -3927, 1630, 5122, 620, -4744, -2606, 3677, 4242, -1229, -4625, -542, 4664, 3046, -2819, -4050, 1572, 4856, 875, -3966, -2696, 3080, 4343, -875, -4223, -978, 4305, 3164, -2484, -4184, 870, 4609, 1317, -3658, -3120, 2698, 4698, -392, -4548, -1786, 3865, 3146, -2267, -4447, 167, 4440, 1806, -3717, -3951, 1766, 4282, -351, -4939, -2350, 3499, 3479, -2354, -4651, -373, 4284, 2129, -3788, -3905, 1654, 4427, -111, -4543, -2746]
7182b746N482J070n326l677M369M897j894n826k63M991L250l701n055J410N983
7197B964Q74n078l748L898N207j559n567j401N146L359k978n554J032N815J900
7212D310n331l813L706N036p94n648k077N213M177k944n670N01N853K144m979
7227c16m005K804N230l7n351k658M634M445k790n367J20N362K272m017m581K336
7243a919N596L19n368l079M638M262k277n078o33N234L007l745n027J949N724
7258C603K39n047k736L364M808j269n441j450N164L466l482n089J407N325Q65
7273C727m600l215L255M891j073n401j622M744L958l604n001R66N370J701m590
7288d94m027K924N444p66n645j579M710L557k608n050M3N361K381m619m135K411
$$ y = [-2746, 2736, 3806, -1520, -5197, -828, 4069, 2175, -3651, -3914, 1077, 4327, 626, -4429, -3019, 2964, 3838, -1240, -4988, -1090, 4117, 2558, -3009, -4410, 736, 4095, 1117, -4437, -3405, 2410, 4310, -1021, -4834, -1128, 3908, 3114, -2534, -4611, 602, 4779, 1835, -3835, -3334, 2519, 4663, -316, -4321, -1517, 3713, 3676, -1675, -4333, 301, 4746, 1956, -3411, -3291, 2071, 4343, 326, -4255, -1919, 3677, 3996, -1372, -4451, 187, 4449, 2172, -2906, -3539, 1695, 4702, 957, -4070, -2121, 3603, 3842, -1205, -3941, -577, 4231, 2962, -2479, -3929, 1235, 4701, 1219, -3870, -2463, 2862, 3727, -873, -4088, -833, 4058, 2985, -2416, -4038, 706, 4664, 1060, -3941, -2975, 2395, 4096, -494, -4521, -1597, 3847, 3081, -2564, -4143, 567, 4124, 1516, -3534, -3491, 1870, 4251, -368, -4503, -2092]
7304b092N416o3n252k216L954M190j890n447o50N303L054m354m381K242N129K77
7320C220m767l077L859M599j660n429q32N510K629l673m545J704N120Q93n000
7335a449k948L364M870j306n596q10M875L227l170m777Q09N476J348m743l480
7350d310L346M650r10n286j424M703L445k779m845P37N081K001m726l631K575
7365a373N194n07m930k453M343L824j984n559M57N051K116l988l979K161N054
7380C427K98n365k637M536M087k286m906m44M961K370l319m715J830N200Q61n311
7396a413k596L421M359j266m997r31M598L359l423n254J719N084J061m644l168
7411d091L124M528r89n152j150M034L929l277m511Q16N068J433m531l553K638
$$ y = [-2092, 3324, 3261, -1991, -4207, -253, 3937, 2047, -3400, -4050, 1253, 4307, -47, -4428, -2186, 2943, 3220, -1547, -4624, -765, 3834, 2174, -3255, -4087, 1423, 4052, 379, -4166, -2462, 2658, 3551, -1449, -4397, -1033, 3837, 2531, -3065, -3875, 1000, 4227, 1057, -3720, -2911, 2565, 3913, -830, -4310, -964, 3686, 2776, -2510, -3934, 769, 4214, 1435, -3410, -2673, 2408, 4409, -317, -3948, -1373, 3821, 3314, -1616, -4069, 274, 4098, 2114, -3445, -2988, 2063, 4179, 191, -3788, -1627, 3427, 3725, -1640, -4277, 259, 4346, 2060, -2846, -3290, 1671, 4041, 722, -3993, -2163, 3037, 3898, -1413, -4009, -588, 3771, 2505, -2492, -3423, 1175, 4534, 1111, -4143, -2424, 2660, 3721, -923, -4091, -967, 3561, 2572, -2580, -3730, 304, 4233, 956, -3555, -2739, 2329, 3762, -769, -4322, -1684]
7426a684N157n66n516j707M555L849k758m750K60M846K219m184l993K402N080
7441C210n7n385k018M159L856k090m806m46N011K554m191l922K137M954J06m995
7457a923k309L738L959j256n129o89M811K893l874m160J760N022L72m182l222
7472d189L472M850j829m856q25M605K712k996m740J353N081J043m148l647L148
7487i66M893j255n158q08M014L173k639m500N22N078J599m147l662K579N052q96
7503B879m643j782M157L555k636m574J5M960K052l919l759K278M615m3m501k510
7519c856L897L994k296m853J70M848J883l468l870J784M688O29m810k519L571
7534b08M013j531n063n54M312K751l026m252J047M970J160m896k627L144M219
$$ y = [-1684, 3473, 2907, -2609, -4316, 239, 4088, 1330, -3420, -3160, 1686, 3905, -279, -4272, -1870, 3210, 3153, -2232, -4250, -91, 3765, 1675, -3131, -3577, 1434, 3988, -203, -4125, -1988, 2966, 3072, -1923, -4232, -494, 3465, 2209, -2920, -3609, 1202, 4095, 221, -3939, -2179, 2843, 3215, -967, -4189, -717, 4133, 2304, -2552, -3377, 1228, 3940, 944, -3796, -2443, 2638, 3681, -467, -4114, -966, 3927, 2672, -2486, -3294, 720, 3893, 1254, -3246, -2724, 2354, 3953, -194, -3856, -1277, 3775, 2879, -1764, -3546, 611, 4166, 1530, -3044, -3029, 1931, 3983, 64, -3695, -1417, 3198, 3155, -1346, -3856, 41, 4035, 1739, -3114, -2944, 1904, 3787, 319, -3551, -1767, 2921, 3550, -1260, -3779, -208, 3805, 2274, -2789, -3343, 969, 3720, 694, -3558, -2511, 2459, 3619, -1277, -3904, -760, 3459]
7549C459j082m829r90L822L406k651m941J005N000R42l945l287K874M175o78m504
7565b224j468M075L511k902m560P84M583J796m092l459K239M498l8m679k143M181
7581A02L554k265m649n2M834J863l548l633J843M723Pm651j810L578L310j393
7597A813m467n24M614K500l563m225J805M909L49m352k385K964L950j084m623
7612b319r60M478K753l164m150J410M280J185m189k982K818M797j173m825j084
7627c125M003L059k732m299P83M352J846l898l447K366M483m43m680j425L425
7642B68L905k705m154J0M662J723l648l443K148M299k77m205j951L131M094j776
7658B081m941j14M511K253l503l587J712M343N50m496k542L018M353j514m757
$$ y = [3459, 2377, -2452, -3442, 380, 3786, 1135, -3806, -2801, 2199, 3141, -804, -4091, -1217, 2958, 2280, -2224, -3692, 383, 3894, 992, -3568, -2784, 1799, 3595, -497, -3956, -1717, 2781, 2743, -1936, -4079, 102, 3656, 1391, -3258, -3310, 1524, 3387, -161, -3794, -1951, 2772, 2779, -1872, -3682, -104, 3206, 1813, -2654, -3178, 1436, 3936, 373, -3852, -2047, 2862, 3211, -1141, -3526, -562, 3388, 2304, -2319, -3279, 1199, 3952, 788, -3362, -1952, 2328, 3513, -676, -3658, -840, 3957, 2784, -2041, -3125, 878, 3937, 1205, -3094, -2311, 2041, 3887, -11, -3458, -1092, 3391, 2948, -1732, -3157, 268, 4173, 1468, -2686, -2676, 1986, 3709, 61, -3382, -1234, 3065, 2788, -1417, -3368, -237, 3857, 2081, -2860, -2974, 1537, 3790, 287, -3300, -1588, 2755, 3305, -1191, -3733, -715, 3638, 2124, -2633]
7673b633o44M138K451k773l667R24M459J034m151k684K722M209j448m413p92L906
7689F38K902k607m299Q18M521J059l733l344K776M184o78m150j814L880L430k522
7705A061m256N69M454J145l428l189K083M158L8m355j761L518L418k161m186J67
7721b725L997J766k863l306R71M966m7m525j704L376L449j894l782m53M062K224
7737C512k872m024J517M138P42m060k167L082L413j307m275o13L655K871k928
7752F84l827J226M359P27l749k790K458M260q61m715j080M108K899k599m002J011
7768a891L818J405l900k520J966M636p11m473r82L164K900k067l983J10L938J850
7784C260l386l287K118M398n58m115j388K840L590j954l911l98M283J768k934
$$ y = [-2633, -3277, 861, 3312, 539, -3128, -2204, 2255, 3289, -862, -3546, -824, 3385, 1937, -2476, -3268, 638, 3540, 933, -3366, -2548, 1973, 3032, -701, -4045, -1269, 2915, 2237, -1913, -3727, 153, 3583, 1061, -3195, -2626, 1828, 2973, -455, -3644, -1561, 2597, 2635, -1720, -3481, 37, 3455, 1294, -2892, -2725, 1272, 3038, 175, -3131, -2160, 2806, 2759, -1766, -3470, -94, 3355, 1461, -2321, -2774, 1288, 3512, 640, -3384, -1867, 2271, 3013, -1047, -3214, -132, 3281, 1974, -2301, -2914, 741, 3612, 684, -3143, -1917, 2442, 3169, -580, -3370, -912, 3348, 2487, -2228, -3308, 800, 3699, 1100, -2902, -1891, 1927, 3332, -568, -3088, -1122, 3514, 2803, -1670, -2652, 512, 3412, 1345, -2638, -2528, 1410, 3260, -126, -3413, -1295, 3103, 2545, -1570, -2958, -118, 3472, 1518, -2393, -2791, 1492, 3260, 326]
7799C26l836K219L803K68l947k228K977L335j181m523j19L881K404k968l731J401
7815a919M041O89l936k647L039L596j085m104q12M065K383k783l811P09M265R64
7831B654l530k712K504M103q56m113j394L250L301k026m310L08M726J256l627
7846d66k934K136M049n42l839j755L363L283j857l995k22M255J603l177k978J264
7862a812M224J91l930k217L463L429j701m009j26L670K022k553l788J690L952
7877B505N46m026k188K958L281j287m056m28L721K234k386l716J012M083O53l627
7893g21k264K695L145l24m223j278L874K431k322l640P68L963Q94l365k729K350
7909g46L475k93m148j197L116L031k058l622K97L615J648l085k984J358L997J23
$$ y = [326, -3510, -1291, 2512, 2780, -1167, -3395, -418, 2917, 1736, -2787, -2906, 975, 3379, 411, -3320, -1919, 2122, 2811, -1125, -3772, -733, 2863, 1778, -2326, -3138, 927, 3310, 527, -3284, -2575, 1690, 2654, -876, -3588, -1084, 3019, 2163, -1950, -3344, -94, 3207, 1181, -3129, -2821, 1905, 3161, -466, -3400, -1264, 2785, 2243, -1596, -3351, 12, 3295, 1438, -2557, -2779, 1476, 3079, -98, -3076, -1812, 2412, 2603, -1327, -3544, -81, 3348, 1647, -2362, -2488, 1182, 3204, 651, -3137, -1447, 2505, 3051, -975, -3163, -205, 3076, 1789, -2267, -2695, 1026, 3260, 874, -2842, -1830, 2253, 2906, -721, -2985, -290, 2855, 2531, -1692, -2970, 904, 3335, 1013, -2627, -1859, 2104, 2998, -367, -3096, -746, 2729, 2436, -1712, -2909, 207, 3238, 1180, -2442, -2145, 1470, 3118, 33, -2951, -1593, 2404, 2527]
7925B527l843j800L186L127j930l713j38L804J852l237l041J609L803L68l940
7940a366j701K862K733o10m238m41L690K271k976l521J567L496P36l294k495K582
7956g05L360q10l868j028L911K192k479l448Q27L657J117l356k487K073L973r14
7972B015m005p56L080K441j924l641L26L934J212l079k703K125L618m35l616j317
7988b725K711L184j897l378m65M121J287k934k779J693L469j20l484j860L116
8003f1L316j649l940J31L597J654l003k823J278L853O05l727k029K752L023j197
8019A780l420r95L691K025k510l101J001L701O50l493k140K315L415j047l513
8034a641q21K748K672j758l768Q49L788N22k965k423K095L053O0l722j499K913
$$ y = [2527, -1316, -3116, 70, 3197, 1267, -2446, -2584, 1220, 3072, -165, -3206, -1597, 2206, 2574, -1366, -3067, -205, 2528, 1918, -2320, -2761, 929, 3200, 224, -3297, -1730, 1766, 2502, -792, -3287, -705, 2655, 1845, -2023, -3051, 860, 3052, 573, -2875, -2048, 1609, 2726, -630, -3117, -1044, 2929, 2015, -1990, -2746, 334, 2775, 851, -2790, -2464, 1470, 2682, -397, -3100, -975, 2643, 2208, -1408, -2725, -14, 3170, 1273, -2105, -2570, 1551, 2838, -96, -2875, -1182, 2287, 2167, -1317, -3177, -61, 3255, 1606, -2334, -2203, 1394, 3048, 45, -2778, -1500, 2353, 2958, -769, -2798, -46, 2977, 1780, -1640, -2635, 1056, 3081, 571, -2530, -1529, 2172, 2822, -671, -2811, -496, 2919, 1872, -1641, -2462, 286, 2958, 1200, -2568, -1719, 2069, 2591, -374, -2797, -702, 2351, 2411, -1311, -2810, 103]
8050A03K843j890l471L87L530J139k929k634J513L663m5l446j700K803K846j652
8066A060l847O90L022J708k594k966J075L819L19l685j897L089K834j399l569
8081b341m11L439K206k521l409J491L568L74l452j944K175L544j090l632p71L308
8097E34K029k223l012R72L213R01l078k144J864L555q44l503r75K749K814k385
8113D67k963M44L515J267k766k726J474L820n44l310j202K606K624j559l292j86
8129b331L634J596k824k904J567L586o9l133j622K572K639j105l532m64L341J875
8145B826k572k740Q35L601O49l445j902K362L403j374l439m64L328J728k103l163
8161b470Q96L399O83k953k470K448L276j149l156j195L321K204j965l076M56L449
$$ y = [103, 2946, 1056, -2415, -2028, 1502, 2641, -288, -2922, -1409, 2254, 2209, -1237, -2937, -134, 2712, 1060, -2787, -2097, 925, 2633, 39, -2927, -1852, 1967, 2286, -1399, -3296, -207, 2627, 1228, -2341, -2752, 687, 2893, 372, -3037, -1546, 2022, 2396, -1056, -3000, -825, 2719, 1629, -2003, -2774, 534, 2563, 340, -2672, -1700, 1513, 2414, -664, -2808, -944, 2611, 1767, -1736, -2711, 38, 2852, 467, -2496, -2052, 1463, 2730, -36, -2762, -1288, 2532, 1988, -1322, -2524, 82, 2706, 1147, -2145, -2331, 1303, 2899, 75, -2829, -1262, 2324, 2255, -878, -2500, 72, 2711, 1606, -1926, -2390, 951, 2826, 254, -2486, -1651, 1950, 2599, -846, -2748, -386, 3017, 1643, -1796, -2260, 1068, 2796, 693, -2470, -1574, 1825, 2508, -445, -2915, -467, 2809, 1660, -1496, -2691, 630, 2834, 869, -2207, -1751, 1698]
8177A698P48k847k232J755L116n05l086j117K707K400j605l138n3L440
8191A281
$$ y = [1698, 2446, -401, -2633, -878, 2238, 1733, -1353, -2470, 237, 2637, 1032, -2106, -2159, 1281]
$$ Imaginary data points
##PAGE= N=2
##DATA TABLE= (X++(I..I)), XYDATA
0@%%%Qj6QqJ6k4L2m0M8n6P2q8J04j24J48j76K08k46K88l29L79m41N07n75O52p41
29c94Q37r42J060j190J330j486J658j842K045k273K521k787L087l422L787m193
45b204M653n171N754o425P209q128R226j0576J2270j4469J7465k1797K8648m1177
59b4722P1371k72356l27844N84936K57185l28302l32396K02907K79370o769k09861
70a06481r8233O7189J89698N9380k07754k21941J92855L77191l6902m10065o2045
81b57108L89219J50769l42766k08027K53604K51550j23117k28803j8910J69042
91C5453J63463k4211k40620j43457K09003K41925j70312l17218J06937L70768
101B31731j3965l82299j01405L19730J82768k10154k17339O0485J64173N9363
$$ y = [0, 0, 0, 0, 8, -8, 0, -8, 8, -16, 16, -24, 24, -32, 40, -48, 56, -68, 80, -96, 112, -134, 154, -175, 204, -237, 270, -305, 347, -394, 443, -499, 561, -629, 701, -785, 873, -969, 1076, -1197, 1324, -1463, 1624, -1798, 1989, -2204, 2449, -2722, 3032, -3393, 3816, -4312, 4914, -5662, 6608, -7861, 9604, -12193, 16455, -24722, 46649, -225707, -553551, 31385, 288570, -39732, -372128, -169221, 110149, 103380, -106481, -204714, -137525, 52173, 111553, -96201, -318142, -125287, 251904, 215002, -195063, -257108, 132111, 282880, -59886, -267913, -14309, 237241, 114124, -114679, -133589, 35453, 198916, 174705, -65915, -209372, -369, 241556, 71244, -245974, -139037, 231731, 217766, -164533, -265938, 53792, 236560, 26406, -190933, -130448, 33725, 93088]
111I3088o3466j30335k9762J95398J48666k26365k84602J90348L97377p8546m27192
122b15391n2716L70673J57426k47087j86857J28031J75917k0730j44319r5464
132a30517O2979J93920P4030k27939k20933J90805L27728j09182l68319K4921
142a82507L53925L8802l15721r9313K49391J70213j17780j88991m5166J24340
152a2807J73934O82k26453j28272K19608K33599j76593l08978J16020L63897k6810
163B27827l79254r1071L10882J78613j75001j96715K2787J42184R1954o6482j78132
174a12408k6926K27758J20931k53302k39367K07742L33316j02738l62631k5458
184b33083L10117J11768k21127j56775J14517J63252R29j32738j18298O3454K24485
$$ y = [93088, 29622, -100713, -130475, 64923, 213589, -12776, -297378, -107030, 290347, 211801, -215391, -268107, 102566, 259992, 12905, -173952, -45921, 129996, 109266, -35053, -130517, -67538, 126382, 200412, -27527, -248460, -57655, 270073, 160891, -207428, -182507, 171418, 210220, -105501, -204814, 44577, 214790, 97010, -91981, -137147, -12807, 161127, 161809, -64644, -192916, 26692, 260291, 83698, -225280, -109260, 254637, 227827, -151427, -242498, 68384, 246997, 71996, -124719, -101932, 40252, 132206, 65724, -112408, -139334, 88424, 209355, -43947, -283314, -75572, 257744, 155006, -207625, -233083, 77034, 188802, -32325, -189100, -74583, 88669, 89598, -43140, -161438, -97984, 126501]
195A26501N7871k73189j92649K45323K87726j68574l22222Q7582L21518J034k83917
206a12996q8740K04297J55231q2847j72682n6774J19828J69572j5594k26296r3068
217b00069K39056J88673k23852k73232J70850L29142p8079l30941l1221K63886
227E4213J21504j40782j52335J1458J33677R7248q5345j83876J2678K47745R3894
238B10079k58343k03053K14037K86680j22256l09740K3188K72227N3130j98750
248c2801j00379J08381J32458P510j30001j35174P1877K32485K7686k70229j34185
259b22372K45084K12974j81970k54851J07510K68331k2336k47661o8340J77347
269A3716J36531n8754j47124o8535J03150J71195k3880k28879n6479K55772J34063
$$ y = [126501, 184372, -88817, -281466, -36143, 251583, 83009, -239213, -151631, 169887, 170921, -112996, -201736, 2561, 157792, 74945, -97737, -154511, -34683, 134889, 119295, -107001, -200069, 38987, 227660, 3808, -269424, -98574, 230568, 152489, -178452, -209673, 54213, 175717, 34935, -117400, -105942, 27735, 124983, 39638, -144238, -131560, 116185, 210079, -48264, -251317, -37280, 249400, 127144, -182596, -159408, 112819, 165949, -32801, -133180, -24799, 107659, 115169, -14832, -150006, -78129, 154356, 182042, -88187, -222372, 22712, 235686, 53716, -201135, -93625, 174706, 152370, -95291, -163631, 13716, 150247, 91493, -55631, -124166, -21016, 150179, 126299, -102580, -159059, 96713, 230776]
280B30776k51319k10477K02182K70716j02670k75737j3688K16420J01568j16259
290E1512j42423L664J35931R6065r8597j87009K8939K51828O7201k75263j74867
301b43019K31307K43118j50108k59213N7283K23855J7636j65646q3326Q2678J28140
312H2705J9499j40483j33166R7103K21169j0841k59070q6074K45095J64233j99652
323E18k14406J33736K37140m9748k19370m1821J50967J14855l8847j38945q0424
334a46345J14502J73120n9389k30663p022K57627Q3764k47855j61921J94007K19940
345A89765j01559k29781j235J83468Q1120r8102j20817J24J27763R9061j04374
356B5433j90893M7715K55843L7241k69541j22844K28792J83064j51267j99701
$$ y = [230776, -20543, -231020, -28838, 241878, 139208, -136529, -150217, 66203, 167771, 51512, -90911, -87247, 48684, 144749, 46152, -140857, -111918, 139910, 207111, -68152, -243019, -11712, 231406, 81298, -177915, -120632, 103223, 120859, -44787, -128113, -45435, 82705, 102204, -38279, -171445, -74342, 146827, 135986, -123084, -209158, 35937, 200170, 518, -213888, -80152, 156988, 107240, -112130, -153951, -2984, 111871, 73024, -65921, -146345, -31843, 141277, 81888, -148775, -155797, 101830, 185594, -62261, -224182, -30175, 189765, 88206, -141575, -142810, 40658, 121778, 23676, -97141, -97017, 30746, 129807, 25433, -165460, -117745, 138098, 175339, -94202, -217046, 11746, 194810, 43543, -156158]
366a56158O5611J84653J5534j41398q5892P2581J36908K5222j43913j28174J04979
377e0047K11538k8773k50568n1306K49046J21297k13724j70373J50068J97648
387A64806n6785j80379m2179J15880J17159j8820j46328p9294J32268J59727q7598
398G8457k15735K5465K46189N1733k42810j32102J93609J85299j09487j92025
408a11407J6990J50814N8369q1716j11095k655J37289R2449j34685j80439Q9939
419g6147K40324j2733k54156p2078K18546J34396j53544j67285P5480J67395L322
430A03520j38636p9481P1972J36106K4101j53675j27936J22575K05728o4000k45740
441a45466n595K45938P2043k13161j30831J45527J66266n3129j63639m5717J12356
$$ y = [-156158, -90547, 94106, 109640, -31758, -117650, -45069, 91839, 117061, -26852, -155026, -50047, 161491, 132718, -117850, -169156, 79890, 201187, -12537, -182910, -32842, 164806, 108021, -72358, -114537, 1343, 118502, 99682, -46646, -125940, 6328, 166055, 78457, -137278, -111813, 134376, 186109, -56701, -188803, 4806, 190105, 80618, -111407, -94417, 56397, 114766, 33050, -78045, -80700, 56589, 149038, 14353, -166086, -76147, 164177, 151444, -102712, -174790, 43756, 178152, 24608, -142677, -67197, 100198, 103520, -35116, -114597, -42625, 93481, 117582, -36093, -164029, -41454, 164274, 100274, -145466, -151061, 94877, 166920, -46241, -177072, -31545, 134721, 81592, -82047, -127764, -15408]
452a5408J18595l0729j50315o0268J43626J39489j10131k03121N3241K41343J9093
463A45415k40165r3685J91062J43692j07727j53740J6012J26322O4281p3151j23874
474a05558L322J58230P8675j54996j58736J12269K17404l8036k32798l9551K08131
485D8356J01367j53287j33945Q3818J40874p64j14381p9025N4943J40228L0840
496A19024j60019j15200J40787J80400q9499k12929K6876K17377M1509j89522
506d1196j03182J31868J44037m7722j43218l8883J01336J07397l0620j44705m8364
517a13252J52680J24731j33643j87331Q6554K23815j6388k19344n7127J70866
527C1561J11226r5162j32433J1135J20242O4019q1640j24749J8406J61358O1728
$$ y = [-15408, 103187, 72458, -77857, -138125, 5501, 144990, 34859, -168262, -115021, 126322, 145415, -94750, -188435, 2627, 146319, 38592, -115148, -99136, 27186, 91467, 18316, -105558, -102236, 55994, 134669, -20327, -179063, -66794, 150610, 112574, -120224, -159775, 48356, 149723, -3564, -137509, -53691, 87183, 86419, -27962, -106987, -52044, 88184, 119024, -40995, -156195, -15408, 164992, 75493, -137436, -110560, 106817, 148326, -41196, -144378, -12510, 131527, 83805, -59413, -98296, 3040, 110437, 79817, -64888, -113252, 39428, 164159, 30516, -156815, -70261, 153554, 137166, -82178, -139305, 31561, 142787, 47625, -84808, -73673, 46569, 110588, 28948, -95801, -77395, 83963, 145691]
538A45691j62978j43763J23902K01239o0792k19407q166J98500O6473j49328j06842
549a15471P7301J23770P766j09681r1751O1174J50467J1447j70204q8262J51914
560H470J48396j07267j87927M7125J99153J8640j80164q1660J25740J18914m6348
571F3072j22359l9822Q7087J07909l2105j53116l4454J67052R9681j53156j57723
582a67934J04791J91577l5549j91645l9015J52375R3487q9480j18594J5794J14464
593C0271N6620q2105j19950K4509J62816N0335j70198j22913J41718J74212q5170
604F0145j90038K0753J75013M2276j31044r1863O7601J20335J1874j13555q8258
615a16761P3383J44934n443j67131o5274J58382J28030j23617j69828P1971J86521
$$ y = [145691, -17287, -161050, -37148, 164091, 103299, -116108, -124274, 74226, 140699, -8629, -115471, -38170, 85600, 93366, -16315, -108066, -46892, 103575, 115022, -55182, -143444, 8470, 156866, 49599, -138328, -91203, 107950, 126590, -53574, -135234, -9494, 109420, 63072, -59287, -99109, -12022, 95887, 63782, -89334, -123788, 43264, 142945, -10211, -167934, -63143, 128434, 92885, -98760, -137775, 14600, 108087, 18607, -99987, -84193, 30271, 86891, 4786, -115164, -90655, 72161, 122496, -47702, -170615, -28897, 145315, 60145, -129893, -109140, 65873, 108149, -22895, -114758, -47157, 73178, 85052, -28503, -116761, -43378, 101556, 96113, -71018, -136292, 22090, 150120, 26503, -143325, -71354, 115167]
626A15167n531j67158n6526J14042J01243l6360j12569m3460R4027J10782n0793
637F2864j53513n981J70499P1249j56289j30901J11425J69463m6224j73544k0295
648a01247J42133P2247q6193j01174J5506J04883N8054q3619j24938L6474J67891
659A00017K7305j76075r1111J47225J37961r4173j58736L0919J52702L1963j21278
670a3281q3394O5204J13501P918j09563q2268P4514J38269j7212j67531m5026
681a18869J67030J00791j39966j41712Q7442J58948k0707j46099m7989R8776R6139
692I3784l3164j16371l8938J03013R9603o6756j46918J0224J67211N2617j61004
703c6699j13152J21687J48936o3439j53992j653J25195N6050p4968r4383R970
$$ y = [115167, 109636, -57522, -114048, -6, 101237, 64877, -47692, -91152, 2875, 113657, 62864, -90649, -96630, 73869, 145118, -11171, -142072, -30647, 138816, 92592, -80952, -101247, 40886, 113133, 26940, -74234, -58728, 46155, 104209, 20590, -104348, -67874, 100017, 127322, -48753, -139864, 7361, 145322, 51149, -107587, -76668, 76034, 107997, -13281, -96675, -31471, 82030, 89948, -19615, -101883, -27369, 110900, 93688, -73843, -118869, 48161, 148952, 8986, -132726, -45284, 113664, 92957, -53142, -101131, -2355, 93784, 60620, -55751, -94689, 8324, 107927, 41171, -105747, -95523, 71688, 124305, -36699, -149851, -28164, 120772, 57333, -96659, -98312, 26883, 82933, 7965, -86418, -76448]
714g6448J08830N9630r7247j20852N7013J60172L246j67321o4885J43381J14301
725A19820r7780j40050M1589J41485J8448j13709o9540N9926J03252J1248j06358
736c1669q1457Q2149J36421l6594j63606j6462J64361P0623j36937j13816Q7013
747c9974J37473k0252j30603m2617R4396Q9874l5537j09051l0018J03520R3116
758A10327p3127j41960K6112J68441L2611j62769q6072J26711J21469o8214j29356
769g5827L697J10608N4827p0469r7102J4922J15946M9220j05873j08502O6969
780d1584J48933j1061j61701m6308J45644R3277j07238j19481N2807J23226Q718
791H5232r9255o5414N0772J04110J2855j14076p4755R6012J22990n5556j50529
$$ y = [-76448, 32382, 92012, -5235, -126087, -69074, 91098, 94344, -72977, -137862, 5519, 119820, 22040, -118010, -76421, 65064, 83512, -30197, -99737, -39811, 63441, 74689, -31669, -113126, -30977, 105444, 68850, -94756, -111218, 53143, 123766, -13171, -126987, -39974, 97499, 77247, -53356, -95973, -1577, 88297, 52760, -56291, -86309, 17211, 110327, 37200, -104760, -78648, 89793, 122404, -40365, -126437, 274, 121743, 53529, -75827, -72130, 38478, 93305, 22836, -74266, -59344, 56602, 105822, -51, -108553, -41584, 107349, 96288, -65413, -111721, 33923, 127200, 19962, -99519, -46712, 76514, 85232, -14023, -79437, -28665, 75445, 88300, -25776, -100531, -4519, 118471, 62915, -87614]
802h7614L524J53824N0920j32425r8233Q7631J23143k8870j19539l1340Q5439
813F460P6779l3419j04400k8217J05893Q6511q7920j33762M5399J57301O969j52443
825e4849o2125J17029J00050o4778j17021M582J07330M9995p5400r3151K2541
836f5797J13939M0363j09441j00274P8478J41818l0584j57316k0821J44307O5920
847A00592j07034r7941N2720J09286J0253r4342o8416N5577J07873j30j18795
858e0357n8585J04504J08013o7667j40773J9487J51554L3550j34428p7595R2850
869a9447J04111l4460j02473k6110P7680P6867l3392j07726j7949J17046P1460
880A05607r9343j15547O0691J40818o716j39791m5527J13441Q6071o8379j03405
$$ y = [-87614, -84090, 69734, 120654, -11771, -110004, -22373, 100770, 71900, -47639, -78979, 6460, 83239, 49820, -54580, -82797, 23096, 109607, 21687, -112075, -66676, 90625, 97594, -54849, -116974, 55, 100105, 35327, -81694, -77112, 30218, 80213, 4813, -88338, -65797, 48142, 88505, -20936, -121210, -42732, 99086, 68502, -88814, -109635, 34672, 100592, -6442, -104383, -51663, 57623, 67876, -26466, -94882, -39305, 68568, 68438, -50357, -108942, -4438, 103575, 35908, -104865, -85378, 66176, 99726, -34702, -112297, -19447, 84664, 50204, -52269, -78379, -699, 76168, 42776, -64950, -82899, 34147, 105607, 6264, -109283, -48592, 92226, 85510, -54281, -99808, 13633, 99704, 31325, -72080]
891g2080J4768R8109L9991o9713q4942K2549J12334L5216j13779q8208R0457J25797
903A10499m8219j39489j468J30139M9571r8326q6193N0419J04290O867r5370o0572
915g7852O1854R9045j0450j14799m5506J07473R5782q0140j30378L8053J41131
926H4213J1814j25682n8542Q4877Q8542k9349r6831k9209Q0602P6680m5606j09304
938f7795l027J18307N4890j05129j02360O8785J30070k1288j34222k8320J11597
949B1508O5576p0392q7743J6041Q7580L9529o7974q7464K8064J15426K0791j18651
961c7709o9954R6035J05655n6074j24478P523J21218L9522r6883p6450N3502R4159
973E6066M8q7445n4213N8496R4924j3743j15750l5231J14672P9601r0764j11461
$$ y = [-72080, -57312, 40797, 80788, 11075, -73867, -51318, 61016, 96232, -17547, -105755, -15298, 110499, 62280, -77209, -78677, 51462, 101033, 2707, -83486, -33067, 71223, 78090, -17280, -77852, -15998, 83047, 72597, -42202, -87708, 19765, 115547, 35407, -94971, -56918, 84213, 96027, -29655, -88197, -3320, 85222, 55873, -40958, -70167, 10435, 87115, 41509, -67795, -70822, 47485, 102375, -2754, -105114, -36329, 93741, 72453, -61769, -90089, 21508, 87084, 16692, -71051, -55010, 32570, 72099, 4125, -83339, -55275, 60151, 80942, -37709, -107663, -11628, 94027, 37953, -86525, -79002, 42216, 81738, -15145, -91595, -38093, 56066, 56114, -31331, -85544, -27048, 67876, 54133, -61617, -96848, 17824, 97425, 6661, -104800]
985a04800M9214J23808K054j11661m9931P8237Q3486k9821r4447k1258Q2755O7991
997G5627n0389j01818N435J17071M6138j08623r0354P9884J18311l4957j21754
1008f5429j2140J02303N4100o3380q1141J3707R0704L9398p5753q3581M1221J11083
1020G1092O985j14981n4860R7698R4052o2530j15051J9895J15259K5281r2163
1031i323o2039N0374Q3132L052q2112n4832O1692R4585k5437j15037j7278J13393
1043D0170O0543r1253r4133N2105J10600m825j04492m0302P7305P1365l4626q4556
1055d2099j5568P7022O2589n2427r9749J3809J17407K9843j12644p0619Q4538
1066g898R6976m2700j05623n783R2886M7909o2761p9259J9485Q9734K8602p8884
$$ y = [-104800, -55586, 68222, 70276, -41385, -91316, -13079, 70407, 40586, -53861, -75119, 7636, 75627, 25238, -76580, -71145, 45926, 92064, -16559, -106913, -27029, 91282, 56325, -65429, -77569, 24734, 78834, 15454, -65687, -51980, 38724, 78122, 2369, -81212, -39991, 71092, 78077, -36904, -91764, 5934, 99986, 37456, -77595, -57700, 57559, 82840, -9323, -71362, -20988, 62144, 65196, -16916, -71748, -10056, 84529, 59092, -55945, -73223, 40170, 100713, 9460, -84673, -32568, 78032, 73207, -31285, -71587, 5718, 77083, 42457, -42099, -57667, 19355, 81944, 29517, -70232, -56423, 60984, 90827, -21817, -92436, -7898, 89078, 46378, -59245, -65028, 27858, 75767, 13006, -66253, -46768, 42966, 71568, -7316]
1078g316p3976M6623J03967l123j15175m2039J03321P8474p4813j00768L2539
1089e2286J01651J4334q3427n5697M5779Q1782Q37q7470m7939P1342Q4758l8555
1101C5109j06881m541J09595M8229r2638q3779N9335J01173j5923r7077k7299
1112g4697P2233O0894l1338p9492j5609Q0095O1146o1741r5139K8044J11884J4461
1124G0741j06473n4424Q1336Q4621m2242r6253l13Q8862M0903o1801o9644K1316
1136d3371Q2859K7124p5080p0573N1221J01808j4296j12191k4935J02818O0595
1147H5979p3686q3989L3147R1575J3639p8680n3304M8606P9879o733q5525l7745
1159f6837P2543P6952m3486j01758M766J09831L5656r6635o8688O5240Q6278k1652
$$ y = [-7316, -81292, -34669, 69298, 66175, -49000, -91039, 12282, 90756, 15943, -84825, -52286, 49365, 63699, -19728, -75425, -29646, 52136, 52973, -34497, -82436, -11094, 73664, 35109, -71772, -76313, 33282, 81511, -11127, -94906, -35571, 65602, 49679, -47398, -74697, -2464, 58430, 27092, -52400, -68009, 12086, 73232, 11491, -83648, -55604, 56280, 70741, -35732, -90156, -8820, 75801, 33559, -62694, -63007, 25855, 66758, 4957, -64687, -43371, 39488, 66612, -8468, -79041, -27820, 73988, 59692, -52499, -77434, 25384, 85979, 12293, -71696, -38549, 53026, 66665, -12015, -65319, -16713, 63166, 56433, -29092, -66837, 5706, 82658, 39172, -62586, -57820, 52011, 87667, -8968, -77656, -12416, 73862, 52210]
1171E2210q5961k2285O5901N9456l2420q2159q752Q5639N0069p0241q3925L7166
1183c5302J02782L553j02241m3873Q3079P3326n0798q6319R144Q0725L0457n7383
1195G150o3982J9694Q2046K2928q1438o3580O1728R0771k9343j02375j0462R5112
1207B8249M6807p1962p4623L5412Q5287N449p6824m4505M9567P0310j0798q1529
1219c9160l3205P5193P1087n3559r7309K0046J04232J7815r2352n2197O2141P4550
1231E7282k2295q0236k0180O7789N5665l9931p8221J406Q3834M0389p0832p6628
1243h1958M3492R8505o848j00995k9373Q4705N8568n2923p3926J2283P4039L0562
1255E6131n6476o4260K5806Q4200J2748q3961m9635O6425P9048l4202r3533k508
$$ y = [52210, -33751, -56036, 9865, 69321, 36901, -45258, -54010, 31629, 81698, 11457, -72468, -35302, 67480, 71033, -31208, -75081, 7998, 81324, 30526, -55793, -46649, 34076, 64533, 7150, -56832, -37138, 44908, 67836, -13602, -77182, -15454, 75317, 45974, -56401, -66863, 28249, 75056, 3094, -71529, -36117, 49170, 54619, -22205, -66710, -17143, 53167, 42369, -39160, -72365, 2828, 73915, 20356, -76953, -56907, 47325, 65140, -27212, -79409, -17268, 57282, 34987, -45249, -65429, 2360, 58025, 18094, -60127, -58721, 25113, 65502, -5330, -81958, -38466, 60039, 53191, -47804, -77177, 7528, 66096, 13173, -60753, -48470, 25569, 56131, -345, -64605, -38799, 45401, 58149, -25812, -75447, -9022, 70026, 35824, -57709, -60217]
1267f0217R2503L8464p2807o4483M0617P5952L39o8875l8519M5764O9386j1446
1279D6678q3446k5560Q0686O0324o1063q3690K8920R2690J0034q4094m4467O0165
1291b823O8226k5205p5973j2335O5588M7193l9737p2156L318Q2605L5336p5643
1303a606o8767N3134Q9167k0200r3131j5247P7895M7259m9846o7806J2307P3256
1315C6415K5922o1314n8698L3338P8141K912q1464m1527O8547P2017m3447q9603
1327e8761R793Q9138K3907p2548n1844M0018O6727r80o6537l8374N0134O7072
1339E7745k2707q2605j2563Q0323M6290o3322p3307L3170Q5743J701q2672l4788
1351f6992O2411N7221l0372o6520q256O0305M4473m0555p1768J0330Q3649K3676
$$ y = [-60217, 32286, 70750, -2057, -66540, -25923, 50029, 50368, -18507, -57026, -11262, 58124, 46678, -36768, -62328, 18358, 78682, 17619, -66071, -37151, 55539, 65573, -18521, -62988, -2823, 65403, 40198, -35775, -48110, 17478, 64671, 24934, -47222, -43904, 38701, 74037, -1606, -70373, -17239, 71928, 51728, -41403, -56650, 21245, 68504, 18658, -49148, -36841, 36415, 62337, 1023, -57675, -24337, 53804, 56716, -24748, -66275, 2272, 74289, 30842, -58761, -48968, 40170, 64077, -8471, -60315, -20297, 46430, 45450, -21087, -59461, -9327, 57745, 35038, -47567, -60130, 20193, 66483, 3161, -70146, -36976, 48767, 50468, -32204, -66992, -4581, 52640, 22268, -44252, -52508, 7797, 52270, 11715, -60053, -49723, 33926, 57602]
1363E7602p8910n4194N7676P4722k5265q1226j0251P2684M2160m9961o3288J7810
1375d0441O9118J9288n8655n1503L3938P4479k2q1664l3770P3598O2480n0801
1387A6045p7982J8754P9829J6741o4598m6715L8261O5314k987o7679l1167N4435
1399a749O0108k7490p6065o046P8745M0363o4912o7254M0755Q0277q269p6612
1411b8149k3632N7761M9426k6999o2359q527O1967M2596m6560o7948K0111P9527
1423D7214J3065p5151m4211N6695O7138k8392p6741l486P0965L2746n0015n4195
1435d4368J9078O2047J6985n6153n0108L7234P2228r951q0312k1099P2690M8069
1447F6340n1527o6593K0039P1920J2603o2816m1944M0033N9607r657o3942k4471
$$ y = [57602, -21308, -75502, -17826, 56896, 31631, -49595, -59846, 12838, 54998, 5037, -58251, -40441, 28677, 47965, -10690, -62193, -28255, 46224, 46202, -35462, -69232, 4366, 66846, 16045, -61937, -43183, 36646, 53387, -11211, -57926, -19665, 45649, 42662, -25017, -56184, -1749, 58359, 30869, -45196, -51242, 27503, 67866, 2954, -64300, -23545, 56732, 48463, -28149, -51781, 5980, 55406, 28407, -33952, -42479, 19488, 62084, 15524, -52424, -32313, 47214, 60279, -14872, -59083, -2388, 64750, 36358, -40383, -43869, 27096, 59842, 9827, -44368, -25290, 36757, 53742, -2411, -52519, -15285, 56943, 46992, -33320, -54419, 18271, 66340, 14813, -51780, -31741, 40179, 52782, -10034, -51978, -11945, 47662, 38005, -25937, -50408]
1459e0408N2786N3894l0796p4465J211P9289K8571o9815n4055M5854O7367j4402
1471C5031o7659j9316N3549M6291k9172o2749k601O4182L3364n1126n9291K5333
1483c4164P3840N753p4312l6696O0980N8870l6576o9238O383O4268K4579m6053
1495b366m8934J7734O1788J4816o0461m4195M4976O5181j8605p3527j1292O8826
1507A3941M0303n1259o0226K4973O8149N560o0407l2399L9760N2057r197n9327
1519b8072k2822N4565N1300l6873o9509J1832P4882J7573o5033m2330M3626N9437
1531D8576j3968o3785j5902N4524M1780l2349n7202L581O0282K8550n0041n5026
1543e0980K9692P1309k153p3623k4979O2055M6798l8098n8451P685N8537K3297
$$ y = [-50408, 2378, 56272, 25476, -48989, -47778, 31511, 60082, -9733, -63788, -17934, 49433, 35031, -32628, -51944, 1605, 47896, 18724, -44025, -46626, 17556, 50920, -206, -59497, -34164, 39676, 45429, -28883, -65579, -4599, 54271, 17695, -51543, -45160, 19108, 43687, -2366, -51300, -33566, 28222, 43038, -17423, -61618, -16642, 48539, 29934, -43593, -54885, 13941, 54244, 2985, -57241, -32268, 35881, 41441, -18966, -51365, -11605, 40452, 31255, -28072, -50894, 3671, 54971, 18098, -51411, -39579, 35303, 52876, -12157, -54487, -10861, 48576, 34608, -29177, -45079, 9445, 51225, 18876, -38326, -34745, 25537, 54087, 4046, -50980, -21288, 50021, 47868, -25755, -50734, 11321, 58119, 20021, -38430, -30745, 27792, 51089]
1555E1089m5799m8010K2856O1212O179o0591l4921M6910N7729k3336o9717n298
1567d1697O8807L1772n5250n1518L0594N9445j143n4518k8070L7076N0070j2147
1579C3421o1223j6943N8112M2247m3243o0698J7761O7317J0540o2105l7214M4724
1591g304N4207k0025o0041q283N1438L3080l1251n2233L715N9024K4445n3627
1603f855m9866L6974O3964j2486o6622j5362N6650L8640l6205n4111Q962N7535
1615B1218J8100m7698m1136K6186N5080J587n7416l0051M7932N3212k8850o6563
1627d8399M759O6705K0716n3357m1048L0082N2525r40n2039k6698M0235M8231
1639D0772j8434n8633p967N7430L4102m2972n4586K1343O4879N131o2155k8087
$$ y = [51089, 5290, -42720, -19864, 41348, 47527, -13064, -47985, -1075, 56654, 33318, -36399, -41697, 27110, 58882, 3632, -47886, -17292, 42153, 41010, -13508, -41578, -4502, 45568, 33421, -27802, -44745, 13367, 55614, 12371, -48327, -30566, 36751, 47291, -14814, -52028, -7304, 46903, 26878, -33163, -41446, 9992, 43072, 11821, -40412, -36697, 22327, 46772, -6855, -56721, -19747, 44217, 31731, -34891, -50253, 6397, 45037, 8832, -45279, -36317, 21218, 39318, -8380, -49516, -23330, 31750, 33337, -24079, -54130, -6198, 47014, 18164, -48399, -43640, 23065, 43781, -9576, -50624, -20542, 31983, 31043, -20996, -47694, -7459, 40772, 22338, -36295, -44262, 13168, 47270, 4298, -50288, -28945, 35934, 41065, -21090, -49177]
1651d9177M7625M5235k2909n1416n298M7213L2362l1329n1666Q834O0614J6430
1663D6518n5403l8925L9465N5449j5052o0561j0966N5074L4230l8722m8473J4548
1675b2818N2559J2617m3972l5993K5150N2883q48n8198k4467N2036M5343l5067
1687A9225n7399J1009N8789J4641m8737l6867K9347M9828m481n2484k0057M1424
1699D238M1018k1620n3824m259N5537K9681m7139m9600K8040N9643n288n7701
1711b1274j9110M4188L7712k2339m8889m198M7991K8594l6887m7568J6194N5807
1723C0221Q348n3522l3021M0016N0751k0506n8405l610N4471K4569l9291m0737
1735d0716J5810M6707J0799m2849l5086K8520N1541q266n7769j4596N1489L5806
$$ y = [-49177, -1552, 43683, 20774, -30642, -35940, 11273, 43635, 12306, -39360, -30526, 30088, 46518, -8885, -47810, -8345, 47104, 32052, -28509, -39475, 15599, 49829, 11107, -37366, -22818, 29741, 42358, -1614, -37607, -12457, 40426, 39578, -18620, -43087, 8949, 54292, 19225, -38174, -27165, 31624, 46265, -2472, -39339, -9992, 39836, 35355, -17129, -37186, 4238, 45256, 23636, -30188, -34447, 21090, 50771, 3632, -45968, -17928, 41715, 36427, -21274, -40384, 3804, 41516, 19177, -29712, -33910, 14081, 42675, 5788, -41780, -25586, 30221, 38569, -14953, -47974, -7958, 42793, 22287, -36118, -39728, 14743, 39312, 21, -40716, -24906, 21801, 32600, -10249, -45335, -16815, 34726, 26460, -31309, -45905, 5584, 41390]
1747D1390l5859m9879J3022N4828J0544m8074l1647L2531M4159r224m6610j5966
1759d0785L8957L8166k2010n2939J179N6126K1815m8504l9962L2154N0446q326
1771B6317n0589j5912M1584L5926k3546m6748J403M7343K2489l6572m1234J8338
1783b1201N2542N284n2970k7328M4133M4002k5823n1560L951M8777J9139l5536
1795C410l6822J5904M6355P935m4898k9449L3892M5355j3827n2289q976M9333
1807A5923L0599l6767m6151J8421N1471L418m5970k3502L0858L7984q692m4814
1819a7222j4364M0365L5567k8006m9363Q977N2730J2648m6359l2208L0704M4676
1831C8145j0062m9182j0935M1357K9306k6007m0967M212M2734J8813l6297l8823
$$ y = [41390, 5531, -44348, -31326, 23502, 34046, -14028, -45675, -13144, 31015, 21791, -24819, -40785, -1828, 36338, 14328, -38611, -37432, 18694, 40509, -7995, -47957, -15803, 34643, 26317, -24272, -40184, 1400, 37326, 13780, -32968, -31565, 15778, 38267, 1695, -39539, -21201, 31341, 36625, -16345, -43673, 460, 44462, 18639, -32921, -28970, 19807, 38946, 3410, -33412, -17508, 28847, 36782, -8116, -37565, -3673, 41682, 27855, -24434, -33410, 15923, 46522, 9755, -36396, -17975, 33496, 36914, -9056, -32558, -1700, 36284, 27592, -17222, -31586, 8779, 44346, 16340, -33023, -24046, 28684, 41332, -5027, -37235, -6531, 38145, 28083, -21099, -32034, 9323, 38629, 12622, -28345, -24133, 18601, 37414, 1117, -37706]
1843c7706K1334N0403k359n2784j8240M4247L4214k7824m3539M827M4512J6345
1855C3430l6040l4580J9216M3802J432m3524k3006L3480L9676j6608m9964m145
1867c6831M9792K3440m0286l8110K2844M4422j397m1179k0134K9182L6476j1336
1879A6883m4655q904M2479K8220l1053m2439J3579M8017Q198m4830k7390L3384
1891h511M0509j5399m4521m297L8624K3780k4363l7195N149M2921J6139l8986
1903f150l3510K6965M5139q688m6810j1358M1003K9022k6075m0402Q084M3212
1915B0432J2157l5730k8447K0894L8734l80m0315k0357L4568L7522k0937m6671
1927b8530L456M7704J4863l8308l0074K1789L9459j583l9675j7955L1514L3510
$$ y = [-37706, -16372, 34031, 31672, -21112, -39352, 4895, 39109, 11285, -32254, -27427, 17085, 33430, -2610, -37190, -17974, 25828, 27260, -16264, -39270, -5790, 33886, 17278, -32686, -36831, 12961, 36401, -3885, -41995, -19151, 25271, 23874, -17305, -37439, -8257, 28219, 16883, -27772, -36676, 5803, 34023, 2970, -39469, -25890, 22127, 30325, -14505, -41895, -8511, 31998, 16599, -27922, -32219, 6405, 30185, 5822, -31373, -26224, 16697, 32836, -6150, -39660, -12695, 32444, 23756, -23054, -34412, 6591, 35613, 9538, -30864, -22780, 20432, 32589, -3141, -31588, -10694, 28040, 27660, -12655, -33012, 1556, 39078, 18141, -28530, -25074, 22630, 37493, -815, -30889, -9100, 30359, 28776, -10899, -28854, 2660, 36170]
1939C6170j5928m1393l580M0905K2453l1234l8038J5214M6419K765m5127k0432
1951c1806L5107L3009j7994l8372l070L5801K1883k5480l6582R327M2265R188
1963C3276l9766k6405K7685L9073j1457m3911q337M0473K4262k9401l5789J2339
1975a7958L8298O937l3258k4828J9768L7018k774m1932j5313L7205L0450k5360
1987H253m0512P757M1776J0550l5456k7348K2729L6627n699l8045j2685L0823
1999a230K7636j6765l7534j252L9199J9687l3327l4429K0813M2037l763m1525
2011b0453j3408L1966K8116j7022l5961q11L6047J8680k7745l1985J3418L8495
2023A9337N237l7498k2294K9150L5979j4879m1818j628M0069J7631k9012k9361
$$ y = [36170, 20242, -21151, -24731, 16174, 38627, 7393, -30645, -15431, 30988, 33753, -11374, -31806, 3301, 36310, 18316, -20056, -23126, 12675, 34558, 9078, -27504, -18177, 24088, 33276, -6490, -32895, -5210, 33863, 22406, -21505, -29842, 10631, 34893, 5492, -30297, -17958, 20340, 27277, -5981, -30809, -11041, 25977, 23203, -18729, -34042, 3163, 33613, 8253, -32259, -24502, 17274, 27824, -7632, -34980, -12251, 24376, 18677, -19368, -32053, -1230, 26406, 9641, -27893, -29145, 10054, 29741, -3586, -38015, -17202, 24835, 21072, -20453, -33861, -1895, 26221, 9199, -26762, -27573, 8474, 27154, -591, -32576, -19158, 19337, 24574, -12924, -35218, -6068, 29911, 15032, -26786, -28414, 11655, 29286, 274, -29087]
2035b9087J2920L4833O293l2109k3305K3007L6027q303l9649q560L6310K4754
2047C3131k5260l5451R610L9978P657l5673k2305K4955L1901q037l4032r578K9033
2060E929K5729j7776l6002K115L9825J4068l4754k7088K2360L5839o403l6706
2072a2864j1547L1344K5372j9049l3968L238L4239J3591k6972k7815J3626L6207
2084B5402K600l8079j8394L1531L0301j9093l6811L199L4917J3143k6826k7033
2096b5143J2899L3789L048l3541j8842K5075L0341j1568l6352n532L4748K1087
2108C0009k7357l2834J3849L7075J341l3995j6326K3035K7430q660l2528q373
2120b7334L0436K3160k1649l3466P543L6498P758l2565k2429K2510L2242q455
$$ y = [-29087, -16167, 18666, 24959, -7150, -30455, -7448, 28579, 20276, -19373, -27933, 8377, 33131, 7871, -27580, -17970, 22008, 29665, -6008, -28313, -3358, 28543, 20506, -13526, -23104, 5929, 31658, 13882, -22120, -20005, 19820, 33888, -866, -27954, -5594, 30245, 23842, -12864, -24411, 6933, 32305, 13256, -20712, -17474, 16765, 30356, 3384, -24431, -10805, 25402, 28002, -10077, -28471, 3060, 33361, 14268, -22543, -19344, 15573, 28716, 1890, -25143, -12244, 21545, 24593, -8948, -27790, -2715, 27626, 16058, -20294, -25826, 8922, 30009, 2652, -30182, -16333, 20742, 22083, -11912, -28238, -5203, 22227, 13567, -18961, -27334, 3102, 26262, 4613, -28853, -21310, 15188, 22946, -9619, -32048, -9538, 22704, 14249]
2132A4249l5630o880L1234K0150k0096k9054N302L0825J1783k6691k6199J6971
2144a4036L4940k705l6894j1178L0928K3870j8877l1692M165L2746J1687k6805
2156c851k4121J6106L1000o38l0517j4755K4314K7839j2324l4898j669L5637J5974
2169B8097k8663k6273J6424L1770n24l0371j4007K2461K6367j0174l1684m038
2181b0615L0686J8517k2469k8808R680L3916N617l1991j9307K4772K8753j2040
2193A6711l2392k171K8200J6959j9061k6527N321L0862R618k8798k2356K0347
2205c287L0235o929l2910p568K8722K0605j9689k9397O627L1512P114k7060j9032
2218b1057J5808K6782j894k9395j2957K5280K4825j6011l2471L278L2586R822
$$ y = [14249, -21381, -28261, 2973, 23123, 3027, -26027, -20725, 10100, 21883, -4808, -31007, -14036, 20904, 18199, -18695, -29873, 1055, 24925, 6048, -25644, -21479, 11267, 22954, -3851, -27972, -11866, 19134, 18496, -12021, -26776, -2462, 25377, 13053, -21845, -23514, 12123, 28097, -566, -26839, -10415, 21355, 20831, -9540, -23547, -1086, 25281, 15107, -16577, -20615, 10071, 28588, 6119, -22689, -13009, 20907, 26524, -5467, -24774, -2, 28751, 16711, -15681, -17852, 10348, 27307, 8246, -18281, -12960, 17902, 27520, -1278, -23634, -3287, 26948, 20019, -12891, -20459, 8263, 28868, 9179, -20218, -13591, 17921, 25035, -2025, -21057, -5249, 21533, 19639, -9756, -22713, 2567, 27392, 11381, -21090, -17812, 14774, 24596]
2230B4596k7262k1704J5947K8305k220k9315j2202K3950K2226j3264k8457q85
2242b0285K7947J5166k2757k6215J1504L2310Q65l2404j3177K5223K2671j3339
2254G509k7801j271K6481J4946j9956k5115Q951K9835M484k8622j6829K0407K6452
2267A9471q684l0876m493K9092J7282k1827k5143J0130K7562M145k4584j6716
2279b4641J6289K5591l471k9374q755K6996J9979j8190k7195O268K9435P771k5834
2292e131j8960J7274K6553n199k7350p319K3074J8688j2909k5712N18K7797J2866
2305B4190k4130k2834J5795K8570l029k8742r326K3421J9672j2620k5687N62K6490
2318A2332J1330k0842k0671J0873K6160K162k6290j4686K0822K4561j1313k9305
$$ y = [24596, -2666, -24370, -8423, 19882, 17662, -11653, -23855, 95, 22321, 9057, -19400, -20285, 7662, 22828, 71, -26144, -14640, 17670, 18535, -13869, -27046, -1823, 20848, 7509, -20292, -21563, 4918, 19864, -92, -25207, -16256, 13579, 18063, -10559, -27388, -6981, 19471, 10787, -20089, -24582, 4510, 21792, -35, -25178, -15048, 12514, 16659, -7925, -24641, -8352, 17239, 13768, -15606, -24361, 2635, 22614, 4424, -22771, -16503, 12932, 20703, -5131, -24091, -6817, 19736, 14537, -12813, -20132, 2942, 21630, 8721, -16991, -16473, 11324, 24190, 60, -22774, -6979, 21591, 18562, -10180, -19506, 3915, 23587, 10967, -14720, -14158, 12332, 23662, 2820, -17851, -6978, 19182, 21344, -4946, -19632, 1190, 25751, 14438, -14867]
2330a4867l01K8028J1705k1492k0371J0143K4762L107k4416j5129J8184K3759
2342B3112q158k7474m467K5250J5555j8183k4504P455K8049M161k6188j5039J8797
2355a634K1906p810k4378n748K1577J6829j4238k5286L469K7596P455k4961j7693
2368b2916J6466K4123m798k6605p570K3184J7017j4737k3723L838K4162P639j9717
2381c637j8387J0759K5073k18k6458j1065K2426K0315j4441k4810K855K4695Q823
2394A5930j9643j8460J0769K3903K26k3972j1017J8926J9521q891k4298k661K4450
2407D783J4070j9331k2289J0955K5933j03k3827j0511J7434J9128p337k2972l942
2420a8009K2651J4722j6401k2043P378K5160M031k2575j4672J6423K2630o742
$$ y = [-14867, -15168, 12860, 24565, 3073, -17298, -7155, 17607, 20714, -3702, -18831, -647, 23112, 14954, -12520, -16987, 8263, 23818, 5635, -18869, -11414, 16635, 20796, -5392, -20431, -1634, 20272, 12462, -11916, -17664, 3913, 20742, 6504, -18782, -15313, 12283, 19738, -5223, -22916, -6450, 17673, 12875, -13730, -21300, 1884, 18901, 4164, -19559, -15721, 8441, 16080, -3637, -22024, -11265, 13808, 13590, -12868, -23933, -1507, 18808, 4367, -20443, -17588, 7107, 15930, -3713, -22173, -11404, 12499, 12725, -11247, -22264, -3338, 16183, 7292, -17006, -19667, 4783, 18853, -478, -22767, -11812, 14121, 14018, -9809, -20320, -2886, 16242, 8905, -14067, -18009, 4642, 19364, 2963, -19080, -11702, 13458, 17489, -5086, -19758, -3335, 19295, 12553]
2432A2553k5160l562K3039J3418j5412j9656N108K2147O992j9980j6642J3237
2444c918K3630l369k5311p210K2143J6077j4149k1724L774K3458P109k0434j5828
2457a5752J2769K1342k311k1996q644J7610J8344j0055k4129J64K4794R761k0792
2470A105j7787J2408K1425j633k1767r285J7259J7599r250k2573q75K1701J0567
2483A8894j6669j8926P543K2856K807k3016j2963J8314J9297r950k2508n69K0307
2496E417J0663j4726j8719N578K2105M614k1365j3737J5015K0234o400k2776m606
2509a8703K0874J3769j5244j9967O216K2375L283j9450j2647J2735J8482k688
2521I035k1046p508J8757J6283j2730k1673M048K2634N792j9099j4480J2408J9884
$$ y = [12553, -12607, -16169, 6870, 20288, 4876, -14780, -9672, 12475, 19467, -513, -17155, -3918, 19712, 16343, -8968, -16178, 5965, 22042, 7893, -13831, -10057, 13401, 20510, 76, -15752, -2983, 18359, 16048, -5948, -14592, 3018, 21362, 11307, -12822, -12658, 12136, 21897, 1105, -16682, -4274, 17151, 15518, -6249, -15534, 1725, 19324, 10074, -12499, -13374, 8327, 18894, 2225, -16701, -9158, 13698, 16505, -6511, -19474, -1160, 18137, 8187, -14321, -14890, 5417, 16080, 1354, -17365, -11787, 10318, 14932, -6433, -20170, -5155, 15079, 8679, -14097, -18703, 2171, 15940, 696, -19271, -13055, 9320, 12603, -6847, -19494, -6759, 11723, 9035, -12011, -19519, -762, 15521, 2791, -18882, -14834, 7800, 13592, -5507, -19987, -7579, 12305]
2534A2305k525k1182o993J8262J5049j0915j9469J519J9810R379j6268j7336R841
2547h523K2255p47k2393q052J8526J5220r995j9388N57J9716R340j5165j7003
2560a5652Q241K0865J297j9873j0051J5055J7707o727k1374k282K1195J0758j6212
2573B947j6738Q109J9419J753j7673j0983J2946J7739m576k1253l891J9380J2032
2586A9211j3354j8432N635K0067M407j8678j3174J3545J8324n318j9824l848J6620
2599E181J2051j0446j7698J436J9806P461j8258j4774J1759J9232l746j9986n738
2612a3720J6435J3374r961j8538J559J9275O358j5970j4019Q532J8067Qj8495
2625g095r451J5325J6179r216k0428R25K0012O876j5516j3823P782J7657J100
$$ y = [12305, 9780, -11402, -18395, -133, 14916, 4001, -15468, -13949, 5861, 15240, -1028, -18364, -8523, 13732, 12985, -9408, -17460, 1066, 16286, 6291, -13097, -12540, 7176, 16516, 1351, -15652, -7411, 13454, 14751, -5122, -15173, -118, 17589, 10862, -10512, -12794, 8401, 19159, 2947, -13791, -5682, 13737, 15490, -2183, -13166, -220, 17519, 12943, -8310, -12201, 7179, 19211, 5857, -12575, -6940, 13127, 17534, -1144, -14318, -773, 17551, 12233, -7591, -11439, 5181, 17232, 6786, -10912, -9476, 10330, 17791, -467, -15241, -3482, 15750, 12004, -7982, -13720, 2715, 16089, 6128, -12410, -10851, 8424, 14782, -1188, -15207, -6675, 11392, 11400, -7095, -16546, -1221, 14958, 5742, -14686, -13761, 6251, 13127, -2389, -16212, -8430, 9227, 10327]
2638A0327j7920r785J3868J5588o883j8910j460J7967R954j3484j6700O452J9405
2651H419K154j8584r735J3970J5058o209j7466k524J5957J1362j1319j7007M291
2664a1633J9250M052j7577j0881J2147J6540m138j8363m248J7246J1709j1772
2676B332j6252M380J7156M562j4323j1835Q858J7525j293j8600o404J6672J2944
2689A5722j0696j6736L379J7031N722j4088j2886Q745J7126j045j7218o424J3686
2702B318J3094p098j6808n46J7334Q561j4506j4298Q568J7528r94j7074o555J2749
2716B273J3165o324j6485j864J6496R067j2780j4613O397J6751J895j6318r669
2729a2009J1739J5660n834j7879j567J6229P937j1599j3579M412J5758L310j4599
$$ y = [10327, -7593, -17378, -3510, 12078, 5195, -13715, -15175, 2792, 12746, -738, -17438, -10986, 8419, 10573, -8011, -17746, -3776, 11282, 5073, -12393, -14917, 1040, 12402, 1083, -15924, -11633, 7617, 11669, -5908, -16789, -4642, 11898, 7760, -10603, -14851, 2395, 14104, 2332, -13920, -9540, 7616, 12178, -2145, -13980, -5122, 12403, 11110, -7490, -13894, 2778, 15722, 5026, -11710, -8331, 8700, 14422, 334, -12552, -3807, 13319, 12274, -4944, -11368, 2318, 15412, 8314, -8494, -9040, 8294, 16855, 2349, -11949, -3381, 14147, 13153, -3921, -10476, 2273, 15438, 9114, -7371, -9235, 7261, 16328, 3548, -11065, -4668, 12083, 13978, -2340, -12009, -270, 15390, 9556, -8323, -9890, 6339, 14276, 2677, -10902, -6490, 9268, 12578, -2021]
2742b021j0880J0139J5673m077j7393l673J5054J0491j0531j5087K933J6855M158
2755A1641j5332j0264R813J4223l123j5341n025J2767J1581p629j6478J199J7331
2768E363N494j4750j1674R299J4982k119j5281n975J2796J1865p139j5704R23
2781a1920J5382O184j1920j2448O394J6015O43j5739q228J3866J2612p757j4903
2794a1819P58J4445O699j0477j2595N073J5530K000j5065q202J1473J3130m944
2807F006j4962k239J5278Q420j1040j3513N536J5685J381j3776p607R639J2515
2820A1323k903j4430l859J3841R862r391j4121L764J5177L611j3551r286R016
2833i47J3722k430j5471l845J3504R608q766j2585J426J3973N402j2015j1238
$$ y = [-2021, -12901, -2762, 12911, 8834, -8559, -12232, 2822, 13313, 2782, -12305, -9372, 7483, 11641, -3691, -13955, -4142, 10081, 6958, -8383, -13408, -641, 10940, 3311, -13167, -11968, 5363, 10857, -3893, -15567, -6268, 8714, 6595, -8686, -14661, -1865, 10000, 2861, -12843, -11920, 3462, 9646, -2274, -14722, -8328, 7687, 8330, -7409, -15637, -1771, 10841, 3084, -11819, -11061, 3384, 10083, -394, -12989, -7916, 7614, 9614, -5451, -13653, -2180, 10950, 6006, -8956, -11195, 4083, 12503, 1463, -12050, -6514, 9171, 10552, -3224, -10831, -1192, 11323, 8420, -6010, -9869, 3972, 13834, 4443, -9678, -5914, 9263, 12874, -677, -9963, -947, 12775, 10345, -5126, -8971, 4533, 14141, 5375, -7210, -5784, 8189, 13591, 1576, -9662]
2846i662P267J5215j840j5338m447J2481R933p364j3307P72J3394O091j1603j1443
2860i851O817J3725m04j3552o638J0551J1514n706j4618p33J4788O388j1954j1489
2874a1162O434J3421l1j2865o914R366J1676m259j4246k176J3771P320j0052j2030
2888a1747M073J3904K270j3106q642J0111J2209n214j3580j485J2076P384p756
2901D97j1948K024J3823L814j2935q854Q945J2190l062j3429l219J2097Q662p601
2915A004j2862K089J4084L514j1596q321O829J1985q04j2567n582J1550J0663
2928I986p493j2890J770J3472L831j0484q834O371J1909k76j2473n184J0588R909
2942A0202n666j2134J5J2331N806r518j0397N273J3572J28j3135m926J0236R338
$$ y = [-9662, -2395, 12820, 10980, -4358, -8805, 3676, 13609, 6245, -7062, -6290, 7104, 13195, 1592, -9851, -3034, 10691, 10287, -3265, -9903, 648, 12162, 6456, -8162, -8895, 5893, 12281, 327, -11162, -4728, 8693, 8662, -4203, -11117, -1751, 9925, 5666, -8580, -10756, 3015, 10335, 283, -11747, -7674, 6230, 8500, -4606, -13248, -3137, 9072, 3858, -9722, -11207, 869, 8253, 497, -11451, -9427, 4396, 8210, -4725, -13579, -4634, 7556, 4494, -8935, -12154, -57, 8605, 1004, -11858, -9769, 4315, 7829, -3767, -12088, -5259, 6726, 5922, -6645, -12227, -677, 9986, 2493, -10397, -8627, 4845, 8676, -1808, -10642, -4271, 7638, 7362, -5111, -10295, 293, 10202, 4536, -7598, -7583, 4748, 10554, 1036, -9361, -4088, 9484, 9612, -3523, -8449, 1787, 11125]
2956A1125m791j1657q86J1360O539q202j1428M114J3149J438j1993o516Q558J0643
2970A1453l306j2630k385J2159P047q692j0666L609J1550K182j0173p487O598
2983g41J1425j829j3406l079J1547P919q357j0519K340J1545L118j0285q563P035
2997a850J1271k262j1775l574R702P639n445j1211K94J1761M843j0424r338O572
3011c797J1412j857j1277l948Q881Q314n341j1039o6J1405M688q999r106N096
3025e634J0815M06j1017n901Q671R936m879j2037L22J1208M591q025q500L701
3039f343J0304J748j0686o223P897R933l786j1200j239J0463O239p422r588L148
3053f755J1309J924j0770n931Q208Q749k594j0131k185R040P278o150j0504K059
$$ y = [11125, 6334, -5323, -6209, 5151, 11690, 3488, -7940, -3826, 9323, 10761, -1232, -7748, 810, 11453, 8147, -4483, -6868, 5291, 12338, 3646, -7020, -3411, 8139, 10321, 148, -7339, -741, 10684, 8855, -4551, -7630, 3917, 11836, 3479, -7040, -4700, 6845, 9963, -322, -8885, -1850, 9421, 7159, -4616, -8190, 1512, 9151, 3706, -7505, -7211, 4550, 9393, -1031, -10369, -3797, 7615, 5758, -5519, -9467, -586, 7728, 2387, -8652, -8718, 2687, 7375, -1624, -10730, -5634, 5181, 5587, -5430, -11331, -2660, 7276, 2397, -9640, -9318, 1890, 6481, -1544, -10044, -6343, 3961, 5709, -4977, -11200, -3303, 6630, 2844, -8356, -9595, 868, 7107, -315, -9903, -6755, 4554, 6478, -4292, -10223, -2015, 6734, 4140, -5991, -8176, 864, 8142, 1992, -8512, -6453]
3067f453J2028K270j0086o335O849R509j716j0446k856R159P413o175r605K285
3081d159J0074L214q831o799M515J0776p49j0651m209R749P389n950r777J836
3095c572R490L594p637p621M336R911J63j0382m219P994P745m142r793q35R935
3110D967N384q282q409M563R995m90r383m442O860P745k900j0001j719R563N791
3125I242p371r084L730R727J001r145n533O365Q496k874j0145j580R389M705o249
3140F74p996J971Q974K337q415o715N684R332k163j0106j895Q289N887n506q301
3155g949J181Q897L125q160o452N306Q485j297q899l211P161P205m413r458M55
3170h024R972L595q680n789M557Q398m74q458l586O738P394l868q823o7R217L865
$$ y = [-6453, 5575, 7845, -2241, -8576, -1727, 7782, 6066, -4380, -7236, 1923, 9336, 3161, -6444, -4159, 5915, 9129, 298, -6501, -1986, 8790, 8041, -2610, -6819, 2930, 10319, 4369, -5408, -3572, 5918, 9512, 1875, -5746, -1410, 8501, 8664, -1718, -5937, 2057, 9802, 5660, -4133, -4968, 4967, 10351, 2069, -6340, -1777, 8218, 7728, -1655, -6097, 763, 8508, 5608, -4393, -6112, 3451, 9242, 1871, -7213, -3483, 6244, 7245, -1900, -7433, -1068, 7428, 4554, -5591, -7171, 2218, 6923, 674, -7322, -5351, 3623, 5960, -2455, -9170, -3486, 5846, 3683, -6423, -8318, -29, 5858, 352, -7949, -6768, 2129, 5254, -2906, -9358, -4052, 4433, 3136, -5763, -8974, -1813, 5392, 979, -8479, -8024, 1948, 5543, -3137, -8926, -4369, 4029, 3555, -4903, -8489, -1751, 5643, 1775, -7048, -7115, 2102, 5967]
3186E967o720o715L051Q835P49q683m215P134P315l993q049J09P573M362n636
3201A084p226K697R003J339q824m659O700P448k774q327j154P760N224n785p487
3216d981K529Q517J455p764m345M995P280j516q082k522P536N848n237q252K138
3231b401Q612J851p113n514M457P527j330p880k903P371N282m538p435Q52P793
3246D631K659o282o536M246Q134j001q544k595O753M942l634p152N6P186L579
3261F442o416o313L548P296L18q013l227N555O274l112p920n48P820L702o401
3276i95o263L330P027L96o944m028M889O728k294p963j007P426L916n417o102
3291g301K199P347J281o999m517N028O651k306p370n86O056M208l783o480R39
$$ y = [5967, -753, -7468, -4417, 4418, 5167, -3516, -7731, -597, 6718, 2725, -5324, -5215, 2358, 6720, 1084, -6142, -3445, 5558, 6897, -1927, -6586, 114, 7562, 4788, -3539, -4693, 3067, 8291, 2506, -4981, -2452, 6065, 7520, -244, -4589, 406, 7686, 6170, -1912, -4434, 3102, 8950, 3713, -4539, -2401, 6211, 8062, 949, -4565, -108, 7419, 6089, -1791, -4694, 2677, 7959, 3421, -4014, -3162, 4631, 7290, 1008, -5528, -1282, 6852, 5851, -2693, -5288, 1465, 6407, 2773, -4379, -4323, 2863, 6442, 26, -6287, -2739, 4557, 4875, -3138, -6365, -810, 5464, 2352, -5568, -6116, 1704, 5406, -995, -7258, -3928, 3099, 3495, -3449, -7477, -2588, 4140, 1846, -6117, -7124, 302, 4218, -1199, -7301, -5102, 2245, 3526, -3473, -7990, -2962, 3689, 1383, -5987, -6573, -517, 3691, -92, -6572, -5633]
3306e633P673K085o740n060N148O649k140o564j647N929M844l341o920R70P481
3321B734J976o038m343L714O395j58o790k885N946N496l784o776J244P196J816
3336E743n326m731L108O324J83o209l031N463N307l302o441M72O203L286m944
3351B105n497K512O811L19o758k840N251M715k266o094l15N160M014m354o251
3366c488K386O275J242o761l082M474N086k202o071j206O098L441m490n421J923
3381a796N751J074n190l903L203N788j249o506j564N765L623m221n294J038N579
3396B098J518m718m317L213N575q68o081j727M707L980l073n652K79O314J877
3411C125n135m213L115N685j238n583j792M532M048k186n618j84N870K464m979
$$ y = [-5633, 2040, 4125, -2615, -7675, -2527, 4122, 1982, -4582, -6229, -300, 4544, 1203, -5717, -4747, 2734, 4710, -1328, -5671, -1957, 4438, 4280, -2510, -5395, 551, 6047, 2263, -4513, -3269, 3927, 5743, 417, -4314, -1206, 5118, 5301, -908, -3939, 1524, 6831, 3529, -2912, -2440, 3763, 7049, 2105, -3392, -880, 5931, 6250, -508, -3348, 1903, 6618, 4352, -1742, -2057, 3103, 7117, 2763, -3488, -1102, 5173, 6415, -346, -3428, 1046, 6132, 3930, -2141, -3347, 2751, 6192, 1702, -3719, -1796, 3955, 5029, -161, -4064, -861, 4927, 3678, -2828, -4392, 1373, 4996, 775, -4519, -3481, 2098, 3616, -1102, -5419, -2206, 3369, 2501, -3580, -5307, -600, 3380, 307, -5345, -5066, 1248, 3125, -2010, -6223, -3108, 2577, 1339, -4244, -6036, -1504, 2544, 358, -5260, -5444, 426, 2890, -2089]
3426b089m010K633N325j9n382k402M057M929k483n574L65N306K225m052l945J768
3442c348N047J066m833l226M094M882j990n358l43N096K648l412m107J476N363
3457C055P42m669l058L797M421j452m338j410M264L428k856m924J646N324J201
3472E171n121k689L417M012j017m273j348M044L414k787m804J080M720J318l710
3487A427l671K589M474l67m747j931M331L197k647m136M73M277J487l386l570
3502b200J761M473O9m677j931L519L525k306m135j48M098K220l734l766J980M037
3518B785j43m247j859L234K925j334m164q38M261K473l658l950K260L861Q3l942
3534b253j954K696L532j366m470j31L970J986l167l314J155L878Q72l650k930
$$ y = [-2089, -6099, -3466, 1859, 1840, -3542, -5944, -1887, 3042, 559, -5015, -4650, 656, 2881, -1171, -5116, -3348, 1699, 2765, -2068, -5294, -1200, 3682, 1692, -3666, -4009, 1087, 3735, 323, -3784, -2308, 3055, 3797, -872, -3930, -133, 4288, 2836, -1502, -2912, 1352, 4780, 1924, -3000, -1354, 3970, 5171, 50, -2639, 778, 4790, 3773, -500, -1848, 2196, 5610, 2823, -1981, -901, 3819, 5137, 1427, -2244, 345, 4819, 4452, -295, -2226, 2105, 5302, 2655, -1481, -1008, 3269, 4756, 1370, -2200, -439, 4034, 4103, -574, -2505, 1014, 4539, 2233, -1902, -2050, 2048, 4268, 534, -3232, -1252, 2785, 2642, -1605, -3464, -230, 2695, 1361, -2803, -3641, 620, 3093, -565, -4515, -2255, 1606, 1689, -2253, -4207, -1511, 2021, 655, -3815, -3946, 24, 2010, -1157, -4471, -3316, 562, 1434, -2216, -5146]
3549e146K822L627r52m354m24L683K167k675l129R44L475J309l630k398K610L533
3565A462p53l560j046K881K775j850l607N36M400R43l569k177K411L549j114k909
3581a628j315L001K773j736l670P61L877R87k779k402J949L129N7l871j170L299
3597A262K815k025l153K97L180J336k166k740J084L656J42l460j448K876K670
3612D326j916l110M44L063J376k381k528R61L037J62k903j493K192K502q59l142
3628b69q40L063J756k468k819J539K979k89k582j500K062K071p40l101n59K708
3644A011J208j692k616Q11K488O05k280k039J728K750p83l362l29K744J043j953
3660f66k077N95K243J080k593j885J573K441q82k489n92K320J278j265k534M93
$$ y = [-5146, -2324, 1303, 351, -4003, -4427, -744, 1423, -1252, -4381, -3437, 38, 1347, -2283, -4681, -2071, 1462, 709, -2851, -3897, -1016, 1759, -91, -3698, -3162, 1238, 2181, -1388, -3565, -1154, 2395, 1281, -1628, -2943, 58, 2831, 1095, -2575, -1814, 2063, 3050, 271, -2131, -182, 2947, 3004, -867, -2037, 1262, 4077, 2052, -1101, -804, 2376, 3712, 1546, -1194, -110, 3546, 3688, 228, -1220, 1656, 4326, 2410, -700, -256, 2807, 4183, 1802, -726, 235, 3272, 3434, 531, -962, 1230, 3732, 2873, -269, -1109, 1954, 3710, 1242, -1577, -38, 2941, 2652, 70, -1430, 632, 2703, 1963, -1138, -1697, 1011, 2219, 527, -2089, -1278, 1210, 1815, -465, -2504, -776, 1974, 1191, -2171, -2500, 244, 1287, -666, -2743, -2148, 95, 1175, -1418, -3303, -1730, 711, -171, -2660, -3252, -932, 346, -919, -3453, -2960]
3676b960K639P22k310j876J917J852l77j952r11J790J940j209k598M97K706Q05
3692F75k118j698J424K096j00k191o96J566K082j281k093O66J781J054j750j453
3708b036Q71K340O1k110q22K033J344j141j852N12J654R17j278j605R84K160J51
3725B183k145n32J550J465q83j611P8J689J533k081j544J335J690l49j799l48
3741B31J183J318o66j512m15K051Q98j832j367R58J664m4j681q70J312J692r52
3758A968j738n75K314K25j206j354O66J365K39j381j596J568J432r57j948L67
3774f11J504M20j204j343K51J856k67j384j087J296J330m59j644k83J200Q66j035
3791e94j628O13J700j63j857l91J201Q60n51j300m78J673Q22j070j363R70P77
$$ y = [-2960, -321, 401, -1909, -3785, -1868, -16, -393, -2345, -3256, -1466, 474, -735, -3333, -2836, -130, 675, -1443, -3141, -1717, 379, 279, -1912, -2608, -1042, 1040, -241, -2334, -1668, 113, 1167, -583, -2036, -1165, 1175, 1236, -874, -1696, 337, 1681, 540, -1312, -800, 854, 1771, 493, -1112, -128, 2032, 2183, 38, -494, 1056, 2521, 1638, 27, 105, 1794, 3327, 1246, -298, 1037, 2727, 2378, 579, 231, 1414, 2732, 2066, 554, 139, 2190, 3088, 1256, -111, 847, 2511, 2467, 786, -84, 1228, 2920, 1968, 230, -345, 1969, 2194, 988, -366, 300, 1665, 1904, 523, -1073, 495, 1927, 970, -978, -611, 893, 1313, 109, -1234, -983, 873, 606, -778, -1865, -569, 761, 302, -1342, -1625, -425, 441, -594, -2222, -1609, 91, -72, -1929, -2320, -1119, -259, -810, -2110, -2588, -915, -93, -1163, -2526, -1556, -779]
$$ [...]
##END NTUPLES=NMR FID
##END=
