##TITLE=1H_TG-2235-4
 CDCl3, 8 sc, 
 15.3.2019
##JCAMPDX= 6.0         $$ Bruker NMR JCAMP-DX V2.0
##DATA TYPE= NMR FID
##DATA CLASS= NTUPLES
##ORIGIN= UXNMR, Bruker Analytische Messtechnik GmbH
##OWNER= root
$$ XWIN-NMR		Version 3.5
$$ Fri Mar 15 13:58:21 2019 Russian Standard Time (UT+4h)  she@DPX200
##.OBSERVE FREQUENCY= 200.1315
##.OBSERVE NUCLEUS= ^1H
##.DELAY= (6, 6)
##.ACQUISITION MODE= SIMULTANEOUS
##.ACQUISITION SCHEME= undefined
##.AVERAGES= 8
##.DIGITISER RES= 18
##SPECTROMETER/DATA SYSTEM= spect
##.PULSE SEQUENCE= zg30
##.SOLVENT NAME= CDCl3
##.SHIFT REFERENCE= (INTERNAL, CDCl3, 0, 15.7039)
##AUDIT TRAIL= $$ (NUMBER, WHEN, WHO, WHERE, WHAT)
$$ ##TITLE= Audit trail, XWIN-NMR		Version 3.5
$$ ##JCAMPDX= 5.01
$$ ##ORIGIN= Bruker BioSpin GmbH
$$ ##OWNER= she
$$ F:/spectra/data/she/nmr/H-F/1/audita.txt
$$ ##AUDIT TRAIL=  $$ (NUMBER, WHEN, WHO, WHERE, WHAT)
(   1,<2019-03-15 13:57:04.71 +0400>,<she>,<DPX200>,
      <created by zg, POWCHK disabled, PULCHK disabled
       configuration hash MD5:
       00 E9 B6 7A A2 85 ED C7 34 08 36 98 17 FE 4E 26
       data hash MD5: 16K
       59 5F AE 34 8B 46 B0 D9 79 6C FD DC E3 1B 8A 5B>)
$$ ##END=
$$ 
$$ hash MD5
$$ D8 38 75 57 D0 C0 70 44 AA 73 6C 06 0C 47 29 95
##$RELAX= 
##$RELAX= 
##$RELAX= 
##$RELAX= 
##$RELAX= 
##$RELAX= 
$$ Bruker specific parameters
$$ --------------------------
##$DU= <F:/spectra>
##$EXPNO= 1
##$NAME= <H-F>
##$PROCNO= 1
##$TYPE= <nmr>
##$USER= <she>
##$AMP= (0..31)
100 100 100 100 100 100 100 100 100 100 100 100 100 100 100 100 100 100 
100 100 100 100 100 100 100 100 100 100 100 100 100 100 
##$AQSEQ= 0
##$AQ_mod= 1
##$AUNM= <au_zg>
##$AUTOPOS= <>
##$BF1= 200.13
##$BF2= 200.13
##$BF3= 200.13
##$BF4= 200.13
##$BF5= 200.13
##$BF6= 200.13
##$BF7= 200.13
##$BF8= 200.13
##$BYTORDA= 1
##$CFDGTYP= 0
##$CFRGTYP= 5
##$CHEMSTR= <none>
##$CNST= (0..31)
1 1 145 1 1 1 1 1 1 1 1 1 1 1 1 1 1 1 1 1 1 1 1 1 1 1 1 1 1 1 1 1 
##$CPDPRG= <>
##$CPDPRG1= <>
##$CPDPRG2= <>
##$CPDPRG3= <>
##$CPDPRG4= <mlev>
##$CPDPRG5= <mlev>
##$CPDPRG6= <mlev>
##$CPDPRG7= <mlev>
##$CPDPRG8= <mlev>
##$CPDPRGB= <>
##$CPDPRGT= <>
##$D= (0..31)
0 1.2 0 0 0 0 0 0 0 0 0 0.03 0 0 0 0 0 0 0 0 0 0 0 0 0 0 0 0 0 0 0 0 
##$DATE= 1552643824
##$DBL= (0..7)
120 120 120 120 120 120 120 120 
##$DBP= (0..7)
150 150 150 150 150 150 150 150 
##$DBP07= 0
##$DBPNAM0= <>
##$DBPNAM1= <>
##$DBPNAM2= <>
##$DBPNAM3= <>
##$DBPNAM4= <>
##$DBPNAM5= <>
##$DBPNAM6= <>
##$DBPNAM7= <>
##$DBPOAL= (0..7)
0.5 0.5 0.5 0.5 0.5 0.5 0.5 0.5 
##$DBPOFFS= (0..7)
0 0 0 0 0 0 0 0 
##$DE= 6
##$DECBNUC= <off>
##$DECIM= 24
##$DECNUC= <off>
##$DECSTAT= 4
##$DIGMOD= 1
##$DIGTYP= 9
##$DL= (0..7)
0 120 120 120 120 120 120 120 
##$DP= (0..7)
150 150 150 150 150 150 150 150 
##$DP07= 0
##$DPNAME0= <>
##$DPNAME1= <>
##$DPNAME2= <>
##$DPNAME3= <>
##$DPNAME4= <>
##$DPNAME5= <>
##$DPNAME6= <>
##$DPNAME7= <>
##$DPOAL= (0..7)
0.5 0.5 0.5 0.5 0.5 0.5 0.5 0.5 
##$DPOFFS= (0..7)
0 0 0 0 0 0 0 0 
##$DQDMODE= 0
##$DR= 18
##$DS= 0
##$DSLIST= <SSSSSSSSSSSSSSS>
##$DSPFIRM= 0
$$ [...]
##$SUBNAM2= <"">
##$SUBNAM3= <"">
##$SUBNAM4= <"">
##$SUBNAM5= <"">
##$SUBNAM6= <"">
##$SUBNAM7= <"">
##$SUBNAM8= <"">
##$SUBNAM9= <"">
##$SW= 24.9337058887773
##$SWIBOX= (0..15)
0 0 2 0 0 0 0 0 0 0 0 0 0 0 0 0 
##$SW_h= 4990.01996007984
##$TD= 16384
##$TD0= 1
##$TE= 0
##$TE2= 300
##$TE3= 300
##$TEG= 300
##$TL= (0..7)
0 120 120 120 120 120 120 120 
##$TP= (0..7)
150 150 150 150 150 150 150 150 
##$TP07= 0
##$TPNAME0= <>
##$TPNAME1= <>
##$TPNAME2= <>
##$TPNAME3= <>
##$TPNAME4= <>
##$TPNAME5= <>
##$TPNAME6= <>
##$TPNAME7= <>
##$TPOAL= (0..7)
0.5 0.5 0.5 0.5 0.5 0.5 0.5 0.5 
##$TPOFFS= (0..7)
0 0 0 0 0 0 0 0 
##$TUNHIN= 0
##$TUNHOUT= 0
##$TUNXOUT= 0
##$USERA1= <user>
##$USERA2= <user>
##$USERA3= <user>
##$USERA4= <user>
##$USERA5= <user>
##$V9= 5
##$VALIST= <valist>
##$VCLIST= <CCCCCCCCCCCCCCC>
##$VD= 0
##$VDLIST= <DDDDDDDDDDDDDDD>
##$VPLIST= <PPPPPPPPPPPPPPP>
##$VTLIST= <TTTTTTTTTTTTTTT>
##$WBST= 1024
##$WBSW= 4
##$XGAIN= (0..3)
0 0 0 0 
##$XL= 0
##$YL= 0
##$YMAX_a= 273447
##$YMIN_a= -608273
##$ZGOPTNS= <>
##$ZL1= 120
##$ZL2= 120
##$ZL3= 120
##$ZL4= 120
##$ABSF1= 10
##$ABSF2= 0
##$ABSG= 5
##$ABSL= 3
##$ALPHA= 0
##$AQORDER= 0
##$ASSFAC= 0
##$ASSFACI= 0
##$ASSFACX= 0
##$ASSWID= 0
##$AUNMP= <proc_1d>
##$AZFE= 0.1
##$AZFW= 0.1
##$BCFW= 1
##$BC_mod= 2
##$BYTORDP= 1
##$COROFFS= 0
##$CY= 11.3945322036743
##$DATMOD= 1
##$DC= 2
##$DFILT= <>
##$DTYPP= 0
##$F1P= 18.9103706918063
##$F2P= -1.10871071338519
##$FCOR= 0.5
##$FTSIZE= 0
##$FT_mod= 4
##$GAMMA= 1
##$GB= 0.15
##$INTBC= 1
##$INTSCL= 1
##$ISEN= 128
##$LB= 0.24
##$LEV0= 0
##$LPBIN= 0
##$MAXI= 10000
##$MC2= 0
##$MEAN= 0
##$ME_mod= 0
##$MI= 1.114404
##$NCOEF= 0
##$NC_proc= 0
##$NLEV= 6
##$NOISF1= 3.799351
##$NOISF2= 2.8
##$NSP= 1
##$NTH_PI= 0
##$NZP= 0
##$OFFSET= 15.70392
##$PC= 1
##$PHC0= -9231.64
##$PHC1= 13.20026
##$PH_mod= 1
##$PKNL= yes
##$PPARMOD= 0
##$PSCAL= 0
##$PSIGN= 0
##$REVERSE= no
##$SF= 200.130013532006
##$SI= 16384
##$SIGF1= 3
##$SIGF2= 2
##$SINO= 400
##$SIOLD= 16384
##$SREGLST= <1H.CDCl3>
##$SSB= 0
##$STSI= 0
##$STSR= 0
##$SW_p= 3612.71676300578
##$SYMM= 0
##$S_DEV= 0
##$TDeff= 0
##$TDoff= 0
##$TI= <>
##$TILT= no
##$TM1= 0
##$TM2= 0
##$TOPLEV= 0
##$USERP1= <user>
##$USERP2= <user>
##$USERP3= <user>
##$USERP4= <user>
##$USERP5= <user>
##$WDW= 1
##$XDIM= 8192
##$YMAX_p= 0
##$YMIN_p= 0
$$ End of Bruker specific parameters
$$ ---------------------------------
##NTUPLES= NMR FID
##VAR_NAME=  TIME,          FID/REAL,        FID/IMAG
##SYMBOL=    X,             R,               I
##VAR_TYPE=  INDEPENDENT,   DEPENDENT,       DEPENDENT
##VAR_FORM=  AFFN,          ASDF,            ASDF
##VAR_DIM=   8192,          8192,            8192
##UNITS=     SECONDS,       ARBITRARY UNITS, ARBITRARY UNITS
##FACTOR=    0.0002004,     1,               1
##FIRST=     0,             0,               0
##LAST=      1.6414764,     0,               0
##MIN=       0,             -608273,         0
##MAX=       1.6414764,     273447,          0
$$ Real data points
##PAGE= N=1
##DATA TABLE= (X++(R..R)), XYDATA
0 0 0 0 0 0 8 -8 8 -8 16 -24 24 -32 40 -48 61 -72 88 -104 124 -144 169 -200 230 -264 303 -351 399 -454
28 -454 515 -583 658 -739 827 -926 1034 -1153 1281 -1424 1582 -1752 1940 -2150 2380 -2635
44 -2635 2918 -3234 3595 -4003 4469 -5009 5647 -6410 7338 -8507 10020 -12073 15031 -19688
58 -19688 28159 -48562 201485 76972 -233609 140009 183290 -63949 -83331 191737 105592
69 105592 -130028 -53780 153277 -13959 -207402 -66907 49424 -240999 -423186 -141108
79 -141108 127157 -16309 -133877 5251 -65 -235731 -204622 57594 33396 -201041 -136953
90 -136953 76633 23205 -70432 132282 273447 43385 -158939 -32676 63935 -49013 -19982
101 -19982 192552 154541 -97462 -56312 210591 155290 -128317 -98082 105307 -33098 -273509
112 -273509 -97913 193342 92410 -99161 15974 89419 -140788 -223180 30646 109392
122 109392 -134410 -185077 49686 89270 -76174 -4082 200579 72068 -207765 -135653 96311
133 96311 12234 -156679 13477 217455 55849 -126635 15149 114623 -67918 -128729 53236
144 53236 27279 -212232 -156299 133683 124538 -100878 -61669 101509 -33061 -236809 -100085
155 -100085 105659 -7380 -151445 10407 152243 -9161 -102393 103813 185261 -47335
165 -47335 -144032 43524 92167 -45534 34660 248622 164174 -61164 5128 173882 73081
176 73081 -61676 67767 161990 -19904 -117102 94030 229716 70948 -33419 68107
186 68107 46077 -140463 -112031 109063 99705 -87492 -48603 106068 12612 -123732 29963
197 29963 169069 -31494 -211528 -58760 75555 -40667 -60568 134722 141876 -99745 -146912
208 -146912 53080 79936 -88235 -74069 76364 8467 -150188 -37316 157957 61482 -114268
219 -114268 -36477 46247 -117124 -192501 20207 117232 -78123 -153278 19160 48612 -113114
230 -113114 -96863 59566 -7132 -192682 -132429 45041 4086 -104364 -1125 102764 -42876
241 -42876 -169979 -31804 78126 -54727 -121656 31782 65763 -100543 -91836 109706 105042
252 105042 -83685 -75023 58277 -14601 -140956 -19336 134946 30384 -98592 2234
262 2234 88837 -35445 -99142 44813 91365 -75210 -122114 41281 78803 -56165 -30466
273 -30466 126888 66109 -123715 -77465 82096 25380 -80471 32593 125365 -24608 -116898
284 -116898 48400 147211 3809 -74763 38107 55085 -73951 -47696 124912 117144 -40822
295 -40822 -25428 103585 45202 -79466 19636 158116 45952 -91785 16896 129908 33774
306 33774 -9144 127270 132646 -57425 -85356 96113 136212 9101 13521 117290 57979
317 57979 -61584 19946 157069 80434 -50980 7643 84240 -16996 -69897 85640 158908
328 158908 -5385 -94722 24034 55893 -61390 -38874 100475 48440 -114832 -73951 68470
339 68470 27638 -69972 3391 73318 -53022 -149263 -23783 84072 -8680 -76361 16528
350 16528 34635 -93853 -93407 65003 67589 -91535 -89922 46196 13891 -105936 -32606 96386
362 96386 14677 -109929 -42598 34077 -47788 -80585 40585 65543 -80334 -118048 18721
373 18721 53643 -61777 -69044 37949 6028 -121320 -77406 58766 20664 -85264 -24279
384 -24279 49690 -58421 -134182 -3984 79996 -33831 -89868 12109 22725 -89792 -63952
395 -63952 80431 62421 -80958 -76068 32538 7893 -68853 10628 110994 18514 -99629
406 -99629 -22631 75589 4147 -46825 59216 89001 -49244 -81093 60634 97009 -9170
417 -9170 -7430 78678 20360 -88917 -15155 115038 66236 -36636 7868 68019 -10622 -57951
429 -57951 55841 118596 173 -75588 15660 61974 -14352 -764 107579 68298 -73746
440 -73746 -49452 76747 49941 -37218 27164 101160 1403 -84285 18384 110308 32536 -31150
452 -31150 29971 38061 -59218 -53699 78817 96752 -23652 -46411 36426 12946 -72186 -12175
464 -12175 90234 16693 -96252 -36984 45995 -15280 -53575 43406 65100 -63805 -105140
475 -105140 2536 34440 -43993 -32231 54638 18162 -86719 -50855 57151 27716 -60830
486 -60830 -22144 40602 -33766 -94114 9127 87297 -6007 -70896 8177 26816 -75213 -73387
498 -73387 45471 42599 -72603 -69362 21939 1343 -69153 -18233 51961 -23221 -114455 -56216
510 -56216 23388 -23520 -62503 14053 42121 -62188 -99067 7089 43517 -43678 -51819 27812
522 27812 -597 -87010 -28134 84765 46154 -44323 -10648 35170 -30998 -61826 40319 94732
534 94732 5444 -47154 24511 55216 -8737 -967 86708 64262 -51407 -44399 62285 61959
546 61959 -2671 44004 105370 22676 -58142 19351 94958 30236 -14655 51330 63535 -21445
558 -21445 -18346 88125 99104 1143 -19577 40680 22434 -40341 6524 90974 43718 -46690
570 -46690 -9847 56720 6551 -39204 29338 55560 -45356 -82173 15897 54039 -15415 -16992
582 -16992 51064 19488 -69132 -39901 49372 28946 -37799 -5737 46760 -1308 -44431 29667
594 29667 87925 15057 -46799 8090 37087 -28664 -28661 66228 69448 -27618 -32380 41413 19995
607 19995 -48548 -9118 50466 -12294 -84625 -30219 32827 -11146 -48303 3375 16297 -67700
619 -67700 -97291 -19516 8122 -56767 -61320 8135 -7035 -84326 -53818 33319 1998 -79355
631 -79355 -49623 5193 -41879 -73305 7355 53147 -21619 -63548 -4200 13686 -45027 -42448
643 -42448 27290 15529 -64484 -55892 25604 25619 -32740 -13841 29973 -26209 -89500 -29301 41122
656 41122 -4605 -46561 8621 27976 -41714 -45680 42187 51885 -28445 -39634 19629 14287 -23882
669 -23882 22817 89096 48206 -24657 1255 56127 26219 -6515 47328 77329 6863 -26371
681 -26371 48882 84062 22005 6999 58133 32895 -44471 -18721 62717 44971 -16695 7118
693 7118 45240 -1216 -38806 17488 54568 -7013 -50139 -152 30601 -12338 -13543 53971
705 53971 54013 -25714 -33393 34910 32002 -21967 7231 62874 19013 -36250 16004 72838 26894
718 26894 -13909 25921 35795 -28304 -39537 32600 53164 -5400 -19636 23260 9962 -47587
730 -47587 -29127 32873 7769 -60852 -42338 9784 -18067 -49495 5856 38675 -30190 -72078
742 -72078 -18406 5939 -39200 -32228 29648 19340 -46334 -36453 26520 22197 -23692 -8816 22720
755 22720 -16471 -57935 -8056 48887 13256 -30434 2119 17204 -40488 -53016 14225 23683
767 23683 -44988 -54872 -2811 -11368 -53387 -19867 28015 -18006 -81460 -53837 -6617 -27120
779 -27120 -45702 -2031 16485 -39127 -61768 -1765 29893 -13921 -26536 16487 6244 -46248
791 -46248 -15903 62906 53181 -5402 8502 43391 5522 -20679 39462 77600 23853 -13210
803 -13210 28181 50390 14818 16101 65251 56090 -12434 -23307 31530 39261 2612 20553 59951
816 59951 21525 -34524 173 52557 20497 -17530 17135 32361 -18601 -27328 37143 55432
828 55432 3412 -10592 20804 9673 -27295 -3727 45211 27431 -19863 -6518 28874 8296
840 8296 -15953 20958 43467 -10969 -44570 1532 27902 -8938 -8896 37814 21529 -41460 -31839
853 -31839 23585 14179 -24316 -5187 20202 -18068 -46573 827 41830 5771 -30116 -5310
865 -5310 5003 -36619 -39423 22493 36724 -21825 -38041 5385 1730 -38470 -13466 33988 -1908
878 -1908 -59223 -35264 7789 -11795 -27997 9022 16991 -39419 -62932 -17050 6899 -24460
890 -24460 -32238 -1319 -10960 -55505 -42273 15190 10264 -39294 -35390 -5138 -29789 -54431 -6591
903 -6591 31173 -10689 -43828 -10659 4424 -28104 -22857 23458 17089 -34191 -34533 11071 17308
916 17308 -6341 8237 33219 1888 -36891 -7231 37584 19463 -7235 19183 32777 -8840
928 -8840 -17577 36089 50405 4036 -5016 27118 14210 -17395 14176 61090 36189 -9053 5085
941 5085 31668 10510 -5189 30882 50162 7723 -19191 17910 40140 9838 4293 42537
953 42537 33629 -21456 -17342 35787 33617 -3661 12650 41854 8384 -25134 11015 44364 13672
966 13672 -12413 11723 21796 -9277 -12279 30146 39467 -2521 -17595 10554 11012 -17063 -2035
979 -2035 34847 12355 -30244 -11512 23652 2788 -18546 11799 20944 -24366 -39848 2438
991 2438 18141 -10587 -12272 12753 -3257 -40404 -25797 15965 8265 -27849 -22346 324 -19206
1004 -19206 -38873 -2828 26029 -12902 -46624 -18103 -1300 -32675 -31711 12774 9424 -39446
1016 -39446 -40179 -981 -4773 -30564 -13508 8967 -19797 -50064 -22707 11744 -4097 -25132
1028 -25132 -5539 4683 -28335 -39311 2065 18192 -18351 -27884 4833 2533 -28776 -9933
1040 -9933 28948 8328 -31145 -14762 13393 -4627 -16768 14739 28529 -6903 -22926 8547
1052 8547 23543 -811 -5312 21748 18108 -17107 -11490 31384 32113 -1225 5593 29726 6404
1065 6404 -19178 14094 44759 15599 -8190 18562 29103 -190 753 37290 36912 -1745 -6145
1078 -6145 21213 20346 241 14749 42163 22310 -13482 818 31413 15772 -5581 18444
1090 18444 32674 -3188 -17896 21364 35658 2501 -2948 24025 12200 -21032 -5588 31104
1102 31104 20091 -10150 -541 18536 606 -15710 9666 28770 -1384 -26501 -3083 14928
1114 14928 -7399 -12219 18691 15773 -27177 -29293 8119 5907 -22546 -10338 11308 -14863 -40868
1127 -40868 -12551 14508 -6891 -27199 -11682 -7343 -33232 -34873 248 10896 -20645 -32581
1139 -32581 -9835 -9330 -33542 -20346 12638 -3218 -41441 -28274 2090 -11287 -25339 2488
1151 2488 13066 -23871 -39223 -7199 6304 -15602 -15438 7538 -387 -29793 -21236 12292 10656
1164 10656 -16838 -13652 5721 -9232 -28492 -786 27612 2470 -23011 -598 13104 -12751
1176 -12751 -13991 21599 21526 -15586 -15711 15247 14508 -4845 9441 29413 8233 -18732 -1358
1189 -1358 25812 16355 684 16968 26935 -877 -12407 20972 37091 8524 -1997 21329
1201 21329 16976 -10982 5113 41876 29458 -3266 5477 23173 5866 -4509 23665 38234
1213 38234 10034 -7827 11633 24249 8349 6894 30923 26586 -8808 -11703 21387 25627 2073
1226 2073 10284 30389 6956 -21043 3264 31050 9721 -9926 8659 12912 -13714 -14992 18648
1239 18648 22811 -7388 -15999 956 -1486 -20013 -7800 18662 6164 -26530 -19658 5775 -3770
1252 -3770 -20150 166 11777 -21365 -39216 -7946 9013 -13406 -16688 4549 -7128 -37220
1264 -37220 -27201 3954 -335 -23082 -18459 -5814 -20844 -34236 -10689 10667 -9851 -33761
1276 -33761 -20237 -8177 -26702 -27298 5462 8703 -26735 -32131 -3275 -3597 -23605 -8273 13790
1289 13790 -7485 -32540 -12779 11788 758 -9764 7066 11563 -13389 -21986 5608 20169
1301 20169 81 -8113 11920 9995 -15142 -6674 25650 18489 -12885 -6491 14657 -239 -13603
1314 -13603 13761 29202 1397 -15591 5609 14766 -2811 -1725 21125 17618 -9781 -9258 18231
1327 18231 22096 4065 8727 25876 9778 -14143 5525 34966 20929 1458 18687 26977
1339 26977 1135 -2865 29876 35318 5912 552 19702 14593 -2183 12191 35173 21517 -5901
1352 -5901 -986 16647 8203 -3950 13244 25272 231 -17644 5119 20718 252 -5671 15723
1365 15723 9205 -21299 -14708 16800 12083 -10272 -2055 12017 -6264 -20828 103 16174 -2743
1378 -2743 -19588 -5896 2938 -13160 -16612 7292 10346 -19129 -28024 -3893 -2605 -24084 -15766
1391 -15766 6914 -9227 -36470 -20191 3691 -11273 -26219 -8895 -3738 -28259 -33349 -6815
1403 -6815 3443 -15595 -20812 -5194 -7158 -26495 -20150 6251 2947 -21887 -17998 2999 -5923
1416 -5923 -20944 150 18311 -6348 -24741 -2829 8437 -11144 -11095 13911 10209 -15950 -13458
1429 -13458 9572 7718 -9309 -2694 11593 -975 -18483 -3551 18629 7639 -9742 3442
1441 3442 14813 -5447 -13652 13729 22804 -3097 -8112 16201 14858 -5005 6036 28830 15231
1454 15231 -7471 3401 21697 12413 2734 18443 27433 8153 -4187 15007 28332 11428
1466 11428 2653 20304 20602 -3345 -704 28482 26521 859 4426 21639 7184 -9022 11658
1479 11658 28493 7571 -7519 8049 15993 259 -1525 17861 17973 -6151 -11441 8502 12921
1492 12921 -4118 -825 17817 6982 -17441 -6816 16457 4203 -14138 864 10813 -11836
1504 -11836 -19191 6215 12951 -10321 -15991 482 -3211 -20640 -13409 6158 -468 -21915 -18064
1517 -18064 -1355 -7606 -21526 -9637 3901 -14976 -32814 -13498 2027 -14697 -21703 -1065
1529 -1065 -1551 -27828 -25792 729 -1234 -20665 -14647 -223 -12227 -25699 -9131 8391 -3811
1542 -3811 -19588 -10176 -710 -13276 -18926 2386 11299 -10885 -20446 437 4225 -14330 -8432
1555 -8432 13811 3137 -20850 -10041 11111 1854 -9483 5897 13850 -6683 -15536 4148 15098
1568 15098 1198 -4359 9653 10974 -6695 -4801 18671 19827 -2336 -2436 15809 8949 -6197
1581 -6197 10982 29703 11173 -6739 9925 21118 5193 2561 23364 22512 -962 -2230 17946
1594 17946 20839 7267 9839 22234 12465 -5988 3112 24910 18701 881 9346 20347 2388
1607 2388 -7512 16011 27012 4022 -5682 11370 10860 -6370 1576 22967 14517 -7855 -4844
1620 -4844 9777 3276 -6379 5613 16123 -246 -16468 -3239 11088 -457 -9128 5344 6808
1633 6808 -16599 -19885 5081 7906 -12297 -10287 5059 -7463 -23841 -8807 8471 -5226 -19978
1646 -19978 -9953 -2930 -15422 -18480 -1032 4474 -14475 -24197 -9247 -3715 -17454 -15376 3370
1659 3370 -2786 -26111 -20378 1296 -4781 -19347 -6655 3255 -17231 -27619 -6144 6047 -9095
1672 -9095 -14264 -1329 -3252 -19910 -15983 4625 5737 -11862 -12811 743 -3134 -15580 -2726
1685 -2726 15502 2349 -17520 -6485 8126 -4246 -9266 11806 16109 -8112 -12502 8475 10819
1698 10819 -2780 2221 16015 6414 -9822 -562 17430 13257 1047 7378 15968 3437 -6824
1711 -6824 10652 24925 8723 -2202 12844 16585 -253 2939 24920 20495 -2137 1530 17672
1724 17672 11444 1026 14497 24419 8727 -4050 7771 18715 9507 3124 14425 16737 -1024
1737 -1024 -5193 14311 20564 2955 828 14853 7209 -10885 992 20552 9191 -7642 2751
1750 2751 10634 -3739 -8747 9098 14033 -4589 -12090 414 3746 -7910 -5543 8958 4776
1763 4776 -14840 -14086 2730 74 -14202 -6144 6556 -8370 -23426 -6921 6628 -8616 -16689
1776 -16689 -2372 -2513 -20284 -18703 499 -89 -15608 -14415 -3070 -8649 -19816 -11590 2479
1789 2479 -6099 -21835 -14408 -1427 -9825 -18550 -3439 3663 -15490 -23069 -3917 863 -14665
1802 -14665 -12162 3378 -3586 -20105 -11380 5273 -426 -12060 -4445 2757 -7720 -14481 -511
1815 -511 10797 -636 -10193 858 6759 -6701 -7601 11474 12547 -7291 -6466 10862 6977 -5493
1829 -5493 5712 18923 4973 -8188 5042 15488 5052 488 13016 15294 1044 -1610 13842
1842 13842 18214 4870 2319 15300 13232 -1677 3978 22118 15951 -890 6462 18932 7535
1855 7535 -1517 14177 21373 4497 -1714 12796 15611 3309 4593 16741 12531 -2474 -154
1868 -154 13444 11723 -3 4050 13701 4784 -7551 3417 16292 4205 -7175 4861 9697
1881 9697 -6258 -7621 10736 10380 -7825 -7211 5244 157 -10996 -2974 7993 -1324 -13470 -7149
1895 -7149 2667 -4156 -12122 -2634 3358 -10654 -18820 -4250 2849 -11467 -14743 -399 -3231 -19913
1909 -19913 -14874 2347 -4150 -18282 -10655 -1302 -11772 -18329 -5636 1386 -10409 -18165 -8375
1922 -8375 -3470 -12470 -14248 -1077 79 -15233 -17215 -1522 -639 -13479 -9010 3929 -5871 -19093
1936 -19093 -7288 6312 -3839 -11473 -414 2472 -10747 -11684 4065 6986 -5119 -6706 2818
1949 2818 2432 -6889 -1827 11467 8204 -6312 -2856 9662 4380 -3939 8272 17487 2608 -6086
1963 -6086 8373 14796 2444 2351 15739 12081 -2260 1912 15821 13896 3620 7359 14508 7629
1977 7629 -1088 8176 19156 11327 560 8236 15131 4146 642 15424 18431 1268 -1336 12544
1991 12544 11674 -102 6496 18304 8424 -4390 2904 12930 6331 402 7929 10900 -130 -5879
2005 -5879 5402 12610 2587 -3139 5791 5207 -8076 -6223 9710 7933 -7283 -5025 5124 -3193
2019 -3193 -11558 686 8493 -4616 -12921 -4152 -155 -8484 -8007 2567 1458 -12031 -14499 -3690
2033 -3690 -1794 -10662 -8996 454 -5460 -18547 -11540 1838 -4706 -15318 -6765 -1831 -14920 -18490
2047 -18490 -3107 1020 -11952 -14006 -4716 -7138 -16332 -10528 471 -3426 -14783 -13145 -3490 -5784
2061 -5784 -12245 -4362 3792 -6274 -16954 -6287 2923 -5804 -8628 3362 3082 -11153 -9522 5890
2075 5890 5431 -4792 -887 5906 -1326 -7760 1841 11878 6103 -1678 2719 7574 723 -2027 9540
2090 9540 14844 2716 -3064 8006 10848 752 4567 17049 10816 -3038 2251 13401 8209
2103 8209 2540 11510 15033 3552 -988 9431 14564 7144 4399 10917 10486 1342 1658 13941 14973
2118 14973 3307 3156 12082 7531 -1827 6757 17105 7085 -2711 5806 11199 1659 645 11635
2132 11635 10688 -2175 -3123 5816 6387 -302 1249 8138 3133 -7189 -4134 6472 3351 -5750 -1787
2147 -1787 4297 -5426 -11779 77 6477 -4938 -9544 -860 -2263 -12523 -8720 2650 -1206 -11765
2161 -11765 -9501 -3186 -6898 -11447 -5676 -39 -7405 -15450 -10050 -2660 -8200 -12105 -3948 -1719 -13605
2176 -13605 -16356 -4055 -2356 -12648 -10247 -1592 -7907 -16543 -8583 445 -5915 -12254 -5972 -3121
2190 -3121 -9796 -11586 -2676 1315 -6424 -10429 -2905 235 -6702 -6481 3896 2216 -9133 -6447 4998
2205 4998 2011 -5746 1742 8435 -1456 -7203 3157 8740 1087 -846 6873 6206 -1529 -178 9381
2220 9381 10107 2463 2009 8384 7105 309 4686 14452 9437 7 5305 12652 5461 1846 11857
2235 11857 14413 3265 1216 11338 11073 3683 6532 13035 8726 1313 4905 11748 9452 3372
2249 3372 6208 10903 5834 17 6642 12865 5168 -874 6981 8833 -368 -213 10081 7848 -2629
2264 -2629 -128 7290 2775 -2914 2763 6847 -105 -5360 26 4330 -355 -4112 391 2341 -5408
2279 -5408 -8082 232 2872 -5637 -7554 406 -2397 -11605 -6560 2514 -3520 -12040 -6187 -2173 -8701
2294 -8701 -11250 -3166 -1710 -9937 -12081 -6076 -4974 -9873 -9717 -3802 -4720 -12340 -11760 -3481 -4242 -11512
2310 -11512 -8804 -1883 -7707 -14283 -6051 230 -7360 -10963 -3336 -2775 -9791 -8424 91 -1127 -7913
2325 -7913 -6893 -1364 -2212 -5982 -2814 2580 -507 -7217 -3498 3630 553 -4011 2113 6191 -2031
2340 -2031 -4966 4986 7495 -483 208 7243 4206 -2297 2420 10013 6833 1525 4894 7815 4128
2355 4128 1948 7337 11646 6437 1551 5945 10163 4825 3593 11360 11803 2266 2241 11096 9634 3295
2371 3295 7560 12912 6237 609 7481 11493 6244 4042 7921 8630 2917 2218 8386 10039 4297
2386 4297 1397 5843 5821 27 1472 9089 6077 -2749 179 5868 1607 -2852 4166 6117 -2665
2401 -2665 -5618 764 1874 -2782 -1968 2109 -554 -6604 -5387 -259 -416 -4781 -4973 -1667 -4834 -9915
2417 -9915 -5511 1520 -3643 -9943 -5633 -3268 -10022 -10315 -1424 -1779 -10154 -9986 -4483 -6674 -10255 -6007
2433 -6007 -2205 -6629 -11867 -9304 -4833 -5903 -8127 -5164 -3019 -7997 -11974 -5533 -1211 -6429 -8097
2448 -8097 -2099 -3184 -10349 -7220 1098 -707 -6935 -4431 -684 -5065 -6485 -311 2946 -1596 -4302
2463 -4302 -1239 692 -1466 -1492 3640 4499 -1653 -3745 3131 4995 259 2202 7866 3337 -2927 2489
2479 2489 8714 4558 2307 7259 7321 1317 1861 8733 9646 5396 4951 6943 6233 3568 5662 10646
2495 10646 10218 4200 3807 8600 6974 3367 8183 12351 5802 1058 6691 9024 4147 4578 10715
2510 10715 7532 819 2720 7584 6601 3595 5091 6362 3306 -128 2662 6827 4885 -25 1620
2525 1620 3864 -475 -2593 3562 5496 -1785 -3917 1142 136 -5356 -1460 2858 -1864 -7051 -4345
2540 -4345 -1401 -3889 -4768 -2230 -1891 -6515 -8546 -5377 -2470 -5020 -7160 -4250 -4025 -9693 -9651 -2744
2556 -2744 -3104 -8843 -7320 -3775 -7899 -11241 -5023 -1665 -7020 -9099 -5571 -5650 -8538 -6946 -2954 -3299
2572 -3299 -7249 -8085 -5102 -3659 -6291 -5238 -1223 -2968 -8152 -6161 -558 -2290 -5775 -1733 726
2587 726 -4960 -6174 230 1684 -2786 -1945 1549 -305 -3407 -31 3466 2327 -386 188 2284 2069
2603 2069 303 2683 6315 3470 -454 3096 6691 3254 2218 7591 7372 1277 2387 8177 7175
2618 7175 3719 6656 8540 4847 3051 6567 8981 6783 5484 6809 7465 5190 4102 7675 9802
2633 9802 6073 3417 7133 7475 3304 4400 9493 7041 1567 3893 7553 3882 1866 5771 6200
2648 6200 1375 958 4011 3997 1450 1322 2614 1887 -504 -1434 1779 2289 -1648 -2320 952 -632 -4911
2665 -4911 -1747 1637 -2749 -6086 -2115 -1014 -5655 -5040 -1220 -2626 -7079 -6016 -3568 -4767 -6132
2680 -6132 -5336 -4173 -5525 -7708 -6724 -3761 -4623 -7719 -6263 -4130 -7170 -9478 -4614 -2593 -7730 -8486
2696 -8486 -4127 -4847 -8916 -6175 -2424 -5256 -7904 -5183 -3614 -5394 -5135 -3483 -2522 -4514 -5939 -4184
2712 -4184 -1757 -2731 -4649 -1537 -49 -3763 -4256 983 1210 -3036 -1582 2014 -639 -2932 1430 3870
2728 3870 702 -678 2683 2723 763 1767 4496 4440 2233 1663 3976 5206 3441 3436 6324 5914 1855
2745 1855 3111 7925 6205 2945 6628 7916 3424 3098 7885 8090 4687 5024 7306 5542 3834 5854
2761 5854 8023 6956 5061 4467 5772 5624 4074 5197 7647 5121 1357 3856 6571 3407 1766
2776 1766 5695 5190 -116 543 4498 3024 458 2165 3317 -25 -1523 893 1782 486 -1204 -1177
2792 -1177 -730 -1859 -3301 -781 1012 -2651 -5210 -2688 -1996 -5382 -4504 -764 -3201 -7534 -5629 -2654
2808 -2654 -5638 -6126 -3305 -3650 -7504 -7601 -5335 -4627 -5673 -5769 -4947 -5685 -7394 -7604 -4462 -3359 -6258
2825 -6258 -7174 -4518 -5700 -8137 -5192 -1455 -4758 -7206 -4311 -3430 -6093 -4968 -928 -2416 -5314
2840 -5314 -4526 -2705 -3138 -3105 -1531 -1040 -1726 -3398 -3097 -64 526 -1609 102 1896 -902 -2570 1655
2857 1655 3924 311 226 3672 1816 -465 2464 5540 3737 1864 3254 3836 2544 3483 5105 5877
2873 5877 4544 2606 3766 5585 5660 4214 6831 7629 3362 2472 6835 7566 4284 5962 8314 4710
2889 4710 2484 5699 7897 5474 4784 6230 4890 2814 4060 5829 6124 4780 3322 3610 4070 2506
2905 2506 2487 5350 4793 749 604 3656 2036 -320 3161 3959 -742 -2031 1314 908 -1537 -518
2921 -518 1014 -1322 -3406 -2658 -1079 -1307 -2322 -2916 -2519 -3490 -5527 -4020 -1277 -2888 -6065 -4431
2937 -4431 -3079 -6203 -6636 -2528 -2559 -6930 -6870 -4010 -5594 -6867 -4550 -3339 -6056 -7201 -5620 -4904
2953 -4904 -5132 -5210 -4634 -4346 -5393 -7229 -5007 -2548 -4238 -5468 -3149 -3064 -6411 -5254 -976 -2050 -4725
2970 -4725 -2648 -914 -4132 -4186 -741 143 -2100 -2028 -631 -1255 -1381 -331 956 1256 -41 -936 909
2987 909 2458 816 586 4115 2845 -509 1824 5118 2656 1881 4605 4854 1695 2435 5603 5460
3003 5460 3521 4368 5535 4512 3784 4645 6065 5726 4346 3999 6071 5644 3837 5200 7723 5191
3019 5191 2290 5208 6663 3547 3430 6703 5468 2053 3741 5737 3940 3212 4567 4292 2395 2114
3035 2114 3075 3580 3051 1540 1567 2640 1240 -204 1694 2674 -307 -1441 1277 256 -2618 -779
3051 -779 1535 -1361 -3829 -1354 -652 -3146 -3294 -1621 -2227 -3908 -4157 -3088 -2926 -4010 -4466 -3724 -3478
3068 -3478 -5629 -5839 -3435 -3487 -5995 -5588 -3362 -4865 -7251 -4302 -2746 -6227 -6794 -4044 -4435 -6485
3084 -6485 -5041 -3354 -4763 -5822 -4938 -4003 -4030 -4699 -4418 -3538 -3473 -5104 -4167 -1652 -2373 -4602 -2871 -665
3102 -665 -2968 -3866 -433 278 -3065 -2142 957 -594 -2022 526 1470 -16 -458 774 1515 1699 1343
3119 1343 2061 2976 2066 1032 2393 4656 2857 1481 4233 4916 1875 2712 6400 5069 2525 4267
3135 4267 5996 3644 3314 5917 6024 4075 4433 5216 5241 4808 4723 5325 5391 4242 3103 5149 6165 3832
3153 3832 3423 6105 4540 1436 3284 5739 3261 1763 4389 4391 1119 1443 4373 3107 1120 1549
3169 1549 1835 1174 490 1048 1605 1277 -892 -1001 797 451 -1758 -1159 992 -1715 -3861 -1599 123
3186 123 -3163 -3298 -671 -2142 -5204 -3628 -1738 -3171 -4524 -3298 -3363 -4896 -5094 -4289 -3378 -3687 -5418
3203 -5418 -5386 -3874 -5079 -6100 -4016 -2531 -5807 -6513 -3686 -3623 -6221 -4561 -2237 -4713 -6364 -3972
3219 -3972 -2729 -4513 -4259 -2899 -3136 -4646 -4210 -3180 -2243 -2578 -3041 -2622 -1352 -3335 -2913 -107 358
3236 358 -2376 -1784 980 -714 -2296 919 2657 -321 -1117 1701 1582 256 1489 3219 2446 1015
3252 1015 1805 2584 3348 2858 2915 3934 4037 1908 2385 5488 4777 2607 4212 5924 3208 2215 5939
3269 5939 6127 3337 3822 5792 4452 2850 5031 6121 4904 3894 3982 4198 4325 3898 4406 5233 4330
3286 4330 1668 2790 4850 3275 1885 4366 4350 800 579 3838 2742 245 1743 2819 72 -1103
3302 -1103 920 1297 -151 -25 57 -999 -1144 -1811 -745 329 -1005 -3100 -1591 -1029 -3534 -3504 -587
3319 -587 -1760 -5218 -3812 -1647 -3785 -4880 -2228 -2198 -5384 -5129 -3378 -3804 -4479 -3823 -3723 -4297 -5168
3336 -5168 -5541 -4083 -3270 -4582 -5402 -3407 -3770 -5941 -4691 -1683 -3631 -5538 -3696 -2676 -5076 -4704
3352 -4704 -1425 -1963 -4366 -3642 -2187 -2706 -3087 -1807 -1064 -1943 -2633 -2222 -880 -337 -1531 -800 965
3369 965 -451 -2037 472 2328 220 -555 2388 1969 -745 741 3954 2388 995 2755 3305 1910
3385 1910 2145 3547 4633 3427 3067 3213 4286 3926 2865 4794 5657 3587 2403 5124 5750 2887
3401 2887 3576 6201 4341 1993 4237 5948 3871 3137 4944 4796 2728 2930 4386 4299 3470 3077 3177
3418 3177 3505 2570 1862 3714 3738 1293 768 3102 2264 -238 1326 3392 302 -1233 1089 1528 -890
3435 -890 -865 1259 -256 -2053 -1108 -456 -1224 -1756 -1894 -1501 -2119 -3230 -3206 -1376 -2016 -4143 -3284 -1404
3453 -1404 -3811 -5152 -2485 -1945 -4897 -5198 -2582 -3700 -5774 -4122 -2616 -4218 -5087 -3885 -3555 -4499
3469 -4499 -4692 -3993 -3439 -3939 -4858 -4010 -2666 -3725 -4931 -3271 -2084 -4124 -4663 -1434 -1930 -4316 -3075
3486 -3075 -940 -2404 -3215 -1412 -271 -2208 -2121 -757 -563 -1158 -997 -52 220 -320 -720 628 1622 208
3504 208 -243 1936 2421 397 731 3527 2220 243 2849 4258 1885 1880 4203 3548 1831 2939 4514
3521 4514 3890 3122 3509 4239 4268 3304 2989 4516 4860 3279 3220 5149 4401 2718 4080 5524 3305 2218
3539 2218 4467 4580 2223 2819 4707 3674 2189 2836 3655 2676 2095 2693 2723 2358 1293 1136 2430 1786
3557 1786 464 1017 2058 181 -1008 981 1672 -1137 -1047 1041 -423 -2527 -904 417 -1605 -2560
3573 -2560 -1568 -1169 -2458 -2785 -1946 -1852 -2944 -3387 -3214 -2448 -3228 -4323 -2832 -2037 -4383 -4983 -2116 -3073
3591 -3073 -4932 -3771 -1929 -4116 -5402 -3307 -2656 -4777 -4521 -2896 -3161 -4602 -4112 -3050 -3160 -3564
3607 -3564 -4031 -3216 -2593 -3655 -3423 -1858 -1987 -3794 -3008 -990 -2001 -3281 -990 201 -2391 -2428 -39
3624 -39 -105 -1728 -552 1008 -258 -854 221 987 1035 675 941 1980 1585 632 1411 3401 2662 775
3642 775 2513 3607 1588 1398 4111 4073 1983 2475 4508 3340 2422 4163 4788 3141 3166 3884 3760 3551
3660 3551 3397 4117 4536 3786 2497 3614 4792 3477 2508 4044 4527 1877 2211 4696 3545 1282 2690
3677 2690 3725 1624 1097 2821 3018 1454 1267 1605 1509 772 835 1239 1323 87 -789 74 659 -728 -965
3696 -965 713 -453 -2874 -1515 -283 -1601 -2635 -1020 -1273 -3450 -3244 -1517 -1980 -2962 -2855 -2486 -3132
3713 -3132 -3774 -3524 -2904 -2648 -3834 -3959 -3158 -2951 -4708 -3989 -2092 -3451 -5108 -3444 -2483 -4393 -4355 -1967
3731 -1967 -2807 -4819 -3573 -2083 -3183 -3653 -2529 -2252 -3179 -3188 -2762 -1684 -1375 -2654 -2544 -1224 -1950 -2944
3749 -2944 -1222 121 -1494 -1963 -104 -76 -2029 -717 1483 49 -935 633 1522 0 335 1863
3765 1863 2030 1013 1119 1481 2428 2204 1733 2329 3477 2044 1254 3379 3898 2246 2693 4426 3025
3782 3025 1494 3630 4799 3174 2711 4153 3869 2489 3055 4098 3853 3247 3393 3371 3517 3068 2850 3663
3800 3663 3885 2390 1880 3726 3271 1271 2420 3708 1797 648 2621 2685 720 1075 2414 1225
3816 1225 -435 827 1398 416 138 78 306 -322 -958 -804 -136 -350 -1972 -1698 -525 -1731 -2758 -1060
3834 -1060 -341 -3041 -3426 -1331 -2370 -3751 -2456 -1665 -3039 -4093 -2658 -2696 -3460 -3359 -2955 -2921 -3387 -3982
3852 -3982 -3437 -2646 -3303 -4095 -3339 -2284 -4156 -4491 -2332 -2389 -4385 -3398 -1789 -3009 -3985 -2408 -1686 -3089
3870 -3089 -3047 -1835 -1896 -2651 -1988 -1236 -1528 -1750 -1695 -1256 -459 -1096 -1374 -245 172 -1214 -1018 1300 174
3889 174 -696 1047 1691 196 74 2008 2115 610 1569 2706 1918 1398 2099 2727 2338 2507 2185 2858
3907 2858 3198 2519 2459 4035 3152 2034 3207 4346 2524 2311 4062 3931 2141 2624 4104 3305 2025
3924 2025 3540 3920 2892 2688 3257 3061 2638 2472 2189 3048 2576 1569 1939 2845 1727 930 2317 2646
3942 2646 601 554 2163 1401 -399 756 1810 83 -513 390 135 -543 -890 27 -741 -974 -1229 -1151
3960 -1151 -924 -1405 -2338 -1819 -1049 -2558 -3113 -1140 -1509 -3370 -2835 -1333 -2927 -4068 -2330 -2175 -3516
3977 -3516 -3632 -2453 -2856 -3615 -3105 -3031 -3371 -3160 -3340 -3330 -2821 -2840 -3449 -2492 -2210 -3559 -3391 -1615 -2689
3996 -2689 -3722 -2170 -1421 -3234 -2912 -1197 -1394 -2846 -1798 -912 -1694 -1691 -873 -903 -703 -689 -695 -306 234 -604
4016 -604 -120 1085 682 -559 144 1887 415 57 2043 1809 365 1172 2703 2090 1516 2457 2719 2055
4034 2055 2060 2625 2658 2713 2577 3044 2859 2990 2330 2745 3749 3338 2572 3192 3726 1891 2675 4208 3387 1769
4054 1769 3000 3894 2363 2077 3491 3137 1826 1956 2543 2279 2020 1980 1781 1996 1523 939 1371 1845 1064
4073 1064 410 1707 1068 -338 31 1447 45 -871 368 500 -1290 -1082 327 -622 -1491 -1281 -923
4090 -923 -1754 -1569 -1668 -1317 -1574 -1992 -2671 -1957 -1618 -2804 -2455 -1768 -2359 -3805 -2582 -1866 -3344 -3555 -1866
4109 -1866 -2593 -4043 -3387 -2238 -2964 -3370 -2382 -2771 -3352 -3151 -2880 -2588 -2408 -2958 -2802 -2422 -2473 -2911 -2408
4128 -2408 -1198 -2401 -2946 -1419 -1332 -2481 -1836 -149 -1460 -2077 -932 -354 -1118 -481 -34 -121 -420 -78
4146 -78 149 116 791 703 557 840 1038 431 1218 2306 1279 1019 2536 1612 842 2219 3000 1764 1356
4165 1356 2982 2722 1821 2735 3317 2742 2411 2626 2623 2950 2965 2587 3022 3377 2525 2224 3343 3282 2192 2530
4185 2530 3628 2158 1540 2889 2970 1677 2054 2628 1772 1138 1948 2375 1580 1456 1693 991 1069 831 506
4204 506 925 1426 23 -365 893 183 -826 49 683 -954 -1316 -49 -718 -1901 -922 -608 -1782 -2248
4222 -2248 -1395 -1347 -2109 -1577 -1673 -2223 -2244 -2313 -2432 -2002 -2000 -2786 -2782 -2103 -3180 -3471 -2125 -2040 -3467 -2913 -1969 -3007
4244 -3007 -3448 -2416 -1986 -3030 -2853 -1850 -2819 -2627 -2380 -1909 -2306 -2288 -2335 -2233 -1871 -1664 -2086 -1426 -1138
4263 -1138 -1810 -1766 -284 -870 -1891 -534 30 -1349 -1379 305 137 -560 206 463 59 196 963 1037 851
4282 851 964 821 1068 1444 1484 1308 2090 2205 1011 1999 2646 2129 1542 2563 2537 1818 1917 3305 2656 2199
4302 2199 3150 3058 2070 2517 2849 2451 2426 2948 2380 2470 3080 2320 2417 2922 2652 1833 2460 2886 1798 1710 2525
4323 2525 2037 1091 1645 2386 978 1047 1749 1166 570 897 844 388 301 625 95 36 328 -439 -450 157 -524
4344 -524 -1465 -273 -639 -1259 -1392 -579 -1383 -1929 -1123 -1066 -2111 -2002 -1177 -1980 -2420 -1864 -1991 -2490 -2341 -2092
4364 -2092 -2776 -2590 -2328 -3138 -2560 -2287 -2844 -3104 -2115 -2225 -3307 -2470 -1867 -2849 -3067 -1860 -1969 -2904 -2123
4383 -2123 -1593 -2421 -2355 -1423 -1946 -1962 -1263 -1505 -1515 -1236 -1061 -1349 -754 -397 -1217 -885 -13 -625 -875 144
4403 144 78 -704 40 876 509 95 1056 1196 254 933 1535 1096 1330 1774 1571 1477 1990 1759 1682 2407 2232
4424 2232 1563 2305 2616 2035 1883 2752 2466 1713 2336 2788 2232 2019 3107 2589 1953 2544 2616 2210 2151 2348
4444 2348 2250 2158 2415 1845 2055 2566 2192 1242 1998 1733 996 1352 1995 1591 599 862 1322 275 677 1304
4464 1304 459 -130 496 328 -257 42 -26 -359 -424 -407 -932 -1025 -368 -1272 -1413 -857 -1017 -2019 -1474 -872 -1943
4485 -1943 -2067 -1287 -1715 -2529 -1930 -1414 -2376 -2422 -2039 -2462 -2995 -1951 -1974 -2736 -2158 -2375 -2790 -2664 -2114 -2606
4505 -2606 -2690 -2114 -2234 -3009 -2381 -1736 -2507 -2256 -1189 -2195 -2563 -1270 -1313 -2218 -1448 -1049 -1367 -1601 -1064
4524 -1064 -870 -910 -559 -619 -975 -428 -376 -680 -53 482 -32 -52 803 615 55 685 1601 509 596 1369 1371 821
4546 821 1643 1891 1328 1537 1828 1285 1373 2511 2258 1809 2185 2193 1815 2284 2625 2038 2159 2742 2331 1685 2674
4567 2674 3022 1800 1978 2634 2022 1611 2689 2617 1833 1905 2236 1762 1614 1991 1661 1550 1786 1234 1025 1327
4587 1327 1650 718 960 1186 446 -66 1103 515 -255 287 818 -621 -496 60 -127 -807 -706 -354 -1242
4606 -1242 -1116 -850 -1203 -1198 -889 -1665 -1759 -1358 -1622 -2086 -1378 -1397 -2505 -2389 -1549 -2128 -2439 -1811 -1858 -2900 -2474
4627 -2474 -1750 -2436 -2245 -1775 -2123 -2713 -2184 -2217 -2156 -2483 -1588 -2461 -2105 -1754 -2101 -2278 -1294 -1560 -2043 -1797
4647 -1797 -1209 -1566 -1430 -463 -967 -1173 -957 -384 -1019 -590 24 -727 -802 -379 19 -268 199 821 169 317
4667 317 804 16 289 997 1087 711 1607 1493 522 981 1939 1638 1064 2092 1791 1230 1682 2026 1712 1966
4687 1966 2262 1889 1962 2039 2204 1931 2358 2401 1814 1938 2658 1961 1937 2757 2162 1284 1766 2381 1672 1478 2297
4708 2297 1669 990 1936 2121 1249 1243 1593 1063 725 1181 943 514 1120 563 213 464 763 -107 -151 489 6
4729 6 -759 -10 52 -904 -814 -33 -1083 -1586 -698 -1019 -1633 -1376 -1030 -1267 -1527 -1348 -1877 -1831 -1551 -1822 -1945
4750 -1945 -1548 -1698 -2606 -1985 -1442 -2412 -2339 -1426 -1878 -2553 -2068 -1361 -2356 -2202 -1577 -1926 -1978 -1570 -1640 -1765 -1953
4771 -1953 -1688 -1792 -1905 -1105 -1626 -1768 -998 -1008 -1840 -855 -457 -1228 -966 -145 -679 -1080 -336 -190 -785 -194
4791 -194 348 -317 -157 598 586 228 697 642 380 768 1193 942 841 1444 1142 950 1636 1834 1144 1763 1956
4812 1956 1347 1529 2497 2122 1592 1739 2496 1767 1695 2267 1915 1725 2074 2038 1647 1847 2107 1683 1999 2178
4832 2178 1457 1644 2056 1467 1230 1666 1781 1002 1374 1750 1093 844 1602 1049 680 999 1050 275 218 729
4852 729 195 201 697 25 -154 113 79 -412 -464 -76 -706 -1118 -540 -973 -1298 -449 -607 -1519 -1332 -878 -1320
4873 -1320 -2067 -1228 -978 -2046 -1894 -1247 -1966 -2164 -1555 -2260 -2080 -1668 -1602 -2376 -1938 -1699 -2125 -2184 -1664 -1888
4893 -1888 -2529 -1424 -1776 -2100 -1789 -1453 -2222 -2146 -957 -1407 -1720 -1364 -1172 -1490 -1213 -909 -1309 -1171 -616
4912 -616 -688 -1118 -610 -303 -796 -279 205 -380 -326 275 18 -281 488 817 -39 218 1104 685 449 943 1097
4933 1097 980 784 1577 889 1401 1627 1115 1522 1645 1594 1567 1977 2115 1183 1416 2177 1691 1356 2442 2575
4953 2575 1577 1838 2112 1635 1505 2202 1995 1574 1730 1572 1128 1464 1726 1424 1434 1742 890 876 1583 1540 593
4974 593 1274 1033 282 630 1219 532 342 556 506 131 -153 410 -49 -197 10 -286 -688 -456 -599 -893
4994 -893 -638 -373 -1074 -1470 -961 -1175 -1519 -1000 -928 -1962 -1391 -1172 -1629 -1839 -975 -1441 -2308 -1815 -1424 -2120
5014 -2120 -1763 -1521 -1929 -2113 -1922 -1728 -1913 -1584 -1561 -1858 -1667 -1244 -1777 -1974 -1060 -1584 -2050 -1240 -1298 -1744
5034 -1744 -1466 -647 -1401 -1231 -991 -889 -1033 -677 -367 -939 -739 -347 -569 -684 -99 77 -530 233 331 -283
5054 -283 58 988 532 188 914 797 391 659 1618 819 909 1558 1297 1044 1530 1591 1478 1401 1473 1280 1357 1752
5076 1752 1880 1381 2053 1687 1142 2059 1989 1630 1537 2129 1690 1169 1938 2203 1386 1337 1887 1550 1092 1599 1558
5097 1558 1175 1123 1618 988 1015 1398 1148 850 1034 630 351 968 786 312 336 483 -70 -254 291 193 -599
5118 -599 -277 156 -689 -776 -322 -621 -596 -617 -878 -1348 -972 -885 -1212 -872 -852 -1620 -1690 -896 -1286 -1977 -1601 -1024
5140 -1024 -2135 -1799 -1334 -1451 -2235 -1594 -1194 -2151 -1898 -1489 -1258 -1743 -1592 -1722 -1639 -1272 -1575 -1659 -1627 -1318
5160 -1318 -1765 -1334 -859 -1380 -1576 -934 -772 -1516 -946 -152 -940 -1073 -494 -234 -749 -427 -5 -429 -224 -38
5180 -38 -154 -77 403 164 224 732 803 309 817 1042 760 449 910 892 615 1092 1700 1036 1327 1758 1409 959
5202 959 1469 1433 1145 1523 1796 1336 1621 1900 1414 1481 1443 1374 1157 1701 1879 1449 1413 2121 1353 987 1757 1604
5224 1604 1006 1178 1618 1115 1117 1331 1370 951 946 892 327 818 638 567 301 738 -14 230 565 140 -466 44
5246 44 85 -384 -297 59 -680 -851 -350 -107 -1171 -939 -389 -1012 -1207 -779 -858 -1346 -1182 -1258 -1517 -1299 -1099
5267 -1099 -1496 -1664 -1024 -1606 -1641 -1350 -1251 -1991 -2145 -1247 -1653 -1982 -1167 -1370 -1728 -1416 -1282 -1602 -1684 -1191 -1446
5288 -1446 -1616 -1041 -1110 -1496 -1079 -1017 -1500 -857 -849 -1111 -1377 -202 -548 -685 -151 -206 -765 -495 338 82 -272
5309 -272 -21 247 -296 208 443 270 282 801 739 211 751 840 786 1204 1082 625 831 1563 968 1044 1701 1395
5331 1395 1016 1343 1610 1190 1192 1513 1456 1082 1563 1631 1350 1445 1708 1655 1439 1559 1178 1391 1690 1893 1042 1429
5353 1429 1569 772 936 1507 1130 925 1074 1433 715 743 1246 766 305 610 470 82 537 686 303 190
5373 190 239 -142 -313 -12 -191 -517 41 -258 -963 -839 -415 -837 -976 -454 -693 -1402 -964 -680 -1231 -1167 -822
5394 -822 -1254 -1752 -1125 -1206 -1412 -1304 -1246 -1702 -1565 -1266 -1442 -1482 -1125 -1268 -1786 -1455 -1047 -1554 -1684 -979 -1027
5415 -1027 -1704 -1048 -1333 -1283 -1036 -928 -1289 -854 -999 -1018 -873 -976 -722 -916 -725 -318 -439 -686 -237 -433
5435 -433 -589 85 -1 -352 41 482 149 24 477 315 529 588 1225 450 529 992 1145 709 920 793 929
5456 929 1302 1245 771 1257 1542 1238 1097 1641 1552 731 1790 1697 1305 1219 1878 1483 1010 1652 1402 1356 1281 1476
5478 1476 1218 1328 1470 901 1059 1212 899 934 1165 1242 665 1081 1037 958 269 737 821 251 567 451 41
5499 41 292 546 273 44 -118 66 62 -125 -289 -486 -644 -7 -549 -1017 -585 -581 -1070 -472 -518 -1004 -1420 -916
5521 -916 -1065 -1424 -1075 -1080 -1370 -1455 -1274 -1431 -1574 -1072 -1410 -1580 -1279 -1344 -1381 -1408 -1163 -1272 -1233 -989 -1484 -1492 -846
5544 -846 -933 -1285 -1435 -772 -1031 -1463 -892 -684 -1314 -926 -589 -960 -769 -172 -478 -586 -551 -431 -523 -203 21
5565 21 -430 -172 150 -133 -147 704 68 -235 436 843 211 423 1111 664 336 825 866 470 658 1138 835
5586 835 779 1012 1079 923 1187 1334 974 1379 1346 928 1184 1295 1225 1352 1300 1770 984 1154 1601 1301 1036 1238
5608 1238 1463 984 1495 1182 840 716 1174 693 891 1202 450 864 912 928 439 439 870 517 271 561 396
5629 396 -67 287 490 -261 -71 265 -260 -280 -242 -170 -482 -109 -319 -717 -684 -339 -1020 -838 -659 -1059 -1167
5650 -1167 -675 -746 -1113 -1127 -765 -1377 -1823 -1029 -1136 -1227 -1337 -1123 -1466 -1543 -835 -1265 -1531 -1181 -1117 -1582 -1254
5671 -1254 -553 -945 -1275 -1007 -1328 -1374 -923 -907 -1114 -1052 -597 -1295 -1238 -487 -692 -1122 -650 -208 -850 -739 -204
5692 -204 -430 -305 -49 -147 -612 3 256 9 239 42 209 274 725 352 -12 797 976 533 395 1275 589
5713 589 648 1073 997 672 955 1355 1076 1163 1593 1103 1242 1515 951 958 1381 1449 848 1178 1311 1244 978 1527
5735 1527 1293 1007 803 1407 981 745 1423 622 558 1111 1079 991 732 962 729 692 692 246 673 595 638 349
5757 349 185 237 -27 -144 748 61 13 -8 -247 -446 -405 -233 -139 -628 -243 -493 -919 -282 -646 -1145 -774 -730
5779 -730 -1095 -972 -662 -941 -1152 -928 -1004 -1727 -1274 -776 -1292 -1198 -859 -1233 -1629 -1216 -752 -1303 -1401 -874 -1380
5800 -1380 -1467 -944 -1149 -1371 -813 -609 -1323 -1102 -616 -1151 -962 -696 -817 -898 -851 -586 -662 -564 141 -726 -883
5821 -883 12 -98 -391 -372 228 -279 -189 304 191 147 300 503 -237 352 468 230 643 1025 365 716 964
5842 964 732 236 993 1447 598 987 1242 1192 715 971 1390 977 1025 1435 965 982 1526 1184 1065 1426 1068
5863 1068 1027 1426 1473 758 946 1387 1039 763 1425 1262 639 848 968 943 551 877 704 437 421 326 170
5884 170 202 390 487 -25 435 173 -152 217 31 -364 -208 -89 -587 -569 -47 -232 -934 -426 -137 -707 -784
5905 -784 -477 -427 -865 -810 -782 -1004 -1003 -853 -1131 -982 -981 -1398 -1387 -860 -1128 -1116 -1141 -960 -1582 -1388 -980 -1119 -1190 -928
5929 -928 -1125 -1395 -1196 -871 -1148 -1273 -897 -1108 -1069 -749 -648 -1243 -665 -627 -575 -589 -324 -435 -715 -332 -481
5950 -481 -765 -453 68 -309 -230 207 132 -425 14 271 148 300 419 217 176 556 268 269 822 532 390 706
5972 706 733 576 645 1130 799 395 1204 1203 679 1036 1442 1215 948 1360 1436 839 1050 1315 1039 1086 1158 1021
5994 1021 1111 1219 1009 947 1299 951 906 846 774 333 857 1196 872 327 498 1035 449 374 323 485 108 655
6016 655 373 -132 5 434 -73 162 -46 -132 -284 222 -278 -273 -269 -319 -665 -669 -46 -758 -713 -555 -692 -906 -893
6039 -893 -572 -1068 -1203 -671 -915 -1204 -952 -929 -1142 -987 -852 -1081 -1173 -772 -861 -1206 -687 -834 -1613 -1018 -683
6060 -683 -1245 -1044 -541 -970 -993 -1090 -783 -872 -719 -609 -843 -831 -450 -688 -862 -452 -416 -532 -95 -88 -312 -51
6082 -51 90 99 -240 151 -3 -189 105 558 197 205 410 616 236 602 576 373 429 869 512 489 789 808 634
6105 634 883 1182 976 852 863 930 696 1119 1021 656 966 1123 1127 946 1396 1034 730 1365 855 1059 1057 1199
6127 1199 928 816 1228 746 784 945 774 400 845 1035 435 614 738 760 207 498 718 338 155 609
6147 609 -81 -32 145 -71 -236 -182 76 -576 -76 72 -607 -431 -337 -194 -738 -355 -314 -653 -193 -456 -680
6168 -680 -980 -613 -587 -756 -781 -822 -985 -1065 -620 -1055 -1020 -838 -1002 -1114 -947 -884 -1293 -1076 -927 -883 -1139 -364
6190 -364 -1144 -1513 -1134 -694 -1061 -926 -387 -827 -1003 -568 -750 -845 -658 -394 -862 -584 -230 -683 -494 -274
6210 -274 -234 -576 -196 128 -198 -10 339 -65 -228 305 61 -317 244 499 60 100 572 618 374 644 833
6231 833 425 618 790 848 772 1077 946 783 873 813 593 929 1391 776 1034 1280 844 724 1075 997 802 848
6253 848 1063 826 764 1076 864 507 875 956 770 657 966 690 694 763 388 204 809 639 190 355 393 200
6275 200 130 542 434 284 305 336 -506 -61 29 114 -133 -488 55 -106 -741 -57 -350 -598 -211 -820 -797 -607
6297 -607 -393 -955 -755 -708 -878 -904 -742 -779 -909 -1119 -588 -881 -908 -702 -1074 -1178 -778 -1019 -1276 -1211 -1074 -1584
6319 -1584 -1082 -813 -1009 -1016 -656 -974 -895 -664 -705 -806 -752 -384 -454 -666 -23 -381 -668 -287 -330 -423 -544 -58
6341 -58 -70 -246 193 -103 -150 249 147 -1 -26 582 466 153 613 327 69 301 750 389 399 617 748 525
6363 525 750 728 377 744 1019 763 676 1212 670 710 1251 1032 892 1075 1164 842 708 1245 897 619 1262
6384 1262 1162 823 892 1024 589 589 955 771 455 862 790 592 584 888 561 212 772 418 335 576 265 -300
6406 -300 48 411 155 65 142 111 -219 150 -186 -462 -392 -109 -289 -709 -159 -488 -734 -294 -214 -622 -605 -613 -654
6429 -654 -776 -766 -598 -1166 -933 -974 -1020 -819 -402 -1021 -924 -672 -906 -1025 -928 -762 -872 -930 -840 -766 -1125 -395 -553
6452 -553 -856 -810 -887 -1007 -702 -535 -575 -1131 -422 -364 -669 -192 -322 -449 -167 -366 -484 -591 -70 4 -208 91
6474 91 199 13 -4 16 -59 18 388 429 388 291 272 226 318 515 474 330 1127 992 357 872 877 545 352 959 768
6499 768 848 786 976 369 842 853 904 832 941 856 869 858 1059 629 989 930 483 979 829 535 512 545 629 543
6523 543 420 800 330 41 762 564 374 453 821 -57 -9 334 -29 57 172 -80 -92 21 242 -256 -339 -170
6545 -170 -171 -573 -25 -90 -654 -208 -302 -517 -762 -471 -813 -668 -557 -390 -922 -711 -272 -1210 -744 -681 -694 -968
6567 -968 -729 -687 -1187 -516 -644 -949 -1089 -952 -882 -775 -192 -437 -625 -906 -702 -865 -775 -609 -614 -696 -715 -330
6589 -330 -472 -531 -348 -447 -680 -443 -307 -833 -69 -309 -459 -217 148 -133 -15 399 28 59 9 264 -144
6610 -144 128 118 180 114 560 357 -12 733 582 388 524 930 271 356 708 717 221 597 773 448 746 862
6632 862 641 533 872 1019 739 927 1099 661 876 763 705 756 604 930 690 591 748 599 627 897 484
6653 484 297 709 672 350 652 374 138 14 569 127 385 372 25 29 -106 -78 -301 -132 -196 -153 -650 -164
6675 -164 -149 -298 -479 78 -571 -473 -399 -394 -714 -413 -217 -620 -698 -453 -507 -769 -611 -647 -957 -603 -592 -1005 -804
6698 -804 -340 -856 -683 -714 -895 -883 -727 -515 -1026 -957 -448 -874 -683 -534 -681 -922 -685 -271 -858 -364 -444
6719 -444 -589 -614 -436 -334 -464 -232 -209 -278 -263 -26 -268 -296 15 -178 -98 -23 72 -179 -39 307 283 -37 415
6742 415 394 -88 151 287 467 564 568 316 266 261 507 726 679 744 598 763 927 716 383 707 954 519 884
6765 884 741 684 819 1026 859 588 874 556 699 741 604 443 482 653 739 548 638 694 530 147 593 375
6787 375 49 355 261 170 390 644 -32 139 260 81 -235 125 106 -133 42 -19 -341 -333 -106 -389 -373 -224
6809 -224 -174 -509 -249 -530 -485 -508 -577 -674 -792 -403 -493 -652 -843 -491 -861 -598 -646 -681 -792 -391 -571 -766 -828
6832 -828 -516 -764 -853 -552 -611 -747 -578 -558 -791 -785 -661 -835 -494 -722 -801 -533 -432 -161 -631 -156 -252 -544
6854 -544 -414 -109 -339 -437 -263 -106 -276 -134 74 -37 -37 299 -98 -167 110 141 286 147 386 291 215 549
6876 549 554 336 462 773 531 558 582 391 418 723 707 577 561 707 437 464 1013 684 651 1104 943 404 960
6899 960 734 673 585 743 477 853 754 688 454 406 558 457 440 512 303 406 409 273 361 491 525 315 255 277
6923 277 132 50 271 261 142 -245 19 -345 -182 120 -121 -589 -115 -98 -136 -414 -343 -455 -334 -247 -630 -603
6945 -603 -510 -666 -605 -627 -373 -691 -607 -632 -491 -563 -448 -544 -965 -826 -478 -913 -785 -612 -691 -640 -431 -547 -844
6968 -844 -744 -290 -854 -730 -733 -357 -564 -454 -316 -740 -397 -150 -372 -551 -87 -430 -412 -435 -22 202 -63
6989 -63 146 -159 -194 -341 -2 -142 -24 -6 178 114 260 186 190 256 547 225 297 324 194 -28 446 389 236 582
7013 582 611 443 667 835 588 560 548 702 782 819 954 652 465 824 434 472 642 725 588 450 724 572
7035 572 548 569 670 434 658 435 275 662 707 216 298 514 175 183 79 397 69 311 339 163 206 190 -23
7058 -23 -296 488 278 -268 125 -91 -505 -113 88 -262 -405 -191 -123 -689 -204 -226 -939 -634 -263 -644 -688
7079 -688 -246 -438 -654 -756 -343 -547 -704 -481 -462 -517 -480 -480 -471 -800 -527 -522 -524 -444 -554 -739 -564 -559 -404 -706 -636
7104 -636 -503 -838 -328 -250 -373 -289 -43 -350 -359 -16 -467 -197 -71 -227 -256 -5 -54 -241 92 22 -52 -195 324
7127 324 355 56 418 480 291 203 407 402 177 294 141 367 389 377 622 409 687 455 560 799 591 539 505
7150 505 727 447 605 624 519 387 534 746 511 460 804 506 699 751 511 488 437 247 135 521 577 238
7172 238 393 456 225 -126 230 591 91 92 300 39 63 202 121 58 258 339 -359 -29 -185 -190 -169 169 -194
7195 -194 -422 -112 -14 -319 -66 -428 -689 -579 -131 -151 -758 -493 -204 -650 -797 -603 -324 -408 -500 -476 -569 -409
7217 -409 -555 -653 -612 -375 -565 -657 -647 -456 -633 -584 -418 -591 -458 -256 -472 -466 -123 -330 -540 -478 -26 -294 -223
7240 -223 -281 -394 -110 63 -282 -250 11 7 -243 -409 -69 -118 -203 69 176 211 134 249 -84 162 331 353 225
7263 225 229 535 91 557 421 209 241 497 512 494 539 650 281 410 663 395 424 962 415 371 642 569 375
7286 375 452 607 537 225 830 452 488 617 417 449 434 591 516 313 464 502 105 206 206 301 127 662 76
7309 76 152 251 330 -186 181 376 -313 182 68 -67 -63 228 -65 -459 -198 -157 -456 -132 -325 -368 -467 -137 -210
7332 -210 -400 -518 -366 -410 -370 -460 -378 -817 -596 -314 -605 -538 -548 -796 -742 -275 -544 -628 -491 -540 -508 -259 -660
7355 -660 -474 -612 -606 -626 -606 -525 -656 -603 -619 -327 -675 -167 -71 -659 -628 -400 -328 -371 -171 -85 -43 -78 -331 95 -241
7380 -241 -6 312 -359 -99 151 203 270 432 28 337 186 320 175 204 434 464 80 566 548 477 618 658
7402 658 328 455 474 221 493 381 509 651 653 813 178 818 764 556 571 457 835 402 281 762 132 511
7424 511 639 455 298 368 520 231 312 644 45 -86 106 447 151 189 266 129 198 397 108 -134 262 348
7446 348 -39 307 196 -60 -74 -7 -106 -239 -264 -635 -434 -109 -354 -453 -378 -153 -268 -529 -187 -538 -425 -370
7468 -370 -279 -888 -481 -268 -452 -542 -382 -624 -606 -396 -462 -562 -863 -378 -492 -494 -813 -268 -475 -477 -482 -540 -340 -335
7492 -335 -264 -415 -702 17 -722 -338 -399 -446 -207 -29 -343 -229 -150 -152 -82 -274 4 182 -45 45 -57 -7 511
7515 511 211 13 168 606 24 462 381 32 333 364 431 311 301 595 454 399 72 527 107 585 338 372
7537 372 535 513 386 389 714 381 529 382 431 213 408 292 333 280 580 346 696 312 404 324 707 227 522
7560 522 397 338 352 228 257 501 514 289 316 217 143 97 191 -236 366 135 -94 -29 172 72 -117 4 -175
7583 -175 -123 -321 -251 -330 -486 -108 -366 -414 -210 -162 -416 -433 -284 -438 -371 -164 -566 -429 -254 -375 -614 -474
7605 -474 -513 -578 -574 -225 -328 -589 -271 -201 -620 -436 -526 -449 -483 -421 -432 -237 -315 -308 -490 -392 -86 -655 -382 -122 -278
7630 -278 -5 -10 -131 -288 63 20 -180 -195 -240 260 -332 20 236 -10 -5 160 196 155 2 60 304 235 218 153
7654 153 133 499 297 93 463 655 284 495 438 158 222 512 354 685 387 384 400 411 325 496 570 709 435
7677 435 199 428 603 344 490 619 404 336 367 91 341 217 283 7 486 504 -20 361 354 334 231 -47
7699 -47 54 -190 350 534 30 58 -22 44 105 -108 1 -529 -187 93 -166 -236 -243 28 -239 -286 -160 -236 -342
7722 -342 -212 -365 -581 -256 -328 -202 -278 -376 -442 -397 -572 -397 -804 -472 -517 -482 -678 -245 -440 -781 -314 -420
7744 -420 -503 -306 -215 -751 -253 -278 -552 -217 -404 -239 -518 -186 -330 -540 -148 -89 -355 12 -82 -75 -129 -86 -38
7767 -38 -227 -102 177 -290 146 177 -42 94 36 222 245 -17 183 -7 44 519 293 245 256 435 98 524
7789 524 248 249 197 352 450 399 626 473 378 246 558 379 526 485 320 213 494 459 556 386 762 349 178
7812 178 474 210 168 436 423 210 445 106 62 57 521 107 49 315 11 -176 2 358 256 -97 221 -146
7834 -146 -33 -156 122 -146 -273 -93 -140 -277 -286 -7 -374 -107 -72 -373 -248 -224 -135 -385 -607 -320 -608 -583
7856 -583 -38 -473 -606 -231 -481 -495 -372 -138 -349 -328 -388 -478 -373 -415 -369 -515 -436 -472 -478 -518 -150 -540 -388 -179
7880 -179 -412 -334 -166 -363 -558 -210 -269 -305 -63 -414 -152 -357 -96 -169 -209 -89 71 -112 -30 135 -309 -204
7902 -204 -142 144 99 -6 304 215 -36 281 -16 52 143 521 8 124 396 322 167 485 85 258 259 552 179
7925 179 249 445 598 208 460 200 215 226 582 402 461 563 223 299 380 456 99 320 455 281 120 450
7947 450 185 108 272 327 -111 468 451 335 269 106 133 149 171 145 -76 9 150 94 -189 -34 -287 -137 -72 81
7971 81 -121 -318 -113 -340 -194 -33 -314 -432 -96 -184 -462 -96 -83 -247 -423 -322 -216 -376 -130 -306 -452
7992 -452 -340 -506 -430 -565 -90 -304 -348 -468 -544 -674 -450 -225 -574 -390 -398 -363 -411 -373 -245 -303 -495 -445 -208
8015 -208 -441 -383 -245 -357 -396 -177 -348 -21 -81 -315 27 -149 115 -100 -240 -201 -226 -185 -93 17 286 381 497
8038 497 282 -54 -12 410 -91 209 301 -13 391 250 -19 243 351 283 267 456 309 66 556 479 234 397
8060 397 599 393 445 357 272 182 606 775 267 305 425 651 350 218 49 240 487 327 211 350 228 512
8082 512 31 490 366 -99 24 213 172 66 152 148 -99 66 65 202 18 144 -15 -212 70 -26 -312 -132
8104 -132 46 -182 -33 -264 -277 -118 0 -180 -196 -376 -174 -323 -134 -212 -419 -303 -218 -251 -495 -387 -395 -440 -533
8127 -533 -241 -255 -337 -205 -188 -488 -234 -593 -527 -326 -516 -263 -407 -145 -197 -577 -40 -256 -397 -245 3 -183
8149 -183 -284 9 -179 -25 40 92 -71 -85 157 -141 75 167 68 -105 62 169 83 139 290 295 255 240 7 209
8173 209 123 287 103 349 514 195 49 320 207 145 217 333 272 185 216 515 209 287
8191B87
$$ Imaginary data points
##PAGE= N=2
##DATA TABLE= (X++(I..I)), XYDATA
0 0 0 0 0 8 -8 0 -8 8 -16 16 -24 27 -40 40 -51 64 -80 88 -104 123 -147 170 -195 227 -261 299 -339 385 -435
29 -435 494 -554 623 -699 780 -869 968 -1077 1197 -1327 1471 -1628 1804 -1997 2209 -2448
45 -2448 2719 -3024 3369 -3768 4236 -4789 5455 -6279 7327 -8712 10629 -13477 18156 -27195
59 -27195 51090 -245898 -608273 -88516 38535 -245825 -326011 -42616 -68884 -277589 -200858
70 -200858 7679 -158585 -365930 -201541 1279 -178943 -295038 980 241975 39383
80 39383 -133291 17926 77053 -125083 -115074 138141 139193 -73983 2365 234124 163370
91 163370 -12838 103599 216610 -2022 -185892 -26637 107962 -8402 -21163 167330
101 167330 140255 -112655 -111793 113920 54787 -208169 -145811 105133 10527 -221601 -54100
112 -54100 245440 137761 -101553 -22956 68175 -125818 -185461 100558 217191 -23409 -103836
123 -103836 118724 165611 -13522 20964 200602 68655 -209447 -121977 154742 116710 -52479
134 -52479 77353 238409 36161 -180253 -25019 135187 -16161 -105994 55425 61359 -134443
145 -134443 -55728 243957 215961 -70572 -83894 91976 18509 -129655 36219 247965 109764
156 109764 -77277 66813 232922 90818 -31349 123210 176698 -57089 -130686 112859
166 112859 208746 42600 34188 184736 90513 -125932 -46079 141530 33417 -140998 -31479
177 -31479 96480 -39146 -125018 62160 153943 -55842 -187381 -54636 -4231 -144070 -121364
188 -121364 79594 65889 -126057 -88713 86956 10158 -153884 -42786 95423 -70647
198 -70647 -216019 -30376 126533 -11860 -88146 74038 90502 -135111 -179008 24466 56531
209 56531 -115911 -102516 70305 26713 -142762 -65391 110782 14669 -165943 -85782 27593
220 27593 -105517 -178622 33094 144656 -50999 -147815 17171 56827 -105774 -95159 77986
231 77986 37235 -142533 -84553 105040 74294 -49304 26187 117890 -29541 -158709 -10479
242 -10479 129013 12566 -71887 60743 97099 -66668 -69744 130160 128173 -81724 -98349
253 -98349 48241 13967 -92116 29315 175185 45358 -120092 -29781 85135 -8845 -72560
264 -72560 55242 93137 -74049 -114736 72794 136722 -9669 -32540 91017 35618 -131394
275 -131394 -58766 131698 79937 -64735 9891 110114 -10233 -90296 69715 152651 -19452
286 -19452 -115783 20320 84286 -22991 -16612 124405 96046 -72936 -55887 95597 60303
297 60303 -73807 -5008 123080 22287 -105080 13883 137929 24042 -66617 43293
307 43293 69728 -87894 -101265 80397 105942 -53177 -69134 52291 21882 -97153 -39171
318 -39171 79539 -374 -128891 -56361 46880 -39866 -110555 19062 88019 -69145 -154854
329 -154854 -22189 31741 -85680 -80889 59078 25513 -130967 -91645 58224 21872 -88304
340 -88304 -24972 56450 -51522 -139929 -9682 104522 7805 -75399 10250 42022 -75080
351 -75080 -80063 75614 87241 -70835 -79547 58750 39728 -80780 -14128 117758 33148
362 33148 -109587 -45602 58111 -989 -40024 64486 81010 -67919 -104159 47294 99338
373 99338 -18871 -46273 51392 29862 -83468 -29390 117569 79498 -52457 -16988 66976
384 66976 -10081 -69662 61736 141863 8500 -71979 36155 79136 -14607 -1039 121731
395 121731 86640 -65851 -51089 87024 85167 -4975 38446 114939 22155 -83648 10574
406 10574 125442 47545 -36642 43776 83712 -31537 -54959 85447 111578 -23511 -47383
417 -47383 50997 27098 -67173 -2422 111197 44190 -72887 -22886 60913 -3513 -63164 27755
429 27755 82682 -29810 -95635 9992 68470 -18998 -37516 55124 30025 -97316 -69349
440 -69349 61962 35697 -68363 -18886 62663 -23599 -109959 -12443 75847 -12568 -89558 -22302
452 -22302 8794 -74454 -74600 45447 56964 -69922 -97116 -4445 -10044 -91304 -40865 60774
464 60774 -5031 -119316 -60182 38096 -15147 -65839 17949 41519 -82764 -120930 3168
475 3168 53459 -26533 -33288 40586 4525 -96363 -54286 62874 37032 -64915 -41524 26268
487 26268 -27443 -78422 21878 93613 -14098 -99129 -20315 25076 -54936 -54144 58311 49389
499 49389 -75553 -73724 37350 35667 -40592 -9123 51702 -17747 -94586 -15192 83561 36980
511 36980 -26243 27010 57239 -29642 -52408 60589 97399 -5544 -33001 53257 52708 -20046
523 -20046 27726 122792 64216 -44173 -6870 67559 23182 -13895 67200 106411 10231 -40667
535 -40667 42437 83358 10876 -6665 65916 51151 -48137 -30596 81801 76243 -11801 9523
547 9523 70543 2535 -72875 3800 80614 9823 -48696 18393 45633 -33588 -42104 50694
559 50694 53686 -49938 -67951 6690 4741 -56810 -20697 57707 13043 -77700 -42501 30785
571 30785 -13279 -65772 -1076 37201 -50195 -84493 16951 61376 -15246 -32077 32234 8787
583 8787 -75201 -42020 55968 40047 -35227 -14067 39007 -3820 -48694 17991 70273 -9284
595 -9284 -80162 -23697 23125 -29542 -36396 45838 40512 -67575 -80103 4653 1429 -65231 -35323
608 -35323 22836 -34771 -101738 -35912 41421 -2901 -57033 -17543 352 -66058 -77578 14455
620 14455 49577 -22667 -42796 23934 23908 -42038 -14466 66664 29415 -59450 -26291 50661 21225
633 21225 -17764 43928 76416 -6033 -49591 20948 53180 -7012 -18029 43270 37550 -32737
645 -32737 -17140 65432 57960 -17818 -13290 38303 4261 -44818 16585 85641 32657 -22408
657 -22408 30770 64018 2016 -11495 65149 70851 -12226 -19525 53676 57852 8763 33300 83801
670 83801 37956 -34560 -5658 53572 22850 -20913 22408 54430 -9723 -46746 21126 52321
682 52321 -17885 -44281 9380 -905 -69450 -43446 40382 23662 -46001 -28333 15911 -23372
694 -23372 -60621 -5339 36873 -20293 -61628 -7068 31553 -10223 -20834 36477 33675 -47239
706 -47239 -56255 18034 25955 -29778 -12127 39691 -2846 -63077 -14460 44091 -4216 -57591
718 -57591 -22473 -3552 -57051 -61723 13800 32346 -37495 -63486 -19010 -18733 -62848 -41061 20035
731 20035 -4669 -73878 -50682 17004 2766 -33801 6549 32829 -34479 -70702 -1921 39428
743 39428 -5556 -14716 35613 24800 -37452 -23443 43106 34138 -25460 -21179 16341 -7364 -38737
756 -38737 8781 56216 8323 -47242 -15373 15110 -27764 -41264 19769 29447 -38017 -44218
768 -44218 21827 25391 -21658 -2178 41297 2392 -49716 -7344 52933 31759 1374 35756
780 35756 57323 10630 -8678 49065 76100 24238 3674 49296 52349 5049 25471 92064
792 92064 71336 -359 7904 50727 20866 -10511 39592 72867 14234 -26853 16546 42408
804 42408 2365 -7968 32191 23389 -40904 -44926 17141 29784 -11991 -7054 28003 -5931 -58386
817 -58386 -21801 35953 5916 -38749 -7682 15804 -28000 -36828 25796 41353 -19761 -42422
829 -42422 -6062 -5174 -34789 -11318 34305 11071 -42689 -30899 11333 -1863 -28904 -1317
841 -1317 16989 -34237 -63348 -8531 28506 -10344 -25686 10496 -2418 -58782 -42353 21946
853 21946 14231 -35119 -24100 6282 -20413 -42064 4593 38239 -8366 -51800 -23386 2347
865 2347 -25422 -28288 23318 29530 -34601 -50989 2037 10771 -30154 -17599 23194 -8812 -60130
878 -60130 -25986 27925 7086 -24284 1759 12408 -34002 -47553 5679 30919 -7042 -22061
890 -22061 10558 11513 -24522 -12102 38921 30431 -22404 -17587 24115 11666 -12998 25298 58580
903 58580 14329 -21726 14987 38555 6581 3509 44926 39822 -9728 -6731 41885 46641 13605
916 13605 17315 39222 13532 -19992 10741 55278 34012 -2005 18236 35401 -1440 -13457
928 -13457 35986 49128 -2678 -17526 17965 15120 -14484 10891 51520 20661 -30945 -16224
940 -16224 18484 3446 -13919 15664 30298 -13677 -39214 1396 29077 -2766 -17826 12143
952 12143 5623 -42603 -34136 24718 23850 -22698 -17567 12208 -14295 -43576 -6069 27759 -8137
965 -8137 -40967 -15329 3706 -20881 -24549 11876 14644 -31825 -46122 -9669 1560 -24402 -17695
978 -17695 12528 -8409 -48532 -25992 15805 -4061 -34565 -11512 2725 -34408 -43845 3414
990 3414 19495 -17832 -27959 -2112 -8772 -38070 -21168 18521 6494 -32623 -25381 5794 -4847
1003 -4847 -24697 2977 26492 -11796 -43288 -8242 18600 -9618 -16295 23057 21100 -25628
1015 -25628 -24064 20518 19796 -11579 -514 24451 1768 -23523 5745 39572 19625 -7695
1027 -7695 9261 24290 -2116 -12423 26927 42713 4988 -8491 25654 28221 -2956 9153
1039 9153 45372 25349 -15856 1501 35631 20276 2639 28526 39948 4294 -12436 20279
1051 20279 37634 11559 1260 25604 23844 -8514 -2643 39078 37586 -2328 -2990 22728 6612
1064 6612 -16802 14018 43522 10374 -20043 5599 21946 -4792 -8126 23918 20509 -20309
1076 -20309 -23953 9139 13864 -8326 -1423 18996 -1886 -35357 -17465 17680 3906 -23559
1088 -23559 -6628 9610 -20491 -33444 5989 20533 -18097 -31372 -2902 -5718 -33871 -18228
1100 -18228 16715 1462 -33737 -24136 770 -11913 -29157 -8837 6984 -22049 -43845 -15658
1112 -15658 7585 -14824 -27448 -2404 -2152 -39756 -38653 3180 3544 -29635 -22445 2956 -15863
1125 -15863 -37969 -9788 17237 -7398 -31793 -13684 -9 -18504 -19567 12374 19502 -13652
1137 -13652 -25190 2384 9486 -12731 -5028 24176 10269 -25075 -9671 25583 13801 -7252
1149 -7252 13662 25913 -8151 -21371 14266 30950 5674 -263 21558 16414 -10346 -1455 31501
1162 31501 27777 -3227 -2238 20391 11640 -5703 17810 43322 15952 -13712 8326 28784 5961
1175 5961 332 31913 31285 -6871 -7484 27405 28619 4680 11536 28537 8246 -16230 4472
1188 4472 34017 22024 -632 9517 19424 -3321 -13126 18987 33553 490 -16170 8107
1200 8107 11507 -11901 502 32143 15370 -22574 -13751 12043 386 -12110 10312 20799
1212 20799 -9310 -27603 -2941 13447 -3745 -11797 5358 1339 -28737 -27611 8329 12976 -16691
1225 -16691 -17327 3106 -13711 -37432 -12766 15011 -8797 -33972 -14399 -2287 -24224 -25784
1237 -25784 4074 5559 -27465 -35018 -10461 -6362 -22989 -14756 7660 -5196 -35025 -25387 4772
1250 4772 -2284 -23017 -8520 5605 -21294 -35763 -1813 17107 -9167 -19173 1626 -3632
1262 -3632 -28979 -16606 16320 10202 -16759 -12270 4919 -4287 -15330 5763 24255 2206 -21622
1275 -21622 -4839 14266 1323 -2677 24587 26944 -8547 -14013 19191 23752 1299 10550 30872
1288 30872 11125 -12923 9256 35928 22418 4481 16595 21606 -277 -5951 22241 35256
1300 35256 10812 -2477 15512 17775 -3812 2491 31370 22410 -11873 -6740 20359 11512 -4340
1313 -4340 17454 30602 582 -17289 8233 22725 4607 1025 19643 15713 -9235 -6342 22843
1326 22843 25343 1763 -313 15289 4260 -15433 3865 31156 12931 -13838 150 13176
1338 13176 -8462 -14669 14214 17244 -16309 -23080 473 1504 -16013 -6634 11494 -4812 -31191
1351 -31191 -22286 101 -5835 -20349 -8241 3017 -18504 -33661 -9205 8228 -13609 -25209
1363 -25209 -4714 -5462 -31787 -23931 8768 3251 -23899 -18080 -809 -14788 -28628 -8186 7809
1376 7809 -12362 -29208 -13377 -112 -14272 -19957 291 3429 -24304 -30818 -3598 3115 -17583
1389 -17583 -13364 9194 -3244 -28444 -11180 15776 1402 -16810 -864 9098 -10929 -14571
1401 -14571 13707 23582 733 -7392 9347 10805 -5437 965 25051 20780 -5761 -2942 20318
1414 20318 15458 -1156 14196 29999 5091 -14317 9588 25914 6446 1266 22569 19597
1426 19597 -6773 -3798 21955 20370 312 3682 18095 9172 -5929 9208 30175 16648 -4075
1439 -4075 6654 20988 4843 -3681 20806 29087 1618 -5861 19542 21970 102 5809 25668
1452 25668 11979 -11567 1133 21821 12147 -2511 8417 16412 -2089 -13001 6175 18015
1464 18015 -790 -13276 2771 7284 -13719 -12397 13930 10549 -18465 -16697 4167 -5354 -21668
1477 -21668 -3653 12530 -8874 -25904 -8114 3164 -12286 -17017 -59 270 -21957 -25328 -2632
1490 -2632 2415 -15605 -16025 744 -7017 -29072 -18352 5719 -5323 -26330 -12592 1160 -17866
1503 -17866 -26315 -1089 6373 -19018 -25693 -6312 -4894 -20935 -14411 5275 -1782 -22586 -17254
1516 -17254 2134 -1351 -16047 -6360 7710 -8080 -23394 -3118 15658 -977 -12151 6660
1528 6660 9102 -14186 -11131 16749 15638 -6867 -3083 13554 5099 -7334 8238 23986 9517
1541 9517 -8412 2080 15270 5894 -268 17296 24400 995 -8584 13341 21106 2440 3391
1554 3391 23360 14354 -9248 2427 26529 17369 466 11841 20472 2342 -5048 15737 26589
1567 26589 9095 17 13170 16792 1670 2535 22579 21300 -2443 -3696 16650 13411 -2938
1580 -2938 9017 25059 5876 -13421 3886 18355 2298 -4958 12414 11820 -10688 -11083 10903
1593 10903 12787 -4621 -5976 5311 -1545 -17205 -7139 12967 4731 -15673 -9215 3805 -9283
1606 -9283 -19811 1084 11222 -13017 -24574 -5127 -15 -16846 -12129 6926 -2084 -25311 -20344
1619 -20344 -1915 -5928 -17275 -8263 1189 -13824 -27302 -12627 3836 -7892 -20063 -7678
1631 -7678 -2908 -22068 -23857 1789 5880 -17145 -18210 -980 -7763 -23076 -8080 9750 -4686
1644 -4686 -21059 -9595 1755 -8228 -11788 4072 8001 -11071 -18936 -1124 8132 -4584 -5418
1657 -5418 10274 5901 -15520 -8406 15816 10895 -7309 1752 13651 -2844 -11675 11161 23533
1670 23533 5300 -4021 9146 10577 -2821 1668 20999 19879 134 -1650 14055 14075 2174
1683 2174 10554 25653 12092 -7770 4631 22737 11803 2366 19287 22509 -508 -4654 17937
1696 17937 21835 4639 5350 17874 10353 -4644 5135 22688 15893 -109 3879 13463 4193 -5370
1710 -5370 10011 21953 4403 -8915 5670 12937 -3028 -3661 15752 10646 -12544 -9450 10013
1723 10013 4998 -7850 1753 10620 -5017 -17440 -3698 7930 -2332 -11049 -1989 1040 -13832
1736 -13832 -17063 2153 7367 -12140 -17610 -2479 -5948 -21510 -11216 8485 -3622 -23194 -13288
1749 -13288 -1036 -13154 -18836 -2391 1942 -17050 -23677 -7681 -1854 -13035 -12869 -627 -4111
1762 -4111 -21766 -19407 -298 -449 -15925 -11107 2391 -9103 -22415 -5813 9475 -6198 -17392
1775 -17392 -3008 813 -14104 -12040 7214 6872 -11134 -10323 3310 915 -9154 -1894 10589
1788 10589 2462 -11930 -3569 11323 5044 -5216 6221 14051 -3091 -10317 9923 17200 431
1801 431 -597 14959 10162 -5553 3720 20792 13422 -891 5856 14760 6545 116 13459 22903
1815 22903 9196 -1517 9773 17456 5679 2410 18716 19834 -608 -849 18227 16117 709
1828 709 8245 20589 7159 -6350 7237 19280 7607 -300 10790 13389 -312 -3296 11093
1841 11093 14625 341 -3935 8218 8125 -5532 -1956 14177 7721 -10472 -4627 9563 -4 -10840
1855 -10840 2783 9770 -7003 -14741 992 5571 -8324 -9284 2369 -1396 -15487 -12381 2150
1868 2150 73 -12762 -10672 -804 -7245 -18706 -8326 4353 -7404 -20471 -9142 -867 -14636
1881 -14636 -17300 161 563 -18313 -18669 -2950 -5540 -16516 -9575 1348 -7993 -19813 -11541 393
1895 393 -6219 -14430 -6568 421 -11121 -18122 -2937 5508 -8441 -13552 390 917 -14107 -9213
1909 -9213 8736 2972 -12529 -5434 6642 -1388 -8770 3715 10669 -1950 -8672 2099 9104
1922 9104 799 -2049 8939 10604 -3079 -4626 11867 13665 -372 1356 14387 7527 -5557
1935 -5557 6242 20445 9581 -1530 8707 14335 2435 1308 16006 18309 3990 1540 12569
1948 12569 13173 4216 7196 18466 14029 -678 2415 16165 12292 1898 10365 18464 4371 -5327
1962 -5327 9520 17304 3585 113 12023 9662 -4807 -652 13722 10066 -2469 -426 7078
1975 7078 1473 -6433 1679 11423 2766 -9268 -2302 6572 -2763 -8383 4235 7228 -9924 -13525
1989 -13525 1943 2899 -9536 -5760 5050 -4225 -17157 -8488 2982 -3696 -11937 -5614 -1842 -11465
2003 -11465 -15675 -3947 2449 -8295 -16230 -7457 -4734 -15179 -13659 1572 -562 -16964 -14998
2016 -14998 -2568 -7381 -16129 -5487 2527 -10752 -18834 -7399 -827 -8767 -9978 -940 -1728 -14102
2030 -14102 -14767 -1563 1411 -7574 -7878 917 -2891 -13718 -6449 7621 1633 -10619 -3402 4431
2044 4431 -5900 -9023 6297 10449 -3618 -6567 4255 4711 -3579 1133 11649 6645 -4157 -682
2058 -682 10064 8904 2004 6892 13937 4844 -4335 6881 17987 8785 2364 12893 13698 454
2072 454 2167 17788 16718 4002 5437 13424 8097 1217 10715 19060 10603 1282 5525 11593 6166
2087 6166 2688 12084 15332 2920 -3726 7722 12110 2015 2464 12798 6834 -7227 -1311 11302
2101 11302 6281 -2580 4442 8041 -3062 -7218 3828 8624 -313 -4985 1176 1716 -6152 -5665 5174
2116 5174 5490 -7213 -8950 520 -1332 -10604 -3891 6049 -4348 -14892 -6001 1448 -7185 -10762
2130 -10762 -702 -1525 -14081 -14554 -3182 -1901 -9953 -9538 -3666 -7180 -16017 -11622 -916 -3641
2144 -3641 -13694 -10773 -3153 -9751 -15402 -4143 2474 -9459 -15709 -5383 -3052 -12599 -9077 2180
2158 2180 -1867 -12663 -9808 -748 -3396 -8198 -2757 1718 -4815 -11383 -4407 3896 -536 -5773 986
2173 986 4054 -6122 -8049 4968 8106 -3299 -2886 7146 3116 -4996 2883 12223 5113 -2377
2187 -2377 4016 8747 3162 1356 9531 12429 4345 524 8028 12231 5446 4255 12564 12014 867
2202 867 3004 14753 12509 3011 7729 14817 5797 -179 10043 15448 6425 2822 9658 9863 2428
2217 2428 3501 12093 11640 2784 1136 7973 7464 960 3602 11912 6747 -3576 1052 9232 3100
2232 3100 -2504 5806 8374 -3011 -5572 4733 5337 -3102 -2264 3784 -351 -7458 -3841 3240 47
2247 47 -6682 -4931 -21 -4376 -9616 -3660 2382 -5785 -12274 -4833 -935 -9222 -10238 -581 -2350
2262 -2350 -13137 -10891 -1792 -5404 -11777 -6689 -1932 -8753 -13384 -6959 -2049 -6915 -11150 -6790 -3914
2277 -3914 -10081 -12128 -3920 -789 -9342 -11863 -3151 -3783 -11630 -7604 1794 -3556 -12135 -6374 398
2292 398 -5339 -8328 -496 1739 -6251 -7928 -605 1830 -3047 -3463 2276 1997 -4594 -3610 5087 5198
2308 5198 -2587 -789 6716 2695 -3458 3893 11090 3408 -1880 5770 8611 1546 2272 10342 9378
2323 9378 1312 2825 9347 8637 4192 6355 11323 7854 1860 4998 12340 9411 3409 8404 12240
2338 12240 4763 1331 10526 13462 4673 2801 10104 8117 1055 5740 12774 7961 986 3557 7480
2353 7480 4258 1770 6260 9069 3426 -1736 2605 6976 2443 -867 5055 5248 -3700 -4239 5006
2368 5006 4422 -3573 -1472 4325 -2141 -7905 -1202 3458 -2488 -6505 -2166 -1728 -6286 -6552 -912 -195
2384 -195 -6466 -9510 -4698 -3399 -8208 -7637 -1076 -3943 -12249 -9851 -2164 -5822 -10770 -4764 -2481
2399 -2481 -10643 -12975 -5139 -2765 -8101 -8570 -4440 -6467 -11403 -9212 -2785 -3209 -7935 -8404 -4171 -5889
2415 -5889 -9591 -5041 1331 -3729 -10194 -5579 -952 -5822 -6473 1473 1557 -6783 -6434 677 8 -3735
2431 -3735 81 3729 -561 -5104 -1002 4082 3332 102 2490 5016 828 -2161 4255 9157 3461
2446 3461 338 5799 6882 500 3387 11370 8724 904 3724 8417 5007 3514 9069 11314 5524
2461 5524 2568 6428 8965 6717 5948 9241 9461 3605 2031 9228 10919 5415 5068 9568 6274 -162
2477 -162 5085 11451 6653 1934 5819 6672 1281 1253 7924 7883 1674 479 2954 3017 358 1858 5565
2494 5565 3904 -2787 -2934 2405 1537 -2848 400 3622 -2641 -7644 -1437 2318 -3294 -4291 44 -2300
2510 -2300 -8759 -6251 -508 -1837 -6253 -5361 -3815 -6278 -8657 -5676 -1959 -4644 -9314 -8440 -4701
2525 -4701 -7382 -9590 -4258 -2053 -9337 -11716 -5159 -4645 -9477 -6749 -1937 -6546 -11521 -7466 -3056
2540 -3056 -5485 -6839 -4251 -3896 -7691 -8227 -4104 -1013 -3461 -5616 -2846 -2169 -5741 -5482 1453 1672
2556 1672 -4799 -3982 1106 -1185 -3991 1359 5116 -515 -3203 1160 2766 -137 1145 5210 4009
2571 4009 217 138 3992 5471 3420 3324 6270 5022 739 2824 8855 7141 2455 5427 8497 3342
2587 3342 2229 8159 9824 4126 4007 8013 6380 3760 6090 9653 7091 4096 5177 6890 6954 4858
2603 4858 6142 8722 5797 1713 4884 8827 4951 2263 6904 7012 586 1321 7160 5912 807
2618 807 2887 5154 1456 -966 2713 4479 1489 -588 274 908 -874 -2198 465 1841 -2325 -5188
2634 -5188 -1261 -150 -4317 -4295 6 -2313 -8010 -5541 -1101 -4598 -7181 -3464 -2845 -7487 -7919 -4404
2650 -4404 -3974 -6790 -7229 -5308 -5694 -7678 -7638 -4877 -4320 -8082 -8387 -4619 -5347 -8831 -6500 -2332 -6085
2667 -6085 -9479 -5194 -2906 -6480 -6956 -2431 -3244 -7257 -6068 -2196 -2694 -4855 -3329 -2231 -3060 -4699
2683 -4699 -3062 -191 -408 -3399 -2310 845 -971 -2988 1129 4008 -741 -2446 2819 2977 -1065
2698 -1065 874 5326 2871 -348 2765 5210 3045 2485 4627 5221 3268 2438 4705 7044 5638 3531
2714 3531 5679 7507 4203 3291 8197 8525 3672 4157 8250 6066 3039 6592 9307 4929 3150 6317
2730 6317 6835 4552 5158 6845 5906 3499 3324 5563 6590 4126 3041 4822 4522 1045 2211 6082
2746 6082 4624 208 2409 4390 546 -1123 4055 3920 -1018 -946 1606 -55 -1767 -67 1362 -438
2762 -438 -2925 -3016 -1462 -1479 -3505 -3050 -1264 -3004 -6731 -4341 -1294 -4014 -6319 -3280 -3130 -8142 -7412
2779 -7412 -2678 -4028 -7375 -5865 -4422 -6857 -8033 -5401 -3850 -5991 -7172 -6540 -5510 -6202 -6467 -4846
2795 -4846 -3304 -6256 -8312 -5377 -3464 -6244 -5646 -2238 -3853 -7790 -5246 -1187 -3367 -5061 -2069
2810 -2069 -1391 -4997 -4305 -743 -72 -1374 -1357 -941 -910 -1317 -1204 1610 2798 -67 -1194 1979 2327 31
2828 31 2512 5884 2841 -533 2861 4844 2283 3000 6576 5333 1821 3317 5782 5171 4673 5535
2844 5535 6053 4791 3352 4324 6858 7184 4654 4894 6873 4720 2853 6611 8863 4979 2738 6262
2860 6262 5865 2674 4955 7999 5383 2294 3579 4696 3562 3710 5158 4867 2923 1117 2234 3892
2876 3892 3560 1753 2807 3171 -173 -1377 2595 3423 -488 -547 1672 -1017 -3839 126 1932 -1194
2892 -1194 -2748 -1565 -1979 -3885 -2757 -955 -1645 -3542 -5361 -4725 -3587 -4458 -4507 -2878 -3459 -7225 -7151
2909 -7151 -3450 -4148 -6675 -4374 -3295 -7202 -8736 -4560 -3607 -6505 -5573 -4271 -5953 -7395 -5823 -3821
2925 -3821 -4108 -5238 -5393 -4841 -4964 -5782 -4609 -2029 -2872 -6166 -4617 -1871 -3998 -4778 -918 -82 -4574
2942 -4574 -3841 -61 -1012 -2401 -64 1257 -1501 -2046 283 1242 862 754 1385 1918 882 206 2281
2959 2281 4512 3261 1031 3319 4196 1492 2312 6774 5500 2076 3581 6094 4006 2994 6637
2974 6637 7099 3891 3703 5334 5451 4736 5762 6518 5834 4191 3550 5734 6550 5349 4309 6369 5585
2991 5585 2078 4047 7246 4892 2427 4976 5450 1583 2181 5493 4530 1692 2363 3484 1893 1398
3007 1398 2305 2799 1663 -109 -106 1324 1177 -993 -147 1710 -886 -3377 -1064 1016 -2625 -3205 -466
3024 -466 -1372 -4929 -3329 -803 -2729 -4579 -3016 -3053 -4837 -5059 -3901 -3100 -4367 -5409 -5373 -4224 -5000
3041 -5000 -6215 -4658 -2939 -6069 -7392 -4214 -3888 -6954 -5555 -2893 -5071 -7701 -4767 -3414 -5392
3056 -5392 -5627 -3330 -3853 -5583 -4587 -3461 -3044 -3563 -3753 -3170 -2323 -3542 -3597 -1127 -586 -3315 -2804 181
3074 181 -774 -3046 -280 1317 -1259 -1913 1290 1791 -526 523 2328 1353 77 1527 3129 2618
3090 2618 2212 2167 3442 3714 2239 2723 5512 4585 1895 3425 5999 3628 2670 5952 6667 3144 3907
3107 3907 6558 5335 3513 5549 6445 4567 3540 5606 5765 4683 4398 4672 5408 4646 2982 4268
3123 4268 5628 4012 2224 4204 5235 2028 2165 5509 3761 237 1852 3959 1803 316 3212
3138 3212 2815 -18 14 1299 949 -115 31 103 40 -1271 -2348 -689 234 -2151 -3069 -1015 -1736 -4770
3156 -4770 -3285 -278 -3000 -5533 -3082 -2169 -5107 -5038 -2230 -3012 -5651 -5192 -3845 -4787 -5280 -4557 -3841
3173 -3841 -4270 -5456 -5985 -4146 -3772 -5618 -5177 -2921 -5066 -6984 -3948 -2489 -4770 -5722 -2600 -3681
3189 -3681 -6023 -4406 -1337 -3050 -4458 -2920 -2552 -3262 -3167 -1819 -1178 -1392 -2419 -2243 -564 -677 -1633
3206 -1633 -29 1496 -1091 -1981 1222 2001 -503 505 3166 1451 -986 1942 3975 2068 2023 3654
3222 3654 2933 1534 2697 3785 4684 3998 2944 3839 4407 3416 3317 5699 6017 3003 3007 5740 4898 2933
3240 2933 5565 7104 3811 2494 5012 5491 3320 4410 5823 4288 2928 3535 4249 4718 3759 3174
3256 3174 3947 3682 1791 2190 4393 3867 858 2074 3938 1145 -297 2974 3384 -560 -572 1564 299
3273 299 -1330 242 1222 -521 -2071 -1509 -1148 -1169 -1625 -1736 -1197 -2553 -4192 -3395 -1017 -2711 -4519
3290 -4519 -2573 -2323 -5404 -5585 -1854 -2881 -5554 -4662 -2996 -4965 -6319 -3680 -2691 -4986 -5151 -4632
3306 -4632 -4564 -4651 -4429 -3591 -2879 -4473 -6159 -4586 -2723 -4642 -4700 -2340 -2658 -5748 -4550 -1321 -2925
3323 -2925 -4284 -1677 -1202 -3784 -3699 -874 -794 -2039 -1606 -559 -1038 -1566 -1029 466 1231 -355 -708 1042
3341 1042 1402 -534 695 3689 1964 -286 2136 3736 1011 1244 4315 3845 1104 2017 4559 3504
3357 3504 3137 4260 4484 3465 2919 3743 4903 5218 3673 3771 5220 4359 2833 4862 6548 4336 2758
3374 2758 5326 5308 2606 3710 6186 4441 2094 3507 4681 2868 2775 4103 4114 2576 1937 2281 3006
3391 3006 2516 1415 2335 2814 767 -662 1519 2394 -317 -548 1855 -14 -2571 -809 1403 -919
3407 -919 -2256 -616 -739 -3040 -2372 -1015 -1621 -2572 -3114 -2709 -2680 -3199 -3911 -2382 -2315 -4384 -5149 -2653
3425 -2653 -2982 -5307 -3952 -1963 -4527 -6183 -3456 -2493 -5165 -4966 -2835 -4058 -5753 -4642 -3050 -3941
3441 -3941 -4408 -4396 -3449 -3569 -4071 -3713 -2278 -2481 -4113 -3693 -1547 -2695 -4139 -1651 -443 -3194 -3292 -392
3459 -392 -604 -2682 -1201 915 -645 -1620 -118 619 -172 -304 994 985 776 159 743 2489 1760 661
3477 661 2074 3340 1501 901 3804 4228 1141 2394 4951 3509 1736 3798 4937 2968 2956 4587
3493 4587 4459 3583 3673 4617 4613 3815 3299 4130 4712 3700 3104 4577 5008 2495 2981 5425 3784 1976 3652
3512 3652 5074 2449 1863 3819 3924 1465 1835 3603 2499 1137 1583 1933 1621 910 422 1423 1399
3529 1399 -189 -281 1299 324 -2002 -561 973 -1458 -2822 -582 86 -3012 -2676 -372 -1906 -4067
3545 -4067 -2458 -1846 -3059 -3774 -2809 -2790 -3550 -3890 -3832 -2847 -3135 -4810 -4102 -2710 -4399 -5615 -3526 -2321
3563 -2321 -4938 -5132 -2626 -3346 -5473 -3822 -2176 -3866 -5068 -3186 -2466 -4089 -3689 -2398 -2480 -3194 -3477
3580 -3477 -2837 -1726 -2139 -3145 -1664 -763 -2586 -2989 -423 -53 -2544 -1157 643 -586 -1923 497
3596 497 1868 -233 -445 1473 1105 46 801 2022 1926 1286 1173 1832 2610 1797 1837 3698 3514 1595
3614 1595 2020 4399 3781 2003 3951 5017 2359 1653 4464 5105 2749 3386 4900 3774 2874 3822 4661
3631 4661 4039 3462 3626 3601 3947 3124 3177 4583 3691 1683 2472 4233 2251 1457 3599 4039 941 1225
3649 1225 3075 2197 755 1915 2605 680 35 1162 1126 565 -31 374 46 -387 -1349 -730 568 -865
3667 -865 -2273 -1189 -729 -2967 -2562 -505 -1336 -3482 -2856 -1415 -3105 -3913 -2100 -1973 -3947 -4132 -3151
3684 -3151 -3306 -4087 -3400 -3375 -3730 -4030 -4617 -3487 -2367 -4102 -4241 -2782 -3109 -5317 -4285 -2058 -3091
3701 -3091 -4508 -2936 -2566 -4399 -3855 -1904 -2095 -3424 -2668 -2114 -2637 -2447 -2008 -951 -1140 -1854 -1879 -987
3719 -987 -596 -1618 -912 855 -81 -1791 -86 1743 -192 15 2051 1439 -360 869 2670 1775 965
3736 965 2220 2384 1517 1583 2531 3116 3290 2409 2300 3113 2857 2303 3605 4781 3095 2380 3960 4460 2258
3755 2258 3309 5254 3754 1833 3584 4633 3191 3044 4545 3779 2783 2501 3141 3765 3162 2761 2686
3772 2686 3131 1743 1173 2743 3563 1258 1133 2594 1759 -258 1469 2847 695 -502 1434 1043
3788 1043 -939 -426 753 280 -1167 -814 -445 -1014 -1313 -1693 -882 -971 -2740 -2648 -1049 -1595 -3265 -2597
3806 -2597 -1489 -2925 -4066 -2266 -1520 -3480 -3764 -2001 -2825 -4336 -3437 -2340 -3256 -3831 -3285 -3038 -3365
3823 -3365 -3843 -3418 -2695 -2969 -4006 -3740 -2367 -3140 -4137 -2378 -1535 -3856 -4122 -1523 -1990 -3450 -2426
3840 -2426 -1008 -2486 -2918 -1599 -743 -1843 -1504 -788 -943 -1117 -879 -447 371 93 -713 -152 1370 -123
3858 -123 -453 1810 1978 169 370 2512 1578 398 2280 3326 1447 1590 2943 2856 1977 2636 3133 2904
3876 2904 2621 2856 3204 3505 3164 2644 3702 3978 2664 2669 4545 3629 2233 3282 4452 2926 2334 3784
3894 3784 4022 1978 2406 3804 2819 2058 2417 3169 2511 2317 1957 2024 2161 1227 1075 2157 1915 210 867
3913 867 2163 716 -360 871 1281 -898 -660 1118 -2 -1402 -364 -261 -1102 -1698 -933 -1081 -1767
3930 -1767 -1985 -1771 -1811 -1961 -2827 -2665 -1941 -2445 -3413 -2516 -1619 -3417 -3872 -2056 -2583 -4338 -3418 -1846 -3508
3949 -3508 -4351 -2786 -2586 -3628 -3453 -2679 -3005 -3126 -3259 -3138 -2627 -2694 -3214 -2861 -1899 -3264 -3285 -1775 -1411
3968 -1411 -3234 -2717 -691 -1602 -2800 -940 -460 -1709 -1911 -283 -299 -1201 -498 8 -284 -388 -183 348
3986 348 672 443 234 1091 1379 470 759 2181 1916 530 1796 3064 1417 1211 2950 3163 1513 2311
4004 2311 3414 2671 2113 2900 3457 2976 2873 2922 3155 3251 2883 2662 3469 3299 2250 2668 3790 2837 2157
4023 2157 3262 3521 1958 1948 3546 2691 1707 2571 2867 1812 1577 2438 1977 1458 1671 1588 1568 1172 660
4042 660 853 1390 805 -364 111 1116 -587 -830 799 -41 -1644 -931 -38 -1073 -1752 -620 -701 -2141
4060 -2141 -1794 -1279 -1805 -1973 -2258 -2059 -2258 -2565 -3012 -2444 -1695 -2497 -3197 -2220 -2560 -3971 -3318 -1901 -2912
4079 -2912 -3923 -2668 -2471 -3771 -3245 -1966 -2412 -3287 -2921 -2770 -2784 -2937 -2272 -2246 -2289 -2422 -2661 -2002 -1584
4098 -1584 -2329 -2017 -1246 -1760 -2604 -1379 -22 -1423 -1526 -204 -358 -1599 -818 706 -242 -804 570
4115 570 327 -256 423 964 1031 1517 1099 939 1729 1727 1508 1572 2627 1897 1117 2671 2828 1676 2195 3591
4135 3591 2530 1588 2702 3643 2564 2453 3277 3097 2517 2711 3139 2908 2998 2754 2678 2924 2940 2080 3011 3352
4155 3352 2280 1926 3024 2597 1258 2161 3216 1915 1285 1932 1865 779 1173 1925 714 408 610 796
4173 796 432 658 456 218 20 -117 -984 -129 193 -1413 -1328 -262 -1104 -2433 -939 -511 -2329 -1906 -1215
4192 -1215 -1845 -2565 -2101 -1535 -2445 -2540 -2307 -2835 -2885 -2155 -2652 -2591 -2460 -3017 -3172 -2290 -2502 -3466 -2738 -1758 -3116
4213 -3116 -3518 -1956 -2067 -3239 -2462 -1957 -2836 -3254 -2127 -1717 -2511 -2389 -2002 -2222 -2015 -1721 -1635 -1384 -1108
4232 -1108 -1585 -1520 -658 -1036 -1364 108 -162 -1372 -859 467 293 -627 517 1174 -121 330 1288 1121
4250 1121 496 1313 1884 1283 1089 1579 1658 2113 2158 1657 1997 2428 1801 1957 3029 2947 1886 2292 3404 2322
4270 2322 1781 3250 3405 1997 2475 3060 2690 2330 3010 3171 2313 2611 2711 2262 2745 2455 1929 2448 2505
4289 2505 1395 1619 2247 1673 801 1962 1790 790 670 1674 1043 173 776 1156 -25 50 541 252
4307 252 -308 -359 -331 -656 -363 -756 -890 -618 -765 -1537 -1357 -591 -1877 -1938 -900 -1557 -2800 -2282 -1100 -1991
4327 -1991 -2682 -1865 -1887 -2810 -2331 -1789 -2664 -2454 -2320 -2549 -2680 -2444 -2984 -3018 -2118 -2411 -3019 -2345 -2002 -3080
4347 -3080 -2805 -1706 -2044 -3046 -1615 -1394 -2259 -2567 -1232 -1756 -2214 -1365 -1247 -1476 -1291 -942 -1125 -845
4365 -845 -590 -800 -298 -120 -471 -560 257 278 -527 62 1357 308 36 1218 1313 330 747 1876 1291 1272
4385 1272 2042 1920 1579 1715 2204 2201 2207 2456 1761 2294 2550 2367 2032 2788 2760 1770 2628 3056 1760 1982 3263
4406 3263 2586 1924 2773 2766 1991 2097 2495 2466 1729 2499 2010 1742 2262 1861 1648 1591 1802 1000 1477 2017 1069
4427 1069 744 1317 1210 -321 363 1336 -274 -460 561 403 -671 -169 92 -419 -769 -662 -736 -1490 -1064
4446 -1064 -1298 -1377 -1022 -1231 -1934 -1559 -1333 -2135 -2265 -1242 -1711 -2740 -2059 -1664 -2768 -2508 -1622 -2475 -3096
4465 -3096 -2565 -2279 -2926 -2631 -1930 -2771 -2427 -2385 -2683 -2649 -1809 -2406 -2726 -1963 -1938 -2227 -2170 -1247 -1674 -2620 -1042
4486 -1042 -1329 -2065 -1240 -635 -1202 -1527 -549 -732 -1192 -229 34 -191 -496 -19 -379 -11 447 173 367 950
4506 950 794 94 1026 1489 963 933 1873 1228 471 1704 2143 1454 1657 2250 1987 1761 2263 2659 1860 2321
4526 2321 2411 1897 2130 2410 2398 2324 2778 2202 1850 2670 2603 1875 2564 2844 1909 1452 2624 2380 1466 1943 2430
4547 2430 1585 1211 2198 1605 1404 1753 1542 712 1165 1297 863 1055 1220 297 180 588 178 -301 327 688
4567 688 -690 -808 195 -506 -1140 -416 -323 -1490 -1219 -866 -1650 -1508 -804 -1453 -1806 -1560 -1922 -2068 -1748
4586 -1748 -1627 -2151 -2288 -1502 -2380 -2566 -1723 -1807 -2525 -2506 -1934 -2586 -2848 -1619 -1964 -2828 -2058 -2054 -2638 -2531 -1828
4607 -1828 -2042 -2019 -1708 -2292 -2283 -1279 -1448 -1831 -1374 -862 -1616 -1623 -651 -764 -1572 -465 -285 -1158 -786 -143 -488
4628 -488 -659 90 -20 -320 190 683 194 444 1149 565 540 1148 1128 732 1399 1813 1238 1422 2025 1418 1175
4649 1175 2249 2068 1323 1861 2465 1713 1646 2627 2454 1961 2297 2338 2017 2430 2942 2091 2040 2471 1891 2059
4669 2059 2565 2174 1336 1948 2481 1410 1627 2563 1473 885 1566 1583 901 1079 1275 998 968 960 715 58
4689 58 791 649 198 195 510 -426 -160 31 -190 -702 -235 -289 -1336 -1130 -80 -1088 -1368 -674 -1164 -1728
4709 -1728 -1214 -1037 -1798 -1812 -1341 -1540 -2185 -1735 -1759 -2121 -1887 -1767 -2440 -2133 -1733 -2512 -2313 -1450 -1990 -2342
4729 -2342 -1979 -1564 -2272 -2380 -1492 -2052 -2490 -1649 -1449 -2421 -1716 -1217 -1834 -1552 -1289 -1338 -1588 -1090 -1097 -1395 -774
4750 -774 -961 -1176 -586 -156 -726 -873 -95 -323 -712 -110 385 176 -232 619 484 109 537 793 473 989
4770 989 1293 835 1283 1569 1419 1232 1379 1633 1480 1910 1891 1644 1469 2160 1872 1575 2353 2443 1963 1752 2245
4791 2245 2217 1755 2643 2073 1767 1931 2277 1494 1896 2186 1662 1528 2103 1537 1201 1911 1925 987 1305 1616
4811 1616 777 896 1178 1307 565 1020 1263 525 493 837 397 14 130 314 -185 -316 -136 -658 -485 -280
4831 -280 -763 -878 -443 -918 -1634 -909 -839 -1789 -1557 -991 -1520 -2036 -1543 -1173 -2142 -1768 -1566 -2282 -2281 -1784 -1986
4852 -1986 -2161 -1938 -1631 -2266 -2111 -1872 -2158 -2156 -1681 -2168 -2382 -1997 -1533 -1847 -1756 -1191 -1868 -1882 -1284 -1349 -2118
4873 -2118 -1137 -959 -1647 -1248 -433 -771 -1144 -361 -579 -646 -397 -403 -950 -323 135 -187 -147 106 420 -254 609
4894 609 876 302 780 1352 726 339 1204 1073 711 1118 1339 867 1169 1727 1457 1298 2149 1734 1164 1735
4914 1735 1947 1739 1849 1807 1558 1393 2347 2091 1256 1801 2370 1510 1588 2211 1674 1612 2342 1931 1490 1352 1449
4935 1449 1613 1423 1563 1046 1105 1309 1208 914 1156 1315 365 612 888 450 -176 568 924 -291 -208 163
4955 163 -379 -510 -17 -434 -771 -628 -615 -997 -713 -631 -994 -1297 -872 -1478 -1284 -1248 -966 -1946 -1446 -1255 -1881
4976 -1881 -2012 -1309 -1560 -2156 -1673 -1563 -2227 -2108 -1144 -1960 -2279 -2077 -1951 -2111 -1712 -1599 -1684 -1551 -1595 -1699
4996 -1699 -1935 -1432 -1275 -1740 -1224 -1340 -1579 -1340 -786 -915 -1598 -404 -930 -1271 -679 -349 -767 -1084 71
5015 71 -155 -789 49 105 -291 310 312 216 456 867 509 497 1432 1013 482 852 1324 644 839 1835 1212 802
5037 802 1651 1610 1241 1521 2062 1337 1529 1892 1555 1576 2050 1836 1586 1573 1848 1341 1573 2168 1951 1153 1956
5058 1956 2121 1326 1671 2035 1363 991 1425 1350 940 1351 1533 1115 1066 1118 747 468 901 570 239 687 599
5079 599 -17 218 838 64 -232 338 -413 -742 -277 342 -978 -948 -188 -716 -1098 -646 -750 -1310 -1149 -741
5099 -741 -1472 -1460 -1327 -1487 -1658 -1182 -1247 -2031 -1499 -1036 -1781 -1892 -1254 -1694 -2275 -1495 -1414 -1943 -1622 -1250 -2065
5120 -2065 -1642 -1548 -1557 -1694 -1423 -1415 -1734 -1559 -1159 -1359 -1257 -1157 -1519 -1143 -489 -978 -1359 -601 -504 -924 -892 -365
5142 -365 -427 -718 -34 -20 -562 -214 419 124 114 193 478 325 386 779 529 1048 897 930 656 1490 1112 698
5164 698 1548 1685 1139 1211 1870 1283 1264 1463 1806 1298 1577 1894 1394 1401 1803 2066 1575 1952 1870 1438 1831 1849
5186 1849 1449 1345 1849 1326 1034 1728 1430 1148 1400 1867 879 699 1556 1099 452 944 1044 578 568 736
5206 736 693 190 572 264 -1 228 -8 -153 -193 -47 -574 -521 118 -571 -875 -292 -508 -1065 -926 -556 -1293
5227 -1293 -1389 -706 -922 -1358 -1538 -966 -1453 -1618 -1540 -1715 -1706 -1263 -1569 -1744 -1258 -1338 -1784 -1550 -1156 -1759 -2003
5248 -2003 -1287 -1367 -2112 -1649 -1095 -1748 -1774 -1167 -1209 -1474 -1126 -867 -1252 -1111 -1018 -1271 -1063 -521 -882 -956 -283
5269 -283 -497 -599 -525 -121 -641 -701 211 -155 -443 356 218 204 192 581 393 413 644 379 663 787 1009 644
5291 644 1217 1514 1182 1012 1506 1253 1143 1692 1708 1207 1354 1673 1534 1007 1847 1581 1220 1617 1835 1407
5311 1407 1060 1641 1542 1397 1603 1380 1155 1449 1505 1298 1276 1403 1075 1005 1461 1305 464 1149 1115 546 346
5332 346 951 471 240 612 460 68 262 735 -210 -202 243 -81 -634 -203 -66 -498 -325 -402 -811 -753 -251
5353 -251 -1039 -978 -388 -981 -1400 -1000 -793 -1362 -1597 -804 -951 -1595 -1550 -1173 -1568 -1383 -1013 -1490 -1660 -1384 -1571
5374 -1571 -1639 -1377 -1336 -1742 -1460 -1058 -1498 -1549 -838 -1398 -1812 -1116 -1049 -1466 -1110 -535 -1401 -1260 -830 -697 -934
5395 -934 -989 -407 -777 -600 -221 -676 -548 -165 -217 -113 183 162 -445 7 568 189 414 858 540 326 696
5416 696 943 1051 614 1174 862 713 1233 1155 1096 1222 1192 1062 989 1359 1094 1276 1873 1568 925 1490 1569 1160
5438 1160 1369 1703 1594 995 1687 1483 1266 1426 1700 1166 829 1178 1003 735 1267 1329 937 1140 1095 746
5458 746 693 1243 474 215 1166 707 215 393 995 202 -94 329 352 -288 -12 326 -405 -431 -238 -620 -414
5479 -414 -251 -510 -662 -700 -829 -1051 -400 -638 -1404 -1346 -615 -1204 -1433 -1088 -862 -1218 -1454 -1113 -1404 -1757 -1074
5500 -1074 -1351 -1562 -1388 -1209 -1535 -1456 -1003 -1083 -1336 -986 -1359 -1391 -1396 -1055 -1422 -1056 -799 -1047 -971 -759 -812 -1310
5522 -1310 -879 -655 -930 -866 -80 -485 -577 -500 -79 -621 -209 -89 -79 54 156 92 59 235 292 108 492 506
5544 506 468 379 1143 707 280 818 1257 538 1125 1061 936 1089 1272 1097 1036 1108 1497 1362 1297 1319 1226 1333 1517
5567 1517 1345 1077 1405 1464 1005 1508 1594 1225 984 1531 1143 978 1488 1548 1013 844 1028 932 890 963 976 574
5589 574 732 702 341 502 801 -61 379 565 218 -267 109 73 -157 -358 202 -308 -672 -254 0 -560 -643
5610 -643 -312 -1056 -707 -584 -770 -956 -714 -933 -1328 -1257 -860 -1451 -1247 -871 -1502 -1449 -1038 -996 -1565 -1295 -609
5631 -609 -1377 -1746 -1219 -1431 -1816 -1144 -1293 -1327 -1441 -866 -1048 -1166 -654 -1307 -1630 -817 -954 -1015 -997 -510 -847
5652 -847 -900 -361 -742 -772 -470 -254 -903 -497 -454 -545 -436 195 130 -92 -281 601 -27 110 710 316 597 609
5674 609 385 398 906 922 583 421 1164 419 750 1142 1169 723 963 1118 987 1255 1267 1121 1146 1078 1178 1096
5696 1096 1269 1578 1017 1403 1269 868 976 1519 1083 943 1174 1481 616 845 1295 1148 752 1289 1026 746
5716 746 757 1115 689 569 756 584 370 303 314 136 314 651 -102 76 247 105 -273 4 36 -495 -599
5737 -599 -144 -330 -682 -268 -782 -768 -611 -649 -1095 -975 -744 -1133 -952 -1000 -1067 -1036 -868 -983 -1410 -1083 -708 -1515
5759 -1515 -1247 -1087 -1421 -1485 -1352 -849 -1524 -1082 -575 -1246 -1324 -800 -1023 -1284 -1035 -966 -913 -1014 -669 -1043 -908
5780 -908 -513 -490 -971 -608 -614 -847 -395 105 -526 -555 4 -177 -227 -100 309 -172 -140 221 150 255 337 440 161
5803 161 456 674 503 619 742 472 528 969 894 543 852 1109 892 834 1298 834 850 1414 1324 1133 1140 1582
5825 1582 878 855 1216 1288 1083 1195 1492 1037 942 1289 1120 983 1445 998 836 1053 982 862 591 1126 791
5846 791 403 784 580 468 594 802 74 17 455 470 240 433 62 -193 -247 -2 -329 43 33 -275 -582
5867 -582 -369 -496 -583 -112 -425 -995 -905 -387 -913 -1209 -932 -865 -1009 -805 -742 -1051 -1014 -800 -1146 -1341 -923 -968
5889 -968 -1588 -957 -979 -1322 -1373 -960 -1447 -1569 -867 -1094 -1327 -1061 -897 -1087 -1181 -759 -972 -1188 -1022 -742 -942
5910 -942 -494 -691 -636 -926 -508 -656 -740 -497 -381 -661 -487 -400 -334 -212 63 93 -108 281 381 -80 294 801
5932 801 425 242 572 502 536 369 712 707 889 931 878 711 1032 855 751 1099 1329 594 844 1356 1048 859
5954 859 1327 1077 1154 1292 1251 1023 968 1388 1093 834 1140 930 970 1009 1192 617 953 1201 592 604 1054 712
5976 712 336 635 650 380 372 767 475 49 258 612 -220 57 -11 -147 -283 19 -112 -542 4 -245 -792
5997 -792 -579 -203 -795 -688 -344 -768 -1015 -569 -636 -1057 -961 -582 -1202 -915 -599 -924 -1356 -811 -959 -1553 -1010
6018 -1010 -968 -994 -1103 -724 -899 -1167 -742 -728 -1338 -1071 -689 -1154 -1247 -495 -880 -747 -1072 -832 -1178 -917 -404
6039 -404 -971 -846 -244 -325 -946 -435 -27 -557 -416 145 -106 -284 43 -227 -172 80 269 1 136 309 279
6060 279 -129 366 530 271 515 809 376 457 704 773 527 920 969 450 969 775 785 982 1187 1274 846 1267
6082 1267 1229 766 940 1241 554 1058 1305 1213 696 1240 936 505 1037 927 840 925 1067 807 952 809 980
6103 980 453 751 874 368 291 520 252 223 296 184 19 267 291 27 -3 112 -7 -296 -82 -35 -581 -288
6125 -288 -44 -794 -397 -279 -588 -329 -299 -549 -894 -751 -642 -748 -892 -552 -691 -1180 -935 -577 -1224 -1109
6145 -1109 -684 -1158 -1448 -945 -664 -1045 -1110 -743 -1386 -990 -804 -1206 -1228 -685 -774 -1176 -683 -700 -820 -894 -695
6166 -695 -727 -1260 -375 -678 -662 -806 -218 -668 -578 -175 -349 -321 14 -265 -465 -180 -42 -99 -52 463 138 31
6188 31 179 437 -57 396 905 513 163 630 424 390 1058 1053 418 699 873 520 492 988 966 750 1032 1057
6210 1057 724 681 1027 839 708 1188 1182 653 1111 1222 962 704 1120 1123 526 1051 1058 853 896 828 658 741 1067
6233 1067 484 655 528 494 284 543 450 342 313 400 274 -283 231 193 -116 -107 102 -221 -384 -177 -234 -377
6255 -377 160 -237 -463 -412 -275 -720 -885 -437 -600 -493 -583 -553 -1030 -790 -675 -973 -855 -526 -750 -1232 -944
6276 -944 -983 -1079 -1065 -790 -1101 -1242 -910 -730 -898 -1027 -693 -1094 -888 -475 -920 -1147 -534 -848 -1073 -703 -462
6297 -462 -926 -704 -180 -674 -507 -231 -272 -303 -30 -326 -552 -153 198 -294 -393 -44 84 -145 213 499 218
6318 218 255 539 -9 18 336 529 406 694 816 551 532 839 537 732 686 851 434 795 1188 707 759 725
6340 725 745 1010 939 1120 816 1317 1264 796 869 1112 705 675 1086 1118 824 867 774 553 625 760 807 430 443 560
6364 560 265 483 880 270 129 421 318 289 460 454 -162 151 141 -61 -164 -7 11 -333 -294 -50 -412 -593
6386 -593 -137 -362 -832 -329 -328 -582 -597 -518 -854 -1130 -517 -724 -609 -804 -593 -1046 -520 -730 -1374 -849 -730
6407 -730 -627 -1284 -538 -667 -1019 -627 -891 -959 -674 -747 -885 -960 -689 -624 -1089 -610 -492 -825 -997 -509 -478 -692
6429 -692 -370 -229 -556 -336 -228 -503 -535 -245 -127 -94 -192 -39 -261 -21 57 81 -71 217 287 25 540 334
6451 334 320 559 713 669 303 600 607 299 870 797 534 702 1237 673 478 1154 795 883 845 771 807 626 1000
6474 1000 943 716 982 806 793 1010 1017 612 405 902 890 742 614 914 513 503 741 226 471 519 552 570 867
6497 867 297 168 384 696 38 81 389 -127 -38 55 -131 -40 133 533 -413 -327 20 -330 -279 -396 -353 -821
6519 -821 -354 -56 -484 -657 -356 -590 -798 -529 -526 -727 -575 -502 -720 -702 -793 -674 -1111 -834 -845 -910 -854 -772 -804
6542 -804 -1065 -650 -691 -969 -730 -541 -1066 -845 -560 -971 -896 -557 -747 -843 -371 -309 -400 -555 -681 -510 -543 -200
6564 -200 -174 -530 -285 -133 -287 -317 159 -100 -164 190 280 70 235 205 134 285 406 308 464 361 655 243
6586 243 233 794 516 663 586 598 501 861 829 312 912 1074 304 556 902 814 524 771 784 936 805 1083
6608 1083 682 667 771 923 564 972 507 550 648 897 447 561 690 652 466 585 454 125 418 224 174
6629 174 328 195 245 86 302 310 33 -78 153 85 37 133 -17 -423 -397 158 -446 -564 -259 -507 -543 -192 -163
6652 -163 -1010 -575 -483 -1031 -587 -576 -683 -783 -677 -565 -785 -442 -766 -680 -609 -594 -923 -1006 -513 -518 -879 -773 -700
6675 -700 -747 -983 -245 -574 -925 -554 -621 -779 -667 -597 -824 -485 -320 -762 -613 -208 -413 -353 -428 -240 -729 -82
6697 -82 -85 33 -222 -7 59 69 308 237 55 22 206 -16 436 380 334 396 428 498 204 582 843 495 282 692
6721 692 566 355 1033 670 756 591 383 729 532 544 976 965 692 708 763 1029 844 643 609 722 746 471
6743 471 1021 702 630 518 953 593 529 534 588 519 382 656 460 138 555 289 269 339 106 261 -134 196 -139
6766 -139 -81 -188 47 -70 112 -49 -258 -438 -222 -371 -431 -370 -437 -471 -624 -313 -637 -685 -393 -580 -578 -411 -443
6789 -443 -824 -236 -486 -419 -796 -498 -770 -778 -589 -306 -857 -813 -549 -720 -588 -439 -581 -772 -577 -543 -657 -730
6811 -730 -548 -799 -798 -607 -146 -480 -439 -604 -687 -215 -8 -411 -320 -100 -222 -771 -162 -259 -553 -248 26 -103
6833 -103 -86 400 -147 138 254 317 237 151 571 144 414 469 278 322 150 657 449 562 712 486 907 529
6855 529 788 388 745 886 636 807 997 652 627 995 647 500 634 734 627 876 832 542 599 853 728
6876 728 546 757 585 356 441 800 472 294 476 441 368 28 579 504 123 568 113 -64 123 -138 -149 307
6898 307 88 -52 -508 214 -326 -340 -100 -391 -455 -277 -140 -408 -329 -252 -489 -559 -593 -541 -709 -646 -461 -532 -771
6921 -771 -436 -484 -910 -471 -457 -681 -526 -517 -421 -1018 -589 -412 -715 -527 -690 -703 -817 -374 -701 -455 -615 -589
6943 -589 -521 -630 -496 -370 -168 -415 -242 -135 -157 -368 -440 -156 -251 -119 -365 -53 -71 -91 70 197 -43 -135
6965 -135 431 209 -103 225 205 143 245 481 271 363 850 154 207 636 634 270 422 648 441 764 730 702 701
6988 701 839 422 497 567 661 551 459 581 568 614 977 736 378 571 836 547 332 832 476 337 645 510
7010 510 313 351 204 216 128 305 309 174 302 243 -262 54 229 -193 -135 38 220 -340 -42 -109 -314 -473 248
7033 248 -415 -599 -135 -257 -117 -520 -772 -463 -546 -599 -643 -531 -358 -188 -1124 -574 -379 -937 -463 -557 -673
7054 -673 -652 -335 -587 -813 -611 -501 -830 -853 -482 -315 -975 -568 -691 -779 -609 -489 -529 -607 -334 -426 -689 -107
7076 -107 -216 -540 -193 -131 -667 -281 0 -250 -204 -177 55 -319 -185 91 -220 -32 394 -14 -141 388 290
7097 290 -57 243 286 47 345 375 205 172 539 624 405 654 415 144 597 724 787 595 660 771 457 518
7119 518 632 687 535 810 644 550 555 570 485 508 761 605 534 902 240 433 681 684 316 480 189 323 432
7142 432 476 134 500 501 495 299 146 361 135 108 327 124 174 151 -112 -75 -147 89 -150 -297 22 -142 -327
7165 -327 -217 -254 -542 -383 -94 -490 -295 -401 -480 -990 -739 -467 -425 -487 -595 -676 -773 -774 -475 -732 -543 -496 -898
7188 -898 -724 -487 -769 -597 -454 -4 -635 -577 -412 -537 -408 -304 -258 -375 -464 -355 -441 -385 -261 -494 -541 -17
7210 -17 24 -410 -198 -128 -202 65 -13 -68 -59 21 -10 69 -2 -9 95 242 283 31 305 209 573 496 197 626 62 186
7236 186 447 451 326 408 681 448 625 809 324 305 419 340 510 456 478 339 751 581 105 784 906 347
7258 347 119 652 550 311 684 373 331 374 641 298 198 519 189 -84 274 467 242 263 215 67 72 -10
7280 -10 351 81 424 0 -133 -101 45 30 -30 -244 -312 -333 -5 -48 -451 -364 197 -98 -789 -72 -296 -536 -661
7303 -661 -202 -116 -693 -296 -174 -726 -174 -493 -706 -509 -357 -639 -573 -759 -539 -887 -486 -724 -590 -517 -444
7324 -444 -576 -422 -273 -645 -589 -592 -255 -586 -297 -368 -278 -506 -36 -212 -635 -216 -238 -368 -439 -132 -122 -372 209
7347 209 -117 -68 34 61 19 -43 220 23 -22 365 191 111 149 259 364 200 651 344 198 743 319 201
7369 201 436 521 358 522 449 423 431 402 415 375 466 286 400 472 712 412 611 595 730 183 495 643 520 436
7393 436 618 518 260 638 348 193 274 633 315 211 647 466 141 321 138 74 -260 324 -105 -199 86
7414 86 59 -215 -206 291 -125 -16 -58 -182 -464 112 -357 -414 -295 -4 -312 -252 -72 -512 -634 -548 -425 -565 -334
7437 -334 -437 -949 -336 -566 -460 -528 -386 -459 -584 -313 -152 -527 -596 -314 -523 -494 -405 -698 -404 -522 -448 -610
7459 -610 -510 -354 -345 -282 -459 -10 -294 -487 107 -574 -4 -16 -109 -207 105 -94 -443 -214 38 -161 21 103
7481 103 309 149 275 190 234 501 232 182 320 305 289 236 376 558 168 242 626 342 335 497 103 150 339
7504 339 558 225 403 566 234 61 712 666 254 331 632 544 489 587 547 489 445 571 292 552 479 319 355
7527 355 601 217 118 129 537 2 183 395 199 239 51 181 28 187 214 -126 268 241 -210 126 132 -109
7549 -109 -299 -45 97 -433 -370 -47 -343 -194 -123 -423 -349 -535 -490 -247 -309 -435 -513 -475 -256 -323 -466 -542 -592
7572 -592 -661 -523 -469 -351 -487 -250 -419 -471 -285 -412 -361 -530 -544 -291 -428 -152 -433 -546 -374 -260 -286 -685
7594 -685 -213 -99 -543 -272 -52 -366 -48 -169 -442 5 77 33 -470 47 141 -8 189 154 140 230 246 30
7616 30 95 100 268 233 218 382 67 286 475 783 264 533 514 373 524 553 171 335 453 106 282 431 550
7639 550 169 487 699 523 519 493 319 383 108 465 402 584 439 102 324 549 244 320 288 365 420 298 299 207
7663 207 16 396 302 -58 435 197 114 108 71 -291 178 28 104 34 -47 0 -115 -127 39 -38 -223 -62 -231 -493
7687 -493 -268 -31 -509 -235 -415 -301 -456 -416 -255 -701 -282 -126 -494 -492 -428 -391 -663 -292 -796 -552 -346 -748
7709 -748 -794 -333 -383 -228 -419 -374 -329 -727 -333 -242 -595 -274 -196 -630 -355 -324 -273 -214 -2 -136 -351 -381 -65
7732 -65 -375 -236 -27 178 -118 -54 -15 -61 -39 329 55 98 148 56 -368 110 367 200 160 200 506 258 204 286
7756 286 415 416 394 327 353 259 295 176 283 526 365 502 536 349 427 541 172 112 732 537 50 418 329 584
7780 584 -41 324 381 39 479 398 368 184 429 343 95 433 180 46 430 503 123 298 466 153 -268 -74
7802 -74 -30 -381 33 30 -8 -179 -52 -327 -286 -57 48 -339 -134 -370 -159 -149 -152 -497 -590 -59 -259 -373 -217
7825 -217 -261 -270 -267 -524 -391 -589 -418 -151 -519 -668 -552 -418 -629 -346 -358 -486 -374 -365 -478 -306 -618 -437 -533
$$ [...]
8191B16
##END NTUPLES=NMR FID
##END=
