##TITLE=1H_TG-2235-3
 CDCl3, 8 sc, 
 11.2.2019
##JCAMPDX= 6.0         $$ Bruker NMR JCAMP-DX V2.0
##DATA TYPE= NMR FID
##DATA CLASS= NTUPLES
##ORIGIN= UXNMR, Bruker Analytische Messtechnik GmbH
##OWNER= root
$$ XWIN-NMR		Version 3.5
$$ Mon Feb 11 14:39:23 2019 Russian Standard Time (UT+4h)  she@DPX200
##.OBSERVE FREQUENCY= 200.1313
##.OBSERVE NUCLEUS= ^1H
##.DELAY= (6, 6)
##.ACQUISITION MODE= SIMULTANEOUS
##.ACQUISITION SCHEME= undefined
##.AVERAGES= 8
##.DIGITISER RES= 18
##SPECTROMETER/DATA SYSTEM= spect
##.PULSE SEQUENCE= zg30
##.SOLVENT NAME= CDCl3
##.SHIFT REFERENCE= (INTERNAL, CDCl3, 0, 15.7039)
##AUDIT TRAIL= $$ (NUMBER, WHEN, WHO, WHERE, WHAT)
$$ ##TITLE= Audit trail, XWIN-NMR		Version 3.5
$$ ##JCAMPDX= 5.01
$$ ##ORIGIN= Bruker BioSpin GmbH
$$ ##OWNER= she
$$ F:/spectra/data/she/nmr/H-F/1/audita.txt
$$ ##AUDIT TRAIL=  $$ (NUMBER, WHEN, WHO, WHERE, WHAT)
(   1,<2019-02-11 14:36:48.07 +0400>,<she>,<DPX200>,
      <created by zg, POWCHK disabled, PULCHK disabled
       configuration hash MD5:
       00 E9 B6 7A A2 85 ED C7 34 08 36 98 17 FE 4E 26
       data hash MD5: 16K
       5C E8 86 E0 5B 42 1D A2 E1 4C 49 87 E8 33 41 5B>)
$$ ##END=
$$ 
$$ hash MD5
$$ 11 7E 88 71 A0 D8 48 BD 87 A7 51 E2 C6 D7 AD 73
##$RELAX= 
##$RELAX= 
##$RELAX= 
##$RELAX= 
##$RELAX= 
##$RELAX= 
$$ Bruker specific parameters
$$ --------------------------
##$DU= <F:/spectra>
##$EXPNO= 1
##$NAME= <H-F>
##$PROCNO= 1
##$TYPE= <nmr>
##$USER= <she>
##$AMP= (0..31)
100 100 100 100 100 100 100 100 100 100 100 100 100 100 100 100 100 100 
100 100 100 100 100 100 100 100 100 100 100 100 100 100 
##$AQSEQ= 0
##$AQ_mod= 1
##$AUNM= <au_zg>
##$AUTOPOS= <>
##$BF1= 200.13
##$BF2= 200.13
##$BF3= 200.13
##$BF4= 200.13
##$BF5= 200.13
##$BF6= 200.13
##$BF7= 200.13
##$BF8= 200.13
##$BYTORDA= 1
##$CFDGTYP= 0
##$CFRGTYP= 5
##$CHEMSTR= <none>
##$CNST= (0..31)
1 1 145 1 1 1 1 1 1 1 1 1 1 1 1 1 1 1 1 1 1 1 1 1 1 1 1 1 1 1 1 1 
##$CPDPRG= <>
##$CPDPRG1= <>
##$CPDPRG2= <>
##$CPDPRG3= <>
##$CPDPRG4= <mlev>
##$CPDPRG5= <mlev>
##$CPDPRG6= <mlev>
##$CPDPRG7= <mlev>
##$CPDPRG8= <mlev>
##$CPDPRGB= <>
##$CPDPRGT= <>
##$D= (0..31)
0 1.2 0 0 0 0 0 0 0 0 0 0.03 0 0 0 0 0 0 0 0 0 0 0 0 0 0 0 0 0 0 0 0 
##$DATE= 1549881407
##$DBL= (0..7)
120 120 120 120 120 120 120 120 
##$DBP= (0..7)
150 150 150 150 150 150 150 150 
##$DBP07= 0
##$DBPNAM0= <>
##$DBPNAM1= <>
##$DBPNAM2= <>
##$DBPNAM3= <>
##$DBPNAM4= <>
##$DBPNAM5= <>
##$DBPNAM6= <>
##$DBPNAM7= <>
##$DBPOAL= (0..7)
0.5 0.5 0.5 0.5 0.5 0.5 0.5 0.5 
##$DBPOFFS= (0..7)
0 0 0 0 0 0 0 0 
##$DE= 6
##$DECBNUC= <off>
##$DECIM= 32
##$DECNUC= <off>
##$DECSTAT= 4
##$DIGMOD= 1
##$DIGTYP= 9
##$DL= (0..7)
0 120 120 120 120 120 120 120 
##$DP= (0..7)
150 150 150 150 150 150 150 150 
##$DP07= 0
##$DPNAME0= <>
##$DPNAME1= <>
##$DPNAME2= <>
##$DPNAME3= <>
##$DPNAME4= <>
##$DPNAME5= <>
##$DPNAME6= <>
##$DPNAME7= <>
##$DPOAL= (0..7)
0.5 0.5 0.5 0.5 0.5 0.5 0.5 0.5 
##$DPOFFS= (0..7)
0 0 0 0 0 0 0 0 
##$DQDMODE= 0
##$DR= 18
##$DS= 0
##$DSLIST= <SSSSSSSSSSSSSSS>
##$DSPFIRM= 0
$$ [...]
##$SUBNAM2= <"">
##$SUBNAM3= <"">
##$SUBNAM4= <"">
##$SUBNAM5= <"">
##$SUBNAM6= <"">
##$SUBNAM7= <"">
##$SUBNAM8= <"">
##$SUBNAM9= <"">
##$SW= 20.0189088683792
##$SWIBOX= (0..15)
0 0 2 0 0 0 0 0 0 0 0 0 0 0 0 0 
##$SW_h= 4006.41025641026
##$TD= 16384
##$TD0= 1
##$TE= 0
##$TE2= 300
##$TE3= 300
##$TEG= 300
##$TL= (0..7)
0 120 120 120 120 120 120 120 
##$TP= (0..7)
150 150 150 150 150 150 150 150 
##$TP07= 0
##$TPNAME0= <>
##$TPNAME1= <>
##$TPNAME2= <>
##$TPNAME3= <>
##$TPNAME4= <>
##$TPNAME5= <>
##$TPNAME6= <>
##$TPNAME7= <>
##$TPOAL= (0..7)
0.5 0.5 0.5 0.5 0.5 0.5 0.5 0.5 
##$TPOFFS= (0..7)
0 0 0 0 0 0 0 0 
##$TUNHIN= 0
##$TUNHOUT= 0
##$TUNXOUT= 0
##$USERA1= <user>
##$USERA2= <user>
##$USERA3= <user>
##$USERA4= <user>
##$USERA5= <user>
##$V9= 5
##$VALIST= <valist>
##$VCLIST= <CCCCCCCCCCCCCCC>
##$VD= 0
##$VDLIST= <DDDDDDDDDDDDDDD>
##$VPLIST= <PPPPPPPPPPPPPPP>
##$VTLIST= <TTTTTTTTTTTTTTT>
##$WBST= 1024
##$WBSW= 4
##$XGAIN= (0..3)
0 0 0 0 
##$XL= 0
##$YL= 0
##$YMAX_a= 434093
##$YMIN_a= -615186
##$ZGOPTNS= <>
##$ZL1= 120
##$ZL2= 120
##$ZL3= 120
##$ZL4= 120
##$ABSF1= 10
##$ABSF2= 0
##$ABSG= 5
##$ABSL= 3
##$ALPHA= 0
##$AQORDER= 0
##$ASSFAC= 0
##$ASSFACI= 0
##$ASSFACX= 0
##$ASSWID= 0
##$AUNMP= <proc_1d>
##$AZFE= 0.1
##$AZFW= 0.1
##$BCFW= 1
##$BC_mod= 2
##$BYTORDP= 1
##$COROFFS= 0
##$CY= 11.3945322036743
##$DATMOD= 1
##$DC= 2
##$DFILT= <>
##$DTYPP= 0
##$F1P= 18.9103706918063
##$F2P= -1.10871071338519
##$FCOR= 0.5
##$FTSIZE= 0
##$FT_mod= 4
##$GAMMA= 1
##$GB= 0.15
##$INTBC= 1
##$INTSCL= 1
##$ISEN= 128
##$LB= 0.24
##$LEV0= 0
##$LPBIN= 0
##$MAXI= 10000
##$MC2= 0
##$MEAN= 0
##$ME_mod= 0
##$MI= 1.114404
##$NCOEF= 0
##$NC_proc= 0
##$NLEV= 6
##$NOISF1= 3.799351
##$NOISF2= 2.8
##$NSP= 1
##$NTH_PI= 0
##$NZP= 0
##$OFFSET= 15.70392
##$PC= 1
##$PHC0= -8677.002
##$PHC1= 11.00018
##$PH_mod= 1
##$PKNL= yes
##$PPARMOD= 0
##$PSCAL= 0
##$PSIGN= 0
##$REVERSE= no
##$SF= 200.130013532006
##$SI= 16384
##$SIGF1= 3
##$SIGF2= 2
##$SINO= 400
##$SIOLD= 16384
##$SREGLST= <1H.CDCl3>
##$SSB= 0
##$STSI= 0
##$STSR= 0
##$SW_p= 3612.71676300578
##$SYMM= 0
##$S_DEV= 0
##$TDeff= 0
##$TDoff= 0
##$TI= <>
##$TILT= no
##$TM1= 0
##$TM2= 0
##$TOPLEV= 0
##$USERP1= <user>
##$USERP2= <user>
##$USERP3= <user>
##$USERP4= <user>
##$USERP5= <user>
##$WDW= 1
##$XDIM= 8192
##$YMAX_p= 0
##$YMIN_p= 0
$$ End of Bruker specific parameters
$$ ---------------------------------
##NTUPLES= NMR FID
##VAR_NAME=  TIME,          FID/REAL,        FID/IMAG
##SYMBOL=    X,             R,               I
##VAR_TYPE=  INDEPENDENT,   DEPENDENT,       DEPENDENT
##VAR_FORM=  AFFN,          ASDF,            ASDF
##VAR_DIM=   8192,          8192,            8192
##UNITS=     SECONDS,       ARBITRARY UNITS, ARBITRARY UNITS
##FACTOR=    0.0002496,     1,               1
##FIRST=     0,             0,               0
##LAST=      2.0444736,     0,               0
##MIN=       0,             -615186,         0
##MAX=       2.0444736,     434093,          0
$$ Real data points
##PAGE= N=1
##DATA TABLE= (X++(R..R)), XYDATA
0@%%%%%%%%%%qJ6j7K5m0M8n6P2q8J04j26J51j77K08k47K93l40L91m51N21n98O84
32C65p79Q81r94J123j264J417j586J771j973K196k440K704k992L308l653M029
48B113m442M896n394N941o547P221p972Q816r772J0863j2123J3596j5347J7472
62I321k0107K3483k7987L4327m3991O0699r7564L24719j83745m78234N35852K91867
74D28640k52191l30686Q7148J60759J10411j09969k60609q8958L75352K42402
84C62299l47558l74631K87304L47248k47098l59838J54045K89888M135j80670
94f4876j61487j768K75556J85253k57129k62457K67783L29480k29235l83306J41165
105a61021L70909j7891k71208q4735R0674J30039Q0279j58669k21497K17451L91112
$$ y = [0, 0, 0, 0, 0, 0, 0, 0, 0, 0, 0, -8, 8, -9, 16, -24, 24, -32, 40, -48, 56, -70, 81, -96, 112, -135, 158, -182, 209, -242, 279, -319, 365, -414, 467, -527, 596, -668, 749, -837, 934, -1039, 1157, -1283, 1421, -1571, 1737, -1916, 2113, -2329, 2567, -2827, 3114, -3433, 3788, -4184, 4632, -5140, 5723, -6400, 7196, -8151, 9321, -10786, 12697, -15290, 19037, -24954, 35745, -61819, 262900, 79155, -399079, 136773, 428640, 176449, -154237, -67089, 93670, 204081, 94112, -166497, -255455, 119897, 362299, 14741, -359890, -72586, 274662, 27564, -332274, -178229, 111659, 115794, -64876, -226363, -228131, 47425, 232678, -24451, -286908, -19125, 310355, 81120, -302186, -161021, 209888, 191997, -79211, -163946, -73272, 56767, 137046, -21623, -243120, -25669, 365443]
116C65443j89936m91008R8415M84425J7102l72515q9272K16121R8688r0571j26803
127g9911q2868J07402K63193l3363l90379n5979M32239J14285l98608j22888L43631
138I6754J54029k19146j80975L1728J52748J59720n3573k81353o1815L35276J50683
149B84076l69003k40459L46853K98692k67803l18904J02476K25406L5865j09196
159a1997j52863J071K53912J10376l07080k10789L15479L27381k06782l36232
169b17524J03752K91730q433k01396p5074Q0748J57019O8999k29676k51748K16502
180f5101L60283j69523l94476J06241L69455l8482l17497n3476K18143J42934
190A58501n4636j65195j13458J33014K51482p9054l43106L5074M05472K5536m04839
$$ y = [365443, 175507, -315501, -217086, 267339, 284441, -88074, -177346, 38775, 137463, 46892, -79911, -162779, -55377, 207816, 174453, -215926, -271905, 160334, 274619, -123989, -246877, 96754, 250783, 31637, -149338, -117610, 35138, 194858, 141285, -140068, -201883, 133393, 284076, -84927, -325386, 21467, 320159, 52356, -266548, -164072, 61334, 97199, -11997, -164860, -163789, 90123, 200499, -106581, -317370, -1891, 325490, 118708, -217524, -113772, 177958, 169525, -31871, -106945, -26197, 130822, 199821, -29855, -281603, -65101, 295182, 125659, -268817, -162576, 206879, 168397, -149100, -202576, 15567, 158501, 103865, -61330, -174788, -41774, 209708, 130654, -212452, -177378, 228094, 253630, -151209]
201a51209j07175L03434J53880j50745j61322j3130J23351J35408q2556k45560
211a95624J5724L31657R2512l43255j79945K96352K25456j96902k01011R5404
221e9632J63227L1019j09360j77832J2554K79097R6602l10622j90880K71616K34705
232B40494k12624k53327J38137K50546k7229j84078q2024O4576J63430P7936j98289
243b2452j85672K16169K62185k10569l19977J44235L23160m1185k68468p1041
253a73615J46384J24349k6083j52830j00292J54298K26693j22581l23899O5469
263a82107L69153J8368l15005n8441K34463R9752j21979j29643j416J47386J34484
274A95015j21240k52158L5895K95902L6752l05834j04288K71166J42409k03201
$$ y = [-151209, -258384, 45050, 198930, 48185, -113137, -126267, -2916, 132492, 49936, -195624, -179900, 151757, 244269, -98986, -278931, 17421, 242877, 45975, -155036, -59632, 103595, 134614, 25254, -152578, -140024, 139073, 235675, -74947, -265827, 5789, 240494, 27870, -225457, -87320, 163226, 135997, -48081, -130105, -65529, 97901, 175837, -22452, -208124, 8045, 270230, 59661, -260316, -116081, 207079, 165894, -102574, -173615, -27231, 97118, 71035, -81795, -182087, -27789, 198904, 76323, -247576, -182107, 187046, 205414, -109591, -168032, 66431, 166183, 44204, -85439, -86855, 60531, 195015, 73775, -178383, -142488, 153414, 190166, -115668, -219956, 51210, 193619, -9582]
284i582j68727Q0578J53483O8126q5070j80758J3736K56033N7106k84228j16333
295b15636K80919J86593k18875k30463J10462K09681m117j42114q9368M2585J57952
306H7619N4794k18386j58485K35617K42730j92569k68280J20404K48691l4886
316A17249j89669l5558J25873J10518l0797j62540r3904J63987K03289j33755
326G4693k79135P8745K92704l4024k75581l1844K04272J01799q4771j41492m4017
337a38651J43919J56600j04370k21758O5444K74684N18k90248p2392K54253J26114
348A94113j65976j42684M6026J16967O1174r1519j72063M4510K50857J8409k83601
359a23787r3637K54406J52141j81644j68218J06677J68488j2250j31470q5189
$$ y = [-9582, -178309, -97731, 55752, 123878, 38808, -141950, -128214, 127819, 184925, -99303, -215636, 65283, 251876, 33001, -197462, -87000, 122681, 118564, -23550, -112918, -70333, 87619, 142413, -75973, -234458, 1159, 243889, 51320, -216960, -96556, 152135, 117249, -72420, -107978, 17895, 128413, 97616, -64924, -158828, 5159, 208448, 74693, -204442, -125697, 167007, 132983, -142598, -174442, 29830, 131629, 46858, -94634, -138651, 5268, 161868, 57498, -164260, -98816, 175868, 176386, -113862, -186254, 67999, 194113, 28137, -114547, -68521, 48446, 109620, 18101, -153962, -109452, 141405, 159814, -123787, -217424, 36982, 189123, 7479, -160739, -54062, 114426, 102176, -29294, -114483]
369a14483O3366J79404L5981k33088j32407K33756J85461k07310k18639J40163
379f7796K18734m9855j90769n5447J16007J33783j1029j61830q2089J70194J71429
390A91332j50422k34851J14274K68704m4008k39547l3262J56236Q7026o1785j31495
401g7798m0550J46957J28908j41175k14946Q6289K59060j1787k52413m7120K12643
412D8068R1930j35599j09207M3020J22874Q0146r8159j83011M9763K41400N610
423A56835k55838o2941K26929J05697j81915j51630R2605J54463O371j16987r9162
434a25573M9263J70416K5638k12226q4406K34651J49125j99060j82111J25833
444d8450J83645k8369j47710n6690R1123J19644k5745j72628o6218J85398J51639
$$ y = [-114483, -51117, 128287, 164268, -68820, -201227, 32529, 217990, 10680, -207959, -67796, 150938, 101083, -89686, -145133, -29126, 104657, 93628, -68202, -150291, 19903, 191332, 40910, -193941, -79667, 189037, 145029, -94518, -127780, 28456, 115482, 53697, -77798, -118348, 28609, 157517, 16342, -198604, -112315, 146745, 134958, -117455, -164575, 48068, 139998, 4399, -104808, -61788, 61086, 141232, 43073, -139938, -90175, 151225, 156835, -99003, -161944, 64985, 170682, -11233, -162863, -70258, 84205, 90576, -26411, -125573, -76310, 94106, 119744, -92482, -176888, 57763, 206888, 7828, -174283, -48450, 135195, 106826, -40884, -97574, -6451, 113193, 87448, -85180, -151398, 34000, 185639]
455A85639j66378k13922J13319K24491n2821j94455r846J40549Q4271n6203j38307
466h3663l8466J61497J29170j39226j89544R1848K17623m0105k25687k2720J91372
477E2099P5542j19991j12673J5332J16467Q7892r7310j64877P3977K23670k5755
488A24373k38544l0531K19233R4830j53545j27787P1801J27981P999j09004r6496
499a09690N9153J68089k277k22717p1245K20043J18725j80465j43441J15615J51139
510A02929k9068j33151n3734R8042J34315k1347j70730n4855J79880J24656j62340
521A4597j72535J21645J87943o4918j76907k0080J15519Q7442m2460j39573l7920
532a27247J57636J06352j48289j60733J14573K03882m7402k00969j2535J67127
$$ y = [185639, 19261, -194661, -81342, 143149, 90328, -104127, -113973, 26576, 110847, 54644, -83663, -122129, 39368, 168538, 29312, -160232, -68384, 149239, 109134, -116553, -139273, 52099, 127641, 7650, -105023, -89691, 26776, 114668, 17358, -147519, -73542, 150128, 124373, -114171, -144702, 74531, 169361, 15816, -111971, -40170, 87811, 95810, -13194, -109690, -50537, 117552, 115275, -107442, -178687, 41356, 160081, -20384, -163825, -48210, 102929, 73861, -59290, -113024, -14982, 119333, 97986, -72744, -127599, 52281, 176937, 14597, -157938, -36293, 151650, 86732, -90175, -110255, 5264, 92706, 50246, -89327, -127247, 30389, 136741, -11548, -172281, -57708, 146174, 98772, -102197, -114732, 52395]
542E2395O6975r4960r6791J2636J15019P7156j17800j61177Q6759K07602m0606
553A07208k17505j9908J86467O7575j37582j06055O8928J25485J7355j09060j00750
564a17842O8121J69654j1673k04235l9268K06520Q2450j75790j20297J03997J33821
575I5458j9378j24613o6973Q4263J27982k8963j65009l2600J82378J01361j63762
586i856j44037J23155J64947n2696j40203j6262R6699Q4889m0798j40571k8214
597a02947J62263Q9837j56024j49050J07436J71065n6585j73990j293J45367N4494
608I0573q6621r5444J0419J23639Q0386j16415j41720R8330J83849n5353j91798
619a00155J746J71711N5593j26909j04467N1585J15353K1127j08288r9004P3737
$$ y = [52395, 119370, 24410, -72381, -59745, 55274, 132430, 14630, -146547, -59788, 147814, 107208, -110297, -130205, 56262, 123837, -13745, -119800, -50872, 74613, 91968, -17092, -117842, -49721, 119933, 108260, -95975, -135243, 71277, 153727, -22063, -142360, -38363, 95458, 76080, -48533, -115506, -31243, 96739, 67776, -97233, -129833, 52545, 153906, -9856, -153893, -30738, 134209, 81513, -58690, -74952, 21747, 106636, 65838, -74733, -102947, 59316, 149153, -6871, -155921, -48485, 122580, 65995, -107995, -109288, 36079, 90573, 3952, -91492, -81073, 42566, 122952, 6537, -135183, -36853, 146996, 91643, -100155, -98409, 73302, 128895, 1986, -102481, -50896, 64457, 85584, -22704, -121708, -47971]
630d7971J56513l2559j94027j6694J96624O7128j52180r6990Q9244J16680p841
641G7927j09446o1608Q8708J25048m2438j66524k1242J74925P7267j59083j19719
652a36185J14502J30598n7502j22833j6976R1230R0504l8324j40419j9070J62167
663E7692P6844j49058j18907J15738J50134o4477j58279J742J29471N1819p6991
674A5728r7006K662J18010O4284j26061j23997J09394J63281o4253j70168R390
685i8736J53621N2574j04603q9975N0961J14750J9628j13488r0904Q9043J48152
696A31023n0790j82783k63J72261L8279j40736p9211P8352J03922n973j11486
707d7405o6666R2953J27416m5097j56443k555J70432N7890j53330r5064J15238
$$ y = [-47971, 108542, 75983, -118044, -134738, 61886, 129014, -23166, -120156, -30912, 85768, 77927, -31519, -93127, -4419, 120629, 78191, -88333, -109575, 65350, 142617, -16466, -136185, -21683, 108915, 51413, -71420, -88396, 2834, 93338, 55014, -85405, -104475, 57692, 134536, -14522, -133429, -17691, 132443, 67966, -90313, -88571, 40900, 92719, 15728, -81278, -78616, 39394, 103678, -22383, -146380, -36986, 126295, 62042, -108126, -98736, 54885, 107459, 2856, -87119, -36158, 78592, 98220, -15268, -106172, -17129, 131023, 80233, -102550, -102813, 69448, 107727, -33009, -112220, -33868, 70054, 64081, -47405, -114071, -21118, 106298, 61201, -95242, -97797, 72635, 130525, -22805, -117869, -2631]
718b631J16712n1776j11895k4023P9891Q5626m3746j37264p057J55231N3487j50398
730c7843j02181J13585J33779n8895j35268N596J15981N0289o7716r0805J0787
741f2691J25020N5624j30985j10032J10209J39919p1226j49476J4869J32314L7881
752I1426j01375q8295M5877J14450K1029j12668q4361R2969J36981n6431j60292
763a00690J8143J60821L0195j25189p2006O4777R8115J477j07285o6681Q9603
774h720J12358n9497j50497Q694J60572M1844j44003p9445J04186R9149m1500
785D3141r4133k0453Q1047Q8524m5995j33669M669J52282M3090j42197q6130J05372
797d452J11127o3128j25657M768J06753M8834o8568r6948J0767J25688M7375j29317
$$ y = [-2631, 114081, 62305, -49590, -73613, 6278, 91904, 48158, -89106, -96163, 59068, 112555, -37843, -140024, -26439, 107340, 48445, -86823, -81227, 34754, 85043, 17327, -73478, -62691, 62329, 117953, -13032, -123064, -12855, 127064, 55838, -93638, -78769, 53545, 91426, -9949, -98244, -52367, 62083, 83112, -29556, -113917, -20948, 116033, 59602, -100690, -82547, 78274, 108469, -16720, -88726, -23949, 74166, 75643, -31642, -98323, -8720, 103638, 44141, -106356, -97662, 62910, 104754, -39249, -118694, -14508, 84641, 43141, -50992, -71445, 9602, 98126, 52131, -81538, -76869, 75413, 118503, -23694, -109824, -4452, 106675, 43547, -82110, -77342, 29411, 78245, 9677, -87271, -76504, 49184, 96559, -32758]
809c2758q9291J16409J22872p2242j30330J9151J21150M1077q6697q4943L7808
820c7794J06224J5718j13968p7588R7106J22846o9517j51621K4639J44049K0264
831H0358j10006n9747O0768R4075J772j04894n6951R7656J09482o1142j38514
842h7143J5780J46001K8279j33397o7039R3906Q5773l9986r4273l0265P8658Q8432
854H4726n1025j28662J5377J45034K8708j33227o6657J05723J01412n5174j08678
865f2443L177R4869M8779o1240r3453J3624J21161L2324j34590p8932J12900J04156
877A00332p3505j15711J9198J07818L5407q0843p7708M2121J10109J5152j12481
888c0111o7764J00949J12607p1596j32397L2594J26415J0579j01087n8426N0291
$$ y = [-32758, -122049, -5640, 117232, 44990, -85340, -66189, 54961, 96038, 9341, -75602, -37794, 68430, 84148, -29820, -107408, -10302, 112544, 43027, -108594, -83955, 60094, 80358, -29648, -89395, -28627, 65448, 67220, -37674, -94625, 3031, 112513, 51371, -87143, -71363, 74638, 102917, -30480, -97519, -3613, 82160, 42174, -52099, -82364, -3706, 84726, 33701, -94961, -79584, 65450, 94158, -39069, -105726, -3, 101409, 46235, -62443, -59266, 35603, 84382, 23142, -70311, -56687, 64474, 96798, -37792, -116724, -3824, 100332, 26827, -88884, -69686, 38132, 73539, -7304, -85012, -42891, 67218, 82370, -30111, -97875, 3074, 115681, 44085, -88312, -55718, 70697, 81276, -19811, -78237, -27946]
899b7946Q9570J661j06424n6466R5632R7771o7208j25319K7959J38681J9005j22388
911c5472n3275Q8480P9261l0981q4394k8692P7735Q2869n9221j23912K3456J35742
923G1596J5123j28400n8967R4964Q6419n2939r9000M087R1294M9806o0243r1779
935g8039K1344J24097K6145j27084o1489J10504Q8133p1335j01776J6725R6570
946D3795L3562p7890q0541L5913J03335R081j12075n8787J01692R8721p5190j16992
958i5376L9405J16009J1035q6079n1659M7033Q8476J716j03897m8650R7414Q7493
970A02920p3194j17740K9712J23393Q524j13215m6821P7751P0180k8554q2072
981d9116k7958Q2375Q1516o1810j12545L4404J27624O861j16028m4808Q9759P6806
$$ y = [-27946, 61624, 63285, -43139, -99605, -3973, 93798, 26590, -98729, -70770, 67911, 86916, -35472, -88747, -267, 78994, 48013, -36381, -65073, 12662, 95531, 36310, -87602, -64146, 71596, 86719, -41681, -100648, -5684, 80735, 27796, -71204, -67117, 24177, 73983, 13740, -78039, -56695, 67402, 93547, -33537, -95026, 15478, 103611, 32276, -69500, -52775, 43795, 77357, -533, -81074, -45161, 58174, 67255, -44820, -103607, -1915, 96806, 21616, -95376, -55971, 60038, 71073, -15006, -66665, -19632, 68844, 70560, -33337, -81987, 15427, 102920, 29726, -88014, -58302, 65091, 73615, -39600, -86421, -8670, 61510, 32956, -49116, -77074, 5301, 86817, 25007, -87538, -53134, 74490, 81351, -34677, -79485, 10274, 87080]
993H7080n0732r2682k80Q4037M6793o2396r2273K4290J17656J1909j24947m7023
1005i8568J08522P5090o6984q8485J9021R1317L4741p1519p3803M1111J01291
1016G1734K836j11364n0082J01523Q4435p9248j05911L8256R9401M259p9654n0735
1028g4550M4536Q7087j749j02950l8747J00028P9874p2737j01628L8432J14131
1039G1727K413j02765l8419P0675O4453k5155q2819l0081Q0069P2583o9689j05922
1051i2930M0337J15854l077j07908l6310Q4934P0915m4179q3062K386Q3092M7530
1063G7582o1362q6555L2610J14096K129j20844l7503R9325O1324o4523q0785J3463
1075e1043Q2194L1623p1695p2564M2830R9503j256j06465l8347J01777P4356p6955
$$ y = [87080, 36348, -56334, -56614, 27423, 74216, 11820, -80453, -56163, 61493, 73402, -51545, -98568, 9954, 85044, 18060, -70425, -51404, 39913, 74654, 3135, -70668, -29557, 71734, 74570, -36794, -86876, 14647, 99082, 19834, -86077, -47821, 51580, 55839, -23815, -74550, -30014, 57073, 55324, -47626, -86373, 13655, 93529, 20792, -80836, -42404, 71727, 74140, -28625, -67044, 3631, 68084, 42929, -39890, -69971, 10098, 82681, 12992, -92930, -52593, 63261, 60184, -47724, -84034, 900, 71815, 27636, -55426, -53040, 30052, 77582, 16220, -70335, -37725, 76371, 78500, -42344, -79847, 19478, 80802, 16279, -64506, -51043, 31151, 62774, -8921, -81485, -38655, 60848, 59592, -46873, -85220, 16557, 90913, 13958]
1087A3958q9106M2755R0651L849p2313n0859M1289Q3700o622j03052l3132R5715
1099A6833O5302p5839r3622M1179J03925j709r3883l2730O7141O3189k1336p8601
1111d0151k2649Q5960O6452p3911r4878M7388J04842j1264r9904l1024P5713N9702
1123F6276m4961q0635J156P9922M3627o4673q2656L9571J09323o051j11191k1445
1135g1737R6882N2332n9456p1028J4785P9336L0481p0968o9483M3576R1350j0926
1147E5144j05494l0773R8106O0709p8093p9723M0813Q1388N064o5285m6574M4370
1159b0348Q3618j0048r8052k2092R6841N7191p4552q2418M1309R1890p230q7458
1171c1349l0250N9791N7499k3776q0621k1400Q6327N8153p5579q2287N2069R5145
$$ y = [13958, -75148, -32393, 58258, 62107, -10206, -61065, -19776, 63924, 57302, -45750, -78882, 16833, 82135, 6296, -87326, -46147, 57778, 56069, -37814, -70544, -3403, 59786, 38450, -40151, -62800, 23160, 89612, 15701, -79177, -31789, 73053, 61789, -38115, -69139, 6574, 66276, 21315, -59320, -58164, 21758, 65385, 712, -81944, -42373, 66950, 60899, -50292, -71737, 25145, 77477, 18021, -53007, -38222, 41114, 71595, 627, -68856, -25280, 66070, 55144, -50350, -81123, 16983, 77692, -401, -80124, -39311, 42077, 47141, -18144, -64718, -20348, 63270, 53222, -44830, -66922, 29919, 87110, 12558, -69860, -28551, 63339, 56109, -31349, -61599, -1808, 55691, 31915, -48706, -70106, 16221, 74374, -1205, -83492, -31423, 63722]
1183F3722j3962q8444k2881P3226N7648m0387p5818J889P7535L9435o7648p8112
1195g3797M3820R9320j8154j06388j5006Q7133M3423n4557o4895J3930P5837K9188
1207E9854o8237o1899M9358Q9546j3470r8995k0767R5007N0666p4829o9139L8589
1219b4316P0971K254o5466m8028M3282P8483j6719r5864j4988R2556M7278p1935
1231b492p0847M5176Q6045p289p8173k5593N7309N7554k2667p7901j5648Q4939
1243C0413M7763q0106p3686N2148Q2761j9295q2757k0818O5995N1988l9104p0792
1255e5490N069P7868L7452o6831o9708N0111R3885k1973r5756o371Q0386L5894
1267F4536n1733o1577J1752P1612K3795p0438n9399M8822Q1410j9902r3393j2688
$$ y = [63722, 49760, -38684, -61565, 11661, 69309, 28922, -46896, -45007, 32528, 71963, 4315, -73797, -29977, 69343, 51189, -55199, -70205, 16928, 60351, 5794, -59101, -45171, 30666, 59854, -8383, -70282, -20924, 68622, 55152, -43843, -64610, 30397, 81063, 6234, -62905, -24316, 46655, 48909, -16557, -64585, -21303, 57180, 40461, -55403, -70391, 22165, 69443, -2492, -73339, -28163, 57882, 50593, -27580, -53173, 4136, 61690, 39023, -38878, -54526, 30413, 78176, -1930, -75616, -23468, 59293, 39998, -42759, -63577, 2418, 54406, 15302, -55490, -50421, 27447, 64899, -1932, -71640, -21529, 72356, 50383, -45373, -51744, 28642, 64536, 12803, -48774, -37022, 34590, 58385, -12053, -71452, -22630, 58780, 38878, -54515, -67203]
1279f7203R1188M2090o9874n8751L8869O7327N685n9882m4233M5454P5753k1891
1291D4532r1405q557Q7227L7133p2317o4157M1626P4809j0768p2917k3809N3609
1303d994N5325k2899p6174r066Q7524M1554p6534o1695N5244P4491j9938p4330
1315c1492j6752O1392M6984l9092o9340L452P3391L0736o9363o5133N1506Q4724
1327F1013k7737q6906q94P4590L3278m5091n5475J3744P1145K2822o7724n2042
1339e9277N0769P5227k4244q8674q085Q3706L2115o7224n3395L3430N9898M605
1351C8851n9047m2848M7948P2415k5142q4579R8Q4810L1624o6600n4189M2565
1363a4094O8641j0667o7395k3116M9868N1603k5782p6581o233Q3322L1072p7060
$$ y = [-67203, 23985, 66075, -3799, -62550, -23681, 43646, 49331, -10551, -54784, -9330, 66423, 44532, -46873, -55430, 31797, 68930, -3387, -67544, -25918, 48891, 38123, -34794, -58603, -4994, 50331, 27432, -48742, -57808, 29716, 71270, -5264, -66959, -11715, 62776, 42838, -31492, -48244, 13148, 60132, 21040, -48300, -44848, 28543, 59279, -10084, -75217, -23711, 61013, 33276, -53630, -54524, 20066, 53344, 8253, -47222, -33478, 37667, 60489, -7235, -59277, -8508, 66719, 42475, -46199, -54284, 29422, 61537, -5687, -59082, -25652, 34246, 38851, -20196, -63044, -15096, 57319, 32177, -52402, -52304, 32506, 64130, -2470, -56659, -14094, 54547, 43880, -23515, -46631, 3237, 54840, 29058, -47523, -53756, 29566, 60638, -16422]
1375a6422n3431N3781O5584k0296o7012j3079N9580M5876l6123o3460P725P3139
1387C5862K7688o8581n7213N3853P4921l2196p9840L35O5564K7531m3766n4834
1399e0676J2527O7712J8629o7267m6558N3149P0076k5311p9732o37P9851K8248
1411F0011o0881m5575L1531N6341M956n8583m1964M7582O5893l1200q0644L183
1423d9350P6878K3386o3537m8360M0536O3007r633o1271j9985M9959N2075k5162
1435B8543p1796P42Q1933K4437p4668m5321N1453N7077k1496o3172j4538N3715
1447F909M1198l7358o1936Q678P0560K3383o7523m9593N5593O8955l1166o9443
1459d1743M623O1269K6949l9473n2417J2899O6244J4284o7262m2865N1113O1466
$$ y = [-16422, -69853, -16072, 49512, 29216, -37796, -50875, 8705, 54581, 18458, -45002, -37277, 35862, 63550, -5031, -62244, -8391, 66530, 34334, -45506, -45171, 20393, 47924, 4158, -50676, -38149, 29563, 48192, -19075, -65633, -12484, 57592, 32281, -47451, -48088, 31763, 60011, -870, -46445, -14914, 41427, 46383, -12200, -54164, -6582, 59311, 28111, -52533, -49350, 27528, 50914, -12623, -60983, -20447, 42560, 32927, -28344, -48329, 1630, 53705, 28543, -43253, -42511, 39422, 63859, -10809, -56130, -4677, 52400, 30904, -32268, -46806, 6909, 48107, 10749, -51187, -42509, 28051, 51434, -16089, -65682, -10089, 58866, 27700, -41743, -37120, 24149, 51098, 11625, -40792, -27893, 38351, 52635, -14627, -57492, -6379, 55087]
1471E5087l0360p4829K049P2376K2315n6593m1714K9261N5197O570n5972l6846
1483e3459N1672O2401l2646p3032Q922P2266J8817o0069m4068L6852N5687j1282
1495C2061n9115k1041M6312M8608k8739p0279N335P8419J8836o9258l6463N0272
1507e052N2567j8433n6755j1294N3212L9784l6237n8935R665O6706J7269o7177
1519a4680m4754N3414N8841l3950o4145M556N5069K5511l7028m9105J4882O5360
1531C3971J2102o3389l4896N2949N7237l0221o7750N043O6083J7838n2210l9382
1543d2625K4997N0737L704n7693l5061N0944N5965l5694o6180J2148O6904J5534
1555D3680n4145l7069L7038N3486r025n4258j9370M6277M6635l0248o6663Q347
$$ y = [55087, 24727, -50102, -48053, 24323, 46638, -9955, -51669, -22408, 32789, 39359, -16613, -53459, -1787, 60614, 27968, -45064, -36142, 36124, 54941, -5128, -49196, -12344, 43343, 32061, -27054, -48095, -1783, 46825, 18086, -52193, -46858, 31561, 50397, -18861, -55324, -5052, 47515, 29082, -27673, -38967, 14245, 54029, 17792, -41143, -31478, 35228, 52497, -14680, -59434, -6020, 52821, 18871, -45274, -40718, 14351, 39862, 2834, -46271, -31389, 33971, 46073, -17316, -52212, 737, 57974, 27753, -39997, -34954, 31129, 48967, -3243, -42625, -17628, 33109, 36813, -20880, -55941, -4997, 50968, 15274, -50906, -38758, 28146, 43680, -10465, -47534, -10496, 42990, 33965, -20293, -39663, 6614, 53249, 23001, -43662, -35315]
1567c5315P2400J0846o7209l2778M5005M6152j8127n3962j0932M9746L7532l4257
1579I101n4549J3324O6053J5469o3185l7459N3312N3053l1564n6822M021M9122
1591A9876K3593l6518m9494J3982O1133P424o3008l1711N0073N0550k9910o0866
1603d4876P796O1875J7234m6043l5155K4166N0774N334n5541l0891N0798M9981
1615E5452l6817o1980J2901N9396J1299n1775l5773L2737M7952q817n1833j7787
1627d5045M5830M4947l0135o1391J3604O9155Q649o0162k6116M2126M1870j6723
1639B6609n0838j1271M7396L3580l6562n2539J2994O0498R593o1508l1697N1257
1651b488M6309l0067n0183N143M7500K4558l3642m5582J7541N9628L892n9403
$$ y = [-35315, 37085, 47931, -19278, -52056, -7051, 39101, 20974, -32988, -43920, 5826, 43358, 9101, -45448, -32124, 33929, 49398, -13787, -51246, 2066, 55119, 23555, -33267, -29246, 19876, 43469, 6951, -42543, -28561, 32572, 39996, -23012, -54723, -4650, 45900, 15990, -44876, -37080, 24795, 42029, -4014, -39169, -15003, 35771, 41105, -14436, -45327, 5471, 55452, 18635, -43345, -30444, 28952, 40251, -11524, -47297, -14560, 33392, 24575, -27258, -45045, 785, 45732, 15597, -45794, -32190, 36965, 45614, -14548, -40664, 1462, 43332, 26609, -24229, -35500, 11896, 45476, 8914, -43625, -30631, 29867, 39460, -22048, -53745, -2488, 43821, 13754, -36429, -31286, 16214, 40772, 7130, -38452, -20911, 38717, 42609, -16794]
1663a6794k6609M8813M3812l1919n6518P953N4404J2290m3929l3850K2349M8085
1675B8087K904n4602k5532N2220M5232l6532n2966J6773N5563R763m7102l0712
1687c6904L1701M4526j0131m9912j7148M3637L9051l3805n7837J5800O2314K529
1699C3821n6071k1957L9400L8916j4505m6739q133M7772L1929l4655m7254J6544
1711b0932N7615O018n8605k6595M7583L8636l0356m6318L244M2533K1622l4308
1723A37m4209J8740N6430R64n5518k0462M7726M0483k9370m9711J0468N1073J2047
1736C8798l9809l1595K0580M5875L81n4628k3000M9771L7467l7948m8460J5645
1748b6923M9824P572m3621k7536L0569M2643q413m6115j3422M4556L7513l3009
$$ y = [-16794, -43403, 5410, 49222, 17303, -39215, -31262, 23142, 35432, -8497, -42347, -19998, 28087, 30991, -23611, -49143, 3077, 48309, 11777, -41189, -24416, 31147, 40910, -6192, -36904, -5203, 39323, 29192, -20720, -37868, 5769, 44820, 11015, -46822, -31022, 31292, 33821, -22250, -44207, -4807, 34109, 19604, -27135, -35268, 12504, 44433, 9778, -37476, -20932, 36683, 42701, -15904, -42499, 5084, 43720, 13364, -32954, -29710, 12823, 34445, 137, -44072, -25332, 31098, 32062, -23456, -43918, 3808, 44291, 14921, -34790, -24322, 26751, 38798, -1011, -32606, -12026, 33849, 34230, -20398, -43398, 6373, 43840, 5892, -42568, -26923, 22901, 30473, -13148, -40684, -10115, 32528, 24115, -22000, -35422, 9134, 46647, 13638]
1760A3638n2582J8762N7032m88n1460k0340L4542L4572j5496m5799q528M4655
1772H508K7766l5007m3974J7945N3902L971n3689k0614M6135L5715k6418m0552
1784b6312L424M0874K1872l3948m1930J9512N1594l050n4209j8004M3548L3991
1796C7362k9973m5364J0356M6239J0664l6696k9032K1629M5615K2n0946j7299
1808c7423M9543L3410l6137m2530J5963M4854N602m1817k6586K7823L8237j1079
1820A9860m4999j2418M2587L2643l4341m6742K0809N2764j571m5226j5684L3255
1832I37L3904j3924m2898n562M3906K4393l5368m1077J8191M8708j128n1330j7915
1845c9163M1713K9593k5384l7347K727L9257K0694l2645l7219K2836M9084m762
$$ y = [13638, -38944, -20182, 36850, 36362, -15098, -35438, -896, 33676, 18180, -27619, -36147, 8508, 36274, 1267, -42707, -24762, 29140, 33111, -20578, -41192, 4943, 40658, 14240, -26312, -22888, 17986, 39858, 5910, -36020, -16508, 35086, 32036, -22173, -40177, 3371, 37362, 7389, -37975, -27619, 18620, 29284, -7412, -36444, -14815, 30800, 30822, -20124, -37423, 12120, 45530, 9393, -33137, -17174, 27680, 33282, -8535, -35121, -7298, 30939, 19860, -25139, -37557, 5030, 37673, 3332, -43410, -22601, 30163, 28592, -16634, -32318, 937, 34841, 20917, -21981, -27543, 16363, 40756, 5388, -35689, -17498, 31210, 30082, -21248, -39163, 2550, 32143, 6759, -30588, -27861, 11396, 32090, -555, -37774, -14938, 34146, 29384]
1857B9384m8616j2552M2232K9934k8302m1372J0098M1589Q150l5541k8339J9812
1869a3523M1702m245n0000j4004M7597K7688l4135l6846J6680M2259N546l7548
1881h829k2273K8121L6729j0235m2140r852M0767K8466l5166m2443K0322M5839
1893B9306n173m2507j5246K9778L0809j3723m0959l258M2620K2085l3637l4763
1905c4668K0539M5899j818m6508j3386L9217K6107k3317l4985J559L6061J7809
1917C2509l4400l5791K2749M3472p793m5396r904L9234K6671k6618l5657J1706
1929a9218L9431Q893l2447k5252K1149M0397n876m6768j0180M3752K2181l3671
1941B391l3606J4599L6777L387l6206k1499K6229L3952j0851l9378o612M0787
$$ y = [29384, -19232, -31784, 10448, 40382, 12080, -29292, -19194, 22395, 30545, -4996, -33335, -13523, 28179, 23934, -26066, -40070, 7527, 35215, 1080, -35766, -19086, 23173, 28719, -8829, -31102, -2981, 33748, 23513, -18627, -28479, 12288, 40754, 5588, -36855, -16533, 29306, 24133, -18374, -33620, -3842, 26967, 13244, -27715, -30973, 11647, 33732, 95, -34668, -14129, 31770, 29952, -16556, -29942, 9275, 35382, 12065, -22920, -21361, 14700, 32509, -1891, -37682, -14933, 28539, 20746, -24650, -34554, 4680, 31351, 4733, -30924, -19218, 20213, 29106, -3341, -28593, -7444, 32953, 27077, -19691, -29871, 13881, 36062, 2391, -31215, -16616, 20161, 23548, -12658, -34157, -7928, 26024, 15173, -24205, -30817, 9970]
1953I970K5804l3075l6142K1889M1866m552l7164j3414K7240K8784j4448l9429
1965b2671l255L9436J7499l3366l2863J9239M0600l878m2255j0886L6217K4100
1977B7917k0166l1352K887L5967J7733l2089l1641K3729L9756r039m1508q922
1989b6728L5188K2519k5619l4130R676L4604O965l0563k4563K0625L7835o309
2001A9500m3156o197M1701K0651k9455k8687J4049L5138M035l3919j9902K4924
2013a318L0401j1809l7947o837L7170K0715l2464l2981K0506L6684m341l3438
2025a5659j2531K6560K8402j2841l5896kL8316J6170l1626k8140J9172L6889n471
2038B3343l9538j0098L1990K0411j9790l0715J323L3791J5388l2097k8379K3882
$$ y = [9970, 35774, 2699, -33443, -11554, 30312, 25760, -11404, -24818, 2422, 31206, 16758, -22671, -25926, 13510, 31009, -2357, -35220, -15981, 24619, 20741, -21514, -32400, 3817, 27917, 7751, -23601, -20714, 15253, 32986, 897, -30744, -7015, 32741, 23702, -17806, -26728, 8460, 30979, 5360, -28770, -19094, 15510, 22475, -8088, -32651, -12026, 25809, 19500, -23656, -29853, 11848, 32499, 3044, -25643, -11594, 23544, 27579, -6340, -26242, -1318, 29083, 17274, -20673, -27510, 9660, 30375, -2089, -35070, -14564, 22120, 17779, -15659, -28190, -1630, 26772, 13931, -21965, -21967, 16349, 32519, 893, -27247, -8075, 28814, 23343, -16195, -26293, 5697, 26108, 6318, -24397, -23074, 10717, 26105, -5992, -34371, -10489]
2050a0489L6761r167l6616n471L3595K1381k2503k9992R566L3220O540k9372k3294
2063b5841J9305L4661r603m1275m763L7074J6072k7928k6524J2569L2666L990
2075B0403l1182j7013K5017K9557j0984l3842l936L6014J8971l0570k9003J9058
2087g510L2259n022l1414j2991K3075K5769j3862l5421L52L5626J3600k9160k5396
2100c0095J9088L4775m805l4756p276L0321J9989j6820k7859Q96L2378J3397l1372
2113b139k6384K2513L1445j0330l4721n862K9361J9179k1449k7979R592L0955
2125A4181O655k6813k0247K0319L3549q826l7006k163L4685J3761k5274k4278
2137b1457J0783K9312K728l0921j6966K2690K5703j1446l2747k797L3911J6219
$$ y = [-10489, 26272, 17105, -19511, -24982, 8613, 29994, 7491, -22501, -12935, 20285, 26825, -2547, -25841, -6536, 28125, 18522, -22753, -27516, 9558, 25630, -2298, -28822, -16253, 16413, 20403, -10779, -27792, -2775, 26782, 15798, -18044, -21980, 14034, 33005, 2435, -26568, -7510, 24749, 19727, -11687, -24678, -1603, 24166, 10304, -25117, -24765, 10861, 24461, -4699, -30095, -11007, 23768, 18963, -15793, -23069, 7252, 27241, 10421, -17438, -16542, 15836, 29233, -2139, -28523, -6010, 25435, 15105, -19616, -25478, 3883, 23062, 1613, -26366, -16774, 14181, 20836, -5977, -26224, -5905, 27644, 18818, -18188, -20351, 14334, 28095, 2821, -21457, -10674, 18638, 21366, -9555, -26521, -3831, 21872, 10426, -22321, -25118, 8793, 25012]
2149B5012k7991k5045J8981K9964k663k7424j1603K2669K5439j3129l3049J435
2161a7404L2892J0807k8206k3865J6927L0265o040l3202o796K6490J8222j5549
2173D541k6157K120L1612J2695k9155k1982K3293K8984r324l0461m373K7349J7279
2186B6421k0883k6313Q005K7812N075k6902j9967J8970K9871j0311l4395o30L1835
2199H588J3139k2063k1241J0533K8965L536k8568j4001K2846K4130j1600l0585
2211a6321k106L0932J2909k7877k2681J6710K5649l932k6302j1446K1598K4139
2223B1272j3179l0096L768L1492R975k5218j9816J7290K8282o081k9665n498K4347
2236F873J5722j5077k5680J326K9092R152k9053j9742K1122K5802r599k7371l733
$$ y = [25012, -2979, -28024, -9043, 20921, 18258, -9166, -20769, 1900, 27339, 14210, -18839, -17404, 15488, 26295, -1911, -25776, -8849, 21416, 15376, -17826, -24622, 1868, 20090, 4541, -21616, -19496, 12116, 24811, -4344, -26326, -3033, 25951, 16627, -13834, -18207, 9142, 26421, 5538, -20775, -12770, 15042, 20117, -6785, -26752, -7782, 22089, 11778, -22617, -23247, 8588, 21727, -336, -21577, -11044, 17921, 21457, -7111, -21112, 1734, 25864, 14264, -16321, -18427, 12505, 25414, -2463, -25144, -8434, 17215, 13283, -13019, -24465, -2867, 21272, 8093, -22003, -18235, 13257, 23232, -1986, -21802, -4512, 23770, 17689, -11976, -17474, 6873, 22595, 7518, -18162, -16836, 12256, 21408, -7645, -27387, -6265, 19537, 9938, -17433, -21166]
2249b1166K6406J6483j8428k3235R188K6983N261k4456j7499J8635K7319j1127
2261A4364l1443K0K7483J0136k1278k0840Q876K6413J938k7015j3332K2010K2677
2274B0009j1015k7320K68L0029J1818k4711j9077J6525K3114k538k4059j1199
2286a8156J9833K1419j4382k8895L390K8140P168k4393j8849J6218K5437n642
2298A1288k6390m024K3067J5716j2523k3587K956K8828Q517k7169j6747J9961
2310a07K1910r579k5779m000K3217J3881j8788k1996P909K4483L981k3618j5076
2323b3562J9436K4736j0714k7270K368K6076R650j8168j8679R334K4482J089k6192
2336g414j1379J9646J9279j2334k5960N70K6564Q774k3662j6378J5009K1214k453
$$ y = [-21166, 5240, 21723, 3295, -19940, -10752, 16231, 21492, -2964, -20463, -1828, 25491, 14364, -17079, -17059, 10424, 20560, -718, -21558, -12682, 13731, 15669, -11346, -24678, -2668, 20009, 8994, -18326, -18058, 11971, 23789, -922, -19999, -3474, 19640, 17102, -6957, -18156, 1677, 23096, 8714, -20181, -16791, 11349, 18517, -5876, -24725, -8507, 16930, 11288, -15102, -19126, 3941, 19657, 7134, -16453, -13497, 15331, 23848, -3321, -20068, -107, 21803, 12224, -13555, -17555, 5662, 19543, 755, -21241, -13332, 11151, 15132, -8486, -23562, -4126, 20610, 9896, -17374, -15006, 11070, 20720, 2552, -16127, -6793, 17689, 18778, -7414, -18793, 853, 20132, 7798, -18162, -17592, 8972, 17746, -5916, -22294, -7285, 13929, 11476]
2349A1476k1262r372K0548K0535j3480k5027N376K6413N543k2711j5920J5065
2361b816K2156p092k5022m307K0365J3047j3264k2614L601K6769N762k5106j3415
2374b1936J9740K0166p908k2238k251K2520J3479j7538j9639P945K2895K475k3033
2387e323j4481J8224K1201j2314k5574K271K2550Q104j6989j6894Q799K3933J093
2400A4600k3459r182K0440J8083j1140k3303K149K4946P127k1854j5332J3011
2412c914J8686k798k1370r850J8954J7933j4504k3198N876K4041N064k0081j3753
2425a8914J5246K1123n857k1666k854J9538J2896j2579k1161L739K4815L457k4578
2438f795j2342J7210J7370q347k1639k777K1270J1626j6094j7666Q731K1656K621
$$ y = [11476, -9786, -19158, 1390, 21925, 8445, -16582, -11206, 15207, 20750, -1961, -17881, -2816, 19340, 12248, -12774, -17081, 3284, 16331, 3067, -19547, -15946, 10823, 16585, -8521, -21936, -2196, 17970, 10062, -12176, -14427, 8093, 21572, 4034, -15605, -7660, 15235, 17710, -5323, -19804, -1580, 19621, 7307, -18267, -15996, 6554, 14658, -2331, -19225, -10426, 13507, 14600, -8859, -18041, 2399, 20482, 9342, -13961, -11812, 13134, 20261, -1593, -16925, -3914, 14772, 11974, -9396, -19246, -292, 17641, 3137, -20061, -14185, 9856, 14920, -5161, -18914, -3668, 17455, 11598, -10068, -12922, 6616, 19512, 6933, -14228, -10489, 14326, 17783, -6795, -19137, -1927, 15443, 7096, -14543, -17320, 3950, 15576, -518, -18184, -9453, 12203, 14824]
2451A4824k0412j1889J8541J9914j1492k2170K433K0361O733j5734j6692P662
2463g921K1419q15k3317q495J8328J5918j1146k1313K722K3671O286j9463j2114
2476a6240J2945J7880j160j9718q183J8953J6218j4419k1011N482K1015L113j9520
2489d645j3390J3090J8747o650k0526k259J7569J2228j1464j9196N687K3819K954
2502A5964k1611r046J6563J5404p084j9392k741J9607R562j5713j7250P354J9161
2515A0778J133k0311j0808J7030J7120j1152j9311L133J9308P300j3447j5188
2527a4415Q452K1186r77k0672o699J6960J3997j1090j9904K062K0587M505j8809
2540d817j1520J0536J6002j824j8571p201J8168J5170j2999j8377O995J9549L929
$$ y = [14824, -5588, -17477, 1064, 20978, 9486, -12684, -10251, 10110, 16843, 1109, -15583, -7921, 13498, 12683, -10634, -19129, -801, 15117, 3971, -17342, -14620, 9051, 15337, -4126, -16240, -3295, 14585, 13425, -6293, -14476, 4477, 20695, 6276, -14735, -9253, 11762, 14875, -4645, -18035, -4945, 13802, 7152, -13374, -15633, 1936, 14164, 2700, -16496, -10809, 13010, 15964, -5647, -14693, 1870, 17274, 10190, -9202, -11943, 7664, 17226, 1513, -15737, -8383, 10778, 11911, -8400, -19208, -2178, 14942, 3790, -15521, -12388, 6920, 14220, 773, -14415, -5963, 15223, 14246, -6426, -13125, 3835, 17832, 6742, -13162, -11100, 9487, 13992, -4817, -16337, -5801, 10201, 8377, -10194, -17395, 773, 15943, 2944, -15433, -8438, 11111, 15040]
2553A5040j6974j1701J3133J7384o348j8979k820J5724J0445j1847j8724M664
2565a1003K1186J103k0261q231J4896J4237n901j7607j454J8576J0227j4164j4477
2578a2873Q110J7981J235j8748r621J6132J4629j0975j8147K048J6178N838j3336
2591a549j4776P665J9265j280j9141n467J6059J3322q981j7228L532J9394M235
2604A5050j6158j0282R623J4822j502j8028p276J6347J2588j3494j6871N225J7293
2617G337K961j5975j0332J2379J5714n441j6511j493J5538J0755j0430j6452N556
2630f394J9548Q78j8586p405J2567J2569o490j6956k168J6226Q268j3538j3675
2643a5156O964J6518J324j6867p498J5461J3643r249j4756K221J5292O421j2100
$$ y = [15040, -1934, -13635, -502, 16882, 10534, -8445, -11265, 4459, 14904, 3057, -15667, -11003, 10183, 11286, -8975, -17206, -2310, 11927, 6026, -11581, -13035, 5541, 15768, 1604, -12873, -4763, 13218, 14453, -4295, -13916, 2216, 16845, 5870, -12277, -10229, 5949, 11787, -1549, -16325, -8660, 10605, 9325, -9816, -15283, 776, 14098, 5117, -12111, -8579, 10815, 15050, -1108, -11390, -1767, 13055, 11553, -6475, -13751, 2596, 15184, 1690, -15181, -9956, 7337, 10298, -5677, -16009, -3630, 12084, 6643, -9868, -11361, 4177, 14932, 4502, -11950, -6394, 13154, 14032, -4554, -11959, 608, 13177, 6687, -10269, -12437, 3789, 12057, -1481, -15156, -8192, 8326, 9650, -7217, -14715, 746, 14389, 5140, -9616, -7395, 7897, 14318, 2218]
2656B218j3882P432J7417k442j8099n480J3734J1441r472j6545K766J7050L658
2669I796j4554q667Q774J4512p61j5610n577J6341J1538j1394j4571M999J5370
2682A0196K539j4685j0107J0415J3504n615j6029k536J3697R373j0259j4981N493
2695h995J8073N12j6004n392J1788J2374m788j4819j370J5521P493j2423j2611
2708a0641O555J4124L13j6405p451J3277J1459r441j3280J476J3596O070j1010
2721a358j2105P811J6628j750j5107m192J3560J0413q408j4510K669J5391K566
2734A1608j3660q652O989J2489j623j5437n442J4812R869j1378j2243N282J4270
2747F884K864j2770q016J0436J2784m402j3762j644J2357Q823j0250j4189N078
$$ y = [2218, -11664, -4232, 13185, 10743, -7356, -12836, 898, 12339, 2867, -13678, -10912, 6138, 9796, -4758, -13425, -4651, 9861, 9100, -6510, -12087, 4254, 15792, 4398, -10173, -5174, 10196, 12735, -1950, -12057, -1642, 11862, 6247, -9782, -12318, 1379, 10752, 493, -14488, -8995, 9078, 9590, -6414, -11806, -18, 12356, 7568, -7251, -8621, 6900, 14393, 1970, -10641, -4086, 10038, 10351, -6054, -13505, -228, 11231, 1790, -11490, -10014, 3582, 9652, -1358, -13463, -5652, 10976, 9226, -5881, -10073, 3487, 13900, 5492, -9018, -6349, 9042, 11608, -2052, -10704, -3715, 8774, 7151, -8286, -13728, 1084, 10953, -425, -12668, -7386, 6884, 9748, -3022, -11038, -602, 12182, 7780, -5982, -7626, 4731, 13554, 3304, -10885, -5807]
2760e807J5555q94j4804n827R617J0536m648j3963p87J4113O957j0803j0510O578
2774d687J4083J106j4280n976J3054R846q073j2054P98J1655N264j0742j1630
2787a1636O541J3915k879j4100m138J2218R383p667j2585L480J4120K896j0893
2800a345p442P224J2462j327j4260l921J3078Q054j0317j1693L526J2227J872
2813H138j2138q061Q673J1167l964j2281j670J1775Q937q974j1943N608J4880
2826A0147p50j2258m524Q716R545m183j2999j756J2895N116j0551j0470N061J2242
2840F231M63j3478n151J1590R157o805j0313J423J1538N771r109j0257O836J2785
2854A0681j757j3248l514J0269Q255p872j2083K202J1910K184j0595p119O062
$$ y = [-5807, 9748, 8854, -5950, -11777, -2160, 8376, 3728, -10235, -11022, 3091, 10048, -755, -11265, -4687, 9396, 10502, -3778, -9754, 3300, 13146, 5073, -6981, -6183, 5472, 10736, -6, -11636, -5095, 8820, 5941, -8159, -12297, -79, 9304, 1637, -10948, -7468, 6652, 9548, -1345, -8787, -1563, 10899, 9572, -4688, -8609, 4469, 12523, 2206, -9487, -5961, 6266, 8138, -4000, -12061, -3388, 7779, 3815, -8466, -10136, 1639, 10576, 1602, -10341, -4733, 10147, 9397, -2861, -7385, 1331, 10876, 6693, -6306, -8062, 4833, 9949, -602, -11072, -6011, 6231, 6694, -6784, -11935, -345, 8812, 2007, -8306, -6883, 4655, 10426, 1317, -8940, -2104, 10681, 8924, -4324, -7838, 2431, 10686, 2814, -9269, -7067, 4843, 7027, -3568, -10687, -4625]
2867d625J0819m86j2822l325J2846P542q145r467L627J1523K314j0413p418Q144
2881A14R974m174j1637k208R938O963q727j1354N054J1996n07j0898m122P788
2895a800R482k886j1543p30J2485N665r010q872M797J1238R1j2298m922R846P427
2910H970o728r909J59R696M928q955r618O904J1441j609j1143k701J0026P780
2924I241n663j0166K428J1567J620q970o912N317R686j574j2296l105J0762N618
2938G553p945q672K456J0513K284r768o088Q230R343k976r682j652J0079O810
2952A0485p717j0056M791J0840j066r839m211N992P902l995j0443j154J0350M325
2966F204p923p678M475J0887L36j0330l480R200O974m534q712L24R239M681q534
$$ y = [-4625, 6194, 5708, -7114, -10439, 2407, 9949, 1804, -7663, -4036, 7487, 9801, -612, -8030, 114, 10088, 5914, -5723, -7931, 2007, 8970, 243, -11111, -6057, 5939, 5432, -5466, -9588, -1800, 7682, 4796, -6747, -7477, 5008, 10673, 1663, -7209, -2412, 8826, 8917, -3381, -8303, 1543, 8970, 2242, -7667, -7508, 2188, 7116, -1839, -11457, -4553, 6888, 5279, -5864, -8565, 1461, 9241, 3578, -6588, -4160, 7407, 9027, 57, -6855, -1538, 8148, 6574, -5722, -8827, 1935, 7553, -392, -9064, -6608, 3905, 6189, -3579, -9667, -1437, 7906, 4930, -4752, -6404, 3675, 10485, 2768, -7288, -2497, 8343, 7277, -2562, -6773, -781, 7121, 3126, -7317, -8471, 1879, 6204, -1719, -9397, -4922, 5965, 6301, -4029, -7509, 1691, 8665, 4131, -4581, -4257, 4982, 9663, 1129]
2981A129q579N238R777k328j0381k870P826O666n791r324K320R587K394p732n546
2996g614N142R649r51j0320k022R973N340o565p860K086Q629J677q837o132N983
3011a822Q020l382r439j738Q782O032o974q221M518R895j11p865l400N955P881
3026H131k599r516r48R517L505p270p334K899Q876jj0031l568P617N975m430p271
3042f448p4Q494M515o948p056N493Q989j125q160k444P139O248n025q565J354
3057c613Q054J388p380n726L757Q194j051r813j828Q536M912n426o388K200Q429
3072D245K345p324m885N997P106k095q098j736P227N034o816p777L347P651p03
3087C518o878l849M873O841k118q429k55Q784L675n791n799L514Q258L43q340
$$ y = [1129, -7450, -2212, 7565, 5237, -5144, -8014, -188, 6478, 687, -8637, -6317, 3270, 5664, -2068, -7614, -2472, 7177, 6226, -4094, -6116, 3857, 9197, 2632, -5228, -3142, 5487, 7164, -1673, -7805, -1822, 6198, 2816, -6623, -8361, 421, 6453, -521, -8742, -4224, 5671, 5560, -2305, -5705, 250, 8131, 5532, -3984, -4932, 4585, 8090, 820, -6514, -3615, 5261, 5260, -4771, -8339, -722, 5253, 823, -6448, -6522, 1972, 6487, -461, -7517, -2024, 6965, 5840, -2320, -4764, 2375, 8623, 3598, -4967, -3613, 4441, 5829, -1551, -7277, -3520, 4674, 3623, -6190, -8018, 518, 5430, 4, -6384, -4184, 4245, 6590, -734, -5619, 378, 7484, 5389, -2709, -4445, 2782, 7816, 1000, -6777, -3430, 4221, 3518, -3360, -7209, -2336, 4505, 2387, -6042, -6297, 2487, 6162, 371, -5428, -1914, 6344, 6687, -1653]
3102a653l042O444M864l330o869q30O614L848o741p071M551P070j296p195k477
3117g113O691N916m226o782J945P529K354n553n121L710P883j206q989j700P024
3132B362L587m947o136O83O933J600p031m428N151O146j476o711j168O985N263
3147F813n366o191L246P186J65o009l838L974O102k117p958j074O908K834n499
3162h24n787K852O659L81p134k190N697N006k434n561k09O513L924n500n866L962
3178e11O630j162o725k652M903M681m049o905R78O210J729m985m646L119P439
3193D054n16p363j022O953L525l303n240Q60O198J894n904m052L713N094j695
3208C196o469k198N637M134n108n458K460N802Q11m568l553L960O250j043o387
$$ y = [-1653, -4695, 1749, 6613, 3283, -3586, -4416, 2198, 6046, -695, -7766, -3215, 3855, 2559, -4636, -7113, -422, 5494, 1268, -5514, -3569, 3960, 6314, 761, -4360, -650, 7233, 6027, -2962, -4662, 2362, 5949, 1002, -5134, -4451, 2482, 4082, -2949, -7377, -2226, 3920, 2444, -4267, -5435, 1550, 6813, 1447, -4744, -1498, 5688, 5853, -156, -3994, -20, 6082, 3965, -3993, -5067, 1841, 4675, -824, -6611, -3759, 2900, 3281, -3853, -6043, -346, 4660, 2226, -3335, -3544, 2969, 6893, 1393, -4473, -511, 6119, 4957, -1768, -4420, 483, 5164, 1115, -5790, -4812, 1398, 3127, -1858, -6504, -3385, 4054, 3538, -3825, -4847, 2106, 5631, 2328, -2912, -2052, 4146, 6040, 136, -3916, -203, 4891, 3196, -3273, -5471, 166, 4300, -808, -6266, -3806, 1996, 2807, -1761, -5314, -1354, 4896, 3853, -2534]
3223b534p34O520K798m023n328J910O029qo419k836M334L816k185n654j272N959
3239C73L365m970m883L536N627L32n087k341M799M798k362n347M48N016K078m409
3255I73m910J835O139r97o639j682M914L053k726m765J55N776K441m619l609L774
3271h87N228m27m957k065N032M174m207n280K010M689M87m425m043K428N301j390
3287A668n965p70N039L163l202m727K000O054J046n050k381M091L964j207m843
3302a120j458M692L249m672m825K092M640l12m497k778L255M379k081m808J92
3317d052N074K456k925m070K230N659R4n472j387L775L228j990m946p87M815K206
3333C908m923l704K205M513l23m625k159M316M120k723m255J446M372J699k882
$$ y = [-2534, -3268, 3252, 6050, 2027, -3301, -1391, 4638, 4630, -1789, -4625, -291, 3525, 1340, -4314, -5586, 373, 3738, -1232, -6115, -2579, 3048, 3380, -1707, -4048, 751, 5549, 3187, -2160, -1712, 3304, 5382, 973, -3937, -2102, 4037, 3040, -3599, -5281, -367, 2686, -40, -4805, -4650, 1126, 3567, -1052, -4661, -887, 4341, 3914, -1043, -3108, 1924, 6098, 1891, -3389, -1379, 3310, 3797, -628, -4671, -2243, 3058, 1668, -4297, -5067, -28, 3135, -67, -4794, -2794, 3260, 4306, -744, -3125, 966, 4930, 3723, -1120, -2578, 2114, 5363, 691, -4134, -2042, 2598, 2286, -2211, -4989, -1734, 2645, 564, -4244, -4052, 1022, 3478, 553, -3517, -1287, 4372, 4466, -1006, -2393, 1382, 4610, 2620, -2326, -3113, 1702, 3908, -1015, -4719, -2514, 1999, 1676, -2949, -5108, -792, 3328, 605, -3650, -2204, 2168, 3867, 985]
3348I85l743K480M806n60n169j129L621K470k738m525K71M870Q29m341k778K763
3364a888L620k50m003j583M831L270k926l788J805M152Q31l272l425K856M081
3379D311j755m792p33L598K025k848m463J051N182K92m344j399L198L159r50l476
3395a944o04M526K511k968l398J543L772N06m268l017L350L224k401m302M27L018
3411b5J722k656l399J367M779L21m262q90L406L281j481l840J49M645J221l867
3427D71k458J629L375o11l990k326L478L135l112l681J007L525J165k617k774
3442c784K430M250m72l589m44L165K655j799l965K41M634J29m013k242K151K513
3458A860o52l733j774L879K365k521l022J181L736J337l293k088K888L850j564
$$ y = [985, -2758, -278, 4528, 3968, -1201, -2330, 1291, 3761, 1023, -3502, -3231, 1639, 2468, -1873, -4651, -1888, 1732, 1482, -2521, -4104, 727, 3997, 1071, -2717, -912, 3240, 4071, 799, -2626, 230, 4311, 2556, -2236, -2969, 629, 2654, -194, -4657, -3606, 1576, 1868, -2476, -3875, -677, 2482, 1532, -1944, -2548, 1978, 4489, 1521, -1877, -334, 3438, 3944, -324, -3341, 9, 3233, 832, -3470, -3043, -25, 1697, -959, -4358, -2991, 1788, 2109, -2153, -3043, 363, 3644, 2163, -1677, -1528, 3117, 4338, 471, -1987, -358, 3017, 2406, -1584, -3910, -432, 2703, -409, -4090, -3083, 442, 1607, -1010, -3784, -1354, 2896, 2424, -1165, -1609, 1556, 4211, 2412, -1553, -1312, 3322, 3451, -562, -2804, -653, 1860, 1208, -2525, -4299, -420, 1945, -576, -3598, -2417, 1319, 2656, -637, -2725, 163, 4013, 2449]
3473B449l243k91K997J552j860l894O81L838N1l972j943K680K401r36l762n38
3489c790M036K024k962k161J470L925P50l037k297L359L151k212l665K64K794
3504A649J598l047l414J060L580k39l855j171K418K897p83l806M17M482R84k693
3520G7j878J860L043P9l061j981L090K426k276l430J53K816J309l392k886K060
3536a991L543j022l185p38K788K914j230l495P88M298P84l028j963J870L198n05
3552C026m199r95K930J982k699k870K80K864J212l184k785K891L547j015k928
3567a943l16L172K353j827l149J116L833K5k807j959J618K968j289l963o11L362
3583E83J214k703k357M63L503R65l179j960K927L342j143l108qL405K117k831
$$ y = [2449, -794, -1085, 1912, 3464, 1604, -2290, -1609, 2229, 2280, -1692, -3635, -955, 1446, 510, -3252, -3790, 246, 2270, -692, -2853, -1383, 2542, 3292, 255, -2042, 1317, 4468, 2256, -1409, -1145, 1649, 3247, 200, -3214, -2154, 1426, 1187, -2668, -3839, -1421, 1476, 693, -3113, -2696, 1786, 2770, 77, -1801, 59, 3102, 3181, 120, -1861, 1229, 3655, 1379, -2051, -1898, 918, 2227, -1165, -4051, -1991, 1552, 530, -2655, -3393, -605, 2309, 1079, -2416, -1628, 2670, 3454, 426, -1537, 333, 3531, 3026, -1173, -2168, 762, 2744, 45, -2825, -2545, 319, 1531, -1653, -4438, -1547, 2000, 985, -1943, -2259, 913, 3266, 1439, -1710, -594, 3239, 3264, 457, -1502, 116, 3084, 1795, -2168, -2779, 583, 1797, -906, -3263, -2800, 703, 1668, -1511, -3471, -544, 2798, 1655, -1453, -1461, 1944, 4061, 1230]
3599A230k962J488L129m79l147j449J619K954j625m010P4L407J220k701k196J485
3615a963L744M02l400j151L543K368j699k802j30L462J479l253k999K036K766
3630B403q36l552j323K405K468j285l606O32L670Q21k932j587J723L940k56l819
3646a134n05L676J549k089k558j13L124R75l410k668K133K887j481l282q05L150
3662e51K538k024l281J402L595Q19k780j687K348L119p57l813k44L299J440k651
3678G72l038Q74K875P16m160j906K816K720j428k819p24L528K740k437l254K020
3694g05L834ol277j417K124L381j947l629p4L209J118l136k667J241L329p9m023
3711b724j231L400K598j354l159L95L438K215l104k541K307L260m60l599j562
$$ y = [1230, -1732, -244, 2885, 2406, -741, -2190, -571, 2383, 758, -3252, -3178, 229, 1449, -1252, -3448, -1963, 1781, 2183, -1217, -2368, 1175, 3543, 1844, -958, -1088, 2374, 3853, 600, -2399, -363, 2403, 1567, -1985, -3308, -903, 1565, 280, -3326, -2694, 976, 1797, -1135, -2722, -999, 2941, 2685, -1134, -1639, 2037, 3586, 1497, -1061, -1174, 1950, 2925, -485, -3153, -1020, 1867, 386, -2896, -3701, -551, 1987, -37, -3318, -1916, 1679, 2498, -282, -1969, 379, 3498, 2741, -1072, -1316, 1983, 3423, 772, -2266, -1392, 1483, 2199, -1961, -3867, -1051, 1669, 241, -2578, -3302, 226, 2966, 529, -2725, -705, 3129, 3123, -154, -1571, 553, 3934, 1987, -1642, -1716, 1493, 2611, -525, -3192, -1951, 1378, 1299, -2724, -3955, -555, 2043, 689, -2470, -2075, 1363, 3578, 474, -2067, 240, 3500, 3040, -559, -2121]
3726b121L005K415k220l931P60L022Q55l123k661K053L682k33m263o29M009K439
3742C059k013l261P63L966J375l400k654K232L382r73l996j196L493J996k961
3757a88l589J428L413J85l090j717K211L771q98l735j49M145J747k017l304J145
3773f42L907l0l745j768K795K425j785l784o16L539J883k988l452K314L362K67
3789A682l485j630L633L499j767l771N36L938J037k814k654R83L942m81m264j540
3805c156L337K024k192l618k2M220J559l284k458K422L575o9l586r58L472L046
3821D312k870l584J120L801N61l499k827J913L865j297m332j023L707K245k424
3836c32l634J160M661Q29l891j760L186L358j273l731l50L568K789l552l834J681
$$ y = [-2121, 884, 3299, 1079, -2852, -2092, 930, 1785, -1338, -3999, -1946, 1736, 1503, -2760, -3389, 620, 3059, 1046, -2215, -1452, 2514, 3889, 489, -2165, 67, 3449, 2476, -1520, -2716, 777, 2773, -188, -3777, -2349, 1064, 1249, -1841, -3558, -1347, 2424, 1526, -2209, -2358, 1787, 3534, 1517, -1787, -642, 3265, 3235, -510, -2278, 517, 2942, 1157, -2627, -3243, 296, 2179, -809, -4261, -1947, 1415, 1682, -1803, -3433, 200, 3699, 1932, -1839, -1303, 2635, 3672, 858, -1796, -813, 3129, 2648, -1616, -3156, 181, 2205, 13, -3605, -3627, 593, 2152, -1132, -3590, -1168, 2407, 2338, -1248, -2206, 1266, 4312, 1442, -2142, -1022, 2779, 3340, -159, -2986, -1073, 2792, 1495, -2837, -3860, -153, 2092, -332, -3966, -2806, 1855, 2684, -1207, -2967, 219, 3577, 2304, -1427, -1777, 1791, 4580, 1028, -2806, -1125]
3852a125L793K41m407k296K899L203j582m532M80L713J849k507l401J805M928
3867C061L11m500j376L933K827j838m457K21M161J498m158l167K089L555l84m335
3883b559j796L814L074k135m337J001M561J161k916k624K314M390q22m403j115
3898b392L929K468k613m144J67M735M78m326k532K941L395p28m633p13M251L098
3914C381l261l451J677M529P69l966k475L453L716j884m580n11M181J517k804
3929B91m314J658M412Jm730j575L464L389j395m321O6N046J742l630l135K714
3945c17M206m24m288k322M107L129k807m383M30M154J250l735l676K463M757o07
3961A937m708j436M637K983k135m198P25N340P64l734k974K797M068j460m523
$$ y = [-1125, 2668, 2909, -1498, -3794, -895, 2308, 726, -3806, -3326, 387, 2236, -271, -3672, -1867, 3061, 3372, -1128, -2504, 1429, 4256, 2418, -2039, -1818, 2343, 3841, -317, -3484, -1395, 2160, 1776, -2559, -4355, -541, 2533, 398, -3939, -2938, 1623, 2784, -132, -2756, -442, 3948, 3126, -1277, -2392, 1537, 4005, 1392, -2752, -2585, 2150, 2628, -1698, -4230, -1289, 2106, 1378, -3255, -3968, 283, 3381, 120, -3331, -1654, 2875, 3644, -322, -2797, 656, 4372, 2488, -2092, -2603, 1578, 3095, 291, -4023, -2365, 2047, 2048, -2682, -4257, -793, 2596, 1201, -3120, -3054, 1992, 3734, 104, -3031, -317, 3889, 3465, -823, -3145, 962, 4091, 1284, -3099, -2669, 1485, 2735, -1000, -4676, -2213, 2544, 1937, -2771, -4207, 430, 3413, 1278, -2920, -2195, 3145, 3909, 175, -2799, -2, 4066, 2606, -1917]
3976a917j576M279K841l687m201J383M792K64m075k750L209M676j643m401j61
3991b967M777K410k890m441J993N222K8n151k230L572L548k136n049n73M868K096
4007C077m103l620K211M914j43m431k196M512M033k619m512Q66M814J752l895
4022F60m215K943M772j193n040j391L663L311k852m925M93N514J211m782k694
4037d525L206M497o95m743j106M899L313l292m444J594M727R03n156k872K883
4052h11M789k139n307n99M496K478l149m415J954N303L96m824k091M172M001j736
4068B518m960k92N396K030m165l921K220M664j97n440k579M674L705k932n166
4083d445Q59M755K013l814l969L075N463j058m854j175M585L492k808n008Q52
$$ y = [-1917, -3493, 786, 3627, -60, -4261, -2878, 1914, 2178, -1897, -4647, -1438, 3238, 1595, -2806, -2967, 1810, 4220, 1330, -3111, -1118, 4104, 4132, -1019, -3249, 323, 3871, 1735, -3314, -3887, 981, 3077, -1026, -4646, -2435, 2479, 2336, -2095, -4291, 221, 4254, 1635, -2877, -2011, 2803, 4555, 660, -3555, -612, 4160, 2967, -2073, -3464, 199, 3510, 658, -4267, -3774, 1740, 2951, -1831, -4525, -1319, 3178, 2483, -2260, -3366, 1533, 4846, 1554, -2890, -1296, 3431, 4334, -822, -3694, -811, 3978, 1839, -3468, -4067, 429, 2907, -242, -4657, -2703, 2600, 2996, -1828, -3919, 253, 4254, 2518, -2442, -2734, 2662, 4692, 527, -3394, -1174, 3490, 3293, -2147, -4726, -52, 3653, 721, -4445, -3586, 1169, 3182, -632, -4601, -1526, 3937, 2879, -1975, -3150, 1435, 4927, 2119, -2889, -2037]
4098b037N376Q92n023l493L180M399j181n419j506M793L456l548m628J921N238
4113B420J059m504k852L911M778j747n362n10M964K864m063m790J782N219Q7n402
4129b146k677L864M308k248n376J12N529K379m025m011K654N220K14n011k378
4144c592M854L953k954n367N27N103J717m699m404L029M947p51n616j343M286
4159c10L987l081m494P94N920J356m657l451L543M882q88n542j216M814L385m088
4175I54m872J604M955Q21n591k949L687M865j975n335k94N179L092l504m809K223
4191a949N958n7n204k358M273M129k245n578k97N458K207n074m156K425N229j34
4207B627n543k125M821M257k765n283R34N559K074m506l650K826N677j031n918
$$ y = [-2037, 3339, 4231, -792, -4285, -1105, 3294, 2113, -3306, -4812, -19, 3437, -111, -4739, -2818, 2420, 3479, -1025, -3877, 34, 4812, 3065, -2297, -2807, 2157, 5021, 958, -3832, -2050, 3169, 3256, -2146, -4823, -959, 3349, 1101, -4275, -4163, 1366, 3745, -280, -4291, -1637, 3583, 3797, -1214, -3592, 1262, 5215, 2261, -3106, -2579, 2524, 4241, -458, -4862, -1833, 3114, 2363, -3253, -4596, -310, 3677, 596, -3898, -3104, 2816, 4172, -485, -3936, -393, 4489, 3601, -1941, -3157, 1657, 5042, 954, -3918, -2314, 2641, 3462, -2129, -5078, -1391, 3474, 1499, -3836, -4130, 1049, 4141, 637, -4172, -1949, 4009, 3952, -1252, -3610, 663, 4792, 2547, -3031, -3328, 2130, 4337, -737, -4893, -2468, 2761, 2627, -2916, -5041, -220, 4037, 1272, -4011, -3077, 2482, 4556, 50, -3600, -774, 4903, 3872, -2046]
4222b046j775N101L734l824n391R92N696J112n260l235K965N072p48n690r99N315
4238A019L740l954m659K174N476O48n037l661M218M774j902n794p10M922K830
4253D084m148n161K233N784K48n667k135M402M643j975n883J67N988K503m634
4268D49m224K795N289m12n648k695M713M403l365n771R42N182J858n195l558L150
4284b087N629p56n867j258N396M015l123n670J375O183R89n027l756L570N016
4299D629j588o189j029N131L438m409m954J803N665J207n439l383M405N402k173
4314B516n549k55N653L075m250m888K059N876k31n552k983M439M311k750n806
4329d335j16O179K086m790m275K998N636J21n913j946N302M344l098n405O50N440
$$ y = [-2046, -3821, 1280, 5014, 1190, -4201, -3209, 2487, 3599, -1661, -4896, -1931, 3141, 2393, -3297, -4296, 1019, 4759, 805, -3854, -1680, 3796, 4444, -593, -4254, -36, 4738, 2836, -2958, -3668, 1254, 4084, -64, -5225, -2992, 2792, 3040, -2627, -4762, -360, 4283, 2308, -3575, -3408, 2580, 5083, 449, -3775, -980, 4309, 3897, -1751, -4446, 267, 4670, 1305, -4466, -3524, 1658, 3516, -1679, -5237, -2087, 3542, 2786, -3081, -4339, 1057, 5072, 1949, -3721, -2346, 3837, 4826, -201, -3957, -387, 4629, 3041, -3148, -4177, 954, 4392, -17, -4971, -3168, 2497, 3704, -1735, -5118, -713, 4689, 2516, -3033, -3288, 2365, 5440, 1190, -3698, -1639, 4237, 4006, -1546, -4529, -90, 4221, 1471, -4335, -4451, 1728, 3814, -976, -5251, -2253, 3383, 3504, -2409, -4355, 947, 5291, 2193, -3212, -2562, 2878]
4345B878K210n116m576L464N564j518n916j713M975L867l512n685J380O100J392
4360C794n236l392L928N522j076o215j081N825L633m317n105J562N797O48n879
4375a592l460M114N159k572o076j13N457L207m329n060K664O318L16n731k745
4390d443M885M786k088o469m1O047K414m925m764K808N518m88o265k438N362M118
4406D017l151n523Q09N881K532n132m342L716O045q53o277j309N054M022l694
4421A795n841J098O024J006n793l255L361N351j499o054j169N866L504l921n272
4436d799K022O294P44n431l150M429N383k479o117l25N647K696m494n338K441
4451b477N775j30n681k665M638M520k552n727M98N994K704n152m179L019N965
$$ y = [2878, 5088, -28, -4604, -1140, 4424, 2906, -3010, -4723, 252, 4119, 607, -5078, -3698, 2402, 3794, -1442, -4834, -906, 4616, 3540, -2675, -3756, 2069, 5702, 1385, -3720, -2158, 3639, 4287, -1592, -5052, -938, 4221, 1649, -4427, -4540, 917, 4124, -205, -5265, -2601, 3717, 4033, -1698, -4443, 442, 5228, 3140, -3329, -3370, 2677, 5091, 166, -4598, -1790, 3728, 3240, -3025, -5463, -101, 4017, 866, -4657, -3848, 2033, 4565, -567, -4909, -1193, 4852, 3999, -2278, -3587, 1467, 5489, 1795, -4046, -2948, 3076, 4082, -1711, -4966, -1605, 3746, 2247, -3807, -4976, 890, 4394, 473, -4799, -2777, 3517, 4261, -1170, -4320, 109, 5492, 3013, -3104, -3429, 2218, 4914, 420, -4918, -2477, 3298, 3168, -2513, -5178, -540, 3980, 1428, -4299, -3801, 2193, 4897, -255, -4434, -1415, 4550]
4466D550o8o505k200N389M308l929n737R04O104J561n350m412L446N872j388o286
4482c741j172N545L895l315n945J695O683J233n719l398M002N329j733o254j408
4497d303O394L055m919n308K124N966Q72o578k860M641N195k389n641j60N800
4512A889L328m799m853K641O361j21o249k302M668M575l038o262J17O476J925
4527D356n201m790L268N969q12n921k021N574M232l248n417J018O023K057n256
4542a69m370M171N434j375o299j822N747L599m261n640J691O144Q80n703l262
4557e235L859N764j472o768m00O397L340m416n066K021O307L18o225k965M555
4572A4M998k872o256k15N869K869n068n119K938O375l09n828k319M990M820k490
$$ y = [4550, 4482, -2023, -4223, 1166, 5474, 1545, -4192, -3288, 2816, 4377, -973, -5385, -1939, 3933, 2545, -3741, -4913, 632, 4527, 1212, -4733, -3038, 3645, 4878, -841, -4239, -237, 5092, 3359, -2895, -4303, 2091, 5146, 227, -5081, -2957, 3009, 3881, -2697, -5557, -916, 4279, 1890, -3751, -3911, 1889, 5217, 418, -4435, -1794, 4567, 4446, -1803, -4105, 563, 5138, 2100, -4162, -4045, 2431, 4356, -845, -5635, -2367, 3602, 2790, -3131, -5152, 422, 4654, 1406, -4011, -2993, 3030, 5087, -169, -4539, -368, 5066, 3691, -2608, -4430, 1317, 4916, 655, -4985, -3294, 2850, 3730, -1973, -5235, -1376, 4388, 2916, -3852, -4252, 2145, 5485, 1069, -3997, -1976, 4331, 4649, -1576, -4541, 14, 5012, 2140, -4116, -4331, 1538, 4407, -661, -5780, -2842, 3533, 3224, -2604, -4923, 67, 4887, 2397]
4588B397o171O43O341K011n382m023K850O092j164o452k028N372M224l931n582
4603d803R31N997J934n439m215M125O175j624o339r04N727L597l590n669J978
4618b119O187N67n812l387M056M993j541p115m21O050K754m490n033K382O148
4633C219P81o336k781N236M856k576n830M8O071K966n473m938L226N961q02o077
4649b449k168M460M542l098o429R41O548J836n392l824L260O270p23o489j639
4664d354N746M123l850n380P61O616J212n781m379M272N570k235o157q78N502
4679G88L552m051n765K489O565O62n942l262M713N420j691o883l47O346K606m914
4695B86m590K082O033J79o361k758M794M660k984n968J60O462K863n372m506L363
$$ y = [2397, -3774, -3131, 3210, 5221, -161, -4184, -1334, 4758, 3594, -2858, -4886, 486, 4710, 779, -4803, -3872, 2125, 4059, -1380, -5595, -1470, 4705, 3081, -3258, -4162, 1565, 5162, 1572, -4097, -2119, 4068, 4635, -1177, -4564, -508, 4485, 2944, -4171, -4592, 1458, 4212, -278, -5311, -2929, 3219, 4000, -2336, -5117, 119, 4975, 2399, -3431, -3383, 2688, 5654, 181, -4757, -1531, 4430, 3628, -2449, -4617, -157, 4385, 1287, -5142, -4201, 2347, 4183, -1209, -5033, -1773, 4497, 3774, -2715, -4354, 1392, 5515, 1665, -3715, -2954, 3662, 4874, -907, -5286, -1014, 4556, 2321, -3836, -4714, 788, 4340, 289, -5476, -2987, 3578, 4240, -1702, -4964, -251, 5169, 3478, -3405, -3752, 2594, 5200, 286, -4304, -2222, 3811, 3990, -2371, -5129, -335, 4325, 1341, -4627, -4467, 1995, 4858, -514, -5020, -1657]
4711a657O266p92o114j699N230M282l272o274J037O212J363n404m609L885N412
4726C866r61o496j502N571M005m137n234J798O398J494o093l866M840N587k013
4741C257o249r25N890L309m657n592K113O544K17o150l375M958N183k584o413
4756d474j77O825K406m654m621K767O155L76o588k508N534M570l439o025L58O177
4772B682K046n535m585L507N901j363o062j716N287M476l317o298J648O503J906
4787E080n643l838L564N955j092o916j164N820L244m044n653J487N979J327o095
4802a989l777M794N139j813o208m12N865L400m193n707K926O353K25o142k832
4817d371M509N236k715o570j48O205K525m919m977K746N803m7o358k316N477M993
$$ y = [-1657, 4609, 3817, -2297, -3996, 1234, 5516, 2244, -4030, -2993, 3219, 4582, -822, -5431, -1546, 3866, 2905, -3591, -5093, 478, 4483, 346, -4888, -3090, 3308, 4802, -1291, -5157, -317, 5270, 3257, -2992, -3917, 1973, 5282, 625, -4967, -2854, 3690, 3907, -2243, -5618, -660, 4523, 1939, -4474, -4651, 2174, 4580, -74, -4695, -1928, 4227, 4603, -1985, -4493, 1041, 5611, 2172, -3853, -3495, 2682, 4728, -807, -5392, -1885, 4016, 2653, -3409, -5125, 162, 4638, 1321, -4977, -3329, 3174, 5080, -563, -4401, -837, 5118, 4026, -2890, -4054, 1766, 5010, 966, -4687, -3200, 2779, 4106, -1989, -5766, -972, 4167, 2354, -3854, -4266, 1599, 4999, 806, -4901, -1975, 4378, 4603, -1539, -4371, 138, 5374, 2659, -3911, -4059, 2146, 4671, -248, -5225, -2479, 3324, 3277, -3081, -5397, 80, 5073]
4833E073l559n620L63O769K340n417n013M324N750j247o223k195N418M294l861
4848A196o249J279O638J396n925l881L913O047j896o240q21O450L186l961n557
4863d425K112O185J180n985l929M817N182k496o195p79N826L262m991n482K838
4878b880O358J56o070k879N353M838k571o214K78O854K135n293m567K863O239
4893D600l05o847k295N533M202l467o130R67O104J909n580m305L844O000r67o241
4909b978j374N378M335l788n864J778O475R15n743l857M062N346j843o694o91
4924d543O206L030m870n191K126O520J080o455l150N050N290k454n966k77O057
4939B453L226n121n232K972N847k58o007k780N079M580l019o586N03O583K338
$$ y = [5073, 1514, -4106, -3743, 3026, 5366, -51, -5064, -740, 5010, 3763, -2460, -4655, 763, 5057, 1196, -5053, -3774, 2864, 4260, -1665, -5546, -1633, 4414, 2518, -3722, -4543, 1907, 5093, 1132, -4425, -2313, 3872, 5052, -933, -4862, -45, 5137, 2641, -3554, -4333, 1493, 4755, -236, -5718, -2880, 3478, 3634, -2436, -5315, 38, 4876, 2305, -3909, -3631, 3223, 5358, 65, -4502, -1639, 4600, 4295, -2552, -4847, 686, 4888, 1421, -4709, -3742, 2362, 4271, -1309, -5614, -1770, 4230, 3263, -2978, -4352, 1026, 5361, 1573, -4291, -2513, 3962, 4877, -866, -4723, -661, 4685, 2842, -3852, -4543, 1663, 4693, -177, -5368, -3242, 3278, 4358, -2097, -5247, -197, 5093, 2639, -3327, -3604, 2453, 5679, 558, -4674, -1702, 4145, 3887, -2120, -4900, 179, 4759, 1740, -4846, -4343, 2240, 4578]
4954D578n499m563L604O205n51o630j524N591M134l562n888J115O453J801o106
4969h42m173L871N832k051n865j600N652L738m370n333K056O375P65n716l278
4984d939M521N454j976o366k26O035K766m527n275K338O079K75o488k911M945
4999b95M468k389o081q2O321K878n288m582L160O090m69n765k422N150M960l395
5015B259o294J061O261J488n263m510L449N797j217o284j619N648L635l823n326
5030d738J389O478J434n874l381M288N189j512n906j236N701L808m741n546K084
5045b563O098O19o132l466M560N121k132o290m3O118K507m357m782K410O498M28
5061D594o450k468N027M494k882o004J31N964K694n456m800K918O140p31o258
$$ y = [4578, -921, -5484, -1880, 4325, 3774, -2856, -4380, 1211, 5345, 1783, -4105, -2990, 3463, 5264, -842, -5015, -1144, 4688, 2637, -3228, -4828, 824, 4562, 192, -5141, -3085, 3290, 4055, -1661, -4939, -418, 5036, 3060, -3306, -3532, 2503, 5269, 742, -4533, -2195, 3884, 4159, -2329, -5240, -295, 4173, 1784, -4297, -4379, 1942, 4820, -468, -5050, -1890, 4200, 3731, -2034, -4456, 694, 5654, 2259, -4035, -2974, 3287, 4775, -488, -4998, -1549, 4248, 3031, -3253, -4872, 776, 4411, 588, -4738, -3349, 3129, 4563, -1311, -4692, -404, 4785, 3273, -2633, -3869, 1832, 5640, 899, -4647, -2563, 3535, 4154, -1978, -5444, -884, 4237, 2105, -4185, -4228, 1890, 4397, 40, -4742, -2332, 4166, 4594, -1856, -4324, 703, 5197, 2315, -3689, -3558, 2406, 5100, -356, -5156, -2238, 3902, 3171, -3087]
5076c087k107N329M819l522o174J391O291J646n416l791L550O199j365o664r63
5091c864N808K994l773n671J389O235J124o117l348M368M928j892n890p90N921
5106A422L599m615n209K566O262K65n591l260M797M943k442o468l6N769K740m908
5122a66n014L017N894m40o130k361N426M234l050n472M74O525J971n178m440L570
5138a140N651r15o023k251N737M324m124n968J424O164Q84n102l845L680N775
5153D271j492o483o88N726L540m123n127J914O282J014n880l315M358M890k177
5168B710o297o76O028K962m716n479K728O286j32n915k720M997N322l076n984
5183c962M37O063K384m767m371K594O196o65o124k361N151L998l105n753L61O332
$$ y = [-3087, -5194, 135, 4954, 1432, -4742, -3351, 2940, 4586, -830, -4621, -1071, 5128, 3763, -2901, -3864, 1944, 4938, 1165, -4506, -3117, 3118, 4242, -1875, -5223, -855, 4073, 2181, -3709, -4499, 1422, 5021, 406, -4803, -2237, 4025, 4290, -1301, -4561, 236, 5179, 2737, -3731, -3767, 2002, 4742, -166, -5180, -2163, 3731, 3291, -2839, -5200, 226, 4460, 1410, -4062, -3588, 2937, 4908, -270, -4710, -1140, 4511, 3596, -2427, -4678, 1059, 5383, 1259, -4709, -3285, 2879, 3763, -1339, -5184, -1504, 4271, 2779, -3704, -4392, 1334, 4874, 751, -4376, -2462, 3820, 4834, -1046, -4361, -3, 4887, 2710, -3587, -4263, 1765, 4727, 11, -5468, -2740, 3546, 3414, -2501, -5221, -224, 5098, 2022, -3962, -3525, 2538, 4922, 155, -4216, -1622, 4574, 3909, -2215, -4576, 575, 4573, 1468, -4285, -3924, 2408]
5199B408J840n738l797L620N966j469n787j477N524M257m259n128J755N887Q83
5214D485n504l603L853N604k017o358o58N659L138m479n289K298N815N38n651
5229b169k897N095M362k029n935r2O213K780n237m499L039N517k67n923k535M609
5245C2M647l428n835P82O036J503m527m223L109O083r43o229j346N263M183l372
5261A735n666J339N847J637n760l738L506N464j781n751j419N556L735m260n277
5276d833J936O094P78n346l687M411N603k181o254R0N424L194m409m974J966O150
5292C962M9o147k536M538M497k614n919k30O242K662n110m419L322N574o70n308
5308b107k331N046M719l394n707J038N726J441m906m256L036N752j255o126j317
$$ y = [2408, 4248, -1490, -5287, -1667, 4299, 2830, -2957, -4434, 1090, 5347, 1088, -4040, -2285, 3602, 4485, -1019, -4622, -769, 4835, 2818, -3540, -4198, 1461, 4599, 120, -5169, -2871, 2944, 3482, -2169, -5066, 29, 4391, 2362, -3573, -3665, 2548, 5328, 91, -4408, -1369, 4148, 3881, -2042, -4577, 32, 4679, 1251, -4584, -3802, 2234, 3737, -790, -5013, -1904, 4179, 3236, -2993, -4339, 924, 5107, 1735, -3931, -2592, 3255, 4892, -868, -4606, -1100, 4364, 2583, -3168, -4587, 969, 4704, 444, -4833, -2897, 3197, 3975, -1371, -5058, -647, 4956, 2775, -3479, -3389, 2035, 5229, 820, -4154, -2188, 3962, 4011, -2136, -4672, -134, 4363, 1749, -4170, -4400, 1842, 4504, -606, -5025, -1703, 3871, 3201, -2107, -4438, 608, 5327, 1933, -3774, -2736, 2990, 4431, -475, -4731, -1695, 4057, 2802, -3324, -4641]
5323d641N249L706l617n269J219O085J581n630l310M098M849j394n591j249N642
5338A728L735m760m986J967N555P16n633l232M439M767k257o189j74N719K979
5353D374m506m740K795N565N70o094k258M877M406k748n617o4O041K061n088m506
5369d932L186N379n59n846k137N186M354l750n294J108N801K055n172m039L459
5384a201N988j507n933j330N412L371l737n059J492N623J152n914l341L983M957
5399C956j858n706q15N854L216m543m243K179N777L62n525k939M485M726k574
5414B352n656J82N111K430m526m491K286N659J3o007k018M627M407k888n449L56
5430c612O085J962m990l627L274M894o04n721j870N184L878l374n903J503N512
$$ y = [-4641, 608, 4314, 697, -4572, -3353, 2732, 4313, -1317, -4627, -529, 4320, 2926, -2665, -3914, 1728, 5463, 703, -4283, -2316, 3239, 3955, -1678, -4910, -471, 4296, 2039, -4150, -4324, 1395, 4374, -132, -4872, -2077, 3488, 4058, -2036, -4294, 583, 4989, 2241, -3376, -3440, 2601, 4662, -426, -4932, -1746, 3633, 3074, -2772, -4909, 277, 4631, 881, -4413, -3305, 2496, 4551, -621, -4660, -1201, 4787, 3280, -2653, -3983, 1429, 4800, 1063, -3996, -2504, 3119, 4271, -1643, -4984, -1001, 3956, 2098, -3608, -4423, 1431, 4647, 104, -4139, -1960, 3817, 4179, -1346, -4285, 200, 4926, 2352, -3304, -3122, 1989, 4419, -107, -4598, -2312, 3347, 3360, -2647, -4665, -38, 4369, 1481, -3968, -3612, 2473, 4435, -555, -4182, -908, 3986, 3382, -2339, -4209, 975, 4853, 1479, -4424, -2921, 2591]
5445B591J057m711m136L978N135j272n828p63N233L220l411n266J656N901J051
5460D435n613k738L857M635k105n522m73N129K807m475m572K429N430Q7n538k644
5476d871M400M865k444n698N88N570J972m465m264K754N802o00n916j515M509
5491F87L678k746n676L52N929J718n135l857L711N003q97n567j736N358L882l421
5507A283n379J769N290J450n138l746L908N303j928o143m99N125K895l762n129
5522d701J871N758N31n579k386M137M570j818n629m31O012K590m708m225K376
5537a632N369L19n851k473M614M024k890n448N43N254K152m614l850K655N655
5552C827r86n317j568M401M060k845n315R28N705J790n428l625L700M703j096
$$ y = [2591, 3648, -1063, -5199, -1221, 3914, 2642, -3186, -3949, 1284, 4504, 1093, -4173, -2517, 3384, 4435, -1178, -3916, -59, 4576, 2471, -3051, -3524, 1605, 4412, -63, -4635, -2206, 3224, 3311, -2227, -4871, -471, 4394, 1950, -3748, -3160, 2410, 4382, -83, -4347, -1593, 4209, 3609, -2307, -3822, 687, 4365, 1619, -4057, -3705, 2224, 3942, -1193, -5050, -1339, 3664, 2767, -2800, -4536, 822, 4704, 1283, -4096, -2327, 2963, 4413, -725, -4471, -563, 4740, 2812, -3331, -3830, 1295, 4190, 428, -4701, -2830, 2928, 3459, -2120, -4506, -369, 4201, 2383, -3246, -3677, 2335, 4925, 217, -4008, -1632, 3737, 4056, -1795, -4268, 346, 4370, 1480, -3968, -3425, 1829, 3981, -633, -4483, -1828, 3827, 2841, -2476, -4044, 357, 4417, 1572, -3743, -2815, 2890, 4680, -748, -4373, -673, 4030, 2934]
5567B934n643j650N348L389m012m625J324N658P62n049k875L824M894j835n671
5582c227j27M876L114l783m722J908N340K22n299k599M119M305k027n644k65N432
5598A623K429m561m074K752N434k35n414k172M782M412l080n303M83N429J706
5613D211m503m025K835N512j281n591j165M576L480l240n035J179N652J343m997
5628a049l157L549M848j288n503j023N127L240l920m536J498N187M65m679l159
5643d400L780M636k244n335k62N119K624l989m056J757N385N47n390j935M210
5658D47L954k232n347K03N172K308m945l589K506M427L14n751j962M748M052l464
5674H41n006J088N311J764m579l736L355N062q13n944q38M497L495l289m974J119
$$ y = [2934, -2709, -4359, 989, 4378, 366, -4259, -2935, 2723, 3485, -1564, -4439, -615, 4279, 2444, -3227, -3354, 1522, 4636, 853, -3869, -1961, 3379, 3601, -1698, -4297, -178, 4127, 2100, -3544, -3809, 1623, 4052, -509, -4583, -1831, 3603, 3368, -2046, -4218, 564, 4976, 1896, -3407, -2924, 2505, 4211, -292, -4317, -1482, 4030, 2749, -2842, -4007, 569, 4049, 809, -4226, -3047, 2605, 3948, -1049, -4206, -657, 4191, 2903, -2600, -3623, 1504, 4744, 824, -3712, -2214, 2973, 3438, -1241, -4400, -620, 4016, 1772, -3563, -3825, 1294, 3918, -71, -4127, -2370, 3015, 3562, -1828, -3763, 447, 4401, 2169, -3178, -2975, 2197, 4505, -440, -4029, -1523, 2904, 3218, -2533, -4495, 253, 4305, 841, -4165, -3077, 2234, 3998, -581, -4317, -962, 4100, 3287, -2657, -3495, 1002, 4497, 1208, -3766, -2647]
5690b647N661P30m991l041L254M482j179n361j008M984L142l945m159J880N193
5705B995R24n176k799L773M594j868n413j37M812K419l801m492J987N501m64n213
5721b358j488L818M142k407n158P8N433J965m612l348K711M931j52n386k039M557
5737F87L674k912m919N57N215J348m531l808L238N038j639m736j219M723L478
5752D194l513m689J715N452P06m652l082L539M394j361n428n98M860K660l961
5767B36m135J979M636L68m804k731L971M683k651m814o6N116K233l639m278K519
5783a377N253n58n148j696L697L805k183n396N82M971J871m634l561K837M559
5798C022K4n376j459M751L015k809m613Q65N576J186m440l421K914M879j536n006
$$ y = [-2647, 3014, 3744, -1247, -4288, -1034, 3448, 2269, -3092, -4100, 884, 4026, 81, -4078, -2198, 2995, 3919, -1257, -4056, -283, 4311, 2443, -2970, -3107, 1705, 4124, 323, -4169, -2182, 3319, 2855, -2358, -3846, -28, 4114, 1707, -3451, -3373, 2060, 4025, -587, -3935, -1224, 3707, 3555, -1831, -3870, 687, 4361, 1449, -3470, -2913, 2302, 3650, -881, -4689, -1451, 3587, 1948, -2788, -4007, 716, 4194, 681, -4008, -2293, 3159, 3865, -787, -3869, -330, 4064, 2703, -2725, -3323, 1537, 4197, 236, -3899, -1920, 2716, 3084, -1720, -4451, -480, 4203, 1552, -3262, -3328, 1788, 4021, 382, -3896, -1377, 3876, 3318, -1830, -3526, 171, 3976, 1793, -3603, -3021, 1950, 3821, -813, -4374, -1537, 3022, 3046, -2330, -3789, 962, 3977, 1168, -3445, -2580, 2996, 4182, -258, -3679, -765, 4114, 2578, -2428]
5814b428j131M184L260l441m673J762M952P07m588k980L699M078j205n020p11
5829c535N015K740l909l995K113M711M16m971k418L657M149k510m465l71M387
5844A014K645m109l937K408M956k88m659j718M083L579k429m864N63N529J299
5859D072m286l250K132M921q70n120j278M151L295l204m086P79M700J441m438
5874a041l370L604M487j284m820o52M220K803k973m654J762M992L84m861k096
5889c499L018M217j896n062l42M999K233l823l592J465N193K29m799k122L793
5904A2M150k512m517L06M566K015m246l542K448M618p78m722j480M015L496k632
5920A197m921Q89M771J371m045l045K604M536n19n129j279M712L077l394m207
$$ y = [-2428, -3559, 625, 3885, 444, -4229, -2467, 2485, 3192, -1396, -4376, -677, 3401, 2196, -2824, -3535, 1480, 4220, 311, -3684, -1571, 3140, 3556, -1415, -3833, -176, 3973, 1463, -3002, -3373, 1014, 3659, -450, -4387, -1979, 2977, 2689, -1970, -3688, 395, 3974, 1545, -3319, -2756, 2773, 4072, -214, -3464, -1332, 3589, 2719, -2401, -3679, 472, 3767, 563, -3523, -2744, 1956, 3397, -1041, -4411, -807, 3680, 2396, -2424, -3076, 1144, 3947, 974, -3680, -1918, 3074, 3458, -1403, -3499, -481, 3736, 1840, -3222, -3564, 1435, 3668, -155, -3747, -2282, 2911, 3140, -1659, -3781, 12, 4162, 1650, -2867, -2561, 2005, 4020, -226, -3768, -1320, 3298, 2520, -2202, -3682, 333, 3829, 1197, -3724, -2835, 1936, 3307, -738, -3783, -1179, 3357, 2838, -2291, -3570, 1142, 4219, 825, -3382]
5935c382J120M826J060m830k568L060M208j656m587o08M813K312l399m529K174
5950a986M501P18m912j839L712L799j884m963j43M842J760l669l408K131M468
5965C127r4n034j977M089L273k452m048O2M721J966m073l317K481M552m14m884
5981b022j411M222L287k877m385O82M737J292m670k583K372M393n88n005j208
5996c764M635K668k881l949J011M686J168m686k676L597L805j372m492n56M151
6011A345K388l404m114K072M409lm242k198L316M105j912m920P3M848J704l758
6027b91l163K010M397J73m871j696M192L075k492l985K26M054J798l995l212K707
6043a073L783n31m393j420M210K969k471m571J256M705J051m070k854K468M524
$$ y = [-3382, -2262, 2564, 3624, -1206, -3774, -714, 3494, 1838, -2749, -3357, 1456, 3768, 369, -4160, -1986, 2515, 3233, -1679, -3518, 194, 3993, 2109, -2854, -2997, 1845, 3605, -64, -3472, -1341, 3127, 3033, -2001, -3978, 111, 3384, 932, -3116, -3054, 1667, 3633, -440, -3757, -1276, 3276, 2862, -2022, -3433, 789, 4076, 1199, -3186, -2504, 2233, 3525, -1145, -3728, -1356, 3037, 2449, -2556, -3764, 871, 3539, 658, -3291, -2280, 2406, 3574, -1112, -3788, -191, 3614, 2242, -2250, -2806, 1345, 3733, 329, -3785, -1713, 2696, 2693, -1549, -3747, -431, 3674, 1762, -3158, -3085, 1763, 3467, -291, -3454, -1444, 2953, 3126, -1745, -3441, 751, 3826, 1334, -2651, -2425, 1629, 3427, -568, -3780, -1073, 2710, 2179, -2214, -3634, 576, 3545, 1074, -3497, -2241, 2464, 3515, -555, -3409, -941, 3583]
6058C583j222m566j304M785K501l253l900J064M626Q98m659k795L854L714j782
6073A544m253m32M289K541l250l852K221M344j85m196k066L404L517k052m634
6088c060N12M029J571l079l531J813M440j92m438j811M102L207k324l975L34M349
6104A947J877m156l169K887L801p01m482j255L746L172k768m597J339M354Q06
6119B801l987k698K671M468j127m817n23M444K388k917l922J578M605M42m745
6134a339k128L503L069j388m559j65M477J730l311m044K119M592l43l680j750
6149c217L288L537j914m313Q9M539J422l476l275K506L930l02m725j472L969K421
6165C007k138m173Q50M283J581m124k881K640M086q61m419r37L776L047k711m172
$$ y = [3583, 2361, -2205, -3509, 1276, 3777, 524, -3376, -2312, 2314, 3212, -1447, -4242, -388, 3326, 1544, -2709, -3141, 1148, 3689, 439, -3413, -1192, 3152, 2967, -1229, -3295, 109, 3626, 1574, -3060, -2548, 1481, 3052, -27, -3558, -1745, 2695, 2503, -1935, -3746, 356, 3563, 1239, -2736, -2402, 1947, 3824, -332, -3501, -614, 3187, 2486, -1996, -3251, 495, 3667, 899, -3698, -2359, 1995, 2801, -1186, -3884, -1213, 3255, 2128, -2689, -3212, 1232, 3620, 703, -3219, -1641, 2964, 3406, -1339, -3467, 36, 3105, 1717, -2842, -3007, 1470, 3200, -111, -4155, -2036, 2556, 2213, -1467, -3217, 71, 3608, 1694, -2619, -2530, 2009, 3431, -45, -3320, -814, 3116, 2814, -1911, -3383, 586, 3007, 869, -3304, -2454, 1829, 3410, -714, -3595, -955, 3131, 2270, -2149, -3086, 690, 3737, 1026, -3146]
6181c146J462M376P24m295k521K591M012j385m336q29M555K014k980l361J140
6196a979M332L25m058k148L481L331j420m273m9M042K241l650l632K071M344k50
6212B708m253j890L389L371k209m358O06M134J499l732k744K128M469m88m771
6227b141j017L906K786k448l692O17M082J386l950k947K731L580j019m239r91
6242c356L854K841k762m228J619M340N97l686k591L217L457q50m558n34M212J858
6258C430l022l500J258M296L59m318k047L412L191j558l874n03M318J968l575
6273a65l420K333M081m48l848j812L528L250k204m211N07M447J057l661k763K058
6289a271L923n51m337j132L803K778k168m033N45M438J092l812k618K703L820
$$ y = [-3146, -1684, 2692, 3416, -879, -3400, -809, 3203, 1818, -2518, -3347, 1208, 3222, 242, -3119, -1979, 2353, 2678, -1380, -3528, -47, 3284, 1864, -2409, -2458, 1584, 3825, 175, -3457, -1386, 2958, 2708, -1545, -3435, -46, 3325, 1116, -3242, -2636, 1498, 2997, -735, -3479, -1351, 3118, 2630, -2141, -3158, 748, 3534, 1086, -2606, -1989, 2093, 3479, -471, -3418, -687, 2893, 1874, -2365, -3356, 498, 3339, 577, -3651, -2032, 2308, 2905, -781, -3372, -155, 3302, 2452, -2106, -2640, 1572, 3430, 408, -3092, -1834, 2462, 2821, -1497, -3544, -132, 3059, 1501, -2373, -2876, 1442, 3410, -165, -3585, -1252, 2829, 2381, -1467, -3279, 249, 3499, 1295, -2916, -2409, 2038, 3095, -566, -3329, -1271, 2652, 2101, -2236, -3368, 435, 3213, 1045, -2988, -2443, 1995, 3087, -725, -3343, -640, 3180]
6304C180r56m294p17L755K570k892l881J531L938L20l939k013K570L796j137m554
6320b723l13M136K017k802l337J423M228K89m194j877L306L313j943l820m66M282
6336A519J553l218l204J895M138p50l595j555L273L476k653l748P96L814J441
6351C182l578k607K176M002q01m069j310L985K339k541l733O40M330J042m029
6366i72k590K523L923j236m021q15M174K594l245l713J982L945L52l583k405K901
6382a86L600j367m511j52L900J539k705l189J074M312L97m578j667L644L020j842
6398A289l772J29L759J950l507k943K343L616n53m094j030L196K653k049l777
6413b790M10M288P04l159k759K060M203p38m103r10L527K644k540l479Q20M162
$$ y = [3180, 2224, -2070, -2787, 968, 3538, 646, -3235, -1704, 2234, 2554, -1385, -3398, -828, 2968, 1831, -2723, -3036, 1100, 3117, 315, -3022, -1599, 2629, 2918, -1276, -3153, 153, 3466, 1523, -2297, -2763, 1519, 3072, -146, -3350, -1455, 2683, 1933, -1662, -3217, 56, 3532, 879, -2869, -2073, 1741, 3182, -396, -3003, -827, 3175, 2374, -1695, -3005, 980, 3319, 778, -2955, -2315, 2015, 3057, -972, -3562, -1039, 2884, 1648, -2373, -3188, 986, 3580, 335, -3378, -1396, 2549, 2901, -682, -3087, -186, 3414, 2047, -2464, -2616, 1284, 2823, 118, -3071, -1997, 2315, 2712, -1866, -3533, 111, 3131, 1289, -2483, -2354, 1405, 3355, -152, -3095, -752, 2864, 2311, -1783, -2813, 383, 3036, 987, -2790, -2380, 1908, 2612, -547, -3306, -1246, 2957, 2219, -1884, -2794, 733, 3377, 837, -2642, -1822, 2340]
6429B340P73l987k214L012L180j021m335m90L766K413l253l519J653L891L69l855
6445a277k140L110L463j525m110J10L638K002k863l746J916M154k94l919j525
6460c006L280K814j737m032m6M155J283l563k467K270L493j11m090j141L281L116
6476C499k106l922M19M063J140l365k847K444L649j089m202q33L760K420k514
6491E16l494P76M216P23l749k091K889L179j181l703n87L805J911k941l336J734
6507a333L638N5l336k232K923L447k065m000K03L976J553l012l015J544M160P5
6523B581m089j295L035K709j607l704J62M130J205l223l004K144L396o86l330
6538a576j392L266K595k320l517J032L571P20k908k492K403L604j052m208l74
$$ y = [2340, 3113, -874, -3088, -76, 3104, 2083, -2252, -2742, 1024, 3437, 184, -3335, -1682, 2209, 2578, -1277, -3417, -307, 3156, 1631, -2479, -2369, 1269, 3271, 408, -3338, -1422, 2732, 2438, -1481, -3006, 274, 3088, 1351, -2681, -2727, 1428, 2711, -852, -3319, -1049, 2444, 2333, -1757, -2898, 383, 3499, 1393, -2529, -2110, 1953, 3093, -272, -3119, -675, 2974, 1885, -2317, -3150, 610, 3030, 516, -2978, -2202, 2014, 2737, -1012, -3103, -214, 2965, 1784, -1919, -2506, 1299, 3210, 269, -3067, -1333, 2305, 2360, -976, -3208, -285, 3162, 1097, -2903, -2700, 1276, 2829, -183, -3198, -1654, 2506, 2581, -1508, -2803, 232, 2941, 1334, -2370, -2208, 1922, 3127, -96, -3100, -956, 2440, 1754, -1576, -2968, 298, 2893, 573, -2944, -1912, 1659, 2379, -529, -3021, -618, 2986, 1934, -2274, -2648]
6553b648L592K240k578l193Q03M100O97m288k068L127K905j106l942m57L853K058
6569C095k903l214J735L821k87l368j747K961L122j750l662L7L433J650k722l219
6585c018J711L687j53m136r36K885K825j932l494L36L904J410l579k387K175L218
6601B516m59l600j048K997K837k720l477J232L349P85l122k435K211L758j205
6616A619l768o42L417K389k493l218J004M034K04l569j850K846K839j174l437
6631a799n16L405J899k979k898J343L591J2l420j691K952L054j860l729O53L301
6647A318J447k719k908J842L774n51l548j356L103K552k215l032J24L807J140
6662B778l492k112K023L228o54l356j329L373K464k077l512J060L471P87l232
$$ y = [-2648, 944, 3184, 606, -2587, -1784, 2316, 3013, -1275, -3343, -216, 2689, 1583, -2359, -2816, 1037, 3095, 192, -3022, -1287, 2534, 2247, -1121, -2868, 93, 3215, 1465, -2197, -2160, 1273, 2923, 201, -3018, -1307, 2380, 2227, -1909, -2845, 40, 2865, 933, -2561, -2225, 1679, 3089, -490, -2877, -702, 2516, 2057, -1543, -2591, 406, 3243, 523, -2954, -1722, 1627, 2412, -710, -3145, -934, 2824, 1619, -2149, -2791, 626, 3015, 522, -2696, -1692, 2342, 2546, -1023, -2873, -27, 2812, 1638, -1799, -2315, 1090, 2989, 10, -2888, -1545, 2046, 2058, -1362, -3053, -101, 2953, 1093, -2636, -1983, 1318, 2765, 46, -2862, -1020, 2754, 2203, -1345, -2701, 402, 2954, 739, -2293, -2169, 1638, 2778, -714, -2826, -803, 2425, 1771, -1585, -2914, 459, 2923, 846, -2666, -1606, 1865, 2652, -580]
6677e80k404K545L337j245l496o93L486J873k289l456J281L609K06l606j535K831
6693a36K669j155l453m54L783J713k921k455J242L257K30l147j770K544L084j892
6709A139l630L85L273J152k584k661J898L247l83l599r05K927K264j478l288L68
6725a875L948O48l162k097J975L075m06l568j007L121K251k680l069J043L196
6740A393R88l129k435K417L344p72l716l82L350J864k329l129J118L668K52l611
6756a109j469K275K999j437l378m14L774J374k816k625J613L273L8l378j569L201
6772C52K410j669l286L00L383R51k369k798J994L333n29l514j179K836K492j895
6788H12l299M47L733O67k942k209K018L123n14l474p34L034K362k301l025O65
$$ y = [-580, -2984, -439, 2898, 1653, -1843, -2536, 950, 2823, 534, -2922, -1641, 1968, 2174, -1432, -2967, -136, 2533, 1378, -2075, -2529, 1254, 2967, 46, -2409, -1167, 2090, 2320, -827, -2597, -53, 3031, 1139, -2491, -2106, 1167, 2319, -265, -2926, -1028, 2219, 1836, -1763, -2668, 259, 2523, 1045, -2243, -1875, 2073, 2721, -441, -2538, -563, 2512, 2106, -1462, -2469, 652, 2903, 223, -2846, -1803, 1393, 2381, -748, -3183, -766, 2578, 1806, -1910, -2292, 1058, 2922, 593, -2536, -1418, 2250, 2502, -1109, -2578, -303, 2696, 1259, -2119, -2533, 1241, 2615, -201, -2826, -1213, 2060, 2098, -1280, -2849, 352, 2762, 1093, -2193, -1893, 1490, 2441, 72, -2726, -732, 2601, 2072, -1442, -2621, 215, 2707, 812, -2487, -2040, 1693, 2360, -582, -2791, -773, 2350, 1836, -1638, -2372, 662, 3024, 723, -2302, -1637]
6804a637L398Q15l121k124K224L111j443l253k53K907J874k046l160J282L328
6819A902O51l643j388K423K586q32l645M5L173J521l070k304J564K721K98l289
6835a287j571K840K887k177l068K69L339J248k799k409J784L439o69l417o58K750
6851E01K098j655l368O34L732N28l220j891J971K804l92l848m67L444J747k060
6867E58k893P83L293O32k885k098K331K790j079l260j69K948J668k503k931J489
6883a326L430J28l758j139K439K829j313l539J68L136J344k499k169J269L318
6898B318k83l128j480L255K249k234k642L40K891J093k485k528J780L123q48k966
6914a545q04K588K390j724l144M07L583O31k735k042K022K789o05l592n23L241
$$ y = [-1637, 1761, 2576, -545, -2669, -445, 2666, 1223, -2030, -2283, 624, 2498, 452, -2708, -1426, 1902, 2553, -1090, -2478, -55, 2531, 1699, -1946, -1901, 1272, 2793, -277, -2581, -1017, 1704, 2002, -1287, -2858, -18, 2869, 692, -2376, -2107, 1232, 2480, -319, -2728, -944, 2495, 1826, -1591, -2249, 501, 2599, 944, -2424, -1790, 1942, 2470, -750, -2641, -670, 2134, 1742, -2106, -2573, 871, 2618, 558, -2335, -1552, 1741, 2373, -512, -2610, -279, 2511, 1432, -1828, -1997, 951, 2619, 116, -2815, -1326, 2104, 2232, -1526, -2665, -226, 2603, 1290, -2249, -2081, 1055, 2399, -100, -2269, -1000, 2318, 2035, -1093, -2573, 682, 2931, 697, -1945, -1605, 1286, 2379, -106, -2634, -854, 2269, 1421, -1545, -2349, 239, 2629, 905, -2239, -1832, 1751, 2382, -353, -2395, -373, 2416, 1811, -1781, -2304, 937]
6930I37J495k063k868J144L271K73l134j877K496K664j100l219j67K880J630k352
6946A0k209J197L200K7k976j799K492K424j002l300k96L320J149k455k274J172
6962a320L128j0l359j133K943K407j983k986L80L145J425k502k708K076K967n96
6978A874l156q28K604K040j673l384Q80L044N50k537k189K288K583n28l308m93
6994b233L089J586k018k803R12L115P70l186j921K548K761j246l234l87L138J679
7010B570k435k613J239L149k89k728j253K284K227q09l273q2L450P00k263k010
7026b136J328L008j58l177j342K692K204j761k798J98K937J373k704k312J862
7041g86K949n56l061q59K699K141j572l231P44L398K18k555j753J626K665n37
$$ y = [937, 2432, 369, -2499, -1355, 1916, 2189, -945, -2822, -326, 2338, 1238, -1981, -2148, 732, 2362, 10, -2199, -1002, 2198, 2225, -751, -2550, -58, 2366, 1364, -1936, -2232, 1088, 2237, -218, -2492, -1320, 1808, 1798, -1561, -2694, 249, 2656, 673, -2313, -1933, 1212, 2637, 135, -2573, -497, 2470, 1874, -1282, -2110, 494, 2534, 861, -2523, -1643, 1401, 1951, -586, -2775, -487, 2096, 1568, -1740, -2233, 856, 2442, 424, -2379, -1467, 1648, 2418, -768, -2689, -141, 2620, 1374, -1860, -2247, 891, 2570, 135, -2478, -1239, 1910, 1621, -1107, -2360, -76, 2151, 1342, -1931, -2013, 1437, 2137, -126, -2136, -808, 2200, 2042, -1135, -2477, 215, 2419, 658, -2140, -1942, 995, 2368, -336, -2648, -786, 2163, 1607, -1454, -2313, 386, 2527, 955, -2276, -1532, 1866, 2084, -471, -2224, -598, 2067, 1530]
7057A530l226n50L156J520k179k471Q41K905O54l069j687K506K443j397k475n32
7073b031K876J709k390k620J352K804L95l042j431K402K104j004l098K1L106R75
7089B128k329k000J031K983K25l191j081K762J791j540k736N29K881Q94k832k057
7105b542J818K673o71k736o97K264K176j785k786P56K866O49k614j554J449L017
7121B283p08l220l45K906J311j721k491O84L126N75l242j740K317K422j094l005
7137a942p5K695J955k622k216J261K781j33k481j322K221K460j243l127Q4K826
7153A122J156k431k004J138L132l01l105q50K156K196j369k680J38K742J429k756
7169b87k312K007K748q91k496p04K749J682j781l008Q63K775P34k366k033J842
$$ y = [1530, -1696, -2246, 910, 2430, 251, -2220, -1379, 1526, 2180, -889, -2576, -70, 2373, 976, -1499, -2031, 845, 2554, 164, -2456, -1104, 1700, 2095, -947, -2378, 24, 2128, 1124, -1974, -1953, 1153, 2128, -201, -2201, -1170, 1813, 2038, -1153, -2234, 528, 2319, 779, -1957, -1428, 1453, 2347, -485, -2542, -724, 1949, 1278, -1458, -2155, 109, 2285, 500, -2286, -1530, 1336, 1985, -629, -2183, -734, 2283, 1575, -1645, -1990, 916, 2227, 506, -1985, -1301, 1825, 2400, -842, -2582, -265, 2157, 1063, -1942, -2017, 678, 2633, 11, -2205, -944, 1837, 1704, -777, -2099, 122, 2582, 1339, -1788, -1704, 1122, 2278, -153, -2157, -1019, 2113, 1812, -1293, -2143, 13, 2209, 840, -1840, -1702, 1040, 2469, -287, -2599, -592, 2156, 1265, -1231, -1935, 814, 2496, 715, -2293, -1430, 1345, 2079, -287, -2320, -478]
7185d78K673p68l082o56L132J486k064k226P97K778P30l083j569K541K176j086
7201A301k737k61K693J323k110k509J009K682L81k874j298K276K350j252l111
7216b137L88L066P44j932k129R52L126j13l237p98K527J995j573k789L39K536
7232I65J159k544j840J574K454m77k593q88K278K190j657k597O46K761L23k170
7248d16j708J653K300m12k940o29K626J670j733k704Q21K980N00k620j752J970
7264c94K338n81k733k26K367J740k111k623J375K438L91k683j411J836K271j078
7280I16k963L17K432J484k135k458J476K736J60l297j021K452K190j282k671L32
7296a332K557J006k114k228J402K516l99k238j352K452J845j431k937P81K704
$$ y = [-478, 2195, 1427, -1655, -2311, 821, 2307, 243, -1983, -1186, 1592, 2322, -761, -2330, 211, 2387, 1301, -1436, -1697, 996, 2319, 209, -2300, -1291, 1391, 1772, -1102, -2400, -124, 2226, 974, -2137, -1749, 1317, 2061, 129, -2000, -1048, 2078, 1965, -1272, -2070, 457, 2452, 879, -1910, -1571, 965, 2124, -420, -2260, -686, 1768, 1291, -1302, -2190, 88, 2278, 621, -1976, -1330, 1431, 1754, -416, -2124, -471, 1829, 1417, -1523, -2152, 474, 2144, 411, -2293, -1472, 1508, 2008, -612, -2364, -394, 1944, 1363, -1370, -1596, 771, 2511, 400, -2223, -848, 1590, 1981, -702, -2113, -277, 1994, 916, -2047, -1730, 702, 2186, 51, -2407, -931, 1805, 1965, -1332, -2353, 99, 2289, 1007, -1664, -1332, 1225, 2231, 117, -2111, -709, 1807, 1408, -830, -2182, 270, 2115, 684, -2253, -1472, 1232]
7311A232N45k247j577J295K686n05k742n63K523J477j649k465M56L026L73k449
7327e84j555K004K033p67k498q15K692J818k321k513J215K850P9k197j935K190
7343c04K421j045k825Q3K469J409j888k152O50L007k87k880q02K348J552j011
7359G45k509Q3K647J158k102k370J570K541m09k313p54J978K233j750k563M63
7375a352K462O46j916k106J773K507p95l004k77K410J797j824k154M44K859M71
7391A941k564j219J320K628p30k403p71K427J734k195k148J046K508M7k283j386
7407b048J720K151r48k538K4K351J156j697k291J015K749J76k691p95J807J934
7423B075j292k318m4K633R02k101j899J339K383l96k254j139K304J926j487k561
$$ y = [1232, 1777, -470, -2047, -752, 1934, 1429, -1313, -1876, 647, 2124, 475, -1990, -1534, 1492, 1865, -584, -2139, -135, 1898, 1131, -1367, -2182, 510, 2328, 7, -2506, -1291, 1559, 1638, -559, -2494, -304, 2117, 1072, -1753, -1670, 799, 2208, 320, -1832, -1182, 1825, 1538, -1342, -2144, 204, 1756, 745, -1764, -1681, 966, 2124, 22, -2348, -778, 1763, 1354, -959, -1713, 265, 2498, 748, -1815, -1352, 1110, 1756, -160, -2266, -493, 2014, 1219, -1785, -2062, 348, 2145, 321, -1833, -1389, 1470, 1941, -623, -1842, -522, 2106, 1376, -1027, -1798, 629, 2363, 168, -1980, -934, 1574, 1621, -662, -2048, -328, 1823, 875, -1663, -1639, 712, 1868, 171, -2120, -1105, 1644, 1820, -871, -1666, 141, 2075, 783, -1535, -1579, 1054, 1956, -145, -2044, -705, 1678, 1282, -972, -2111, 193, 2119, 632, -1929]
7439a929N75K294P92k065j770J715K145j57k798o16K419J270j379k331M32K774
7455A371M21k386j467J683K069o07k416n10K635J397k219k227J220K415N56k548
7471f13j252J796K204j155k448J6K026J270j665k081Q25K669Kk427j149K143J695
7488A856r95k516p3K744Q70k030j838J381K368m0k559j035K214J762j511k300
7504a702L07K260R30k287j877J795K234n64k436l44K105J671j711j927M19K585
7520A458N40k459j236J299K280n61k846l51K579J362k007j880O92K293L67k193
7536f63j384J795K256q82k744J04K493Q80j551k057P97K630J15k675r62K006J696
7553A854r14k337j11K541J160k510j806J524K211j72k311r93K004J899j410k257
$$ y = [-1929, -1354, 940, 1732, -333, -2103, -388, 1757, 1600, -1198, -1814, 605, 1875, 496, -1835, -1403, 1371, 1792, -594, -2061, -378, 1691, 1084, -1332, -1842, 793, 2190, -29, -2256, -1036, 1379, 1935, -613, -1865, -69, 2135, 980, -1468, -1452, 574, 1844, 179, -1902, -1077, 1592, 1594, -833, -1982, 161, 1856, 861, -1655, -1728, 1016, 1886, -144, -1982, -601, 1767, 1727, -832, -1867, 347, 2109, 598, -1702, -1395, 865, 1795, -492, -2369, -574, 1660, 1096, -1340, -1684, 421, 2092, 381, -1546, -1127, 1458, 1998, -461, -1697, -398, 1882, 1321, -1525, -1876, 703, 2065, 58, -1822, -1130, 1163, 1530, -663, -2047, -252, 2004, 1122, -1622, -1518, 975, 1855, 304, -1753, -956, 1674, 1789, -886, -1848, 158, 1854, 940, -1397, -1508, 1033, 2193, -317, -2123, -599, 1612, 1440, -871, -1864, 140, 2039, 629, -1628]
7569a628K09K750P57k136j552J090K343m22k821l69K065J854j407k926Q58K647
7585A312N53k408j468J849J964q10k165p79K700J204j866j951R86K207J72k236
7601g36j367K082J932j083k526J27K175J380j776k232J011K796m63k240o79J655
7617E6J888q32k482l72K712J192k405j594J052K466j75k523r42K210J833j818
7633B66k138N58K453P06j964j697J224K378l77k375p73K208J375j415k527Q59
7649a239K662M15k346j373J335J921k90k571j88K375J191j722k168R20K354M39
7665A715k101j735J935K324r62k594k42K292J314j622k373J043K611l39k610k15
7681a559J250K106o86k763r3K648R92j935j895J225K437j83k513q68J834K134
$$ y = [-1628, -1419, 1331, 2088, -48, -1600, -510, 1833, 1411, -1410, -1779, 286, 2140, 733, -2193, -1335, 1312, 1865, -543, -2011, -162, 1802, 992, -1173, -1952, 748, 1952, 86, -1865, -879, 1328, 1500, -736, -2103, -21, 1911, 828, -1698, -1571, 604, 1984, 208, -2024, -1013, 1783, 1320, -920, -1599, 56, 1944, 1112, -1370, -1742, 970, 2162, -243, -1837, -785, 1681, 1506, -1017, -1959, 251, 2084, 266, -1872, -1314, 1139, 1845, -119, -1816, -592, 1786, 1409, -966, -1739, 469, 1844, 429, -2098, -1239, 1423, 1838, -508, -1881, -546, 1375, 1085, -1486, -1674, 701, 1892, 170, -1998, -1078, 1276, 1715, -386, -2121, -186, 2138, 1176, -1418, -1660, 632, 1946, 324, -2049, -1006, 1605, 1266, -1344, -1559, -309, 1797, 1111, -1652, -1745, 903, 1895, -40, -1935, -710, 1727, 1544, -969, -1837, -3, 2131]
7697B131j736k110M56K360Q74j990k161J620K148n63k360m59J959J802j414k461
7713a904Q45K440M60k221j527J620K181q68k215n60K395J210j348k362N85K408
7729A139O13k440j202J566K113r45k176k84K392J562k219j974R75K570j45k219
7745f74r94J604K034r23k707Q6K390J101k127j589J185K110j38k469q78K256J802
7762B069j617j876J35K219R61k041j801J387K539o57k508o61K225J435j210k420
7778a821K83K990L5k033j441J710J916k23k927k77K535J226j713j882P07K118
7794A203O58k392j342J754K006j009k294j74K151J596j924k324J148K715l52k384
7810i64p57J794J747j006k174k52K672Q15k138j428J053K209l44k024j172K254
$$ y = [2131, 395, -1715, -1259, 1101, 1975, -15, -2176, -556, 1592, 1029, -1331, -1790, 169, 1971, 557, -1904, -1059, 1381, 1841, -380, -1907, -287, 1894, 1026, -1189, -1749, 646, 1856, 508, -1854, -1269, 1139, 1752, -688, -1890, -324, 1789, 844, -1332, -1616, 776, 2338, 119, -1855, -880, 1690, 1545, -674, -1668, -64, 1970, 1047, -1660, -1574, 816, 1917, -210, -1799, -614, 1496, 1358, -1111, -1989, 267, 2069, 452, -1424, -1289, 930, 1891, -150, -1951, -564, 1975, 1318, -1190, -1851, 374, 1809, 599, -1821, -1538, 1452, 1487, -546, -1987, -277, 1639, 1416, -1511, -1788, 747, 1973, 260, -1622, -915, 1203, 1861, -531, -1873, -119, 1887, 878, -1416, -1590, 561, 2157, 233, -2091, -943, 1772, 1420, -964, -1721, 73, 1820, 814, -1360, -1612, 1060, 1875, -263, -1691, -638, 1571, 1227, -797, -1969, 285]
7826B85J633j269k310K79K244J042k149j991J586K397o23k017o55J837J678j369
7842E98k195K29K875L92k272j635J470K327m58k515m96K120J601j816k055N47
7858a283K579N74k444j231J850J703o69k181o74K412J522j883k194R53K322J99
7874A555k300j157J943J638q60k627M38K205J081j820j932J056K478p0k596q39
7890a807K173J719j181k303j9K578P20j920k050J569K364m87k280q24J926J900
7906B078j867k132N46K631K33j874j534J628K147l69k562p48K544J082j480j978
7922a655N24K571L77k341j392J671J835o79k319l69K447R97j724j762O31K684
7938A496J42k104j296J892J973q92k619q8K668O94k190j529J008K480j81k421
$$ y = [285, 1918, 649, -1661, -1382, 862, 1904, -245, -2236, -650, 1747, 1124, -893, -1548, 289, 1967, 598, -1597, -1368, 1507, 1899, -373, -2008, -538, 1789, 1331, -1184, -1680, 440, 2041, 225, -1830, -1283, 1296, 1870, -574, -1805, 45, 1748, 1079, -1102, -1776, 636, 2158, 275, -1919, -966, 1356, 1555, -745, -1902, 41, 1679, 819, -1808, -1370, 835, 1916, 96, -1836, -780, 1698, 1628, -968, -1807, 366, 2085, 904, -1399, -1418, 1160, 1880, -40, -2090, -521, 1843, 1356, -924, -1748, 178, 2078, 211, -1921, -1375, 1256, 1489, -385, -1919, -291, 1856, 1487, -1075, -1823, 721, 1803, 323, -1655, -1131, 1440, 1817, -524, -1916, -245, 1590, 911, -1408, -1777, 670, 1667, -57, -1819, -1188, 1496, 1638, -466, -1762, 130, 2103, 1211, -1408, -1496, 1172, 1866, -324, -1853, -845, 1635, 1454, -967]
7954i67j114K056J825j170k256J59K548Q70k150j843J356K364l38k380m55J926
7970D31J797j660k617Q57K170J068k533j696J660K206n23k569n41K413J384j810
7986C7j838P14K483J99k114j561J765K210r62k087m51K319J423k008k039R84K324
8003A398M8k384q44J377K087q07k423J62K112J133j913j574P19K573K4k518r88
8020a818K083J890j402k202K19K438Q14k248j919J808K084o28k185o93J841K133
8036B215j516k279M53K468M68k241j593J901J782m17k768l64K543J386j437k717
8052b116R90K480J28j912j562J695K270j187k153k83K399J290j735k229R58K510
8068A543j29k055j330J785J942q88k696K20K036J408j800k103J135K275L5k418
$$ y = [-967, -2081, -25, 1800, 630, -1626, -1467, 1081, 1951, -199, -2042, -686, 1678, 1340, -1040, -1495, 431, 2228, 568, -2049, -1192, 978, 2046, -487, -2183, -523, 1683, 1160, -1409, -1950, 463, 1847, 37, -1801, -1087, 1396, 1595, -519, -2080, -315, 1895, 933, -1154, -1605, 714, 2137, 129, -1910, -926, 1398, 1446, -938, -1782, -405, 1682, 875, -1548, -1386, 726, 1859, -54, -1628, -909, 1664, 1688, -830, -1818, 265, 2155, 753, -1449, -1230, 1208, 2022, -226, -2145, -337, 1747, 1119, -1066, -1759, 82, 2215, 699, -1580, -1127, 1341, 1809, -432, -2025, -124, 1658, 1241, -1527, -1891, 652, 2038, 601, -2116, -1126, 1354, 1482, -430, -1992, -297, 1973, 786, -1367, -1650, 749, 2039, 304, -1925, -967, 1543, 1414, -641, -1971, -186, 1756, 868, -1828, -1608, 428, 1836, 36, -2067, -932, 1343, 1378, -1040]
8084a040q54K305J388j040j971m0K364Q49k363j556J637J767J66k637p43J886
8100A18J913j593k399N63K495P81j979k186J574K617p28k337n74K289J488j543
8116D99k331M66K494R85k650j627K033J893o38k319m40K194J225j740k073J157
8132h72K291L17k127j410J775K073j019k449k29K790P88j998j791R45K468j01
8148A451k262j210K359J567j383k177J15K549Q99k309j430J350K152l25k267o84
8164a605J935J593j277k457N15K286P43j921j890J599K430q40k524k04K161J452
8180A996j827j933N49K456P39k686j237J954J719q67k182
8191a319
$$ y = [-1040, -1894, 411, 1799, 759, -1212, -1252, 1112, 1961, -402, -1958, -321, 1446, 1612, -1025, -1768, 118, 2031, 438, -1961, -1398, 1097, 1878, -101, -2287, -713, 1904, 1176, -1161, -1735, 554, 2042, 499, -1832, -1366, 1128, 2113, -537, -2164, -131, 1762, 1124, -1195, -1635, 559, 1784, 44, -2029, -872, 1419, 1736, -391, -1801, -26, 2047, 1028, -1421, -1650, 1140, 1928, -70, -1861, -916, 1552, 1451, -811, -2021, 338, 1905, 522, -1655, -1540, 1009, 1908, -401, -1831, -481, 1671, 1346, -921, -1605, 330, 1923, 646, -1811, -1296, 990, 1733, -188, -2078, -479, 1951, 1111, -1413, -1617, 544, 1996, 169, -1764, -1215, 1241, 1980, -706, -1943, 11, 1730, 863, -1319]
$$ Imaginary data points
##PAGE= N=2
##DATA TABLE= (X++(I..I)), XYDATA
0@%%%%%%%%%%Qj6J6j6J6k4L2m0M8n6P2q8J04j21J43j66J92k24K58k95L37l85M37
33B32m95N59o27P02p89Q85r85J094j218J352j493J650j825K014k221K448k696
50a413K968l269L606l979M396m869N407o024O742p592Q612r863J1446j3515J6349
65I002k0484K7096l9337O9346k75492l85317O44403L34693l26231k81229K08864
76c4686K17566L6670j10793j68476j7944L28085J83671l66501l65904K94201L72685
87C68574k62395l92499J83134L37146o7751k70575j09452J03898K55012Q9087
97B34179k92850k24089K86815K86709k77805l57256K15535L83215j05239l35782
107a86568j8325J85925R1754m346j18021j41499J73912L01737j93568m40818J36486
$$ y = [0, 0, 0, 0, 0, 0, 0, 0, 0, 0, 0, 8, -8, 8, -8, 8, -16, 16, -24, 24, -32, 40, -48, 56, -65, 78, -88, 104, -120, 138, -157, 180, -205, 232, -263, 296, -331, 371, -418, 467, -518, 576, -642, 710, -783, 867, -958, 1056, -1165, 1283, -1413, 1555, -1714, 1892, -2087, 2309, -2560, 2847, -3177, 3565, -4027, 4585, -5278, 6168, -7347, 9002, -11482, 15614, -23723, 45623, -229869, -615186, 29217, 363910, 37679, -243550, -34686, 182880, 219550, 108757, -59719, -77663, 250422, 434093, 67592, -298312, -4111, 368574, 106179, -286320, -103186, 233960, 166209, -104366, -213818, -109920, 145092, 234179, -58671, -282760, 4055, 290764, 12959, -344297, -128762, 254453, 149214, -186568, -204893, -18968, 72786, 68440, -49581, -191080, -17168, 284569, 91001, -349817, -213331]
118b13331M95386j8550m22968p3590K82593J11288j36728j22097m170J34602J89629
$$ y = [-213331, 282055, 263505, -159463, -233053, 49540, 160828, 24100, -97997, -102167, 32435, 222064]
$$ [...]
##END NTUPLES=NMR FID
##END=
