##TITLE=1H_TG-2235-2
 CDCl3, 8 sc, 
 11.2.2019
##JCAMPDX= 6.0         $$ Bruker NMR JCAMP-DX V2.0
##DATA TYPE= NMR FID
##DATA CLASS= NTUPLES
##ORIGIN= UXNMR, Bruker Analytische Messtechnik GmbH
##OWNER= root
$$ XWIN-NMR		Version 3.5
$$ Mon Feb 11 14:32:25 2019 Russian Standard Time (UT+4h)  she@DPX200
##.OBSERVE FREQUENCY= 200.1313
##.OBSERVE NUCLEUS= ^1H
##.DELAY= (6, 6)
##.ACQUISITION MODE= SIMULTANEOUS
##.ACQUISITION SCHEME= undefined
##.AVERAGES= 8
##.DIGITISER RES= 18
##SPECTROMETER/DATA SYSTEM= spect
##.PULSE SEQUENCE= zg30
##.SOLVENT NAME= CDCl3
##.SHIFT REFERENCE= (INTERNAL, CDCl3, 0, 15.7039)
##AUDIT TRAIL= $$ (NUMBER, WHEN, WHO, WHERE, WHAT)
$$ ##TITLE= Audit trail, XWIN-NMR		Version 3.5
$$ ##JCAMPDX= 5.01
$$ ##ORIGIN= Bruker BioSpin GmbH
$$ ##OWNER= she
$$ F:/spectra/data/she/nmr/H-F/1/audita.txt
$$ ##AUDIT TRAIL=  $$ (NUMBER, WHEN, WHO, WHERE, WHAT)
(   1,<2019-02-11 14:31:09.53 +0400>,<she>,<DPX200>,
      <created by zg, POWCHK disabled, PULCHK disabled
       configuration hash MD5:
       00 E9 B6 7A A2 85 ED C7 34 08 36 98 17 FE 4E 26
       data hash MD5: 16K
       EB 0C F5 31 FE B8 42 1A EF E6 B4 2A 3B 83 31 39>)
$$ ##END=
$$ 
$$ hash MD5
$$ A6 2A 51 F8 0E AE 37 B1 1C FD AF 3C 5E C3 2B 82
##$RELAX= 
##$RELAX= 
##$RELAX= 
##$RELAX= 
##$RELAX= 
##$RELAX= 
$$ Bruker specific parameters
$$ --------------------------
##$DU= <F:/spectra>
##$EXPNO= 1
##$NAME= <H-F>
##$PROCNO= 1
##$TYPE= <nmr>
##$USER= <she>
##$AMP= (0..31)
100 100 100 100 100 100 100 100 100 100 100 100 100 100 100 100 100 100 
100 100 100 100 100 100 100 100 100 100 100 100 100 100 
##$AQSEQ= 0
##$AQ_mod= 1
##$AUNM= <au_zg>
##$AUTOPOS= <>
##$BF1= 200.13
##$BF2= 200.13
##$BF3= 200.13
##$BF4= 200.13
##$BF5= 200.13
##$BF6= 200.13
##$BF7= 200.13
##$BF8= 200.13
##$BYTORDA= 1
##$CFDGTYP= 0
##$CFRGTYP= 5
##$CHEMSTR= <none>
##$CNST= (0..31)
1 1 145 1 1 1 1 1 1 1 1 1 1 1 1 1 1 1 1 1 1 1 1 1 1 1 1 1 1 1 1 1 
##$CPDPRG= <>
##$CPDPRG1= <>
##$CPDPRG2= <>
##$CPDPRG3= <>
##$CPDPRG4= <mlev>
##$CPDPRG5= <mlev>
##$CPDPRG6= <mlev>
##$CPDPRG7= <mlev>
##$CPDPRG8= <mlev>
##$CPDPRGB= <>
##$CPDPRGT= <>
##$D= (0..31)
0 1.2 0 0 0 0 0 0 0 0 0 0.03 0 0 0 0 0 0 0 0 0 0 0 0 0 0 0 0 0 0 0 0 
##$DATE= 1549881069
##$DBL= (0..7)
120 120 120 120 120 120 120 120 
##$DBP= (0..7)
150 150 150 150 150 150 150 150 
##$DBP07= 0
##$DBPNAM0= <>
##$DBPNAM1= <>
##$DBPNAM2= <>
##$DBPNAM3= <>
##$DBPNAM4= <>
##$DBPNAM5= <>
##$DBPNAM6= <>
##$DBPNAM7= <>
##$DBPOAL= (0..7)
0.5 0.5 0.5 0.5 0.5 0.5 0.5 0.5 
##$DBPOFFS= (0..7)
0 0 0 0 0 0 0 0 
##$DE= 6
##$DECBNUC= <off>
##$DECIM= 32
##$DECNUC= <off>
##$DECSTAT= 4
##$DIGMOD= 1
##$DIGTYP= 9
##$DL= (0..7)
0 120 120 120 120 120 120 120 
##$DP= (0..7)
150 150 150 150 150 150 150 150 
##$DP07= 0
##$DPNAME0= <>
##$DPNAME1= <>
##$DPNAME2= <>
##$DPNAME3= <>
##$DPNAME4= <>
##$DPNAME5= <>
##$DPNAME6= <>
##$DPNAME7= <>
##$DPOAL= (0..7)
0.5 0.5 0.5 0.5 0.5 0.5 0.5 0.5 
##$DPOFFS= (0..7)
0 0 0 0 0 0 0 0 
##$DQDMODE= 0
##$DR= 18
##$DS= 0
##$DSLIST= <SSSSSSSSSSSSSSS>
##$DSPFIRM= 0
$$ [...]
##$SUBNAM2= <"">
##$SUBNAM3= <"">
##$SUBNAM4= <"">
##$SUBNAM5= <"">
##$SUBNAM6= <"">
##$SUBNAM7= <"">
##$SUBNAM8= <"">
##$SUBNAM9= <"">
##$SW= 20.0189088683792
##$SWIBOX= (0..15)
0 0 2 0 0 0 0 0 0 0 0 0 0 0 0 0 
##$SW_h= 4006.41025641026
##$TD= 16384
##$TD0= 1
##$TE= 0
##$TE2= 300
##$TE3= 300
##$TEG= 300
##$TL= (0..7)
0 120 120 120 120 120 120 120 
##$TP= (0..7)
150 150 150 150 150 150 150 150 
##$TP07= 0
##$TPNAME0= <>
##$TPNAME1= <>
##$TPNAME2= <>
##$TPNAME3= <>
##$TPNAME4= <>
##$TPNAME5= <>
##$TPNAME6= <>
##$TPNAME7= <>
##$TPOAL= (0..7)
0.5 0.5 0.5 0.5 0.5 0.5 0.5 0.5 
##$TPOFFS= (0..7)
0 0 0 0 0 0 0 0 
##$TUNHIN= 0
##$TUNHOUT= 0
##$TUNXOUT= 0
##$USERA1= <user>
##$USERA2= <user>
##$USERA3= <user>
##$USERA4= <user>
##$USERA5= <user>
##$V9= 5
##$VALIST= <valist>
##$VCLIST= <CCCCCCCCCCCCCCC>
##$VD= 0
##$VDLIST= <DDDDDDDDDDDDDDD>
##$VPLIST= <PPPPPPPPPPPPPPP>
##$VTLIST= <TTTTTTTTTTTTTTT>
##$WBST= 1024
##$WBSW= 4
##$XGAIN= (0..3)
0 0 0 0 
##$XL= 0
##$YL= 0
##$YMAX_a= 674881
##$YMIN_a= -1011896
##$ZGOPTNS= <>
##$ZL1= 120
##$ZL2= 120
##$ZL3= 120
##$ZL4= 120
##$ABSF1= 10
##$ABSF2= 0
##$ABSG= 5
##$ABSL= 3
##$ALPHA= 0
##$AQORDER= 0
##$ASSFAC= 0
##$ASSFACI= 0
##$ASSFACX= 0
##$ASSWID= 0
##$AUNMP= <proc_1d>
##$AZFE= 0.1
##$AZFW= 0.1
##$BCFW= 1
##$BC_mod= 2
##$BYTORDP= 1
##$COROFFS= 0
##$CY= 11.3945322036743
##$DATMOD= 1
##$DC= 2
##$DFILT= <>
##$DTYPP= 0
##$F1P= 18.9103706918063
##$F2P= -1.10871071338519
##$FCOR= 0.5
##$FTSIZE= 0
##$FT_mod= 4
##$GAMMA= 1
##$GB= 0.15
##$INTBC= 1
##$INTSCL= 1
##$ISEN= 128
##$LB= 0.24
##$LEV0= 0
##$LPBIN= 0
##$MAXI= 10000
##$MC2= 0
##$MEAN= 0
##$ME_mod= 0
##$MI= 1.114404
##$NCOEF= 0
##$NC_proc= 0
##$NLEV= 6
##$NOISF1= 3.799351
##$NOISF2= 2.8
##$NSP= 1
##$NTH_PI= 0
##$NZP= 0
##$OFFSET= 15.70392
##$PC= 1
##$PHC0= -8677.246
##$PHC1= 10.60018
##$PH_mod= 1
##$PKNL= yes
##$PPARMOD= 0
##$PSCAL= 0
##$PSIGN= 0
##$REVERSE= no
##$SF= 200.130013532006
##$SI= 16384
##$SIGF1= 3
##$SIGF2= 2
##$SINO= 400
##$SIOLD= 16384
##$SREGLST= <1H.CDCl3>
##$SSB= 0
##$STSI= 0
##$STSR= 0
##$SW_p= 3612.71676300578
##$SYMM= 0
##$S_DEV= 0
##$TDeff= 0
##$TDoff= 0
##$TI= <>
##$TILT= no
##$TM1= 0
##$TM2= 0
##$TOPLEV= 0
##$USERP1= <user>
##$USERP2= <user>
##$USERP3= <user>
##$USERP4= <user>
##$USERP5= <user>
##$WDW= 1
##$XDIM= 8192
##$YMAX_p= 0
##$YMIN_p= 0
$$ End of Bruker specific parameters
$$ ---------------------------------
##NTUPLES= NMR FID
##VAR_NAME=  TIME,          FID/REAL,        FID/IMAG
##SYMBOL=    X,             R,               I
##VAR_TYPE=  INDEPENDENT,   DEPENDENT,       DEPENDENT
##VAR_FORM=  AFFN,          ASDF,            ASDF
##VAR_DIM=   8192,          8192,            8192
##UNITS=     SECONDS,       ARBITRARY UNITS, ARBITRARY UNITS
##FACTOR=    0.0002496,     1,               1
##FIRST=     0,             0,               0
##LAST=      2.0444736,     0,               0
##MIN=       0,             -1011896,        0
##MAX=       2.0444736,     674881,          0
$$ Real data points
##PAGE= N=1
##DATA TABLE= (X++(R..R)), XYDATA
0@%%%%%%%Qj6J6j7K5m0M8n6P2q9J13j42J71k05K48k96L46m08M81n58O45p47Q63
30D62r89J128j282J454j646J858k091K344k623K932l268L631m031M473m952N472
46B872o042O666p349Q097q917R822j0826J1940j3182J4577j6159J7964k0044K2477
60A1896k5371K8877l3226L8794m6212N6643p2504R9820j59632N19641l69989p86290
72g37553R22515L16637m80720j80083L74187j00624q6964J58562j73011m45993
82d33047L71575N97827l16979n74397L63744L54295n08864l57088M62497K37480
92A97043k67403p3594M5542j88547J29692L93084j71626m18460L17218M36879
102C99828m08597m41891M38567L87646l69850k31219K75057l4044k42680K21249
$$ y = [0, 0, 0, 0, 0, 0, 0, 0, 8, -8, 8, -9, 16, -24, 24, -32, 40, -49, 64, -78, 93, -112, 136, -160, 186, -222, 259, -299, 346, -401, 462, -527, 601, -681, 773, -873, 985, -1106, 1238, -1385, 1547, -1721, 1910, -2121, 2352, -2600, 2872, -3170, 3496, -3853, 4244, -4673, 5149, -5677, 6263, -6919, 7658, -8501, 9463, -10581, 11896, -13475, 15402, -17824, 20970, -25242, 31401, -41103, 58717, -100915, 418726, 48737, -737553, 184962, 501599, 20879, -159204, 214983, 114359, 27395, 185957, 12946, -433047, -61472, 536355, 219376, -355021, 8723, 363018, -145846, -502934, -40437, 197043, -70360, -143954, -98412, -286959, -157267, 235817, 64191, -354269, -37051, 399828, -8769, -450660, -12093, 375553, 5703, -225516, 49541, 15497, -227183, -5934]
112e934J59863l16551J04137N45655k58044p57178K18103P40194j48184n15878
122b33817K06155K96643l11814k00062K18888m8930j33474L98670K22053n33432
132a19120k16960N37753N2750n70319J18973O34068j19480n20864P2655K13979
142H3435j66882L1828K70958j84254k66746L81580K72818n59899l27253O01590
152A37175L22851n40406k59035L69836Q1451k32778N2093N9381j53169J38050
162b4551K45209l09557l23090M35532M18014m11706l88664L51832K56189l33408
172h4200j47234K56805N0561n8201J49602j17733l77266J86516M86282k17231
182A27901m43001L29414M33431l76992m42838K50802K80310j45688l4066J30021
$$ y = [-5934, 153929, -162622, -58485, 487170, 229126, -528052, -309949, 430245, 282061, -233817, -27662, 268981, -42833, -242895, -24007, -72937, -206411, 192259, 414312, -119120, -336080, 201673, 254423, -315896, -196923, 437145, 317665, -203199, -130544, 83435, -83447, -51619, 219339, 35085, -231661, 149919, 422737, -137162, -464415, 137175, 460026, -80380, -339415, 30421, 111872, -120906, -68813, -9432, -162601, -24551, 220658, -88899, -411989, 23543, 441557, 29851, -358813, -6981, 249208, -84200, -231434, 25371, 75932, 17731, 167333, 49600, -327666, -141150, 345132, 127901, -315100, 14314, 447745, 70753, -372085, -121283, 159027, 13339, -20727, 109294]
192A09294j41278p8058K77879m8982m54778J48058O20289j28332o11738J17107
202a90539M72455j73040l56574J53753J87655j00193L8699Q3609k46057q9962
212b20194M00143R3572m87857o4791N33875M0599n03322j8953L70862m2907k13195
223a12168P9151R729j21809J94271J91116l11499k09751L89614J97707m43276
233a36915j92573M34020J80832l34233j07610J92840j5498o4871J04356r0420
243c0072j60878K94478K82559l83382l60972L55158L14576l28489k39479K85572
253B9071J65652j91413o8692L8596j21209M0030K74160p8340l14122J98566L68707
264C41006k90196m23354K68607L77654j90673k27856J41913P3524r5581N1771
$$ y = [109294, -31984, -110042, 167837, 118855, -335923, -187865, 432424, 304092, -307646, -190539, 281916, 108876, -247698, -93945, 93710, -6483, 32216, 115825, -130232, -220194, 179949, 273521, -214336, -279127, 254748, 295347, -207975, -226928, 143934, 101027, -112168, -33017, -23288, -145097, 49174, 240290, -71209, -280960, 108654, 306361, -136915, -329488, 104532, 285364, -48869, -156479, 36361, 20863, -44008, 60348, -30072, -190950, 103528, 386087, 2705, -358267, -3109, 311467, -17022, -256501, 29071, 194723, 3310, -65382, -26786, -147995, -107965, 166195, 87855, -226267, -27701, 341006, 50810, -372544, -103937, 273717, 83044, -144812, -2899, 70625, -24956, 26815]
274B6815K690k09955P3298L87125o0024m58773N5809M44836r6163m07785J10547
285a31580L15365j02597j75835O8845o469m3685J87208M2628l22132m8701M05214
296A88261O4030m17868n5057L91635L4430l29487l5918J66870k9012M447J31573
307A13904j04261j58815J97746J24682l21012j20488M10417J83428l47968j69482
317a91849K31650O6615j78018j8349Q5056Q25J07973J09814k64326k67860K83524
328c4945L12427k61884k41627K88161J89635k79698j77574J45739P3973j6306
338b099Q4655l4158j85065Q0733K42361j52700k95280K17018L57252k04139l48621
349b40043J36352K34912q4946q4456M7411n7221j4605J62432l9663k57976R6495
$$ y = [26815, 29505, -180450, -107152, 279973, 219949, -238824, -183015, 261821, 165658, -242127, -131580, 183785, 81188, -94647, -25802, -32271, -75956, 111252, 153880, -168252, -216953, 188261, 252291, -165577, -220634, 171001, 205431, -124056, -159974, 6896, -22116, -17669, 113904, 9643, -149172, 48574, 173256, -147756, -268244, 142173, 325601, -22367, -191849, 39801, 106416, -71602, -89951, -4895, -4070, 103903, 213717, -50609, -318469, -34945, 277482, 15598, -226029, 62132, 251767, -27931, -205505, -59766, 14207, -2099, 82556, 48398, -136667, -55934, 186427, 33727, -261553, -44535, 312717, 108578, -240043, -103691, 131221, 46275, -38181, 9230, -47991, -62596, 99836, 60173, -197803, -101308]
360a01308L73155o7491m06263J2183L26938k6978k32832P4467J73925m9381o5161
371A1254k5382j48824O233L16519P8618l28852p2433L08075L968l48738l1932
382b31494L12559R5992j43125n2840k3103o9893Q4939J13149j40329p2479K81486
393A54862J06369l60163j74876L00511J62109j98060q4994J23965K3205n5461
403b533l718o9683n5423J94732J65312k43009k44767K33359K51219k07544j95838
414a77893J96506J42271j58076j05536M2691J7391Q4387J32621j16561k26361
424a68560J05249K31826j39974k41030J84558K92395j29802k71860J6379J03163
434a7656n257M8441L9784j01178J6253J71919j03375l05110Q3086L67858N134
$$ y = [-101308, 271847, 204356, -201907, -189724, 137214, 110236, -122596, -48129, 125796, 76415, 11254, -14128, -162952, -156719, 159800, 238418, -90434, -162867, 145208, 149176, -199562, -231494, 81065, 177057, 33932, -18908, -42011, -111904, -26965, 86184, -54145, -126624, 154862, 261231, -98932, -273808, 26703, 188812, -9248, -94242, 29723, 52928, -2533, -6251, -75934, -131357, 63375, 228687, -14322, -259089, -25730, 225489, 17945, -177893, 18613, 160884, 2808, -102728, -60037, -42646, 41741, 174362, 57801, -168560, -63311, 168515, 28541, -212489, -27931, 264464, 134662, -137198, -120819, -17656, -22913, 25528, 65312, -35866, -19613, 152306, 48931, -256179, -173093, 194765, 199899]
445A99899k89626j7212J89272l3063j59747Q118Q1724M5133Q4890j9967k21605
456a32184m3509K69621O7031k64670l3133K76160L4406k46014o5218J47524P1534
467H1548j6125k7650r0549l8368J52754Q0504j98171r5728K48988J17716k71705
478e6786j63802J88926J35178q0383m6834R905k5549L3312L6387j26608p2133
489a68387K31511J87734k13778k39097J48258J93600j31911j43645J27446J31850
499A23581l5138n9950q2518r3297J09030K00271q1905k05444J03915K09951j29802
510E8694k45508P8581K19446j2534j25739j0986K3393O087M9307l0878j34629
521a24766N9223K29276m7693k77300J2395K61733K0987j98995m0393J12653L8383
$$ y = [199899, -89727, -106939, 82333, 49270, -110477, -102359, -20635, 24498, 109388, 89421, -132184, -175693, 93928, 160959, -103711, -136844, 139316, 173722, -72292, -137510, 10014, 81548, 65423, 37773, -52776, -91144, 61610, 142114, -56057, -151785, 97203, 214919, -56786, -220588, -31662, 103516, 23133, -23701, -13796, -39345, -6033, 30354, -96254, -168387, 63124, 250858, 37080, -202017, -53759, 139841, 7930, -135715, -8269, 123581, 88443, 28493, -54025, -147322, -38292, 161979, 80074, -125370, -21455, 188496, 58694, -186814, -108233, 111213, 98679, -27060, -38046, -14653, -8566, 40741, 9863, -124766, -65543, 163733, 116040, -161260, -148865, 112868, 133855, -65140, -105533, 7120, 45503]
532D5503l2705l3140m0039L5850J35746o368k09602m0226K33262O7148k13527
543e8098n2013J95686M8924j59460q7965L6244O9519Q9374M054j46294o0374J63890
555D3487P6089k00026j11894K12645J66997j42958j45847O4864O7320k7873j4059
566a1255j3906m257J11765O9691j72348j47750J66152J79051j39271j77882J14473
577b5537J73092o9899j54695j3179O3599N6514L7984p1172j14825Q2154J68700
588A32736q9094k02205P6481K05068m7176j77753J1318J30185K7520o2054n5264
599e0238k1103N8648R9533m6362j63473L7324K23845N438k29951m8973J72425
610C7113N6158r9760m0448M7100N2292K3210o2149j16743K0902J71480L6432j70567
$$ y = [45503, 12798, -20342, -60381, -24531, 111215, 104847, -104755, -144981, 88281, 155429, -58098, -110111, 85575, 134499, -24961, -112926, -76682, -7163, 82211, 86265, -60029, -120403, 43487, 119576, -80450, -192344, 20301, 187298, 44340, -101507, -36643, 30677, 2804, -11255, -25161, -29418, 82347, 152038, -20310, -168060, -1908, 177143, 37872, -140010, -25537, 147555, 77656, -77039, -90218, -26619, 29895, 67879, -3293, -118118, -35964, 132736, 43642, -158563, -82082, 122986, 75810, -101943, -90625, 39560, 67080, 5026, -50238, -71341, -12693, 86840, 40478, -122995, -85671, 138174, 143612, -86339, -135312, 37113, 93271, -6489, -46937, 163, 52455, 75665, 13516, -103227, -82325, 89155, 125587, -44980]
622d4980m9153J77705N3849j96244j03041J36644J20593k3550o7300n8983O26
633e3834R6138K3449j43906m9690J91540J20007j65613j59561R6376J31056n9640
644B6322r5638L3493P0614J9425k9001r2358n4792J25406J25585j21267j58022
655a50233J06709J65986p9498j60697L8375J42695J8312r2012o4013J7356Q6456
666B9436P2799o3609j19220N2549J46204n7970j75893L9107J88557K2565j35042
677e17p0880L4077N4505J5803m9034m7193P4990J21267n9887k01701k1642J95200
689D4988P1996j37683n0519J10712L8328r1756p5459J6P5775J09810p638j45338
701e6768m5569J36229N3450j46986p1196J60205J22795j13741j40491L2346R5208
$$ y = [-44980, -94133, 83572, 137421, -58823, -161864, -25220, 95373, 71823, 4523, -54460, -53834, 42304, 65753, -78153, -127843, 63697, 183704, 18091, -141470, -45094, 85962, 26322, -69316, -35823, 34791, 54216, 25215, -67143, -121935, 3471, 129056, 7789, -150233, -43524, 122462, 42964, -117733, -79358, 63337, 81649, -10363, -74376, -57020, 29436, 102235, 38626, -80594, -28045, 118159, 60189, -115704, -76597, 111960, 134525, -517, -71397, -37320, 17185, 32988, -16046, -63239, 11751, 133018, 73131, -128570, -150212, 44988, 116984, -20699, -71218, 39494, 77822, -13934, -89393, -89377, -13602, 96208, 88570, -56768, -102337, 33892, 87342, -59644, -130840, 29365, 152160, 38419, -102072, -69726, 25482]
712B5482K7115l1398n6216p922R2705L9153j30194q4040J38069J32839r7384j53692
724a05483K6293J18855J4232p3166l0444M4534O3638k028j10091q4168J14570
735b3258J65096n5042j57931K5879J19393l6009j20992N657J17694P5206l9180
746G6513j08199o4492O0575R6219l3330j06924M8196J58951k7703k02218n1485
757a53897J46018Q5847n0058n4787K30L6963K9957n2923q8326M4656J58315K0813
769A22808j68280p6777J36120R2036j08258r0538Q1689R3575k9612q7099n1990
780h6326M3153J19708L0490j29604q0009J02532Q7267q6429r0171Q2480J17956
791A11047m1148j28195l5303O8595P0175K391o4852k7408Q7185M9271j34318j20564
$$ y = [25482, 52597, 21199, -35017, -42939, 49766, 88919, -41275, -125315, 12754, 145593, 48209, -105483, -79190, 39665, 53897, -19269, -49713, -5179, 58459, 56431, -53660, -137828, -23258, 141838, 86796, -71135, -45256, 74137, 38128, -82864, -77207, 40487, 115693, 76513, -31686, -96178, -35603, 60616, 27286, -79638, -31442, 127509, 99806, -102412, -153897, -7879, 77968, 27910, -26877, -26647, 10316, 40273, -12650, -100976, -56320, 101995, 122808, -45472, -122249, 13871, 105907, -2351, -92889, -11200, 82375, 52763, -34336, -86326, -43173, 76535, 107025, -22579, -102588, -56, 87211, 782, -89389, -6909, 111047, 69899, -58296, -93599, -25004, 45171, 47562, -17290, -44698, 42487, 91758, -42560, -163124]
803a63124J14335J71617k6957j34151k7428O7756K6677m4286m4557K2619R3498
814E5999O2005q6518j39770L0748J51114l509j34237J0830J38247N313j32590
825d2368o2166O4894Q9695J9251p0184p3352L9228J03281j2762j28182j6237J47867
837E8965N8343j34437r1156Q3898R1498j9150o0555k6780L2146N7754k5008j02315
849g6797K696J44092N6942j35631j08984Q0488J05817m6012q7521K9851Q7488
860E2429K3553n9706r3924j9059J14060Q9320q4689r4298P6828R0635q3502j21597
872a09950M0755J26880K6229p8360n5910J9227N3137J4025o8040n7103Q8879J25796
884A25565o5911j61491J8283J44129J5389j03666l4006O5358N5104j8532o9946
$$ y = [-163124, -48789, 122828, 95871, -38280, -65708, 2048, 28725, -15561, -60118, -37499, 55999, 118004, 31486, -108284, -77536, 73578, 70069, -64168, -53338, 84909, 90222, -42368, -104534, -39640, 50055, 69306, -878, -74230, -35002, 68279, 55517, -72665, -88902, 58965, 117308, -17129, -108285, -24387, 67111, 47961, -12594, -39374, -7228, 50526, 25518, -76797, -74101, 69991, 126933, -8698, -117682, -37194, 68623, 22611, -64910, -35059, 52429, 75982, 16276, -77648, -96707, 17353, 106673, 21984, -72314, 4514, 95149, 11647, -109950, -69195, 57685, 83914, 5554, -50356, -31129, 22008, 36033, -32007, -89110, -231, 125565, 59654, -101837, -83554, 60575, 75964, -27702, -61708, 3650, 58754, 40222, -29724]
895b9724l8117O1736Q9440l5413j26627K58J40191K6885j35351m3435J14512N5764
907H0119p7232p2306J2477P1022O1512l2822r8308l393J08614K3452j20856n2640
919a00361J25079R5491q8835j08500K8626P1436L510l8593l1116K5000Q6112J2557
931H0406j26979p2953J12482J04449p3073r7041N4407R7178k9452j00352k4879
942g5807O1333O7971Q657p2941n9791P0771Q6975q2062j19432P0863J40340k9617
954F7260j24172j3319Q1800L9298l7597n2771m783O3408N8887n4466j05799L5410
966d6844J38245q796j45872j8916J20321L2991q1128m2679L5613N3674J5778o1182
978h795q1111L4033J23534J3586j23698l8680J15843M6789j16137o7956Q7867
$$ y = [-29724, -67841, -6105, 83335, 47922, -78705, -78447, 61744, 88629, -46722, -90157, 24355, 80119, 2887, -69419, -56942, 14080, 75592, 42770, -55538, -58931, 49683, 73135, -47721, -100361, 24718, 120209, 31374, -77126, -48500, 22936, 26446, -12147, -43263, -18263, 67849, 80406, -46573, -119526, -7044, 97405, 24332, -72709, -18302, 78876, 49424, -50928, -75807, -14474, 53497, 62154, -10787, -70578, 193, 87168, 5106, -114326, -43463, 96877, 67260, -56912, -70231, 11569, 50867, 13270, -39501, -44284, 19124, 78011, 23545, -82254, -46844, 91401, 82605, -63267, -82183, 38138, 71129, -9999, -52678, -17065, 36609, 52387, -8795, -89906, -55873, 67661, 81247, -42451, -81131, 34712, 81501, -34636, -102592, -14725]
989a4725Q5301j6074n4879m1607Q261O3304O444q8822j2775J29264N5652j29749
1001a0405j05024P8208J03641l5208p5036J7462O1121J9279l6406p4245k3916
1012h0529J02363Q6097q7677j04913P0607R8424o3066j00872L4832R4930J0559
1023F0755o4715n1472J0423O5979M4009o3639q5678N9439J16888n3564j38845
1034a00420L3673J40976Q842r8670m0272L0340L9785J7535l0228m1199M1671Q1048
1046H3081m2654j35876j085J45747M0621j11971l7172Q5229K6924o8978m9431
1057f5565J0340O3986Q0119j9083j19622k9606J09475L9009j04646m0814J13778
1068C7371P1625q6897r1725K2461N8062K1681j3027m3660q699P5555K2655j18236
$$ y = [-14725, 70576, 54502, -377, -41984, -33723, 29581, 36025, -52797, -65572, 63692, 119344, -10405, -115429, -37221, 66420, 31212, -43824, -26362, 34759, 54038, 17632, -56613, -80529, 21834, 107931, 20254, -84659, -14052, 84372, 21306, -79566, -44734, 50196, 60755, -3960, -55432, -45009, 20970, 64979, 1340, -84338, -24899, 91989, 38425, -100420, -66747, 74229, 83071, -15599, -55871, -25531, 14254, 31789, 1561, -39638, 2033, 83081, 40427, -95449, -96534, 49213, 89834, -22137, -59309, 25920, 52844, -16134, -65565, -55225, 8761, 88880, 69797, -49825, -79431, 30044, 69053, -35593, -76407, 37371, 108996, 22099, -69626, -47165, 10897, 32578, 19551, -24109, -32808, 42747, 65402, -52834]
1080e2834n9624J28602R7810r4761j05810M5394Q4452q677n4007j6043K6729M7700
1092C8931J2259q0299o9376Q6554J17829o2902j22389M1863R7156m1377q5545
1103f7296K1340P7568L4950k4998p0837m8980N5830R0084l1411r6272L9041J22398
1115A01417l3340j50021j4552J15278M6303m0254l0514j0196J3432K9725l3705
1126f427p4072M1114J28388k871j39785l6560J10904M2460q6306l7217O7855M7476
1138E4959j9336m6117n0550J5382J03045K5673j18759m9850J11324N2298j03894
1149b5825n8166Q5959O9693m6718o8080r199L3363M9644J6992o2091m1745Q2324
1161B6151N8593j10360q9940J07426J16424n4510r3562N761M2614P938j6924k8321
$$ y = [-52834, -112458, 16144, 113954, 19193, -86617, -41223, 43229, 34552, -19455, -35498, -8769, 38931, 51190, -29109, -98485, -11931, 105898, 42996, -79393, -37530, 59626, 18249, -67296, -45956, 31612, 66562, 41564, -29273, -78253, -22423, 67661, 36250, -60022, -20981, 101417, 68077, -81944, -96496, 18782, 65085, 24831, -5683, -15879, -2447, 27278, -6427, -80499, -39385, 89003, 86132, -53653, -90213, 20691, 63151, -23155, -60372, 7483, 54959, 35623, -10494, -61044, -45662, 57383, 83056, -35703, -85553, 25771, 78069, -25825, -83991, 1968, 71661, 24943, -43137, -52336, -18973, 30671, 47663, -14428, -56173, 26151, 84744, -25616, -115556, -8130, 108294, 53784, -39778, -34017, 8597, 16535, -389, -28710]
1173b8710J58P0166M9863q6697j10504N5826J23522l2028j02599L5759R3513k3339
1185D4930q0474k2308K6654N3221M5120m6890q4323L4375R7429l5205j17608K2638
1197f2441J31057P022j13428l2018O6171L3582j4310k3325l0013J9769P4596j4842
1209D1820j12621L715J36124K4456j24527m7612Q7346M7473n0931l6919K1499
1220a0177L2120K0704k1905p8995j7647J11473N6839j07922o3680R8899N5678
1231G5387r2693o4577N6638O8532Q869l1733m9940j5257N8516L9030p2002n6825
1243g6055R4205R0331q9434j12255N2760Q8625k5402n1375P062K4676K5442N804
1255C4384o2910n2603P6116R5418n9199j12067M1554J12562k5656j02430O418
$$ y = [-28710, -28552, 41614, 91477, 4780, -105724, -49898, 73624, 41596, -61003, -25244, 68269, 44930, -35544, -57852, -31198, 22023, 67143, 20253, -64070, -29695, 67734, 32529, -85079, -62441, 68616, 75638, -37790, -69808, -3637, 29945, 15635, -7690, -37703, -17934, 56662, 41820, -70801, -67086, 69038, 93494, -31033, -78645, 8701, 56174, 5243, -31676, -10177, 21943, 42647, 20742, -58253, -75900, 35573, 92412, -15510, -79190, 19709, 75387, -17306, -81883, -25245, 43287, 52156, 20423, -29517, -44774, 13742, 52772, -19230, -76055, 18150, 108481, 19047, -93208, -40448, 48177, 22775, -28600, -21538, 3138, 28580, 34384, -28526, -81129, -5013, 90405, 31206, -80861, -39307, 73255, 47599, -54831, -48413]
1266d8413P5210J4063k9007k9666k5585L4560P3074l2050j03305K5690J14165
1277F8736j9427j17489M433J10121K3366p5302l9685K2715L1301K4798j4811n9731
1289d0975Q995J00848L592j33099l3304J21546M7484q3893l7598N3738K7271k8570
1301F035l4850j9632K4591P1515J6158r1068m6788R3833N6332j01402o4844R7022
1313F902P8591n3823o4908j503K3030L4423J2711n4587l3634P4893N7352q6982
1325g535q6287P5073R7725n2285q7345L2838O4438j1012l3360j6051m008M7454
1337A9645M9184o6071r1113O1718J14566m0603j10991K0235R0774q676p3201j0965
1349d5498M0770L1882J3911l1177o5909J4937R0097j2847j01570K3246J21362
$$ y = [-48413, 26797, 40860, 11853, -17813, -43398, -8838, 64236, 32186, -71119, -45429, 68736, 49309, -68180, -63747, 46374, 69740, -5562, -45247, -22532, 8769, 33567, 18756, -40975, -31980, 68868, 72460, -60639, -93943, 27603, 75087, -8806, -46404, 7334, 34605, 6035, -28815, -48447, -23856, 47659, 63817, -27251, -74039, 19794, 76126, -25276, -90120, 6902, 85493, 31670, -33238, -34741, -11711, 22712, 35423, -19164, -52798, 22095, 79447, -7535, -93822, -18749, 78976, 26691, -60654, -27816, 36622, 25610, -7750, -23801, -27809, 19645, 68829, 2758, -88355, -26637, 87929, 47326, -63665, -43430, 47344, 38668, -34533, -45498, -4728, 27154, 41065, 9888, -56021, -41084, 49013, 36166, -65404, -42158, 79204]
1360G9204o799j16503k7674O9267L8497j4610k3488j5904J7670M4706j9900r2822
1372f8356m583J21649M0632j09495m9030Q2295L3181o4954k7426L5848L3900J8932
1384D2593j9156o7305j2517Q8333L9728r2246n2700R3513O4088q6422p5364N7200
1396b0255O5832j5006l3493k4086j0802M6409M2310o0838n6368P7796P4121q1687
1408C933r4594N6686R5183j8606o3448K104K9618N167p766l2614k9698O0625Q5707
1421I2297n4617j17715K7327J02023k0323q0727K0813P3243N965m6800l8767j0302
1433d7583L8658O0399j4989p7529J0424R3089j5930j15718n79J13250K5971p2796
1445c333l2240K0449J9143J4858j3479m5288J3594P9672J5j05894k7033J08544
$$ y = [79204, 72405, -44098, -71772, -2505, 35992, 21382, -2106, -18010, -340, 44366, 24466, -68356, -72939, 48710, 89342, -20153, -69183, 13112, 46293, -18661, -46087, -10239, 23661, 42593, 23437, -43868, -56385, 31948, 71676, -20570, -73270, 20243, 84331, -2091, -77455, -20255, 45577, 30571, -2922, -27008, -37810, 8599, 50909, -9929, -66297, 11499, 85620, 3933, -90661, -33975, 61208, 42602, -20846, -18742, 10876, 16043, 8277, -24337, -54035, 6590, 92297, 37680, -80035, -52708, 49315, 28992, -51735, -30922, 42321, 48286, 1486, -37281, -47583, -8925, 51474, 36485, -41044, -30620, 62469, 46539, -69179, -69758, 43492, 69463, -3333, -35573, -15124, 4019, 18877, 5398, -39890, -26296, 53376, 53391, -52503, -79536, 29008]
1457B9008M9346q6554m8751O0747L5572l5522k4952k26J7247N0299O725q9054
1469c6115m4692R1087O1181p6083n7032P1808N6942o1814o7428K1252N0639K5127
1481C4872N84m0931l8280M6328N0658o7088o8274Q2441R5941n7032r5414J4403
1493d1792N7724K264k4396q918N963K9901K3396n1301o9995M5993J01846k6729
1505D3956j00869K0756Q8186j6447p3225k75M5872K5681R13l7427m9024K7276
1517b4627P9444j1038r2075L59R5587N301r8615j9479Q0448L2807l6352k6954
1529a5194j0653Q472M0179m10o3156M360R5968J3249j10150m4894Q5149N5740
1541E8660m9340l9596K8647K6637o089k1777l9240m950P6740M4393q0257o0561
$$ y = [29008, 78354, -8200, -56951, 3796, 39368, 3846, -21106, -21332, -4085, 46214, 52939, -36115, -80807, 10280, 71461, -4622, -61654, 10154, 67096, 5282, -62146, -40894, 9745, 34872, 35456, -5475, -43755, 2573, 53231, -13857, -82131, 310, 96251, 39219, -56195, -41792, 15932, 18196, -6200, -15118, -9155, 20746, 44142, -7159, -77154, -31161, 70685, 43956, -56913, -36157, 52029, 35582, -37643, -37918, 7954, 33635, 34548, -2879, -51903, -24627, 54817, 43779, -48296, -47937, 47650, 52951, -45664, -65143, 15305, 48112, 11760, -15194, -25847, -17375, 22804, 22394, -40762, -36402, 59566, 72815, -37335, -82229, 2920, 58660, 9320, -30276, -1629, 25008, 18919, -2858, -42098, -47048, 29692, 74085, -6172, -66733]
1553f6733P1480N2506o9756n1511N8662N9829k0776m5983j8638J0387L8251K1966
1565C9684m8374m5644O0137P0150o6085r0800M9907Q9144k4538o5165K120L1221
1577A757J3486q1k6335k4581M0677N3477m4987q2077L3873R8120j4527q9728L338
1590c7588P0334J212m9043j7660J1196L2653M0543k7997p8850P700Q6557J85q4361
1603d5119j390Q8672J8069p4622l5521L6650L0597K789j1337k6354M958N5690
1615D3082k180r1138j8117J01711M0399q1041m5654N1296L7131k9284l2588k37
1627b6620K3071L5740L062n9999l2225O8412N1349p0069n7044O7559N9190n3047
1639I379n6081K4810M0995R745j6028l7695j5502M9462M1961n2743o0444N3352
$$ y = [-66733, 4747, 57253, -12503, -64014, -5352, 54477, 33701, -12282, -30920, -20533, 17718, 39684, -8690, -54334, 5803, 75953, 9868, -80932, -31025, 58119, 33581, -31584, -29464, 1757, 15243, 15162, -11173, -35754, 4923, 58400, 13413, -68664, -34791, 63329, 48802, -40926, -37588, 32746, 33958, -15085, -32745, -21549, 11104, 51647, 23650, -55200, -47500, 39057, 39242, -45119, -46509, 42163, 60232, -14390, -49911, -13261, 17336, 20125, 8788, -17566, -12608, 43082, 40902, -50236, -68353, 33358, 73757, -7284, -52938, -1642, 35489, 6205, -26383, -26620, -3549, 32191, 35253, -24746, -56971, 11441, 62790, -7279, -64323, 3236, 62426, 9379, -46702, -21892, 19103, 28848, 12820, -24875, -40377, 9085, 51046, -1697, -62141, -8789]
1651h789P7133m4850q4882K3322P0724o9l5630q822N333J8385J7771l7093m8684
1664e6151M6730P9999l0576r0847Q789P6339k614o5247n170N1781K2977j5811
1676B0199l1701l3245J8661O4911m312p3939M909Q4803K13q8695j9449O8688L4293
1689D5336l2111l0739Q32J8611K1938j1604n0448j312P6782K2421q7865m0792
1701f8951P6765M6149n4459l8214K9633L0623k655k1526k7448P489N6651J9799
1713E3856o7223m7060O0810N7325n3397n6809M7112N6250k7337m8798r115J6660
1725a7726L4469K1066l9398l8412M4771M7012n5072o6136M7105Q2955j6963o9217
1737b5546n084L8022P237j5799j5763o871L5064M3779m0750p8827K3183Q4335
$$ y = [-8789, 68344, 23494, -61388, -38066, 32658, 32589, -3041, -11863, -6530, 11855, 29626, -7467, -56151, -9421, 70578, 40002, -50845, -42056, 34283, 31669, -33578, -38748, 13033, 36010, 20199, -11502, -44747, -26086, 38825, 34513, -39426, -34517, 50286, 50499, -38196, -57645, 11043, 45336, 13225, -17514, -16682, 1929, 23867, 12263, -38185, -39497, 37285, 59706, -28159, -68951, 7814, 53963, -496, -38710, -9077, 21546, 18891, -2635, -30083, -22594, 34057, 53856, -13367, -60427, 383, 57708, 4311, -52498, -5386, 50864, 23527, -25271, -34386, -17726, 16743, 37809, -1589, -40001, 4770, 51782, -3290, -69426, -22321, 60634, 43671, -25546, -30630, 7392, 14629, -1170, -16933, -23804, 11260, 55039, 14289, -64538, -41355, 42980]
1749D2980o801o9976K346N9403O727m6242k3250J8746L2954K0427k3403m9968
1761c6057Q412O6912k83p7514n590Q1544J6140p1227l2014L7806L4487J023k2002
1774A637k7396P056M1675J062n9192j1565P7092L7170p2150n2125M7975M3516
1786C4755k7562k6736J2833K2834J6334j4444n5505j7192O7930M6689n4321n3190
1798d7575M2020M9956l9682n5402K2496N1972R968k1723k8305j3927L0824L3587
1810C4209l6602m3405M8187O0260m3847p3811J9469O5282M638m1689j7015J7604
1822f720K1936M914k9372l2307L2618O3351k2159q0251N255P4871N346n5242p169
1835b4929L9582J4054k2261k9927j0061L2089M5374j4030o2905o216O3405J0793
$$ y = [42980, 36179, -33797, -31451, 27952, 34679, -11563, -34813, -16067, 16887, 37314, 13911, -36057, -27645, 39267, 38984, -38530, -44120, 37424, 53564, -17663, -49677, -11871, 22616, 23639, 1637, -25759, -18703, 22972, 24034, -35158, -46723, 30369, 67539, -4611, -56736, -8761, 34755, 7193, -19543, -6710, 16124, 32458, 18014, -37491, -54683, 13247, 59936, 5615, -47575, -5555, 44401, 4719, -50683, -28187, 23785, 33753, 12030, -16275, -30202, 622, 34209, -2393, -45798, 2389, 62649, 18802, -55009, -35540, 29742, 34380, -7309, -24324, -6720, 15216, 20130, -9242, -41549, -8931, 54420, 32261, -47990, -42735, 32136, 37482, -17760, -24929, 14653, 28707, 6446, -23481, -33542, -1453, 43921, 29891, -33014, -39230, 24175, 34968]
1847C4968o9040j6908O9789L4229m3215l9644J914K2207K5353k323l5026N45N1596
1860C4445O713o9198k9876O3950M7990m1027m5514K3140L3104j1715k7541j3005
1872b8534J3778M3296J3790n7862m0797N3808N1167m1644m9706L1405M9517j5691
1884B2527m4767o162K8562K5597p29l3452k6699L2032M3730l4158n5706L4593
1896a4632O6498k2541o6837k765M4941K1479j4499k3037n362K4910K2096k9970
1908B81m7664K3645P0692r35p0019j3670N3148J1419m1013j5319K5244K7680O953
1921C0442l0124m1611J3561N6072K357n6287q360N9451K0048n7222l5120L8335
1933h458L9122q762k5668j4492R930L1147J39m9353j1827O0556K7044n8542m0580
$$ y = [34968, -34072, -50980, 18809, 53038, 9823, -29821, -27907, -5700, 19653, 17330, -17696, -17151, 34445, 41158, -28040, -57916, 6034, 54024, 12997, -32517, -9377, 23727, 12012, -15529, -28534, -14756, 28540, 42330, -15532, -56329, -2521, 48646, 7002, -42704, -11299, 38218, 22527, -22240, -28402, 160, 25757, 25028, -8424, -35123, -3091, 40639, 6481, -49225, -14632, 51866, 29325, -37512, -40277, 4664, 26143, 11644, -11393, -16755, 8155, 30251, 281, -47383, -23738, 46954, 46019, -24000, -37670, 15478, 26897, -14116, -29435, -4191, 23489, 30442, 318, -41293, -27732, 28340, 30697, -25590, -33950, 25501, 45549, -11673, -46793, -8458, 30664, 21902, -3766, -18258, -8328, 22819, 22958, -26395, -38222, 22334, 49378, -9164, -49744]
1946d9744M0542M4652k0377l8527K968K8122J3384j4195l0591n486M6666L2029
1958D9443m7730n0077L8038N1451k7836m6016J6920M2179K631l1828k7527N085
1970b5267L5950K1288k9732l5721K6166M7472k5949o1715J3943O4794P520m3460
1982d711j7336J7140J8411K81k4588j8248L0900M3035k2707o0439J369N8786J1771
1995C3664n0511j7476M1772K3813k4348k9341l647K4475L2792j0561m8324n00
2007b8192N4130R601n3917j8873M8917K9588l4506l7778J1775L2089J0685j8210
2019E309k6806J367L9122J0803n1358k6276N5180M2464l9075m5602J6456L5086
2031A6670j011k4253r820J8764K8069k829m2156k5342L8476M3643k8375m6405
$$ y = [-49744, -9202, 35450, 15073, -23454, -20486, 7636, 21020, 6825, -23766, -29252, 17414, 49443, 1713, -48364, -10326, 41125, 13289, -32727, -15807, 26372, 29003, -2825, -30352, -25267, 10683, 31971, 2239, -33482, -7316, 40156, 14207, -47508, -33565, 31229, 38749, -4711, -22047, -4907, 13504, 13785, -10803, -29051, 1849, 44884, 22177, -38262, -36893, 21893, 33664, -16847, -34323, 7449, 31262, 6914, -22427, -26074, -1599, 31193, 20632, -27692, -28192, 25938, 35539, -18378, -37251, 11666, 41254, 6748, -31030, -19255, 12834, 23519, 5309, -21497, -20130, 18992, 29795, -21563, -47839, 7341, 49805, 10730, -34872, -18416, 16670, 15659, -8594, -18414, 350, 28419, 25590, -16566, -41908, -3432, 40211, 11836, -34569]
2043c4569K3951M6838j8231m7931l902L3729K7142m466l2690j7612K8303K9344
2055B9906k6476l9999K2510N3973o563n6042j0955M1551J7040k3224j8338N331
2067a1286K1908J3786k6670l7670K1270N4987n745n6884j0930M7995K1190l4205
2079b254k5134K2133K9850k500k7927k3236J3542M2192N224m6669j4740M5296
2091A5777J6107m7005k6291L6671L8499j0717l5704j4090J8926K3628n428k9623
2103a9250l270M3597K2974m7040m4177L2151M7506j3413l3738L354K4139O667
2115A9500k0102k6626M365M0067J9060l6377l6002K5090M1367j7832m4998J0689
2127b1799M6828N243l5688k1719J1515K9443J4546k6847k9853K2143L6998j8964
$$ y = [-34569, -10618, 36220, 17989, -29942, -33844, -115, 27027, 22561, -10129, -27741, 562, 29906, 3430, -36569, -14059, 39914, 33351, -22691, -33646, 7905, 24945, 1721, -16617, -11286, 10622, 24408, -2262, -39932, -18662, 36325, 30580, -26304, -37234, 10761, 31951, -2254, -27388, -5255, 24595, 22095, -5832, -29068, -15526, 26666, 31890, -14779, -29519, 15777, 31884, -15121, -41412, -4741, 33758, 23041, -12663, -26753, -7827, 15801, 10373, -19250, -22520, 21077, 44051, -2989, -47166, -15015, 32491, 19078, -14660, -11306, 12833, 19500, -602, -27228, -22863, 17204, 36264, -113, -36115, -11025, 30342, 12510, -32488, -21799, 25029, 30272, -5416, -27135, -15620, 13823, 28369, 1522, -28331, -6188, 30810, 11846]
2139A1846m5183R621M9896P883m3420k3505K4502K4558n871k0028o775K1293K6135
2152C0952j9518m8457M699N6693J5660m3905k1844K8660K1136k0707k8702O240
2164a9093L2419J8211j9804l6428k998L7286J4477l8028j8009M2505K8446l5270
2176C714l8287J2380L4541J2364j8766k2819P127K9334J784l6497j7546L8232
2188E561L5748k8668m5587J2508M0013j588k9271p664J8154J9809n363l3007j3966
2201c3321L7211L3692k5734m1086J1498M0121l185l8333n068L6169J9395k0772
2213A0587k9179o406K4158K5183j5609l2976J4270M0356j0170m9270o338M2874
2225G480K4940k1888k7228M947K2671M063k1233j8276J7444L8031j629m8095j6198
$$ y = [11846, -33337, -23716, 26180, 34063, -9357, -32862, -8360, 16198, 10327, -9701, -16476, 4817, 30952, 11434, -37023, -32324, 24369, 40029, -3876, -25720, 2940, 24076, 3369, -25333, -19093, 13326, 31537, 11733, -24695, -27693, 9593, 24070, -13958, -31967, 10538, 38984, 3714, -34573, -22193, 12348, 24712, 5946, -16873, -9746, 19588, 21372, -15125, -32671, 5561, 41309, 12641, -32946, -20438, 19575, 17987, -11284, -18948, -794, 19015, 13652, -19355, -33321, 3890, 37582, 11848, -29238, -17740, 22381, 19196, -19137, -24205, 11964, 31359, 10587, -18592, -24998, -840, 24343, 8734, -24242, -9972, 30384, 20214, -29056, -35394, 7480, 32420, 10532, -16696, -11749, 10922, 14985, -6248, -24524, -7080, 30951, 29322, -18773, -34971]
2238c4971M0957K1595l1092k2130K0878K6133n873k9330j5238K1673L1408m024
2250A9986l5922j0556L4739K2710l2479l0241K7587L7115j4259l4868n093K1719
2262D38J9847o592k6791n544L0335J3293l4326k7898K8748M1367j1884m2281l648
2275b4936L2039J0710k0939j5649J0080K7269J0699l1517l2184K1798M0164r543
2287A7991l6327L208L4037M668l3567k0559K0974K9300l58k4411j6445J6061K7423
2300B1995j1313l8632M575M7248R231m0890k1340K3688K5653o747k4436n829K1604
2313D807J7349j5980l0385L426L7605J2247l7687k3368L1092K6981k1104k6856
2325b1873R401K6768R204k0544k7724O602L6163J0168l2375k0140K5986K6325
$$ y = [-34971, 5986, 27581, -3511, -25641, -4763, 21370, 15497, -13833, -29071, -7398, 24010, 19986, -15936, -26492, 8247, 30957, -1522, -31763, -4176, 32939, 18680, -16188, -21281, 438, 20285, 13693, -13098, -18642, 11693, 24986, -9340, -37238, -8490, 32877, 20993, -21288, -24936, 7103, 17813, -3126, -18775, -8695, 18574, 29273, -2244, -34428, -12630, 27534, 17991, -18336, -15128, 18909, 23577, -9990, -30549, -9575, 19725, 19367, -5044, -21489, -5428, 21995, 10682, -27950, -23375, 23873, 33104, -7786, -29126, -5438, 20215, 13468, -10968, -16797, 4807, 22156, 6176, -24209, -20783, 16822, 29069, -8618, -31986, -894, 26087, 4983, -21873, -12472, 14296, 23500, 2956, -24768, -18166, 17997, 28165, -4210, -24350, 1636, 27961]
2337B7961k2641l5488J2074L7215M060k6428j5813Q944J9403K384k5171j1373
2349b4873L2540K7386k7356l8461J0041L8489N095k9719j1404K3260J7959j3040
2361I917k5924o689K4812K5593j6025l5356P257L5913l120l5758m927L1569J7672
2374B4934j8990k6046K149K6003J3105j8157k3268R908L2487m77l9247j1633L8644
2387I412K2232k6962k6533R066K2112M054j7597j4827J5329K6780o348l6415j0215
2400b9912L4217K4774k3676k7761J7432K8278j0672k9336m863K2080K2942m338
2412A9165l0813j1834K7238J7626k6069k2874K2482L2679r701l6566o667K7216
2424A882J5763j2880j7232K901K1601J0679k6130k6624K2338L7596r954l7148
$$ y = [27961, 5320, -30168, -18094, 19121, 23181, -3247, -19060, -10116, 9287, 11671, -13500, -24873, 7667, 35053, 7697, -30764, -20723, 17766, 22861, -6858, -18262, 4998, 22957, 9917, -16007, -22696, 2116, 27709, 11684, -23672, -16415, 19498, 16378, -19380, -24307, 7262, 24934, 5944, -20102, -17953, 8050, 21155, 2998, -20270, -10362, 22125, 21648, -17599, -29232, 9412, 31644, 4682, -21851, -12785, 9327, 13381, -4216, -19043, -3714, 23066, 16718, -19697, -29912, 4305, 29079, 5403, -22358, -4926, 23352, 12680, -16656, -21519, 561, 23503, 19165, -11648, -23482, 3756, 21382, -4687, -27561, -5079, 27600, 17899, -18667, -25334, 1882, 17645, 4765, -12467, -9566, 12035, 22714, -3416, -30040, -7702, 29894, 19940, -17208]
2436a7208k606K8626J0248k1278j7715J2155K4014Q91k5229j8132J6876L1329
2448B1971m733l4855k732L4740P666l1798j4786K3069K4091l839k5375j4319J6201
2461d699K2029q228k5826K286L2367Q532l6383k3986K6497K9412j0764k2657Q47
2474a0573J6766Q725j3919k3490N948L5320J0943l2161k2794K1278K4988j3833
2486G198k7494P686K9696L536k4240j7402P319K4013Q608k3559j8376K3389K4243
2499B4617k0415l0060J1345L3478M520k7309j6539J4453K0862k358j9896p978
2511a5280J9081J9973j7821l3786Q383L8445L275l0727j0428J9549J3227j1967
2523A924j8863J848K5652J5215j8869k8813M353L1634O012k9438j0517L0032J6731
$$ y = [-17208, -19814, 8812, 19060, -2218, -19933, -7778, 16236, 17127, -8102, -26234, -9358, 21971, 17238, -17617, -20349, 14391, 22057, -9741, -24527, -1458, 22633, 18794, -6581, -20900, -4699, 17330, 9102, -16724, -14438, 17929, 26461, -9922, -33908, -7411, 22001, 11237, -11420, -10573, 6193, 14918, 999, -22491, -16543, 18777, 29720, -2441, -25235, -3957, 21031, 7198, -20296, -12610, 17086, 20622, -3618, -21020, -13701, 10312, 18920, -4639, -23015, 374, 24617, 4202, -25858, -14513, 18965, 23485, -3824, -20363, -5910, 14952, 12594, -7302, -15280, 3801, 23774, 5953, -27833, -19450, 18995, 22270, -8457, -18885, 664, 13891, 1924, -16939, -15091, 10561, 25776, 6907, -21906, -17553, 14081, 20093, -9345, -19862, 10170, 26901]
2536B6901k5229k4582P197K2617J0443j2925j9490O202K3050k357k9190o530L1488
2549G595K1077k3094k7906J0739K6207j044k0109p001J3664J8012l747k8774j0431
2562b4812K9903K1559k3052k5795J2651K5100n406k4487k951K2868J3978j2852
2574F704k1540l393K2075J7616j7467k3945J5622K9366j2283l3356q7K8196J4801
2587B2309j4602k0411M14J8016O257j7985j4867J6646K7769o688l5148n610L1472
2600G572J1119k2374j1678J5394J6723l182k1561j3732J7059K6427o158k9674
2612a4065l925K7447J0424k5900j8367K1285K3559r923k2517l978J5165J4802
2624A4007m890k2113r95K7547P062k8476j6417K3661K4933j1800k6604j077K0762
$$ y = [26901, 1672, -22910, -15713, 6904, 17347, 4422, -15068, -8866, 14184, 11827, -17363, -23893, 7595, 28672, 5578, -22328, -11589, 14618, 13574, -6535, -13536, 128, 18140, 14393, -14381, -24812, 5091, 26650, 3598, -22197, -9546, 15554, 10148, -14339, -17290, 5578, 19556, 6704, -14836, -18229, 3846, 21462, 3995, -19950, -4328, 25038, 12755, -20601, -20688, 7508, 22309, 7707, -12704, -12290, 5726, 11983, -6002, -20869, -4223, 23546, 16858, -18290, -23900, 7572, 18691, -3683, -15361, 33, 16756, 13574, -7987, -21719, -4660, 21767, 15609, -14065, -17990, 9457, 19881, -6019, -24386, -3101, 20458, 10535, -11982, -15960, -795, 14007, 9117, -12996, -13991, 13556, 20618, -7858, -24275, -614, 24319, 12519, -14085, -15162, 5600]
2637E600P721j3814j4106N435K1910O829k5839k1395K1447K7740j2666k4972P489
2650h621K2262J125k1189j2369J3210K1581J620k0722j3517J4635K0154j2245
2662E924k7795Q068L3017Q27k9389j1730J6492J5544l397j5557n367J7464J4924
2675A9025j5669k4069P247L0382M043k7895j2248K2703J5362j5984j7158M956
2687i305J7051Q743j3982k2375N795K8144L305k7337r284K3553J4919j8675k0801
2700b0249J0989K3517K217j7398j2353O477J7641K117k2855q385K7085J6719k4815
2713G07k4639J2429K3522l24j7537o173J3075J2869q350j9794l388K2844J8346
2726B3587j7319k5258J1356K5862p440k5315Q25K1609J0176j2200j8951k026J9112
$$ y = [5600, 13321, -493, -14599, -9164, 12746, 19575, -6264, -27659, -6212, 21528, 8862, -16110, -8621, 13641, 14766, -6423, -18792, -5582, 15999, 17619, -3103, -16620, -1985, 18169, 5924, -21871, -13803, 19214, 20041, -9348, -21078, -4586, 10958, 7561, -7996, -13363, 4101, 19025, 3356, -20713, -13466, 16916, 20959, -6936, -19184, 3519, 18881, 2897, -14261, -9305, 7746, 16489, 2507, -19868, -14073, 14071, 17376, -9961, -19245, 4308, 19227, 552, -20249, -9260, 14257, 16474, -924, -13277, -6800, 10841, 12958, -9897, -18282, 8803, 25522, 707, -23932, -11503, 12019, 11695, -5842, -12015, 1060, 13929, 5579, -14215, -17603, 5241, 23587, 6268, -18990, -7634, 18228, 10788, -14527, -13702, 7907, 18083, 5883, -13068, -15094, 4018]
2739D018J1486j5860j7801J1924K3712o392k8224k156K8018J0512j9114j3573
2751a3450P371J4126M207j3877j3701J3601K2973q578k9425k438K7235J1470j9845
2764c31j6247J3173J5902o346j7503l796J4341J7656m295k5010n634K5579R546
2777A7035k3254j1660K0634J8668j1678k2566k721J7151J2339p630j5984r6J8417
2790H655O922k2880j7249K1228K4947j2182k3313L285J7274L733j2069j0694P523
2803d820J8812J811k1405j3929J7247K2232j0417k5257M020K4526K99k1673p552
2816a6106J3326J4652K24j7602j1783J4099J8696r919k0433O856K4625J02k5792
2829i055j0247J9382J6100q104j4515j726J0771R095j0437k0319O728K8670K638
$$ y = [4018, 15504, -356, -18157, -6233, 17479, 11087, -17137, -19293, 8725, 19237, 123, -13450, -6079, 8047, 12254, -1623, -15324, -1723, 21250, 12672, -16753, -19191, 8044, 19514, -331, -16578, -3405, 12497, 6151, -11352, -15148, -807, 16849, 12554, -12456, -18090, 7489, 17035, -6219, -17879, 2755, 21423, 9745, -12821, -15542, 1609, 13948, 6318, -9666, -9762, 8655, 15577, -7303, -24552, -3324, 21623, 9441, -13872, -10587, 6687, 10420, -1649, -12343, -4820, 13992, 15803, -5602, -19531, -2284, 19948, 9531, -15726, -11706, 12820, 13119, -8554, -16106, -2780, 11872, 12096, -5506, -17289, -3190, 15506, 5587, -14846, -7990, 16635, 16737, -9055, -19302, 80, 16180, 8076, -6439, -8165, 2606, 11701, 1264, -19055, -12327, 16343, 18981]
2842A8981k7564j1000J8972J3424j1689j3462O580J6663K950j4945j4019N634
2854i475K0833M826k1354j0627K1610J3384k0550j8117J2348J9711M45j5976j1637
2867a4579Q345J5832n41j7471n655J8957J4034j7493k1791J2052K4310k788j9732
2880f520l348J2132P676n829j4487j880J9594J2454j8841k1418R913K2942j942
2893A0446k0931j642J9617P163j5212j3143L472J6108R898j1065j7621P376K0644
2906A5110o580k3881J577K4346Q018j8148j5366O866J4921Q16j2218p093R689
2919a943J6119m795k4038l149K5772J1135k0453j2507J2951J3241n756j4164k925
2932a0512J3261J2574q051j9560j994J9962J0161j8416j4677J5982J7139j1653
$$ y = [18981, -8583, -19583, -611, 12813, 1124, -12338, -5758, 10905, 13855, -1090, -15109, -9475, 11358, 16184, -5170, -15797, 5813, 19197, -1353, -19470, -7122, 12589, 13034, -2942, -14579, -6234, 9598, 9057, -8414, -14069, 4888, 18922, 1429, -20362, -8310, 16000, 13212, -6520, -9868, 2264, 9940, 4111, -10376, -12256, 7338, 19792, 951, -20467, -10554, 12388, 10446, -10485, -12127, 7490, 14653, -559, -13702, -10230, 5878, 15776, 4711, -12910, -5534, 15110, 8530, -15351, -13774, 10572, 18590, 442, -14924, -8058, 6863, 7679, -4539, -11632, -1943, 14176, 9381, -14657, -17806, 7966, 19101, -1352, -13859, -908, 12333, 6577, -7587, -10512, 2749, 15323, 7272, -12288, -14282, 5680, 15841, -2575, -17252, -1270, 15869, 4216]
2944D216j9088L539J6077Q040o878j4773r30J6452O179j7535j0461J7143J7901
2957A9882j1356k3238J530J9912M097j3212o790O749J0970R97j6411j2147J6167
2970b850K0813r554k1447L599J9850N33j7212o777J3944J3306n263j4823o208
2983a2089J0966J3575o733j9447L515K2862L20k3392o542J7981J1786p482j3507
2996h187j188J2061Q084r167j3120N342J9287J719k2151j0193J9550J4356j3643
3009B750j3900O357J2155O02j0957j1282O762J9183J691k0057q563J6339J2718
3022A3798j3112j5416J0501J8884l052j6864n626Q213J1331n5j3628o353J6478
3035E099J0952j7249j7695J1219K0746k347j7652m853J2967Q269p670j0798R56
$$ y = [4216, -14872, -11333, 4744, 12784, 5906, -8867, -9797, 6655, 12834, -4701, -15162, 1981, 19882, 8526, -14712, -13182, 6730, 10827, -2385, -9175, -2426, 8544, 9541, -6870, -19017, -2850, 17963, 8409, -13038, -9439, 10411, 10944, -6268, -13045, 899, 14205, 8942, -5881, -12089, -1123, 12452, 5719, -13728, -10213, 12649, 12969, -10423, -16965, 1016, 12802, 5320, -8187, -9375, 2686, 10770, 1603, -11517, -6175, 13112, 14831, -7320, -17513, 2037, 16393, 2750, -11150, -4793, 7362, 7964, -2993, -14275, -7513, 11670, 13361, -6696, -15259, 1080, 13798, 686, -14730, -4229, 14655, 11603, -5261, -10887, -2674, 8657, 8602, -5026, -11379, 5099, 16051, -1198, -18893, -7674, 13072, 10725, -6927, -11780, 1187, 9456, 1786, -9012, -8056]
3048h056J3551R794j2568j8018Q365K1211l752k0272R6J6599M631j2312j1374
3061a2105M421J4856M635j2931j2495P217J6707j793j9759j569K1560P154j8124
3074b226j1557R609J2240Q91r815p314P672J2346o171j8470k0K0577Q465j7223
3088i96j3801J0925J4131o818j3091J287J1294Q582n274j6214k828J8144Q831
3101A4172j5482j0917J3288J3665r595j7037J737J6059N660j0350j0231K137J1652
3114D758M668j3618j0890J4132J7057j0429j9532L525J7535L716j1151p869N924
3127b174J0706j210j2518o314J2271J4183p485j9841J293J8957J636j6536m323
3140a1355J3133Q750n403j3102m450J1678J2826o529j4636K804J6361P18j8094
$$ y = [-8056, 5495, 15289, 2721, -15297, -6932, 14279, 10527, -9745, -9649, 6950, 11581, -731, -12105, -7684, 7172, 11807, -1124, -13619, -6402, 10305, 8512, -11247, -12816, 8744, 15898, -2226, -13783, -4174, 8066, 8957, -858, -8172, -500, 11846, 5675, -12795, -12815, 7762, 16227, -996, -14797, -3872, 10259, 3441, -9650, -8363, 2931, 11513, 6239, -9975, -12803, 5341, 14172, -1310, -12227, 1061, 14726, 5131, -11906, -10169, 5890, 11550, 1200, -9031, -6894, 4758, 9426, -4192, -15082, -950, 16107, 5678, -13854, -10329, 7206, 10922, -229, -8098, -2174, 8532, 7322, -5196, -11510, 761, 14944, 7459, -12382, -11089, 7868, 9504, -7032, -11355, 1778, 10528, 5125, -7977, -12427, -749, 12077, 5548, -9088, -6284, 10077, 10795, -7299]
3153g299o880J6545J2644r938j2614J171Q311M607o334j0884M591J6844M87j9409
3167h158p203J5973J1864r333j3001M809J3335j0j1496o138O336J2715J412j5374
3181d269q746J4383J1769j2510j3255Q859J4165l173j4206n035J0126J0857k518
3194F447j1457l795J0916Q951j0634j4300R271J9000l308j7989k948J1172O203
3207G529n223q892M94J1791N276j2885j2731P596J7081m61j6830k832J5197N345
3221A0455j3047p994P119J1201K584r290j0823N169J4406k632j5507n60J5869
3234F950N242j4422j1324Q639J3580k041j1048l626O622Q617k842j3101j049J7005
3248G202P220j5749j1018R927J1854l793j0880n44R677N167p816j1423J433J3984
$$ y = [-7299, -14179, 2366, 15010, 5072, -7542, -6371, 1940, 6547, 213, -10671, -6080, 10764, 11251, -8158, -15361, 612, 12476, 3143, -9858, -5049, 8286, 8276, -3220, -9358, -3022, 9693, 11105, -4269, -13015, 1368, 13137, 627, -12628, -3769, 10396, 7223, -6983, -12018, -1892, 8965, 6447, -5010, -8805, 2111, 11062, 428, -13872, -4601, 14399, 11091, -6898, -9846, 1326, 7529, 2306, -6586, -6092, 5699, 10975, -1910, -14641, -7045, 10036, 9575, -7255, -10087, 5110, 10455, -2592, -10586, -3467, 7734, 10318, 1028, -9795, -4626, 9780, 7148, -8359, -8919, 6950, 12192, -2230, -13554, -4915, 8665, 6624, -4424, -8050, -1428, 7189, 4347, -8754, -9803, 7202, 14422, -1327, -12345, -2418, 9436, 5643, -5237, -5781, 3896, 9063, 1247, -10176, -8743, 5241]
3262E241O596j2720j1473R580J3568q263j3943M347J3784L823q715j0020J716
3275f479J1376L895j0688o729R637J1396p791j6366J745J7039L301j3031n980
3288h675O990O977j544q882n220J1060J1874p889j5506K929J4904K968j2786n809
3302h609J0248Q686o911j0315l31R354P146n333j2875J152J4520J189j5129l925
3316a1133J3857Q518q275j2077J446J0785N039p121p354L736J0402N79j3834o648
3330a2080J3726J1466j0173j2059M837R362n69q559m798O865J0501j554j3276
3343f311m532J1453R574p712j2176O404J3880k895j3241k720Q906P134k460r145
3357c841l773R781O790r763j0203P521J2936k569j4409k754J1823O997o992p629
$$ y = [5241, 11837, -883, -12356, -2776, 10792, 2529, -11414, -7067, 6717, 10540, 1825, -8195, -6479, 4897, 8792, -1896, -8625, 1012, 12408, 4617, -11749, -10004, 7035, 10336, -2695, -8675, -1685, 5292, 3748, -5134, -10354, 706, 12580, 4691, -10815, -7886, 7018, 9986, -2800, -8609, 1639, 10325, 3414, -6901, -7232, 2122, 9268, 3935, -8940, -7788, 6732, 7921, -7208, -11133, 2724, 11242, 2967, -9110, -7664, 3121, 8160, 1039, -6315, -2579, 7823, 8402, -5432, -12080, 1646, 13112, 2939, -9120, -4283, 5079, 4510, -4049, -8847, -1982, 8519, 6965, -6311, -10843, 610, 10184, 2472, -9704, -3300, 10580, 7685, -5556, -8276, 630, 7764, 5304, -3841, -7614, 2167, 8957, -806, -11009, -3488, 9448, 6879, -7530, -10284, 1539, 8536, 1544, -6085]
3371f085K374Q459L249q219r414O053J4834k516j5069j872J1351M510q778p250
3385h373N340R769k00r960o338O092J0425q32j1642k030J3550M976j3751p881
3399a0855R089J0526j925q962m273O177O882l821r881N51J1655N088j1980j0340
3413a2069Q640J1654m591j0662K112Q401L189n634q438J305J2066M494j1261q017
3427h811P856J0067n124j1538J477J2127K108r927o966M576P782K217p775o544
3441h475P829R870p259j2204L935J3504K347j0146o776N728Q236k616p984j679
3455e690P828O953n724j2694Q16J3595K751j2123l617R227N820n664q532L45R362
3470B653O518o358r333K217J0018J661j1025m849J0930Q379q478j0335K610Q725
$$ y = [-6085, -3711, 4748, 7997, -222, -9636, -3583, 11251, 8735, -6334, -8206, 3145, 7655, -1123, -8373, -3033, 6736, 6536, -3424, -9762, -3670, 6755, 5923, -5719, -7749, 5801, 10777, -2974, -10855, -1766, 8760, 6835, -2127, -6400, -223, 6659, 2838, -7043, -6492, 5163, 10251, -1729, -12069, -3429, 8225, 3634, -7028, -4916, 3485, 6674, 1040, -7398, -6093, 5973, 10467, -794, -8811, -955, 9112, 3988, -7550, -6073, 6054, 8162, -1765, -8731, -4155, 3627, 5844, -1931, -8475, -646, 9224, 1965, -10239, -6304, 7200, 9547, -599, -7375, -1647, 6589, 3973, -4011, -5690, 2138, 9091, 3367, -9327, -8511, 5084, 7835, -4288, -7905, 1322, 7142, 1478, -7054, -6709, 2653, 9171, 2813, -6520, -4303, 5715, 7376, -3649, -8498, 2432, 10811, 2333, -8002, -5392, 3333]
3484C333K253n749o244K927R167o70j1189k973J1110P739o626j1387L400J0860
3498E951K66r119k508O496O194k450r331m373R838Q297p813r599N124R167j908
3513D232j0279k405R299P167m663q434o22P135N202n962p847N021J2283k992j3189
3528f054j850J0085M646n208o697J328P336J574q151n730O171R714j305j1151
3542e292l045J0768N512q701o203O318P137j055p317n063N500Q923k368j0082
3556d968q03Q885L462q272p392P110R684l127r794j167O392M712k416o664L0R485
3572E157L445j0842o781P805R223k800q986j108P560L158p061n505L333P697K198
3587F493p827p382O260R461m629r390L173R455Q26p610n566M098Q451L95p874
$$ y = [3333, 5586, -163, -6407, -3480, 5687, 5017, -6172, -9145, 1965, 9704, 3078, -8309, -4909, 5951, 6217, -2902, -5410, 1086, 7280, 4830, -4501, -8874, 964, 9261, 1448, -8151, -3027, 6140, 4232, -6047, -8452, 847, 8014, 3351, -5083, -5705, 1430, 6632, 670, -7177, -2156, 10127, 7135, -6054, -7904, 2181, 6827, 1619, -5078, -3750, 3586, 5160, -2991, -8721, -2550, 7164, 5859, -5292, -8337, 2431, 7943, -758, -6961, -643, 6494, 5439, -1878, -6941, -1441, 7482, 5114, -4968, -5771, 3114, 6576, -1696, -9088, -1978, 7706, 4579, -5215, -6382, 10, 4722, 2306, -4358, -4328, 5157, 8602, -2240, -9021, -1216, 8007, 5207, -3779, -4887, 2673, 5831, -1230, -6735, -3402, 4295, 6493, -1334, -8716, -2456, 7005, 2376, -7014, -3841, 5614, 6440, -1170, -6736, -2638, 5813, 6208, -1666]
3602a666l745N582O376l919r707J165J1352J929j0388m600O332N754k387n862
3616c784j242O716N430o067q234K789J0252J773q788n243O920O582n468p468K182
3631c650P247K459n091p623J020R281J624r258k831Q516N061n799q023K290R284
3646D507K028o420m451L628N363n97p395l578Q616P411p603r374L628P982l2o555
3662b842k716N520N631l155p675l19P244N162m787q026K802R113j000r241p81
3677e070P699M033m657o630o01O619M133n827o025M171P247j529r066j704Q829
3692A622N873o171o296K844N574O76m861m224M684P610k576r709j213Q007M000
3707E840n884o040L975O947j572p555j738N633N104j284o880j637P976L518p574
$$ y = [-1666, -5411, 171, 6547, 2628, -7079, -5914, 5438, 7367, -3021, -7621, -1289, 4465, 2078, -3784, -5026, 1690, 7120, 1053, -7181, -4392, 5860, 7633, -1155, -6398, 522, 7104, 1636, -5832, -3650, 3597, 6056, 965, -6658, -5638, 3643, 5267, -3991, -6822, 1694, 6755, 956, -7067, -4777, 4507, 6535, 115, -4336, -708, 4655, 4058, -3337, -6915, 1701, 9112, 1509, -7865, -4237, 3745, 3713, -2842, -5558, -38, 5593, 2438, -5237, -5556, 1688, 6850, 2063, -5963, -3161, 5952, 4952, -4289, -5070, 2629, 6662, 2005, -4625, -5226, 1393, 5526, -301, -6326, -2155, 5092, 3563, -5503, -7207, 1622, 7495, 1324, -4972, -2128, 3446, 4122, -739, -4963, -279, 7331, 4755, -4954, -6167, 1840, 5840, -44, -6084, -2109, 4838, 3266, -4289, -6027, -394, 4710, 3426, -3454, -5091, 2885, 6403, -1171]
3722a171n481O646O867k405p757j801N862M599m037n850J176O380J683o271n914
3737g474N393Q577l030q739P35P012K010m915l922K677O948M86p623m040N003
3752i02O341k064p637r0Q005J522p923l889M914N762l48n621l250M575N426l325
3768A496o741J996Q380J117p420m845N110O334k259o265J96M867K542l662o594
3783e748J052Q408J857p967l995O341M603l268n856J109P096K172n882m809K926
3798a961O205P35n969l800N446N703n506p257L062O738P44n208m063K769N300
3813B938n97n787r98O063M287m748o749J981Q257N72o769k104N277K685k609n503
3829c804q47O088M330n197o152K446O203j74o336j699O368M559m880n792J964
$$ y = [-1171, -6652, -6, 6861, 4456, -3301, -5102, 760, 5359, 1322, -4528, -3352, 3028, 4711, -1560, -7474, -2081, 6496, 3466, -5273, -4538, 2474, 4484, -431, -4353, -1676, 5272, 5758, -1865, -5905, -902, 5439, 3375, -4262, -4352, 3653, 5175, -2748, -6637, -1723, 4039, 3691, -1930, -5180, -605, 4821, 1496, -5245, -3249, 5131, 6248, -1172, -6017, -907, 5427, 3168, -3097, -2901, 1966, 4508, 846, -5748, -4696, 3712, 5569, -2398, -6393, -52, 4551, 1283, -4573, -3464, 3632, 5804, -78, -4887, -1961, 4244, 4979, -990, -4790, 656, 6359, 853, -6404, -3342, 3396, 4140, -1068, -5131, -2362, 2938, 2341, -3446, -4444, 1619, 5906, 1158, -5591, -3610, 4647, 5219, -1550, -3654, 1623, 4308, 1699, -3804, -4651, 1437, 5767, 570, -5582, -3136, 3067, 2893, -3443, -5142, 1226, 5785, 905, -4887, -2923]
3844b923N496J690l483m515K426O580j580p650j328P183L624m525n674J304N636
3859B261O42n121k324L771M835j352o227k077P059M548n631n068M043N129j590
3874B898n336j692M909M684k977o045n49N261K647m594m722L970O657k522o915
3889d326l79N356L207k359m438P90N291J245n987l329M697N703j875o604j109
3904d117N480K816n408l267L077M520l81m697l229L587O090k117n916K51O344
3919C033J387m879l838M026N095j160n826j289L837L092j976m995J57O251J359
3934D274o996l214M822M871j926m253p49M193K663l652l634K208N207Q88n301
3949e99l810L873N269l347n567K102M869N09m146l623J565N537N44n242k068M242
$$ y = [-2923, 2573, 4263, 780, -3735, -1309, 5271, 3691, -3959, -5287, 1896, 5520, 995, -4679, -3375, 2261, 2903, -2218, -4542, -771, 4064, 2712, -3515, -5592, 1467, 6015, 384, -4684, -641, 4488, 2898, -2438, -4130, 779, 5463, 2486, -3559, -4108, 1153, 3800, -794, -5516, -1546, 5111, 2589, -4326, -4705, 651, 3858, 1499, -2939, -2149, 3142, 4387, -1600, -4929, -232, 5471, 3596, -3008, -4117, 1363, 4179, -1229, -4496, -1419, 3101, 2720, -1977, -5206, -1619, 4471, 2354, -3562, -3311, 3033, 4420, -459, -4297, -271, 4824, 3664, -2162, -3451, 386, 3478, 1502, -3493, -3336, 2915, 4274, -2722, -5936, -1114, 3757, 1831, -2422, -3171, 1022, 3685, 33, -3601, -1393, 3814, 4702, -599, -4409, -536, 4733, 1386, -4181, -2079, 2790, 3299, -847, -4470, -2905, 2632, 3176, -2066, -4134, 108]
3965A08L707k963m956J514O359J005n468k966L597K910o90l382k078M213L647
3980D557m058n465K018N735N44n179k304L783L723k593m066J126M300J898l041
3995I78m578J702N415L59n892j138M904K053l425m274P72M690J754l754l105J889
4011a650L870l88m620j356N486L951m533m571K310M359r1l261j777K744L501j795
4027B179n400n45M833K968l645m585K298M599o46n178k24M061K430j642m015k56
4043b768M063K774l860l557L220M084j574n008q69M824K443l422l572J319L137
4058A234N24k574l057L055M511j525n464j6M881J891l132k505J539L810k45m596
4074a669j440L396L238j306m646p05M575J750m898k562L715L386j063l869j136
$$ y = [108, 3815, 852, -4104, -2590, 3769, 4774, -694, -3660, -63, 2847, 2157, -1225, -3303, 910, 4557, 499, -4966, -2948, 2787, 3331, -1848, -4152, -369, 3354, 761, -3305, -2179, 2121, 4019, 978, -3600, -1898, 3517, 3876, -2016, -3154, 1750, 3803, 378, -3896, -3124, 1566, 3320, -434, -3539, -1650, 2220, 1832, -2788, -4144, 1342, 5293, 760, -3811, -1501, 2858, 2767, -494, -2271, 473, 3974, 2179, -3221, -3766, 1067, 4035, 390, -4195, -1897, 2702, 2056, -3122, -3346, 715, 3145, 1503, -2512, -2768, 1295, 4069, 209, -3348, -128, 3956, 2382, -2626, -3495, 1329, 3772, 350, -3222, -1903, 1234, 1758, -816, -3873, -818, 3693, 2168, -3296, -3312, 1569, 3460, 328, -2177, -638, 3172, 2927, -1669, -3109, 287, 3525, 2219, -2427, -3132, 1443, 3193, -1705, -4267, -552, 2834, 1771, -2098, -3234]
4089c234K882L387j678l763O77M148J106l967l264L442M645k101m843N30L065
4104A032J011k101k764M10M382J009m852k456L437L634j259l859J60M649Q37l873
4120f03j982K451K823K79l340k374K399L280k199m013J371M009N08m033k364K387
4136a401L725j046k985l98K978K119k099l710P54M795J132m843j425K994K116
4151B706k119k557o6K872J868k903l351J465L525O32l436j580L265L089k811l602
4167c003K065L140K95k140k143P98L369r6l905p81L407J915k870l536J169L962
4183A646O7l445p28K548J666p28k848r76L772K634k388l859J848L437o96k769
4199h19j347K933K375k534l065J69K593J597j831k803J264L729o58m378j74L785
$$ y = [-3234, -352, 3035, 1357, -2406, -1729, 2419, 3525, -442, -3706, -264, 4381, 2280, -2563, -2033, 1032, 2043, -58, -2822, -2412, 1970, 2979, -1873, -4329, -892, 2742, 1483, -2376, -2216, 2433, 3270, -603, -2585, -134, 2689, 2968, -372, -2746, -347, 2933, 734, -3279, -1908, 2101, 2609, -1424, -3788, -1401, 2324, 1278, -1707, -2105, 873, 2992, 893, -2817, -2063, 2732, 3864, -979, -2404, 590, 2706, 587, -1970, -2036, 836, 2704, -199, -3550, -2085, 1440, 2072, -1364, -2944, 321, 3410, 599, -3003, -938, 2202, 2497, 357, -1786, -988, 2381, 2285, -1620, -2401, 1006, 2921, 51, -3485, -2316, 1646, 1713, -1732, -2460, 88, 1754, 1026, -1822, -2798, 974, 3608, 1220, -2639, -791, 2646, 1950, -819, -2166, 767, 3142, 608, -2457, -2288, 305, 1902, 71, -2732, -1468, 2261, 1603, -2775, -2949, 836]
4215H36J843j724k445K11K712J202k438k128K057K851j135l628j381L891K013
4230B737l052k793K256K342o96k096j280K071K909n82l764P3L008J557k338k515
4246b163J976L221p82l987m95K777J218p65k443o01K607J445l215k316K833K913
4262B223p65k934l16K518J419j907j669J055K075Q05k736k292J655L336r73l478
4278a984L82K766J52j955j999J058L165k90k183j474J996K206n22k681j52L798
4294B283P32l440j679K259J792q17j968r26J778J617j552k672Q38K938P57k780
4310h40k018K198K718j352k273Q15K257M83j422k241M47K980P70k920j617K386
4326C71J456j226k555J28K683Q31k326j830J554J575K53j738j126K184K474j870
$$ y = [836, 2679, 955, -1490, -1279, 1433, 2635, 197, -1931, 126, 2977, 1842, -1786, -3167, 724, 2737, -315, -3108, -852, 1490, 794, -1302, -2582, -511, 2398, 1816, -1948, -1875, 1133, 2690, 352, -2163, -187, 3034, 2252, -1735, -2230, 547, 1765, 1000, -1443, -2044, 563, 2008, -1207, -3523, -690, 2223, 1458, -1476, -1792, 726, 2145, 238, -1431, -376, 1699, 2504, -232, -2524, -869, 2467, 1494, -1984, -1602, 1164, 1316, -639, -2638, -1580, 1585, 1295, -888, -2362, -366, 1840, 1318, -1363, -1515, 2283, 3015, -425, -2104, 155, 1947, 1130, -838, -1764, 14, 1631, 79, -2593, -1755, 1183, 1940, -840, -2858, -660, 2058, 706, -1567, -752, 1505, 1988, 566, -1675, -1228, 1752, 2522, -398, -2015, 371, 1827, 601, -1954, -1826, 857, 1688, -638, -2468, -914, 661, 914, -824, -1950, 234, 2708, 838]
4342H38k745R92K728J62k062q73Q79J800q41k288k58J726J560j162k823L39L107
4359A079L40k729p15K326J305r42j603n03K032K029j623k242P76K233m69k277
4375i83q60J921K015j841k317N23J740N80j206j439P89K695l6l106k37K395J644
4392B277j343k076O99K108Pk089q51J044J412N9k351q58J739J996k213j908J998
4409c50J447k90j647r47J555J989n42j881J9J306J021j176j749N80K657l71k965
4426a344l81J709P45r77r95j83K081O12k141j304J188K479l03j907q58K391J265
4443B077j896j426J461J165j13j015j274K10K254q83k186J83J948O44j696j441
4459a988J001K165l57j603n39J794Q65l98j555m06K165J143k393j483J257J833
$$ y = [838, -1907, -915, 1813, 1975, -87, -960, -81, 1719, 878, -1410, -1668, 58, 1618, 456, -2367, -2028, 1079, 1419, -1310, -2025, 301, 1606, 664, -939, -1442, 590, 2619, 996, -1246, -470, 1763, 1294, -983, -1843, 78, 2093, 252, -2065, -1542, 198, 778, -428, -1867, -1078, 1617, 1581, -1525, -1762, 633, 2277, 934, -1142, -443, 1665, 1672, -417, -1268, -224, 1188, 1247, -1104, -1962, -223, 1773, -440, -2348, -350, 1097, 807, -840, -1787, -232, 1757, 1215, -666, -647, 659, 1680, 504, -1245, -665, 1992, 1621, -1344, -1725, -16, 729, -248, -1243, -1426, 655, 1267, -874, -2178, -990, 1489, 1186, -721, -1579, 812, 2077, 181, -1245, 216, 1381, 1268, 253, -1021, -811, 1443, 560, -1626, -1443, 505, 1149, -547, -1988, -987, 1178, 821, -782, -1321, 473, 1338, 940, -615, -1021, 1144, 2287, -106, -1589, -332, 1501]
4475A501j015j488l52J517J002j501j272J40J693R63j168j644Q08K418p17j999
4491a114M09J906M17j037j177k2J481M27j466j159J040J317m65k225j97K299Q56
4508A290j822p37R80O66M7q03o25J244J722q45k334N53J656M99j700q32R72J634
4526A565j114j500n65J522O00k72j570m8J960O34j691r36J678J105l98j498j95
4543g23J389O67q80p44K51P09L99j395j579J456J862r36j985N03J370o7n85r29
4561a217N05J643J23j246q21J361J167m90j398k27J593N55k215l19P92Q09Q1j353
4579f57m68P95J095q61j416P50J626Kj083r98J072J589p09j074K77P74L53m94
4597E73j335j47J925j8j631q78J242R00p86r99QJ529N53j196p12M21J284M37r18
$$ y = [1501, 486, -1002, -1354, 163, 1165, -336, -1608, -1468, 225, 1188, 20, -1624, -816, 1602, 885, -1114, -705, 1201, 1618, 581, -596, -618, 863, 1290, -176, -1335, -295, 1022, 557, -1668, -1865, 434, 1290, -532, -1269, -289, 377, 424, -379, -1004, 240, 1962, 1117, -1217, -664, 992, 1491, -209, -1041, -69, 1565, 451, -1049, -1614, -92, 508, 236, -1334, -1382, 578, 1212, -479, -1415, 263, 1368, 970, -528, -723, 666, 1333, 453, -291, -40, 669, 1068, -327, -1906, -450, 1412, 476, -1509, -1006, 364, 297, -288, -1217, -712, 931, 1054, -192, -1013, 348, 1515, 1025, -373, -600, 993, 1548, -667, -986, -194, 615, 696, -657, -1125, -330, 765, -96, -1512, -762, 864, 866, -217, -1215, -143, 1446, 737, -337, -60, 714, 1067, 573, -762, -909, 1016, 998, -633, -1511, -269, 631, -155, -1154, -1146, 383, 936, -260, -972, -551, 733, 1170, 252]
4616B52j210J544J256j555j282Q48R05Qq42r15L86Q05K69j475l62J308Q83p49
4634G4j640M48K230l9j639J17Q35N83J22r62j019J258J143j013j442L93J073J36
4652F58j174q14R17R26m76o95l44R22P47k9j176o1J434M92j566l08J356O18m04
4671A023j428k43J075J93q37o18J77R29K11j040j332J586J228q23j304Q33J011
4688F41K01o04q55J076P88Lj399m23N50J002n68j559K70J693j45j497m1N51N86
4707B70M04j361j41R44J145j245j051O76J320L65j297q10J040R54r00p94K7N08
4725E4L15k53j733M74J595J67j399j73P39Q28n06r13L87J337J15p47p75J13J422
4744A047P1j412p46J548N35j299p84K18R84L01r97o91O07R47K14j582K63R58J122
$$ y = [252, -958, 586, 1842, 287, -995, -147, 758, 766, -76, -991, -605, 200, 469, -1006, -1368, -60, 823, 74, -1566, -1118, 1112, 1073, -566, -449, 386, 969, 1091, 129, -890, 368, 1511, 498, -944, -551, 522, 658, -516, -1330, -413, 513, 37, -658, -1002, -80, 667, 638, -538, -599, 835, 1327, -239, -547, 809, 1427, 1023, -405, -648, 427, 620, -217, -835, -658, 271, 482, -558, -1890, -304, 924, 101, -1203, -370, 641, 842, 238, -617, 459, 1247, 1250, -149, -572, -22, 980, 412, -1147, -877, 816, 671, -826, -867, -316, 270, 674, -687, -828, 116, 1261, 16, -1035, -359, 961, 1326, 29, -781, 259, 1213, 313, -481, -454, 54, 369, 116, -1617, -1143, 452, 619, -780, -953, -214, 614, 108, -805, -418, 919, 1034, 287, -488, -375, 1047, 1118, -294, -1040, 508, 1043, -256, -1040, -822, 162, 463, -534, -1225, -618, 329, 543, -1039, -776, 182, 1304]
4763A304n97j557O98J477m18r26n73J164L77l43j406k41J063Q41j133j150O36
4780g84J199O6j223n53J304J079o47p98k33J142O72m86j267L95J596m29j737k94
4798i98J369M50n73j331L55Q50K01j001n62N79J351J73j130q96J581Q57r95o15
4816c35J07R68O26j204j187Q18J109k76j295l99J040P29q34j242P02J407l57p28
4834c51m93R00P49p2j195j29J585N91j313j297N98J395K10j511r08J277N90q91
4852b65p37J71O02J131j057j550Q81J620Nj173j57J019R80q93j472N42J293M3
4870I83q57p55M14Q80k7j707m09J574R12j312r02L13J167J81r48n81J271J134
4888A331m40j233k85J222R54q35j596P04J553q07j194m30Q16J118m72j483k4J274
$$ y = [1304, 707, -850, -152, 1325, 907, -19, -592, 572, 949, 606, -800, -1041, 22, 863, -270, -1420, -784, 415, 481, -742, -1295, 9, 1088, 441, -357, -590, 552, 1224, 738, -529, -134, 1462, 1033, -704, -998, 371, 821, 248, -1083, -728, 122, 323, -678, -1240, -661, 690, 863, -267, -1163, 418, 1275, 280, -335, -228, 740, 1366, 162, -1025, -207, 902, 626, -669, -1068, -28, 701, -133, -1375, -673, 734, 377, -351, -844, 56, 805, 733, -462, -591, 994, 1585, 272, -1025, -427, 968, 1178, -333, -1241, 36, 626, -265, -1002, -831, -229, 902, -155, -1705, -824, 796, 801, -372, -529, 490, 1470, 577, -895, -353, 940, 983, 126, -629, -215, 665, 638, -1069, -1478, 96, 1008, -304, -1206, -893, 274, 455, -493, -1074, 197, 1331, 891, -342, -627, 595, 1549, 714, -882, -178, 1375, 568, -626, -1056, -240, 878, 406, -1077, -1101, 173]
4906A73M23j088p14R18J227Q6j933k64J552Q71p83r59J53R74M26j477j168J596
4924A3J166n97j690j76Q53J285q23j137M89J483j25j028p55P66J573O9j739o48
4942a021K265N8j597p26N84J236J84j387p47R14P79o04j151q6J721O41j256j349
4960a542J397J455n62j265q0J177Q86q95j305Q3J504K24j662n32K81J598l02j822
4978a362p9J840M23j288j001N92J587P25j168j243J528R35q40j178J69J107R28
4995A675j558j510P11J398n79p32o69J286J297j089j779K82J805M94j144q34R78
5012C2J104k37j406j35J079J174j102j303PJ609M48j682p43J008J184j041j043
5029a047k18J517R54j116j351O24J529J8j182o24J468J244q11j952p7J742L43
$$ y = [173, 596, -492, -1206, -288, 939, 1025, -908, -1172, 380, 1251, 468, -491, -338, 636, 1062, -415, -1583, 13, 1179, 582, -1108, -1284, -431, 854, 31, -1106, -617, 866, 741, -287, -1042, -276, 1297, 1366, -373, -1021, 1244, 1302, -295, -1021, -437, 799, 983, -404, -1151, -237, 542, -62, -1213, -1299, 422, 1063, -193, -1542, -145, 1310, 748, -517, -597, 580, 1466, 571, -734, -651, 853, 1077, -585, -1117, -836, 762, 460, -1362, -1441, 399, 822, -466, -1467, -875, 712, 1437, 269, -974, 554, 1489, 649, -529, -360, 747, 1675, 117, -1393, -682, 716, 137, -595, -1264, 22, 1319, 230, -1549, -1267, 538, 1032, -112, -946, 32, 1136, 899, -507, -642, 437, 1611, 509, -794, -787, 822, 1270, -412, -1155, -147, 1037, -4, -1047, -1265, 252, 1206, 90, -1261, -637, 892, 910, -272, -896, 572, 1816, 1005, -947, -1024, 718, 1061]
5046A061j123r45K46J771m24j898o21J802J201o89j590K05J711N01j399j035J615
5063C89J339r02j104p54J460J029j028j723P38J678l15j616p13R91J490l56j941
5080a338K24J416K69o81j066P56J783j39j875n82J623J218j056j282J23J448K77
5097A118j174j776J165J474j74j634o57J762R10o81k026J286J852j77j456p91
5113i79P50J787l28j717l71J620P29j682j500R75J682J77j927q95J631J038q33
5130A57j334M21J478Q52j714j513J413J784m44j525k61J338R50j266j567M59J613
5147H41M45j976j129J062J656l59k262K88J978R62j337j418O71J479N08j681r05
5164a177J457J192o38k171K29K006O89j538j791J186J632m63j727m75J453J302
$$ y = [1061, -62, -1007, -761, 1010, 586, -1312, -1933, -131, 1070, 381, -1209, -1004, 707, 1208, -191, -1226, 389, 1728, 826, -278, -1032, 428, 1457, 429, -1294, -556, 1122, 807, -809, -1522, -531, 959, 603, -1338, -1114, 302, 571, -110, -1176, -420, 1363, 1224, -651, -1233, 390, 1608, 552, -730, -607, 841, 1118, -56, -1832, -667, 807, 633, -1001, -1658, 104, 1014, 333, -1693, -407, 1445, 1268, -188, -979, -229, 1558, 1230, -487, -858, 762, 1491, -191, -1691, -716, 966, 1143, -784, -1679, -48, 990, 157, -1177, -756, 722, 1574, -140, -1653, -240, 1544, 1100, -425, -686, 652, 1602, 336, -1231, -772, 841, 1286, -690, -1819, -757, 899, 540, -1722, -1434, 544, 1506, 169, -1249, -578, 901, 1409, -272, -1177, 280, 1472, 834, -1337, -1108, 898, 1587, 49, -1742, -556, 1076, 613, -1114, -1589, -136, 1166]
5180A166r99j601K79K365K44j529r01R25J736q86j772k79K308R05j765j419N23
5197g00J375M62k222p92J683J444r63j908L63J711Q71j280j375Q80J963j62j903
5214e53n87J593J662j209k254Q7K189K37j757q87J073J884p67k134n6J582J542
5231A645j280j515K11K034L96j888j203K294J378j244j683j44J522Q24j279k017
5247a949J316J907q3k514p60J685J545p38j794K4K351J15j515r31P75K449m71
5264A412j838r66K133J070j671j565L28K211L14j973j868J781J716n71j686k94
5280a467J767J591j980j639J279K054J49k175q59J061K016r56j914J33K104K43
5296A407j664j742R87K345k46k168p45J977J149j529j579P54K253N43j867j479
$$ y = [1166, 167, -1434, -1155, 1210, 1454, -75, -976, -51, 1685, 799, -973, -1252, 1056, 1961, 196, -1223, -700, 675, 1137, -1085, -1877, -194, 1250, 287, -1621, -1258, 453, 1324, 44, -1331, -451, 1512, 1350, -553, -1140, 453, 2115, 906, -1348, -1261, 928, 1165, -592, -1479, -406, 1478, 711, -1423, -1479, 103, 1645, 365, -1150, -939, 1095, 1491, -397, -1600, 694, 2072, 828, -855, -999, 523, 1347, 68, -1949, -633, 1274, 1191, -1323, -2083, -398, 1147, 409, -1385, -1361, 990, 1105, -410, -1341, -566, 1883, 1412, -426, -1392, 741, 1811, 140, -1425, -1097, 1114, 1428, -545, -2413, -632, 1084, 513, -1173, -1467, 300, 1891, -89, -1728, -449, 1605, 1754, -421, -1280, -219, 1797, 841, -1073, -940, 1164, 1407, -257, -1999, -1012, 1333, 1087, -1081, -1826, 151, 1300, -229, -1808, -1054, 1199, 1742, -125, -1604]
5312a604J709J362k99k143j42J990J110j717k379J177K083J77k456o72J606J386
5328A188p18k191L71K296R19j920j536J043K112L4k413m87J969J523j535k348
5344a693M83J946O60j688j695J216K094o97k414J09K150J434j921j632O08K198
5360A158N37j958r62J522J630o10k823l9K298R87k005j554J127J661n6k367l60
5377a814J621K224j320k420J55K641N54j952j353K024J749p26k471m96K315J210
5393A941j677k150J128J779J65k279o90J525K059r09k799J95K507J139j950j624
5409a640J220K046j16k390j004K174J937j243k355L14J900N77j930j525J481K180
5425A626m63k635l51J620J744r47k235L63L054k5k362j209K056J943q54k306n72
$$ y = [-1604, 105, 1467, 1168, -975, -1117, 873, 1983, 266, -2113, -936, 1147, 1324, -1132, -1804, -198, 1188, 470, -1721, -1350, 946, 1865, -55, -1591, -548, 1564, 1598, -815, -1302, 667, 2190, 655, -1693, -1210, 736, 1396, -292, -1987, -771, 1323, 626, -1788, -1679, 471, 1905, -16, -1648, -1040, 1158, 1695, -263, -1225, 297, 1927, 1317, -1506, -1545, 753, 1740, -265, -1819, -692, 969, 913, -1454, -1814, -193, 2031, 711, -1709, -1554, 1087, 1641, -311, -1664, 360, 2109, 1383, -1088, -1584, 731, 1941, 264, -1886, -758, 1021, 1186, -1093, -1783, -258, 1801, 892, -1907, -1712, 795, 1934, -16, -1640, -420, 1626, 1510, -880, -1884, 290, 2227, 984, -1371, -1057, 843, 1420, -510, -2035, -554, 1626, 1163, -1472, -1823, -203, 1541, 594, -1641, -1278, 1776, 1751, -611, -1820, 236, 2179, 1325, -981, -1553]
5442a553K358J017k098j697J041K414j14k534j315K107J965j246j808M7K530O54
5458A768k034j520J355K370k10k636n44J998J440j805k011R06K223J20k436j448
5474b464J799K086n27k651N2K567J295k495j575J132K470L88k625j056J922J509
5490A827j150k185L38K338Q88k582j962J230K660j32k529l31J992J504j770k095
5506a959L55K928Q61k288j444J509J890n94k663k27K817J105k104k001O58K463
5522A306J6k198j050J572K354j658k514L85K821J114k142k182J784K320n32k074
5538f78r29K288J731j705k767R8L261L92k346j285J415K286j117k798J60K698
5554G04J488j597k289O01K393N02k308j193J993K566j432l136j6K690J025k135
$$ y = [-1553, 805, 1822, -276, -1973, -932, 1482, 1368, -1166, -2481, -374, 1591, 345, -1463, -1416, 1114, 1768, -266, -1786, -431, 1939, 1729, -907, -1451, 547, 1987, 182, -1829, -923, 1300, 1420, -1016, -2464, -665, 1421, 894, -1757, -1705, 862, 2157, -338, -1913, -781, 1689, 2077, -548, -1604, 318, 1827, 677, -1508, -1170, 1168, 2056, -526, -2488, -1258, 1402, 1270, -1259, -1590, 402, 1906, 136, -1959, -1604, 1324, 2185, -103, -1547, -38, 1852, 1258, -1405, -1632, 1185, 2290, 186, -1815, -1157, 1306, 1322, -876, -1926, -354, 2000, 342, -2172, -1787, 1034, 2148, 6, -2176, -392, 1928, 1396, -678, -1607, 681, 2412, 707, -2060, -1962, 1299, 1691, -655, -1940, -525, 1761, 644, -2154, -1994, 704, 2192, 595, -1694, -1093, 1300, 1802, -506, -1699, 294, 2860, 1428, -1708, -1724, 966, 1991, -144]
5570a44k164J579K271n75k593p70K495K020j328l093R43K322P89k335j323K110
5586B04J787j86l271m04K489J700k121k002O60K450K14k880j000K330K029j297
5602G02k153l38K354J448j929k046J457K814n95k925o54K200K248j630k742O35
5618a154K292M74k231j876J853K334l73k667r56K657J359j519k205J265K457L12
5634B022k625j569K003K467r10k623j88K171J480k375k310J502K825l95k674j146
5650b345K134J877j338k043M48K899L42k301j662J558K793m50k839q87K525J240
5666A951k206j982J097K679N30k963j767J875K359q90k489J43K919R10k288k443
5682b565J597L003l5k480r94K040J600j656k490K50L101J230l127j887J434K459
$$ y = [-144, -2308, -729, 1542, 967, -1626, -2396, 99, 2119, 791, -2302, -1359, 963, 1752, -583, -1906, 204, 1991, 1805, -1466, -1870, 619, 2319, 198, -1804, -1144, 1306, 1520, -1360, -2360, -30, 1999, 702, -1451, -1789, 565, 2013, 84, -1962, -505, 2309, 1714, -1211, -1865, 335, 2583, 953, -1789, -1154, 1138, 1612, -619, -2495, -642, 1692, 1319, -1348, -2304, 353, 1712, 193, -2012, -747, 1710, 2022, -603, -2172, -169, 2298, 1388, -1235, -1423, 748, 2228, -147, -2457, -955, 1870, 1475, -1199, -2345, -211, 1666, 328, -1715, -1267, 1632, 1974, -327, -1989, -431, 2362, 1912, -927, -1814, 711, 1951, -255, -2237, -1140, 1539, 2069, -894, -2661, -786, 1573, 683, -1806, -1663, 1256, 2166, -122, -2565, -968, 2035, 2000, -480, -1474, 566, 2166, 510, -1980, -1730, 1371, 2601, -526, -2413, -979, 1480]
5698A480k34k773l40K201J933k233k256R24K971N61k437j668J779K312j146k603
5714a529o7K501J236j939k508Q87K986Nk752p58J837K368j565l237P59L149J019
5731B392k491j884J634K564o51k821o12K549K186k001l140R34K524N23k746j331
5747b371K201K178j460k603p1K528J805j797k466J216K736r4k679j218K688J919
5763B512j477k857Q7K829R42j989j998J323K473o14k910r13K926J784j625k463
5779a970O80K635N56k533j388J838K349p26k979n68K811J774k455k219J101L003
5795A909j72l402j132K485K418j164k784K02K481J308k794j398J433L155m74l231
5811a160j067K514K232j736k459K49K761K88k421k001J925L010j078k645o89K728
$$ y = [1480, 1246, -1527, -1867, 334, 2267, 34, -2222, -1298, 1673, 2234, -203, -1871, -92, 2220, 1074, -1529, -1596, 905, 2141, 202, -2306, -1419, 1567, 1572, -1180, -1938, -101, 2267, 702, -2535, -1776, 1373, 2392, -99, -1983, -349, 2215, 1564, -1257, -1869, 680, 2866, 865, -2275, -1341, 1183, 1706, -1040, -2371, -170, 2008, 548, -2055, -2126, 402, 2207, 410, -2056, -840, 1896, 1802, -877, -2095, 593, 2512, 1035, -1822, -1735, 1094, 2036, 47, -1951, -628, 1845, 1231, -1679, -2592, 334, 2118, 493, -1970, -1290, 1345, 1901, -632, -2020, -182, 2167, 1441, -1538, -2106, 705, 2479, 24, -2195, -1094, 1909, 1737, -1665, -2797, -312, 2106, 942, -1842, -1640, 841, 2149, -645, -2043, -610, 2545, 2071, -1160, -2227, 287, 2519, 783, -1676, -1427, 1334, 1622, -799, -2800, -875, 2135, 1057, -1588, -2277, 451]
5827D51J655k237j901J057L196p5k973j229K068K233r92k589j38K967O71k481
5843c17k352J775K943o24k541j450K649J762j418k427N27K918R69k796k070J927
5859e25K818o14l047l39K548J518k129k648P34L210M96k983j389K091K050j033
5875G58l019N04L007J215k368k505J502K755L93k993j082K451K018k138k825O06
5891a721L274P35k755k159J634K793q73k842k52K436J862j791k746J019L018N66
5907B198k700j624K421K243j578k768m1L060J283k284k322Q12K825ol033q84K651
5924B53K408k136l040O14L155J176k507j948J628K801q08l353n11K990J994k165
5940E51l071J134K914Q6k599j725K571K181r54l133l32K859J904k234k290J289
$$ y = [451, 2106, -131, -2032, -975, 2221, 2146, -827, -2056, 12, 2245, 1253, -1336, -1474, 1493, 2164, -317, -2669, -894, 2049, 1425, -1116, -2566, 83, 1845, 427, -2000, -1473, 1445, 2414, -382, -2452, -525, 2293, 1679, -1368, -1707, 841, 2359, 230, -2418, -1684, 1526, 2022, -961, -2350, -259, 1791, 758, -2261, -1757, 1250, 2465, 97, -2408, -906, 1849, 2242, -751, -1833, 618, 2636, 498, -2327, -1721, 1553, 2288, -467, -2626, -992, 1801, 928, -1914, -2166, 270, 2132, 341, -2405, -1386, 1632, 2198, -502, -2126, 295, 2538, 960, -1808, -1849, 1211, 2494, 210, -2112, -1300, 1525, 1519, -1514, -2398, 253, 2661, 525, -2515, -1901, 1254, 2430, -77, -2025, -397, 2404, 1596, -1757, -2268, 722, 2716, 551, -2520, -1386, 1528, 1614, -985, -2710, -139, 2042, 1088, -2045, -2377, 482, 2386, 152, -2138, -849]
5956h49K638J93l203j160K892K398j640l082M1K986Q34k399j960J583L176j017
5972A431l418n76L033J666j524k702P73L135Q7k944j341K491K684j186l040o86
5988b117K886J659k316k376J540K485j58k539j937K692K325q23l419L70L023Q11
6004B106k510k124J965L121n97l281q07K578J849j592k745J060K819L17l197j821
6020b859K158K759o72k949m79K762J244j909k576J634K667K47k853j471J979K925
6036B607j359l044M46K811J022k854k186J605K883j07k971j102K386J761j283
6051F15k937P78L426Q05k991k087J954K637p69k623n30K788J277k162k884J380
6067a323L063L37l119j408K292K482j692k828L52L298R37k285k463J486K671o
$$ y = [-849, 1789, 1982, -1221, -2381, 511, 2909, 1269, -1813, -1772, 1214, 2048, -351, -2311, -728, 2448, 1431, -1987, -2563, 470, 2136, 612, -2090, -1317, 1818, 1905, -1039, -2380, 111, 2795, 1609, -1431, -2117, 769, 2428, 112, -2264, -724, 1761, 1603, -936, -2873, -181, 2144, 1321, -2098, -1728, 1295, 2106, -404, -2528, -563, 2558, 1961, -1320, -2127, 451, 2300, 708, -2037, -977, 1842, 2159, -1038, -2859, -701, 2058, 1386, -1563, -2042, 720, 1964, 55, -2521, -887, 1780, 2027, -826, -2297, -318, 2607, 1248, -1796, -1350, 1461, 2483, -371, -2557, -952, 1931, 1824, -1147, -2249, 137, 1898, 615, -2322, -1544, 1882, 2687, -304, -2391, -437, 2200, 1431, -1192, -1722, 1066, 2343, 181, -2703, -1323, 1740, 2077, -1042, -2450, -158, 2324, 632, -2196, -1844, 1454, 2391, 106, -2357, -871, 1800, 1794]
6083A794k996r98L136J741k088k915N97L202Q28k839j719J553K499q50k839l97
6099b291K951K047k178l298J498K680M93k885j027K202K569j990k670j79L260
6114A182J306k162k643J030K998j26l320p69K910J897j411l049K90L067Q31k691
6130f60j486J991K641n34l382o83L021J570k084k435Q56K560J66k625j417K465
6146c6K580j450l274J52L053J080j926k407J449K914k66l241r38K660K411j457
6162A304l018j65L067R07k654k091K053K888o87l312r44K996J923j886k563J292
6178h90K623M90l054j874K907K860j551l212QK733J077k333k319J527L150q9l270
6195a217j405K501K414j570k566J61K973Q35k834j984K592K502m42k905j194K655
$$ y = [1794, -1202, -2200, 936, 2677, 589, -2326, -1729, 1473, 2301, -538, -2257, -704, 1795, 945, -1894, -2291, 660, 2707, 529, -2769, -1271, 1409, 1902, -983, -2010, 192, 2761, 771, -1899, -2078, 1182, 2488, 326, -2317, -1287, 1711, 1585, -1735, -2504, 406, 2303, 892, -2157, -1867, 1200, 2031, -660, -2146, -155, 2486, 1952, -1430, -2113, 908, 2478, 394, -2041, -1185, 1375, 1541, -1084, -2501, -36, 2544, 1094, -2180, -2028, 1025, 2105, 179, -2228, -779, 2135, 1869, -1372, -2310, 350, 2761, 1304, -1714, -1879, 1188, 2095, -559, -2650, -597, 2291, 1604, -1708, -2652, 344, 2267, 381, -2182, -890, 1733, 2223, -831, -2705, 202, 3062, 1511, -1701, -1693, 1040, 2117, -216, -2535, -1008, 2142, 2053, -1217, -2622, -121, 2293, 723, -1843, -1682, 1291, 2126, -708, -2692, -100, 2402, 1960, -945, -2139, 516]
6211E16J996k194k499R24K777O57l202j895K441K664j276k777j30K962J455k595
6227a76k378J401L331K9l107j366K519K559j941l021O72L043R49l088k250J617
6243a207K875K8l147j039L008J953k277k810J180L305N73k886j811J649L096j056
6259A434l165Q1L342R66k861k383J056L418j49l168q29K274K212j720l165M28
6275b229L358J571k594k517J508K828l54k879q49L045K158k517k995R41K807J005
6291B287k749k004K020K530j075l254q8L170J702k187k877J226L316J37k973j187
6307b006K605K157j630l034k94L469J129k620k205J735K727o90l135j039L138
6322C07K375j937k984M92L204Q27k592k084K179K917j080l435m84L343J450k136
$$ y = [516, 2512, 318, -2181, -1257, 1520, 2177, -1025, -2920, -479, 2185, 909, -1868, -1998, 964, 2419, -176, -2554, -1153, 2178, 2207, -900, -2266, 253, 2812, 871, -2150, -1478, 1565, 2514, -574, -2824, -1207, 1668, 1696, -1451, -2490, 518, 2471, 194, -2616, -1436, 1869, 2442, -444, -2255, -606, 2490, 1434, -1731, -1650, 1692, 2658, -203, -2586, -1530, 1888, 1739, -1429, -2258, 16, 2228, 508, -2657, -2229, 1129, 2700, 106, -2411, -903, 1925, 1571, -1308, -2157, 888, 3046, 529, -2466, -1525, 1282, 2287, -462, -2466, -446, 2084, 1009, -2245, -2333, 837, 2539, 352, -2525, -1299, 2017, 2154, -819, -2006, 599, 2756, 1126, -1908, -2202, 1267, 2396, -224, -2429, -694, 2033, 1343, -1792, -2831, 307, 2682, 745, -2239, -1747, 1457, 2284, -308, -2392, -213, 2704, 1624, -1811, -2295, 1048, 2498, 362]
6338C62k263N30L042lk983j183K631K447j765k888j62L253J241k566k297K043
6354e61K993n62l144j349L037K497j936l211P22L046N63l026j750K129L142j005
6370A585l466p33L344J514j786k857J126L294K79l370j721K722K679j452k800
6385a642j66K952J547l096k320J964L129k69l528j360K767K226j724k777R72K984
6401A659O94l002k112K220K867n86k952q13K949J534k161k641J205L234K48l389
6417a046j731K132K515j035k689n1K955J620k977k598J946L390l51l044j302K830
6433E64K251k006k988M92L022J154k891k442J768L160n14l464m44L169J621k366
6449H6k899J309L433N26l299j356K168K556j224l233L9L168J586k999k838J872
$$ y = [362, -1901, -1371, 1671, 1668, -1315, -2498, 133, 2580, 815, -2073, -2235, 1018, 2259, -307, -2604, -561, 2432, 1870, -1274, -2623, 414, 2911, 975, -2236, -1514, 1532, 2095, -931, -2681, -552, 2590, 1585, -1881, -2614, 730, 2244, 458, -2399, -1273, 2021, 2300, -1070, -2791, -69, 2610, 1158, -1642, -1808, 1144, 2691, -405, -2725, -761, 2368, 2099, -1429, -2789, -22, 2204, 480, -2297, -1325, 1659, 2353, -649, -2761, -541, 2326, 1740, -1212, -2025, 924, 2458, 297, -2344, -1139, 2095, 2343, -1046, -2777, -645, 1870, 835, -1854, -1905, 1050, 2670, -307, -2905, -959, 2431, 2080, -964, -2266, 564, 2815, 809, -2179, -1687, 1335, 2489, -402, -2844, -1076, 2084, 1570, -1894, -2338, 831, 2452, 86, -2813, -1504, 1929, 2455, -844, -2200, -32, 2524, 1300, -1933, -1894, 1274, 2860, -139, -2977, -1105]
6465a105K956j81k754j333K881K044k142k909Q23L201J026k582k320J964K894
6480B463j059l161m89L306J810k313k963P20L217N03l031j826K596K494j232l384
6496b349K66L068J834k823k397J259L443m38l028j167L237J891j819l239L89L352
6512A479Q95k679k162J871K938p18l950k28K905K193j875k966O17L211P16l000
6528g53j742K771K591j374l164n13K960J640k333k477J402L024l00l460j413L035
6544a06K819j755l136Q4L457Q75k825j698J726L241p62l417j085L353J844j676
6560I39l132R39K939M06l155j895K613L086j047l776k00L026J536k462k643J926
6576i00L350K2l468j574K353K932j514k982K11L397M46k972k164K024L227l64
$$ y = [-1105, 1851, 1670, -1084, -2417, 464, 2508, 366, -2543, -1720, 1481, 2507, -75, -2395, -431, 2463, 1404, -1757, -2246, 1060, 2870, 557, -2406, -1686, 1531, 2034, -997, -2823, -227, 2267, 1035, -2349, -2083, 985, 2819, -4, -2401, -1142, 2301, 1863, -1165, -2332, 905, 2796, 977, -2262, -1873, 1479, 2374, -305, -2467, -596, 2342, 1624, -2326, -2554, 351, 2544, 669, -2297, -1680, 1531, 2247, -753, -2495, 276, 2867, 1493, -1671, -2184, 776, 2416, 83, -2394, -992, 2032, 1732, -1728, -3141, -106, 2713, 958, -2178, -2094, 1363, 2238, -587, -2285, -559, 2682, 1920, -1497, -2582, 771, 2615, 939, -2193, -1254, 1685, 2091, -1064, -2959, -346, 2740, 1693, -2083, -2283, 743, 2279, -183, -2826, -900, 2450, 2472, -996, -2570, -217, 2715, 1201, -1781, -1570, 1827, 2273, -699, -2863, -839, 2388, 2024]
6592B024l496j096K852J901j850k808R17L276Q01l157k136K305L133j059l107
6607a500o38L222J564k502k795J586L083J47l431j353K344K482j365l239O59L107
6623A371J241l160k348J922L259l96l096p22K810J965k292l033O30L623J160l857
6639i23k011K366K787j332l037l52L307J945k481l025J371L223O44l255j397K196
6655B6K765j834l255J95L769J022k610k425J203L061l79l254r68L053K408k195
6671E82l129L77L730J184l212j778K261K939j519l449r5L069J870j936l535J056
6687a585L135M37l235j569K881K654j587l674m7L619J361k456k255J432L323l21
6703B113l397j225L219K256j857l206K63L140J058l070j882K269K532n07l790
$$ y = [2024, -1472, -2568, 284, 2185, 335, -2473, -1556, 1720, 2521, -636, -2772, -467, 2666, 1607, -1500, -2138, 1084, 2648, 146, -2649, -1063, 2020, 2167, -1264, -2617, -273, 2209, 844, -2395, -1736, 1371, 2612, -548, -2896, -974, 2285, 1889, -1207, -1929, 881, 2846, 554, -2479, -1849, 1774, 2934, -923, -2934, -568, 2219, 887, -2150, -2502, 805, 2750, 269, -2756, -1385, 1838, 2482, -773, -2170, 26, 2791, 957, -2298, -2103, 1666, 2688, 78, -2347, -1144, 1917, 1538, -1716, -2684, 369, 2777, 582, -2547, -2170, 1560, 2744, -468, -2246, 15, 2954, 1435, -2014, -2109, 960, 2830, 894, -2641, -1585, 1550, 1987, -1248, -2817, 64, 2718, 1131, -2543, -2590, 1029, 2390, -66, -2321, -889, 2434, 2113, -1284, -2509, 710, 2966, 1109, -2097, -1834, 1306, 2364, -706, -2588, -319, 2213, 1706, -2084]
6718b084m70L065K489k362l032R29L467Q3l462j067K605K614j044l806k26L002
6734G01J802k618k551J988L073p23l429j240L134K511j786l059M63L025Q07k730
6750f32k204K446L291p77l675q33L076J920k216k983J302L332L57l516j927K293
6766g46L361j115l478j65L026J302k604k129J328L800l65l535j334K925K407j563
6782A115l152J06L754R64l407k314J974L358o56l170r07K906J956k339k960J544
6798a228L213O75l119k398K381K840q35l413L6L025J641k865k950J611L390J99
6814B203l323j898K818K582j853l120O33L505J319l364k238J829L343m21l277
6829a262j048L002K238k363l332J264L365P67l026k266K135K692j190l150L0L103
$$ y = [-2084, -2554, 511, 3000, 638, -2394, -1465, 2002, 2085, -1377, -2444, 161, 2775, 1731, -2075, -2301, 701, 2503, -115, -2666, -678, 2395, 1672, -1757, -2997, 137, 2648, 862, -2197, -1734, 1291, 2098, -632, -2836, -390, 2901, 2124, -1551, -2384, 692, 2612, 396, -2587, -1285, 2047, 2404, -1112, -3039, -746, 2615, 1500, -1978, -2143, 883, 2185, -419, -2548, -1220, 2580, 2215, -1320, -2654, 271, 2678, 1115, -2037, -1931, 1823, 2787, -620, -2934, -960, 2398, 1742, -1428, -2335, 571, 2527, 188, -2772, -1228, 1985, 2660, -459, -2857, -476, 2364, 1529, -1884, -1848, 1177, 2818, -47, -2997, -1386, 2004, 2203, -1120, -3018, -200, 2382, 529, -2591, -1958, 1547, 2866, -498, -2736, -907, 2436, 2015, -1262, -2310, 692, 2930, 567, -2765, -1501, 1864, 2631, -395, -2661, -526, 2166, 976, -2174, -2144, 959]
6845I59J662k477k948J346L350L85l262j181K478K611k054l196L85L519J461l083
6861d5k673J785K728m11l272q47L433K271k356l526R14L928N93l067k221K380
6877c86L296j413l741m8L650J640k868k489R85L379j02l395j275L104K460j952
6893H45l239Q4L441J171k248k476J660K951m34l346r83L263K250k077l321R69
6909a490L315M17l178j903K130L218q10l648p90L444K004k607k465J067L387M4
6925B135l497j200K870K505j474l328o2L308J347k894k722K057L814q59l783j180
6941b963K855K836j926l252P00L918K55l244k232K598L348r71l685n40L257J865
6957B819k494k725J259L066N85l811j718K498L274j604l326j5L548J183l087k423
$$ y = [959, 2621, 144, -2804, -1458, 1892, 2277, -985, -2166, 312, 2923, 869, -2327, -1942, 1577, 3038, -45, -2718, -933, 1795, 1384, -1888, -2735, 698, 2969, 613, -2913, -1999, 1929, 2522, -545, -2766, -386, 2910, 1497, -2244, -2292, 1358, 2998, 130, -2359, -1374, 2005, 1903, -1492, -2767, 337, 2797, 845, -2394, -2310, 1131, 2302, 54, -2422, -762, 2189, 1755, -1591, -2574, 689, 2939, 862, -2459, -1490, 1825, 2242, -936, -2839, -709, 2509, 1699, -1949, -2739, 705, 2709, 102, -2363, -1296, 2091, 2135, -1362, -2562, 308, 2813, 1339, -1989, -2051, 1257, 2604, -290, -3012, -955, 2859, 2000, -1783, -2963, -108, 2728, 802, -2450, -1750, 2168, 2423, -821, -3053, -455, 2893, 1922, -1763, -2303, 954, 2819, 325, -2400, -1141, 1925, 2510, -1301, -3019, -521, 2753, 1149, -2177, -2192, 1356, 2539, -548, -2971]
6973b971J901L735l87l318j672L072K298j816l229N87L384J140l377k348J733
6988a268L711q01l671l33L024J957k567k558R64L721N02l467j999K596K777j287
7004A301l404J57L491J765l493k878J782L283K59l236j704K865K906k489l519
7019b914Q52L858Q27k817k569J956L245q40l255p46L516K340k934l171Q72L654
7035A874Q83l755j487J954L066j209l823j27L348K213k720l111J561L600j89l344
7051a266j146L050K264j854l709L44L953J056k715k602J744L274r79l452q00L515
7067F77K238k239l377Q26L621M76l151j841K968L080j752l712k63L571J900k700
7083C22l165J786L199l26l518j139L190K340j560l592J79L439J192k749k308K276
$$ y = [-2971, -1070, 2665, 2278, -1040, -2712, 360, 2658, 842, -2387, -1800, 1584, 2724, -653, -3001, -1268, 2443, 1642, -2029, -2362, 662, 2619, 52, -2506, -1542, 2179, 2681, -786, -2785, -189, 2588, 1301, -2103, -1946, 1545, 3310, -183, -3061, -1279, 2004, 2263, -973, -2677, 188, 3094, 605, -2914, -2062, 1796, 2623, -194, -2763, -807, 2438, 1598, -1657, -2403, 1113, 3453, 519, -2652, -1780, 1874, 2757, -998, -2485, -531, 2535, 1326, -2497, -2624, 724, 2937, 217, -2894, -1333, 2267, 2078, -1266, -2412, 638, 2902, 1048, -2661, -2317, 1636, 2692, -23, -2625, -881, 2393, 1414, -2038, -2838, 677, 2915, 676, -2701, -1875, 1746, 2222, -929, -2770, 198, 3278, 1526, -2186, -2449, 1122, 3022, 322, -2843, -1057, 2142, 1816, -1702, -2841, 349, 2689, 1129, -2463, -2284, 1155, 2347, -402, -2710, -434]
7099d34L176p13l675r01L057K525k175l253O02L667N32l288k118K671L292j635
7115A330l304q29L552J724k247k908J617L201ql195j864K926K927j410l663J10
7131b041L842P21l391k097K083L387m79l748j171L348K042j922l072P23L813P39
7147B777l691k102K614L314j089l346l27K757J580k315k980J403L739j27l290
7162a083k266K755L155j595l374J56L914J060l032k560J804L434m2l392j270L056
7178G20K114k209k896O38L630Q76l505k610K448L351j289l219n23K977K241k648
7194I6l175J312L848L26l357j439K492K554j512l593L53L784J222l213k635J521
7210a416L575j63l724r36L027K514k390l437Q37L597J210k867k712K511K681o85
$$ y = [-434, 2742, 2029, -1646, -2547, 510, 3035, 860, -2393, -1791, 1876, 2408, -880, -2998, -327, 2965, 1330, -1974, -2803, 749, 2473, 226, -2682, -1065, 2136, 2128, -1067, -2931, -5, 2922, 1512, -2151, -2041, 1801, 2522, -869, -2966, -883, 2504, 2025, -1723, -2894, 454, 2496, 574, -2498, -1775, 2038, 2777, -914, -3016, -402, 2912, 1823, -1523, -1850, 907, 2487, 172, -2808, -1405, 2334, 2207, -1083, -3349, -594, 2561, 966, -2408, -2252, 1662, 2722, -310, -2870, -1066, 2368, 2326, -1066, -2336, 720, 2834, 625, -2271, -1633, 1997, 2873, -632, -3242, -794, 2557, 1268, -1951, -2474, 503, 2744, 96, -3079, -1767, 2081, 2407, -950, -2389, 103, 2657, 1145, -2448, -2095, 1689, 2911, -302, -2937, -1416, 2159, 1996, -1728, -2664, 363, 2877, 487, -2950, -2113, 1484, 2694, -173, -2885, -374, 2307, 1622]
7226A622l631o7L239J898k382l535J283L487R8l098j533K509K881j803l549q6
7242b667L920J495k602k731J492L510l37l414j109L261K451k079l676K46L756
7257A516J143l274k156K023L207p90l973l57L298K360k376l376J146L376N85l423
7273a071j808K910L106j625l701k14L156K077k704k882J960L328m74l576j369
7288b887K757L140k050l345L16L347J222l047k234K367L053p78l581n30K866K207
7304B823k042l227R44L343O29l527k090K754L509j472l731n86L282K026k537k935
7320b837J775L295l0l625j765L359K826j695l644O78L075J269l179k763K107L966
7336B812r86l476j087L026K234k104l223J399L490O22l508k137K442L255j012
$$ y = [1622, -2009, -2076, 1163, 3061, 679, -2856, -1573, 1914, 2012, -1086, -2619, -110, 2771, 968, -2581, -2667, 1253, 2748, 146, -2585, -1093, 2417, 2080, -1334, -2443, 818, 3269, 1190, -2486, -2240, 1516, 2659, -615, -2771, -748, 2459, 1669, -2304, -2661, 637, 2997, 621, -2755, -1609, 1767, 2352, -1071, -2879, 31, 3137, 1512, -2189, -2403, 753, 2830, 126, -2756, -796, 2532, 2058, -1518, -2887, -130, 3010, 960, -2385, -2069, 1278, 2500, -547, -2781, -414, 2639, 1861, -1720, -2250, 616, 2823, 781, -2446, -1502, 1841, 2470, -1057, -3147, -393, 3116, 1644, -2087, -2673, 609, 2635, 98, -2837, -1062, 2233, 2203, -1422, -3187, 172, 2998, 1303, -2341, -1663, 1412, 2681, -498, -3261, -1154, 2812, 1826, -1650, -2737, 289, 2523, 419, -2804, -1405, 2085, 2707, -801, -2938, -496, 2759, 1747]
7351A747l607k69L356J563k764k693J411L572N8l547j833K831K891j789l371K00
7367b244L901J100k822k927K275L354n34l190j297K882K470k296l205R31L719
7382B117M69l358k020J885L383r54l811l01L840J920l052l194J416L885K64l590
7398a101j541L134K547j985l903Q42L471J856l190l010J732L368n80l413p75K977
7414D29K332k300l184N43L615J279l429j897K270K965j156l314n06L758J960k711
7430F54l562J321L744n6l345j375K875K670k130l236K09L372J460k514l007K088
7446h32L511r19l660o46L273K511j950l840O64L719L77k961j940K382L112j135
7462A666m144o09L766K243k504k988J317L036L00l121j783L076K890j653l358
$$ y = [1747, -1860, -2129, 1227, 2790, 26, -2667, -1256, 2316, 2374, -1173, -3006, -175, 2716, 927, -2444, -2244, 1657, 2757, -65, -2992, -717, 2637, 2103, -1087, -2384, 498, 2968, 672, -2533, -1602, 2117, 2586, -772, -2792, -907, 2476, 1522, -2289, -2590, 1250, 3170, 118, -3076, -1660, 2225, 2489, -1101, -2642, 492, 3039, 1054, -2849, -2007, 1464, 3320, 130, -2880, -1148, 2220, 1640, -1773, -2548, 429, 2761, 461, -2723, -2180, 1435, 2714, -715, -2612, -342, 2623, 1467, -1847, -2353, 1405, 3365, 654, -2908, -1587, 2157, 2101, -1244, -2619, 256, 2926, 796, -2440, -2231, 1141, 2601, 87, -2920, -832, 2679, 1760, -1900, -2546, 727, 3238, 1288, -2552, -1888, 1831, 2208, -753, -2693, -311, 2801, 1666, -2478, -3087, 679, 2922, 418, -2570, -1253, 1783, 2083, -1038, -2821, 255, 3145, 1492, -1866]
7477a866m82L578J238k411k750J731L365l12l805j221K942K901k274l180P68L532
7493A754O98l463j691K312L312j077l507j037L277K168k099l086J151L461Q6l740
7509a481j546K694L235j923l101J05K901J539k782k170J670L517l47l699j584
7524b972K950K689j693l149O75L214P91l278k203K078L337n85l772o77L065K049
7540B519k465k686J271L548L37l355k287K971K874j195l412Q9L145J533k945k976
7556c034J731L867m9l714j502K833K473j959l175M59L977R61l138k450J973L002
7572B255l02l529n55L256K017k816k877R65L525P38l435k162K421K851j590k923
7588b161l83L636K077l242k775J579L425o1k990j547L061K381k058l545N12L752
$$ y = [-1866, -2348, 1230, 2468, 57, -2693, -962, 2403, 2091, -1714, -2935, 7, 2908, 634, -2546, -1778, 1754, 2452, -1011, -2702, -390, 2922, 1845, -1662, -2699, 578, 2746, 647, -2439, -1288, 2173, 2259, -1481, -3027, -333, 2902, 979, -2122, -2017, 884, 2423, -359, -2529, -859, 2658, 2311, -1388, -2972, -22, 2667, 974, -2175, -1500, 1714, 2505, -773, -2976, -898, 2439, 1854, -1918, -2595, 470, 2519, 54, -2632, -1361, 2187, 2524, -831, -3118, -147, 2727, 1532, -1880, -1791, 1354, 2887, -58, -3034, -1303, 2564, 2515, -1199, -2701, 132, 2605, 646, -2529, -2070, 1907, 2868, -270, -2720, -747, 2255, 1953, -1576, -2131, 1125, 3142, 326, -2551, -1586, 1939, 2677, -758, -2920, -499, 2352, 762, -2161, -2544, 1092, 3169, -73, -2848, -1269, 2156, 2095, -895, -2442, 619, 3000, 942, -2603, -2091, 1661]
7604A661R41k925k192J855K743m97l334r28L334K520k487l462O64L709R41l080
7620e37k134K340L198j391m031N00L260J692k397l005J185L188P9l564j280L018
7636A21K799j681l944M71L801R35k801k337J660L249p0m273o38L286K610k377
7652H11k941M49L389L79k901k070K214L408j311l517o23L436J894k470k916J503
7668a266L558q9l671j047K795K617j544l313r7L283J363l001k116J663L513r93
7684A655l653j041L300K643k425k721N01L188P87l104k270K491L605j200l630
7699a874m98L131K081k736l043J691L614j41l505j782K952K623j105l518j24L623
7715A389J162k927k569J949L691l74l559j405L156K081j971l064R04L531M85l067
$$ y = [1661, 2602, -323, -2515, -660, 2083, 1586, -1748, -2676, 658, 3178, 691, -2771, -2107, 1602, 2543, -537, -2671, -331, 2867, 1476, -2555, -2055, 1205, 2897, 500, -2505, -1320, 1868, 1947, -1617, -2897, 121, 2920, 1239, -2705, -2234, 1567, 2502, -299, -2636, -976, 2273, 2203, -2070, -2708, 578, 3188, 811, -2130, -1681, 1708, 2087, -814, -2884, -670, 2738, 1427, -2090, -2713, 723, 2617, 147, -2769, -1266, 2292, 2203, -1468, -2515, 280, 2897, 1353, -1960, -2057, 1226, 2589, -412, -2528, -865, 2648, 1655, -1998, -3039, 261, 2904, 479, -2242, -1741, 1447, 2234, -870, -3140, -649, 2956, 1756, -1874, -2372, 759, 2840, 104, -2939, -1248, 2366, 2225, -1280, -3062, -110, 2513, 1408, -2110, -2234, 1389, 2551, -376, -2945, -996, 2695, 2321, -1238, -2643, 513, 2594, 623, -2441, -1537, 1994, 2479, -588]
7731e88k544K135L537j044l309m30L144J429k507k880J770L443M52l328k163K613
7747b70K762j206l344L7L780J080l273k471J589L361K74l660j448L118K266k057
7763E38l504J064L725R64l179k552K220L122r44l322j55K900K018k192l176Q07
7779a666L609O97l821j693K760K784j653l376L0L812J660l313k431J294L365P7
7795B135l585j160L172K414k362l257Q23L656P00l022k263K126K836m10l818k99
7811b314K960K515k605l411J056L749L08l323j400K471K862j459l736k00L827
7826A300J684k815k764J631L134k43l534r62K926K627j759l863L95L501J102k890
7842e30k577K474L326q52l557p67L318J941k007l142Q11L737R9l376j723K686
$$ y = [-588, -3132, -997, 2540, 1496, -1813, -2243, 901, 2330, -177, -3057, -1287, 2156, 2608, -720, -2883, -270, 2492, 1286, -2058, -2021, 1759, 2839, -434, -2905, -1316, 2045, 2319, -1341, -2789, 329, 2595, 538, -2966, -1902, 1823, 2787, -392, -2944, -724, 2398, 1454, -1868, -2023, 877, 2895, 703, -2473, -1666, 1943, 2640, -1181, -2874, -114, 2670, 1017, -2359, -2329, 1483, 3143, -170, -2601, -1307, 2058, 2135, -1450, -2610, 562, 2976, 614, -2643, -1820, 1836, 2536, -486, -2749, -623, 2213, 1803, -2015, -2314, 646, 3161, 556, -2855, -1799, 1950, 2258, -1065, -2465, 6, 2868, 1409, -2327, -2527, 1300, 2984, 169, -2595, -964, 2170, 1927, -1607, -2569, 357, 2984, 1225, -2638, -2243, 1258, 2360, -530, -3107, -633, 2693, 1841, -1716, -2483, 835, 2776, 769, -2373, -1562, 2175, 2274, -1102, -2825, -139]
7858a39K607p72l630n78L464J645k597k470J597L397k42l822j198K732L087k028
7874A053l146K35L233J057k879k407K023L429r29l432j079L372J878j593k962
7889b147O17L603J79l114k047K451L272j061l447n00L060J886k694k613J721L300
7905B466k76l326j725K885K574j525l223K63L322J283l206k414J907L481o23l388
7921a525j058L259J934j776l463J341L466N01l298k281K217L190r44l326m43L323
7937A117J425k691k995J672L724n2l326j291K514K344j445l367N07L651J115l098
7953a96k721J731L552p17l162r37L102K061k314l009P37L756N94l190j719J917
7969e15K878r61l534k55L527J924k709l119J178L519K30l274j679L073K316j978
$$ y = [-139, 2468, 1696, -1934, -2512, 952, 2597, 0, -2470, -873, 2524, 2282, -1540, -2738, -6, 3081, 1053, -2093, -1858, 1375, 2432, -447, -2854, -831, 2598, 1669, -1763, -2842, 530, 2408, 815, -2147, -1530, 2073, 2252, -862, -2909, -458, 2814, 1753, -1694, -2194, 866, 2752, 58, -2555, -834, 2466, 2190, -1136, -2861, 24, 2598, 1073, -2150, -1887, 1435, 2718, -488, -2902, -995, 2486, 1863, -1525, -2583, 676, 2610, 834, -2629, -1288, 2178, 2679, -619, -2900, -683, 2507, 1563, -1763, -2206, 1117, 2542, -149, -3144, -1472, 2252, 2200, -1126, -2417, 97, 2441, 996, -2371, -1864, 1787, 2902, -196, -2917, -1186, 2366, 1649, -1513, -2450, 652, 2713, 399, -2610, -1873, 1883, 2477, -713, -2432, -515, 2363, 1402, -2132, -2387, 1140, 3064, 355, -2764, -1586, 1933, 2163, -1111, -2790, 283, 2599, 621]
7985F21k998J46L649J311k739k617J630L510p79l147j191L357K127j968l428L71
8001b145L908Q09l091k091K322K677j090l534n52L576K153k571l188J485L270
8016A938K28l392j304K638K722j338l885L47L336J448k463k898J978L124p61l364
8032a646q66K810K493j784l601N25L215J279l065k309K723K921p13l745r51L240
8048E26K435k358l147J284L234J97l420j482K741L110j920l441k11L430J553l078
8064e47k119J726L475m77l520j275K903K595j874l071N99L423O10l218j890K077
8080e83L105p21l389q72L010J993k444k693J265L127N32l275k077K639L096j261
8096A452l142m95L440J224k517k630J720L346j91l590j392K816K420j775k927
$$ y = [621, -2377, -2231, 1418, 2729, -10, -2627, -997, 2513, 1734, -1413, -2604, 753, 2880, 912, -2516, -2145, 1763, 2572, -519, -2610, -288, 2389, 1299, -2235, -2787, 789, 2942, 371, -2817, -1332, 1938, 2166, -1226, -2530, 108, 2830, 1492, -2393, -2046, 1290, 2738, 275, -2623, -645, 2479, 1718, -1646, -2512, 298, 2791, 1007, -2594, -2069, 1146, 2425, -640, -2949, -226, 2695, 1982, -1763, -2714, 526, 2961, 603, -2544, -1260, 1974, 2171, -1249, -2731, 10, 3120, 1200, -2241, -2452, 978, 2531, -547, -2666, -940, 2535, 2058, -1462, -2737, 166, 2761, 887, -2184, -1585, 1838, 2448, -770, -2660, -583, 2522, 1801, -1588, -2460, 550, 2543, 99, -2594, -1329, 1798, 2330, -945, -3022, -383, 2713, 1452, -1690, -2185, 1255, 2479, -38, -2668, -948, 2398, 2207, -1383, -2775, 41, 2461, 686, -2241]
8111b241L05L918L53k996k142K267K898p63l208o31K949K088k627k717J031L233
8127A717O92l228k245K281L115j134l240LL199J346k400l068J481L664J88l623
8143a252j230K866K206j842l217O98L490R17k778k434J934K736n77k905r31L172
8159H53J689k393k665J111L088P08l169j885K488K918j545l466J44L593J442k638
8175B73k993J460L340l32l024j271K840K453j747l658L63L772J067k698k300J546
$$ y = [-2241, -1936, 1982, 2335, -661, -2803, -536, 2362, 1599, -1609, -2240, 709, 2797, 170, -2547, -1516, 1717, 2409, -819, -3064, -783, 2332, 1198, -2042, -2039, 1160, 2506, 106, -2962, -1481, 2183, 2371, -1252, -2482, 384, 2590, 748, -2469, -1771, 1719, 2636, -142, -2576, -642, 2094, 1517, -1388, -2319, 853, 2542, 149, -2516, -1405, 1683, 2391, -778, -2663, -175, 2743, 1198, -2268, -2124, 1469, 2911, 273, -2720, -1260, 2080, 1748, -1276, -2547, 293, 2746, 999, -2659, -2296, 1476, 2543, -155, -2455, -909]
8191i09
$$ Imaginary data points
##PAGE= N=2
##DATA TABLE= (X++(I..I)), XYDATA
0@%%%%%%Qq%qJ6j6J7k5L2m0N6p2Q2r8J20j42J68j98K36k74L16l66M22m84N54o31
32c35P14q10R15j029J156j296J449j613J792j992K213k450K708k991L301l639
48a907M008m414M864n363N914o522P205p982Q866r878J1055j2452J4130j6192
62h668J8799k2210K6886l3717M4654o4928J14649m54045o33316J078684M31859
73D98647n58044j63863M42552n9958j69361J82546o6362l60005L54360N74369
83F74881l91792o65786L53034M55223m76809l61315N38709K89313l97942j56979
93a39463J59570r9061N0359L39353j67625m83321K46111M69184m05770n09897
103e40560M69605M86326m53438l82480L79334J71002k99140R8440K92084k09347
$$ y = [0, 0, 0, 0, 0, 0, 0, 8, 0, 0, -8, 8, -8, 9, -16, 16, -24, 32, -40, 42, -56, 64, -78, 90, -108, 128, -146, 170, -196, 226, -258, 296, -335, 379, -431, 484, -545, 611, -685, 764, -849, 943, -1049, 1164, -1286, 1422, -1569, 1732, -1907, 2101, -2313, 2551, -2812, 3102, -3420, 3785, -4197, 4669, -5209, 5846, -6606, 7524, -8668, 10131, -12079, 14807, -18910, 25744, -39184, 75465, -378580, -1011896, 66788, 498647, -59397, -223260, 219292, 159334, -10027, 172519, 106157, -253848, 100512, 674881, 283089, -382697, -29663, 425560, -51249, -412564, 126145, 415458, 17516, -139463, 20107, -78954, -28595, 310758, 143133, -340188, -94077, 375107, -30663, -540560, -70955, 415371, -38067, -420547, -41213, 129789, -169351, -70911, 221173, 11826]
113A1826j01040L65817j47147o34929J88452P48839j09964o16470J04874L78227
123A88485k15990k33875K46565J05459j19966K23262J35322m93423k37978N13614
133A11475J37981n25779M0795N87241j18293n75472O5065L59243n5511l6365J94680
$$ y = [11826, -89214, 276603, 129456, -505473, -317021, 431818, 321854, -294616, -189742, 188485, -27505, -261380, -14815, 90644, -29322, 193940, 329262, -164161, -402139, 111475, 249456, -276323, -235528, 351713, 233420, -342052, -276987, 82256, 26745, -9620, 185060]
$$ [...]
##END NTUPLES=NMR FID
##END=
