##TITLE=1H_TG-2235-1
 CDCl3, 8 sc, 
 8.2.2019
##JCAMPDX= 6.0         $$ Bruker NMR JCAMP-DX V2.0
##DATA TYPE= NMR FID
##DATA CLASS= NTUPLES
##ORIGIN= UXNMR, Bruker Analytische Messtechnik GmbH
##OWNER= root
$$ XWIN-NMR		Version 3.5
$$ Fri Feb  8 14:28:44 2019 Russian Standard Time (UT+4h)  she@DPX200
##.OBSERVE FREQUENCY= 200.1313
##.OBSERVE NUCLEUS= ^1H
##.DELAY= (6, 6)
##.ACQUISITION MODE= SIMULTANEOUS
##.ACQUISITION SCHEME= undefined
##.AVERAGES= 8
##.DIGITISER RES= 18
##SPECTROMETER/DATA SYSTEM= spect
##.PULSE SEQUENCE= zg30
##.SOLVENT NAME= CDCl3
##.SHIFT REFERENCE= (INTERNAL, CDCl3, 0, 15.7039)
##AUDIT TRAIL= $$ (NUMBER, WHEN, WHO, WHERE, WHAT)
$$ ##TITLE= Audit trail, XWIN-NMR		Version 3.5
$$ ##JCAMPDX= 5.01
$$ ##ORIGIN= Bruker BioSpin GmbH
$$ ##OWNER= she
$$ F:/spectra/data/she/nmr/H-F/1/audita.txt
$$ ##AUDIT TRAIL=  $$ (NUMBER, WHEN, WHO, WHERE, WHAT)
(   1,<2019-02-08 14:27:39.15 +0400>,<she>,<DPX200>,
      <created by zg, POWCHK disabled, PULCHK disabled
       configuration hash MD5:
       00 E9 B6 7A A2 85 ED C7 34 08 36 98 17 FE 4E 26
       data hash MD5: 16K
       97 A9 74 6B C4 45 91 5A CF 78 80 2A 7C 5B 15 B8>)
$$ ##END=
$$ 
$$ hash MD5
$$ 4A E7 F0 41 FE 46 4A 04 B4 77 42 40 54 45 AE 25
##$RELAX= 
##$RELAX= 
##$RELAX= 
##$RELAX= 
##$RELAX= 
##$RELAX= 
$$ Bruker specific parameters
$$ --------------------------
##$DU= <F:/spectra>
##$EXPNO= 1
##$NAME= <H-F>
##$PROCNO= 1
##$TYPE= <nmr>
##$USER= <she>
##$AMP= (0..31)
100 100 100 100 100 100 100 100 100 100 100 100 100 100 100 100 100 100 
100 100 100 100 100 100 100 100 100 100 100 100 100 100 
##$AQSEQ= 0
##$AQ_mod= 1
##$AUNM= <au_zg>
##$AUTOPOS= <>
##$BF1= 200.13
##$BF2= 200.13
##$BF3= 200.13
##$BF4= 200.13
##$BF5= 200.13
##$BF6= 200.13
##$BF7= 200.13
##$BF8= 200.13
##$BYTORDA= 1
##$CFDGTYP= 0
##$CFRGTYP= 5
##$CHEMSTR= <none>
##$CNST= (0..31)
1 1 145 1 1 1 1 1 1 1 1 1 1 1 1 1 1 1 1 1 1 1 1 1 1 1 1 1 1 1 1 1 
##$CPDPRG= <>
##$CPDPRG1= <>
##$CPDPRG2= <>
##$CPDPRG3= <>
##$CPDPRG4= <mlev>
##$CPDPRG5= <mlev>
##$CPDPRG6= <mlev>
##$CPDPRG7= <mlev>
##$CPDPRG8= <mlev>
##$CPDPRGB= <>
##$CPDPRGT= <>
##$D= (0..31)
0 1.2 0 0 0 0 0 0 0 0 0 0.03 0 0 0 0 0 0 0 0 0 0 0 0 0 0 0 0 0 0 0 0 
##$DATE= 1549621658
##$DBL= (0..7)
120 120 120 120 120 120 120 120 
##$DBP= (0..7)
150 150 150 150 150 150 150 150 
##$DBP07= 0
##$DBPNAM0= <>
##$DBPNAM1= <>
##$DBPNAM2= <>
##$DBPNAM3= <>
##$DBPNAM4= <>
##$DBPNAM5= <>
##$DBPNAM6= <>
##$DBPNAM7= <>
##$DBPOAL= (0..7)
0.5 0.5 0.5 0.5 0.5 0.5 0.5 0.5 
##$DBPOFFS= (0..7)
0 0 0 0 0 0 0 0 
##$DE= 6
##$DECBNUC= <off>
##$DECIM= 32
##$DECNUC= <off>
##$DECSTAT= 4
##$DIGMOD= 1
##$DIGTYP= 9
##$DL= (0..7)
0 120 120 120 120 120 120 120 
##$DP= (0..7)
150 150 150 150 150 150 150 150 
##$DP07= 0
##$DPNAME0= <>
##$DPNAME1= <>
##$DPNAME2= <>
##$DPNAME3= <>
##$DPNAME4= <>
##$DPNAME5= <>
##$DPNAME6= <>
##$DPNAME7= <>
##$DPOAL= (0..7)
0.5 0.5 0.5 0.5 0.5 0.5 0.5 0.5 
##$DPOFFS= (0..7)
0 0 0 0 0 0 0 0 
##$DQDMODE= 0
##$DR= 18
##$DS= 0
##$DSLIST= <SSSSSSSSSSSSSSS>
##$DSPFIRM= 0
$$ [...]
##$SUBNAM2= <"">
##$SUBNAM3= <"">
##$SUBNAM4= <"">
##$SUBNAM5= <"">
##$SUBNAM6= <"">
##$SUBNAM7= <"">
##$SUBNAM8= <"">
##$SUBNAM9= <"">
##$SW= 20.0189088683792
##$SWIBOX= (0..15)
0 0 2 0 0 0 0 0 0 0 0 0 0 0 0 0 
##$SW_h= 4006.41025641026
##$TD= 16384
##$TD0= 1
##$TE= 0
##$TE2= 300
##$TE3= 300
##$TEG= 300
##$TL= (0..7)
0 120 120 120 120 120 120 120 
##$TP= (0..7)
150 150 150 150 150 150 150 150 
##$TP07= 0
##$TPNAME0= <>
##$TPNAME1= <>
##$TPNAME2= <>
##$TPNAME3= <>
##$TPNAME4= <>
##$TPNAME5= <>
##$TPNAME6= <>
##$TPNAME7= <>
##$TPOAL= (0..7)
0.5 0.5 0.5 0.5 0.5 0.5 0.5 0.5 
##$TPOFFS= (0..7)
0 0 0 0 0 0 0 0 
##$TUNHIN= 0
##$TUNHOUT= 0
##$TUNXOUT= 0
##$USERA1= <user>
##$USERA2= <user>
##$USERA3= <user>
##$USERA4= <user>
##$USERA5= <user>
##$V9= 5
##$VALIST= <valist>
##$VCLIST= <CCCCCCCCCCCCCCC>
##$VD= 0
##$VDLIST= <DDDDDDDDDDDDDDD>
##$VPLIST= <PPPPPPPPPPPPPPP>
##$VTLIST= <TTTTTTTTTTTTTTT>
##$WBST= 1024
##$WBSW= 4
##$XGAIN= (0..3)
0 0 0 0 
##$XL= 0
##$YL= 0
##$YMAX_a= 769951
##$YMIN_a= -1079964
##$ZGOPTNS= <>
##$ZL1= 120
##$ZL2= 120
##$ZL3= 120
##$ZL4= 120
##$ABSF1= 10
##$ABSF2= 0
##$ABSG= 5
##$ABSL= 3
##$ALPHA= 0
##$AQORDER= 0
##$ASSFAC= 0
##$ASSFACI= 0
##$ASSFACX= 0
##$ASSWID= 0
##$AUNMP= <proc_1d>
##$AZFE= 0.1
##$AZFW= 0.1
##$BCFW= 1
##$BC_mod= 2
##$BYTORDP= 1
##$COROFFS= 0
##$CY= 11.3945322036743
##$DATMOD= 1
##$DC= 2
##$DFILT= <>
##$DTYPP= 0
##$F1P= 18.9103706918063
##$F2P= -1.10871071338519
##$FCOR= 0.5
##$FTSIZE= 0
##$FT_mod= 4
##$GAMMA= 1
##$GB= 0.15
##$INTBC= 1
##$INTSCL= 1
##$ISEN= 128
##$LB= 0.24
##$LEV0= 0
##$LPBIN= 0
##$MAXI= 10000
##$MC2= 0
##$MEAN= 0
##$ME_mod= 0
##$MI= 1.114404
##$NCOEF= 0
##$NC_proc= 0
##$NLEV= 6
##$NOISF1= 3.799351
##$NOISF2= 2.8
##$NSP= 1
##$NTH_PI= 0
##$NZP= 0
##$OFFSET= 15.70392
##$PC= 1
##$PHC0= -8678.479
##$PHC1= 12.20019
##$PH_mod= 1
##$PKNL= yes
##$PPARMOD= 0
##$PSCAL= 0
##$PSIGN= 0
##$REVERSE= no
##$SF= 200.130013532006
##$SI= 16384
##$SIGF1= 3
##$SIGF2= 2
##$SINO= 400
##$SIOLD= 16384
##$SREGLST= <1H.CDCl3>
##$SSB= 0
##$STSI= 0
##$STSR= 0
##$SW_p= 3612.71676300578
##$SYMM= 0
##$S_DEV= 0
##$TDeff= 0
##$TDoff= 0
##$TI= <>
##$TILT= no
##$TM1= 0
##$TM2= 0
##$TOPLEV= 0
##$USERP1= <user>
##$USERP2= <user>
##$USERP3= <user>
##$USERP4= <user>
##$USERP5= <user>
##$WDW= 1
##$XDIM= 8192
##$YMAX_p= 0
##$YMIN_p= 0
$$ End of Bruker specific parameters
$$ ---------------------------------
##NTUPLES= NMR FID
##VAR_NAME=  TIME,          FID/REAL,        FID/IMAG
##SYMBOL=    X,             R,               I
##VAR_TYPE=  INDEPENDENT,   DEPENDENT,       DEPENDENT
##VAR_FORM=  AFFN,          ASDF,            ASDF
##VAR_DIM=   8192,          8192,            8192
##UNITS=     SECONDS,       ARBITRARY UNITS, ARBITRARY UNITS
##FACTOR=    0.0002496,     1,               1
##FIRST=     0,             0,               0
##LAST=      2.0444736,     0,               0
##MIN=       0,             -1079964,        0
##MAX=       2.0444736,     769951,          0
$$ Real data points
##PAGE= N=1
##DATA TABLE= (X++(R..R)), XYDATA
$$ [...]
3333C060n64m984p75M713J858k836l537J395L961P57l921k502L234L287j445m147
3349b446l05M370K024m327l012K732L840p86l688j226L085K853k098m019P18M359
3365B074J065l871k607K955L378j437m073q1M133J414k614l131R09M260L80m058
3381a304j837L120L130k115l874M98M338J000l364k625K018L287n6m004q80L322
3397F54K742k673l957J724L838Q1l577j557K501L019j311l819j69L758J663k994
3413g7k569J175L791Q6m093q44L264K095k152k916N34L167J097l126k236K253
3429e51L197j189l318n89L400K122k990k850J696L155j47l086j104K287K538j190
3445A381l538J5L519J286l187k192K210K834r34l154m00K912J719k032k751O70
$$ y = [3060, 2496, -2488, -3263, 1450, 3308, 472, -3065, -1670, 2291, 3048, -873, -3375, -141, 3146, 1701, -2446, -2751, 1619, 3643, -684, -3696, -964, 2876, 2090, -1598, -2824, 261, 3114, 1016, -3003, -2285, 2074, 3139, -732, -3339, -384, 2994, 1557, -2516, -2597, 1536, 2950, 336, -2795, -1886, 2374, 2754, -1304, -3141, -21, 3109, 994, -2880, -2382, 1956, 2956, -408, -3033, -1015, 2272, 2216, -1788, -2668, 654, 3396, 723, -3234, -1510, 2328, 2409, -1168, -2725, -224, 2795, 1484, -2335, -2504, 1254, 2917, -77, -2646, -1471, 2320, 2406, -1687, -2531, 733, 2828, 676, -2240, -1706, 1461, 2558, -568, -2804, -551, 2646, 1457, -1861, -2450, 950, 3072, 82, -2768, -1072, 2083, 1936, -1150, -2254, 33, 2571, 1381, -2157, -2142, 1377, 2663, -524, -2716, -506, 2328, 1394, -1760, -2160, 752, 2471, 439, -2312, -1642]
3461a642L303P28l276j779K638K486j335l017p3K683J651k228k198J147K788o7
3477A809k838j141K370K237j798l315Q92L512K14k628j545J754K361m46k825p98
3493b185L148J239j799k474J090K821j02k777j020K581J666j451k365K05K383
3508I60J110k108k281J542K765p40k777m06K401J667j839k183Q76K482J69k279
3524f41j272J636K184q74k510o8K892O88k261j595J191K351m78k214j160K438
3540C07J611j509k076M79K365O81k254j680K201J876r52k349k19K069J348j958
3556f0j859J186K141j88j907r12J904J543j177k320N51K091N95j805j575J401
3572c91J710j25k091m48J737J354j588j661P33K044q6j846j134J828J446q04k043
$$ y = [-1642, 1661, 2389, -887, -2666, -28, 2458, 1123, -1894, -1967, 716, 2367, 139, -2059, -912, 1876, 1809, -1029, -2170, 200, 2437, 639, -2676, -1784, 1728, 1942, -686, -2231, -477, 1884, 1438, -1387, -2185, 963, 2202, 403, -2071, -981, 1840, 1738, -1039, -2059, 522, 2188, 737, -1628, -1423, 960, 2070, -38, -2319, -777, 1988, 1248, -1529, -1935, 466, 2133, 294, -1889, -1013, 1469, 1638, -641, -1913, -277, 1907, 1033, -1477, -1545, 1347, 2035, -226, -1821, -630, 1721, 1243, -971, -2131, 307, 1918, 409, -1667, -1188, 1177, 1858, -396, -2076, 125, 2001, 1049, -1300, -1519, 550, 1898, -60, -1919, -733, 1408, 1220, -687, -1599, 305, 1848, 671, -1649, -1098, 993, 1588, -217, -1792, -391, 1319, 1194, -897, -1345, 392, 1746, 158, -1503, -770, 1274, 1188, -658, -1792, 36, 1482, 678, -1365]
3589a365J30J836Q61j554j855J502J960o43k156J06J626J302j371j652N00J816
3605A043M4j533j216J022J843l69k039j33J747Q80j453j316J220J463k6j766p78
3622a367J736J101r84j754O39J466L13j668q84J218J477n97j525m87J677N64r41
3639a6j168N50J830r5j690p15J512J152o60j780M21J595J99j551o64N54J384l39
3657E19j342m26J755P69j182j409N91J587p4j307o86J394R03q83q80j70J566O80
3675A405j575r08P56J358l12j563j64R63Q05o32j255M20J329J43j300n33R18J143
3693I98n43j236m4J574L78j609m38R07P74k4j290n30J686L77p49j323P93O08L94
3712G03j303l88Q04R65q42o18M64O26N05j090n48N71J298k87j535J75R49K83n09
$$ y = [-1365, -1235, 601, 1462, -92, -1947, -445, 1515, 872, -1284, -1178, 448, 1750, 379, -1273, -773, 1043, 1087, -446, -1662, -640, 1203, 834, -1205, -1338, 409, 1289, -164, -1480, -260, 1203, 1177, -589, -1367, 369, 1470, 486, -1268, -629, 837, 1150, -518, -1402, -184, 1293, 696, -829, -1316, 361, 925, -16, -1184, -634, 1196, 1101, -589, -1304, 208, 1360, 700, -1080, -659, 936, 1135, -416, -1080, -526, 858, 519, -823, -1249, 506, 1275, 93, -1316, -725, 862, 788, -519, -1205, 189, 1092, 209, -671, -841, 725, 1405, -170, -1078, -322, 1036, 724, -839, -1003, -40, 765, 133, -1122, -702, 627, 770, -530, -1063, -145, 998, 455, -781, -825, 749, 1127, -482, -920, -13, 761, 737, -553, -1083, 603, 980, 231, -1092, -299, 309, 703, -600, -988, -184, 781, -61, -679, -215, 411, 916, -174, -722, -151, 1147, 860, -675, -500, 449, 732, 223]
3731B23j306O04J250l07j060j88Q64O60m74j139M41R06O29j479m94J255M28p4
3749G39j396j75J268K82o61j210R48R76j41j199k13N76R46m13j377P03J113p1
3767F95r50n12R46Q47l46r28k23Q05L99o95o60K38J163o2j428k74J163M85p05
3786d2p41j21J335L13r76p98J044J023p32j009j1J215M95j081o78N93Q82m43p80
3805e12m50Q62O47l27r64O9R12M41j221n02R91J181p74j401M48J262N24j433o73
3824i20P85J144k32j425k15J148Q00r49j110O38Q01L07j088n63N62J342o43j284
3842i02O0J174O87r23j078R73J211m83j158n11Q56J057o41j434M87J487j1j219
3860c68o18Q48J098p01j126k59J644M76r06j291J111J140j50j495k50J367O86
$$ y = [223, -1083, -479, 771, 464, -596, -784, 80, 740, 266, -873, -432, 474, 1103, -376, -870, 385, 813, 739, -657, -832, 436, 718, 57, -1153, -205, 771, 630, -569, -782, -206, 740, 327, -1050, -347, 766, 695, -255, -767, 179, 1026, 680, -248, -471, 334, 733, 38, -622, -384, 779, 717, -711, -985, 178, 663, -42, -783, -904, 431, 744, -232, -1030, 14, 1037, 305, -704, -715, 500, 995, -86, -764, -171, 711, 268, -512, -962, -100, 547, 220, -744, -675, 237, 678, -543, -1045, -54, 1127, 353, -1048, -600, 662, 1186, -247, -920, -135, 1009, 777, -648, -863, 285, 1085, 136, -974, -336, 465, 772, -316, -879, -317, 1025, 382, -902, -842, 332, 1019, 96, -982, -9, 1202, 719, -439, -950, -94, 963, 322, -1112, -625, 862, 851, -368, -986, -138, 960, 259, -867, -1126, 518, 994, 88, -1203, -92, 1048, 898, -597, -847, 520, 1206]
3877A206j089j211N02J203J54j123r05J289Q35p40r77j81J622O25j411r20O32
3894d89J759l01j942P5J457R19q70j814O55J565J96j701p25J036J207n28j726
3911a227J05J822M96j216j307R18J488n68j520l50J742R20q89j639N32J692Q8
3928A087j569o64J148J357p72j717O7J611P14j241j264O53J909j55j763n78J566
3945C89J018r38j963P63J849K74j683r32J127J349n63k215K61J865Q67j474j695
3962a701R62J768L5k068m01J393J465n74k043K87J731R46k162j059J307J443k78
3979A051k363j33J875J128j388j695O04J908K91k039j076J985J887j095k339J75
3995a224K376M33j652j734J607J507j90j907p72J854J562j770j741P47K009K92
$$ y = [1206, 117, -1094, -592, 611, 765, -358, -1263, 26, 861, 121, -856, -1037, 585, 1210, -201, -1121, -489, 1270, 969, -973, -898, 559, 1478, 608, -1206, -551, 1014, 1210, -491, -1216, -180, 1027, 499, -1227, -1122, 700, 1196, -20, -1327, -409, 1079, 511, -1009, -1359, 383, 1303, 414, -1225, -693, 999, 1087, -482, -1146, 2, 1359, 587, -1130, -1063, 548, 1262, 21, -1243, -590, 1319, 1164, -599, -1177, 389, 1407, 469, -1494, -731, 1118, 1392, -291, -1223, -96, 1253, 690, -1525, -1264, 601, 1468, -6, -1701, -739, 1029, 1064, -1004, -1405, -12, 1453, 879, -1164, -877, 854, 1800, -362, -1421, -114, 1329, 1051, -1312, -1445, 430, 1558, 170, -1525, -921, 987, 1278, -761, -1837, 148, 2035, 940, -1399, -1224, 1152, 1585, -67, -1801, -194, 1313, 1123, -784, -1556, 298, 1860, 90, -1651, -904, 1105, 1397]
4011A397k050j349J918J998j110k089p1K190Q02j488j835Q39K831m88k372j004
4027a881K202J495j152k254M32K231N47k296j278J617K113n88k705j39K261J408
4043B013j946j816R93K488N5k719j002K186J928j246k556J29K877N96k442j753
4059b215J467K783r82k479l36K073J771j781k325Q65L081L9l086r01K077K017
4075B068j100k611j97K835Q98k098j978J472K207p0k521j194K450J992j579k402
4091a828M30K830M40k296j573J470K912r33k893m50K790J596k557j957J134K770
4107A885j08l138r48K101K254j500k255j83L042Q97k301k050J704K649n15l081
4123a547o59K629J844j789k685J073K850J00k536j865K219K492j183k713k00L214
$$ y = [1397, -653, -2002, -84, 1914, 804, -1285, -1356, 834, 1636, 148, -1687, -848, 1983, 1495, -877, -1881, 321, 1816, 664, -1590, -1158, 1073, 1620, -676, -1954, -337, 1776, 1188, -1517, -1656, 605, 2013, 67, -1749, -756, 1732, 1787, -932, -1934, 252, 2180, 934, -1622, -1493, 1384, 1980, -462, -2215, -748, 2035, 1053, -1426, -1762, 311, 2082, 301, -2024, -1159, 1922, 1961, -1125, -2026, 51, 2068, 968, -1643, -1840, 995, 1893, -205, -2183, -711, 1496, 1426, -1095, -2289, 161, 2153, 574, -1828, -1398, 1432, 1872, -424, -1997, -527, 2385, 1452, -1441, -1891, 899, 2495, -62, -2019, -885, 1885, 1777, -1361, -2309, -208, 2046, 546, -1709, -1892, 1150, 2047, -254, -2304, -600, 2049, 1534, -1547, -2206, 423, 2267, 478, -2207, -1134, 1716, 1816, -720, -2585, -366, 2126, 943, -1770, -1970, 1244]
4139A244P25j932k626J903K664Ml209q08K360K042j632k740M12K999J107k900
4155c87k232K042K823p64l110l80K694J621k014k902J199L442K16l290j555K533
4171f4K845j802k975K48L173J231l018k222J817K635J13l594p25K813K043j951
4187E67k914O89L572M49l280j628J878L251j117l184l39L225J722k729k949J740
4203a047L076j90l336j172K685K347j849l002N99L070J197k806k330J949L308
4218B499q84l513m24L390J683k378k644R19L447L02l526j714K559K721j247l412
4234b222p6L694J317k929k408J481L357k33l303j166K917K456k074l204N80L670
4250A857O91l260k289K708L164j320l578n96L610J814k691l055J429L764M1l655
$$ y = [1244, 1969, 37, -2589, -686, 1978, 1982, -1227, -2035, 325, 2367, 735, -2005, -1593, 1406, 2513, -387, -2619, -577, 2246, 1482, -1628, -2008, 686, 2307, 293, -2609, -1410, 2032, 2248, -1042, -2597, -64, 2781, 979, -1996, -1748, 1425, 2656, -362, -2584, -767, 1868, 1981, -1613, -2338, 475, 2518, 567, -2347, -1658, 1914, 2363, -917, -2545, -667, 2584, 1467, -1717, -2056, 1169, 2891, 162, -2787, -1047, 2029, 1839, -1497, -2669, 16, 2363, 514, -2488, -1889, 1181, 2378, -428, -2758, -809, 2499, 1615, -1898, -2322, 1068, 2751, 373, -2271, -1352, 2095, 2397, -1129, -2843, -284, 2437, 1190, -2222, -2298, 1396, 2713, -216, -2624, -1143, 2214, 1981, -1322, -2488, 429, 2885, 811, -2393, -1813, 1857, 2548, -712, -3001, -293, 2871, 1551, -2027, -2623, 987, 2801, 110, -2945, -1516, 2248, 2289, -1366]
4266a366j512L145K778k264l291N27L691Q78l016k376J948L590q82l694r68L529
4282G17K320k575l492J112L926K60l330k153K886L132j121l814p2L428J738k847
4298A15l060J611L999k67m156j192L449K347k062l406N27L696J022l250k764K861
4314e30L236p35m147m82L540K384l093k769J010L600O78l906j802K814L509k029
4330A278l963j25M593J307l346l019K397L606n65m110j134L684K769k478l974
4345c080J300L866R03l797k451L031L283j358l974l90L685K194l306l168J618
4360a644L996J31l981j913L848K979k418l769P06M011J290l532k858K586L599
4375C031o60m371j207L859K799k983l673J355M321L62m078k203L141L514j376
$$ y = [-1366, -2878, 267, 3045, 781, -2510, -1983, 1708, 2586, -430, -2806, -858, 2732, 1850, -1844, -2812, 717, 3037, 462, -3030, -1918, 2008, 2268, -1062, -3215, -329, 2803, 1682, -2132, -2204, 1224, 2962, 115, -2945, -1334, 2665, 2398, -1758, -2950, 499, 2846, 784, -2622, -2095, 1601, 2623, -627, -3391, -530, 2706, 1971, -2176, -2658, 882, 3266, 173, -2596, -1586, 2014, 2692, -1214, -3016, -202, 3307, 1278, -2685, -2810, 1783, 3090, -256, -3275, -878, 2728, 2163, -1947, -3081, 603, 3372, 894, -3080, -1780, 2086, 2989, -808, -3259, -228, 3055, 1697, -2277, -2667, 1018, 3212, -94, -3262, -1644, 2352, 2483, -1498, -3411, 437, 3416, 998, -2771, -2065, 1946, 3236, -296, -3154, -568, 3031, 2371, -2000, -3207, 652, 3451, 468, -3205, -1850, 2471, 2833, -1245, -3448, -307, 3207, 1831]
4390A831m327j65M179J704l219l393K182M380m46m748j264L732K896k191l849
4405b698N97L983J109l700k931K692M090j327m099o53L857K428k939l414J675
4420a330L943K19m139k197L531L396j754m430L29M123J550l761k956K033M432
4435B989o80m140j364L549L100k533l900J019M362P21m071k456K961L868j688
4450A737l966m93L853K418l234l675J578M516j41m348j573L408L505k135m338
4465b888N80M393J224l484l407K529M204r45m142j470M100K797k797m241J437
4480b110M543M60m235k221K967L696j703l911k09L989K134l307l656K140M419
4495B996k04m469j481L705L015k341m279O56M265J518m327k857L118L808j199
$$ y = [1831, -2496, -2661, 1518, 3222, 3, -3390, -1208, 3172, 2726, -2022, -3286, 446, 3342, 1151, -2698, -2101, 1882, 2991, -709, -3640, -948, 3142, 1815, -2284, -2937, 920, 3348, 409, -3005, -1330, 2613, 2832, -1307, -3504, 27, 3423, 1669, -2761, -2432, 1691, 3241, -520, -3476, -1443, 2989, 2309, -1831, -3195, 354, 3454, 921, -2979, -1960, 2402, 3123, -948, -3404, -443, 3425, 1737, -2229, -2722, 1131, 3549, 315, -3360, -1782, 2734, 2593, -1755, -3328, 80, 3585, 1450, -2888, -2308, 2085, 3309, -175, -3582, -1053, 3151, 2206, -1936, -3406, 694, 3491, 694, -3547, -2110, 2433, 2893, -1342, -3563, -596, 3100, 1397, -2514, -2723, 1266, 3400, 93, -3563, -1423, 2996, 2792, -1677, -3158, 547, 3562, 1221, -3058, -2402, 1863, 3381, -946, -3803, -685, 3123, 1924]
4510A924m601l07L955K611l067l936J341M722M48m234k244L287L740k263m246
4525b870m3M650J671l721l528K723M316q38m373j280L830K860k547m364J102M744
4541B332P34m088k561L140L714j508m458j26M229K180l348m008K105M315r6m027
4557a471k283L954L260k387l980M90M189J660l984k905K721L778p27m379j198
4572c262M284K813l246l962J396M428N76m434k236L337L805j624m503m32M343
4587A283K353l906l170J712M656l28m658j175L977K961k484m435O59M505J487
4602C437m136l036K902M111j298m622n35M289K447l079l985J760M517J23m549
4617a654j806L506L412j908m619L47M463J951m067l559K772M364n74m929j057
$$ y = [1924, -2677, -2984, 971, 3582, 515, -3421, -2080, 2642, 3090, -1144, -3388, -101, 3639, 1376, -2870, -2913, 1737, 3408, -313, -3841, -1118, 3198, 2360, -2013, -3293, 537, 3397, 850, -3514, -2412, 2332, 3066, -1022, -3583, -443, 3271, 1763, -2695, -2821, 1408, 3588, 240, -3768, -1663, 2652, 2556, -1471, -3754, 200, 3460, 1073, -2907, -2417, 1772, 3432, -552, -3457, -736, 3042, 2315, -2064, -3262, 1022, 3835, 589, -3373, -1977, 2451, 3027, -1407, -3643, -306, 3499, 1875, -2628, -3060, 1283, 3636, -270, -3440, -1728, 2928, 2600, -2058, -3233, 744, 3705, 1221, -3214, -2555, 1950, 3437, -699, -3735, -833, 3278, 1980, -2642, -3177, 1112, 3559, 480, -3505, -1745, 2772, 2895, -1654, -3460, 46, 3458, 1550, -3069, -2722, 1741, 3692, -375, -3934, -1162, 3202, 2628, -2301, -3358]
4632c358L996K828k314m341Q51M599P49l940k718L211M373k253m183m58M493K151
4648C686l427l615J781M487l19m481j677L852L636k727m333N37M477J380l922
4663f65k794K713L945o88m452j232M108K967l279l796J391M849j77m344k420L396
4679d78L740j679m194n37M710J764l330l724K541M134j40m815j386M034L071k634
4695A077m060P43M550J073m275k705K854M154j378m662q14M724K252l546l551
4710c564J838M583J80m630j889L765L323j754m681K02M569J488l795l315K540
4725a140M551p31m958j280L994K879k592l989P68M715R91m443k403L163L980j770
4741A735m415k74M681K180l776l650K007M272O6m457j888L563M000k791m555P82
$$ y = [-3358, 638, 3466, 1152, -3189, -2338, 2261, 3010, -930, -3648, -437, 3936, 1683, -2500, -2958, 1535, 3686, 259, -3356, -1575, 2912, 2593, -1888, -3565, 287, 3923, 1196, -3137, -2600, 1877, 3257, -665, -3459, -746, 3199, 2511, -1941, -3173, 935, 3902, 623, -3173, -1782, 3067, 2890, -1454, -3874, -478, 3262, 1583, -2611, -3148, 1562, 3326, -4, -3728, -1187, 2947, 2807, -2008, -3394, 640, 3711, 1077, -2983, -2240, 2310, 3383, -892, -3597, -743, 3411, 2033, -2629, -3443, 1281, 3533, -13, -3564, -1726, 2857, 3037, -1593, -3482, 283, 3606, 1852, -2829, -2627, 1942, 3430, -365, -3680, -1140, 3411, 2680, -2278, -3558, 436, 3315, 723, -3266, -2498, 2217, 3208, -1235, -3638, -475, 3505, 1735, -2680, -2954, 1727, 3907, 131, -3519, -1512, 2760, 2826, -1631, -3519, 44, 4044, 1253, -3302, -2520]
4757b520M666J299m252k933K893M248j013m704q67M089K622k996m313J803M747
4772B769N25m894j906L178L945j770m620l0M537K033m145l488K221M641l32m465
4788a801j766M263K820k511m332J219M619Q00l984k781K651M375j597m594m34
4803c053M319K392l175m397K003M855r6m424k007L481L485j838m586L8M912J879
4819C788m226l452K814M267p12m533j234M161K818k919m219J393M485Q15m403
4834a157k514L160L897j440m813j73M727J974l376l639J893M517j32m705j584
4849c365L947K976k404m176K24M988J392m248l160K983M155j165m376j217M370
4864I24L034l295m018J432M510M47m379k065L547L566k107m419N5M457J617l282
$$ y = [-2520, 2146, 3445, -807, -3740, -847, 3401, 2388, -2316, -3183, 906, 3528, 532, -3781, -1978, 2769, 3294, -1600, -3506, -328, 3617, 1847, -2773, -2803, 1734, 3767, -378, -3866, -1645, 2996, 2664, -1801, -3567, 696, 3516, 1005, -3327, -2108, 2511, 3311, -673, -3454, -803, 3572, 1975, -2619, -3053, 1266, 3658, 483, -3914, -1911, 2944, 2848, -1576, -3583, -102, 3383, 1545, -3041, -3003, 1909, 3788, -438, -3890, -1076, 3191, 2479, -2054, -3288, 873, 3691, 772, -3447, -2054, 2431, 3246, -1157, -3671, -511, 3386, 1946, -2867, -3040, 1687, 3661, 285, -3354, -1461, 3056, 2924, -1781, -3365, 582, 3558, 1154, -3022, -2798, 2190, 3582, -666, -3826, -843, 3312, 2147, -2229, -3446, 924, 3958, 663, -3355, -1923, 2587, 3034, -1345, -3410, 137, 3703, 1596, -2823, -2768, 1689, 3306, 24]
4880B4l577K199M380m00m691j445M317K992k764m543J267M700R62m248k676K893
4896f10L878j200m707m98M399K608l611l983K088M292q1l878k130L828L338k085
4912A648m794O50M538J407m049l260K646M397q73m738p32M255K545l106l947J337
4928b076M342P52m205k493L257L840j599m514k69M569J962l837l219K018M593
4943C121n18m423j369L362L583k674m197P83M558J065m263k409K924L621j167
4958A997m554n47M333K285k992l829J511M331J56m096k043L585L247j988m115
4973b719O7M498J698l772l363K496L977n51m218j429M154K976l120l890J125M390
4989B319N73m004k177K864L907j531m424l61M293J823l085l476J370M931l53m275
$$ y = [24, -3553, -1354, 3026, 2626, -2065, -3510, 807, 3799, 1035, -3508, -2241, 2459, 3421, -827, -3503, -610, 3268, 2068, -2639, -3137, 1262, 3870, 259, -3724, -1636, 2656, 2575, -1303, -3433, 395, 3733, 1648, -3146, -2496, 2042, 3449, -600, -3860, -1214, 3183, 2310, -2428, -3160, 1095, 3640, 534, -3413, -2076, 2266, 3018, -1187, -3680, -423, 3417, 1818, -2696, -2965, 1604, 3566, -271, -3490, -1472, 3121, 2603, -1820, -3189, 173, 3756, 1082, -3115, -2332, 2226, 3291, -972, -3381, -457, 3164, 1997, -2557, -3104, 1229, 3514, 522, -3307, -1796, 2535, 2691, -1405, -3448, 137, 3384, 1396, -2719, -2652, 1846, 3544, -228, -3591, -1095, 2882, 2331, -1887, -3316, 838, 3814, 694, -3196, -2071, 2319, 2892, -1112, -3289, -425, 3482, 1951, -2473, -2834, 1459, 3282, 197, -3279, -1909, 3022, 2669, -1606]
5005a606j779L669K815j771m102L75M213J604m005l097K803M158r23m324j300
5020c270M080L012l495l413J214M249O20m260k214L208L769j751m399K14L964
5035A528J786l658k825J834M103k67m185j427L399L002k345m202R43M501J027
5050C214l802k950K974L510j270m157l20L891K397l298l769K071M115J01m113
5065a406k134L738L238k210m198M77M159J598l372l557K424M135p43m155p94L589
5081G89K428k576l760R92M374Q09l819k570L038L591j592m176j00M032J909l513
5097a44l099K050L816k78m014j210K786L266k140m099R35L991J069l492k701K393
5113h71L788r73m442l07L694K285k690l608J443M068K55l921j840L121L142j807
$$ y = [-1606, -3385, 284, 3099, 1328, -2774, -2399, 1814, 3418, -587, -3684, -881, 3277, 2354, -1970, -3270, 810, 3822, 327, -3086, -1872, 2377, 2997, -1263, -3477, -269, 3500, 1749, -2650, -2436, 1528, 3314, -344, -3169, -1335, 2768, 2501, -1684, -3111, 288, 3290, 945, -3257, -2314, 2187, 3214, -588, -3538, -564, 2946, 1676, -2481, -2801, 1090, 3487, 189, -3580, -1509, 2606, 2707, -1406, -3540, 198, 3436, 1226, -2972, -2495, 1664, 3262, -110, -3667, -1243, 2892, 2149, -2006, -2800, 789, 3217, 641, -3119, -2127, 2247, 3056, -763, -3333, -295, 3296, 1704, -2472, -2572, 1460, 3369, -144, -3243, -1193, 2623, 2345, -1669, -2879, -93, 3173, 1033, -3066, -2131, 1860, 2929, -563, -3264, -871, 2917, 1944, -2498, -2805, 889, 3174, 484, -3124, -1681, 2387, 2642, -1279, -3119, 2, 3144, 1337]
5129A337l888K14L856J640l635k515K122L566l27m046j211L511K559k481l606
5144b904Q10M109R41l766k338K539L543j165m114k90M002J822k872l367J641L748
5160B339M24m212j678L134L008j798l882O26L724J335l583k520K307L429o16m122
5176b085p31L520K475k422l791J419L711M26l554j852K666L169j623l448k60L681
5192A301J352k792k746J867L491k05l949j358L328K771k155l439Q38L392R08l187
5208e83k431K624K998o98m073m90L423K610l137k834J166L555r3l353j233K496
5224e3K847j829l247k13L785J602l094k499J854L353m36l883r28L460K140k106
5240G53l028O42L495P62l326k274K573K884j045l304m67L244J768k820k660J760
$$ y = [1337, -2551, -2337, 1519, 3159, -476, -2991, -869, 2697, 2370, -1676, -2887, 624, 3183, 702, -2904, -2094, 2015, 2956, -810, -3148, -609, 2934, 1769, -2345, -2635, 1367, 3189, 317, -3050, -1409, 2339, 2763, -1449, -3127, 7, 3015, 1217, -2665, -2039, 1685, 3020, -563, -3083, -776, 2653, 2037, -2085, -2816, 704, 3179, 757, -3034, -1615, 2096, 2522, -1032, -2884, -218, 2951, 1328, -2120, -2380, 1301, 2653, -139, -2885, -1018, 2473, 2268, -1681, -3039, 289, 3060, 905, -2534, -1696, 1696, 2604, -583, -3014, -390, 2608, 1910, -2163, -2653, 770, 3380, 243, -2591, -1425, 2130, 2037, -1316, -2549, -53, 2794, 965, -2282, -2495, 1290, 2892, -202, -2701, -847, 2506, 2070, -1813, -2741, 719, 2859, 753, -2275, -1633, 1862, 2624, -702, -2976, -403, 2481, 1436, -1868, -2335, 909, 2677, -143, -2803, -1043]
5256a043L576n85l363j139K519K914j686l777P83L368J211l395j997K145K654
5271B185m21l717m13K987K170k140l205Q82L756K77l481j713K690K670j492l060
5287b025j49L252J551k698k811J740L424n10l402r52K863K272k009k716N93L379
5303A802M13k925k018K086L028q73l241l96L274J412k341k716J319L063K35l271
5319a149j319K619K108j374l040Q4L441J115k757k397K317K722p77k909q39K505
5335C50J942j675k709M09L265N65l248j385K378J991r08k835j68L162J257k633
5351b42k452J486L159j54k982j079K540K125j661k699J56L238Q79k887j715J583
5367g05K737n61k995n04K479J962j937k786J113L138j3k741j158J919K111j056
$$ y = [-1043, 2533, 1948, -1415, -2554, -35, 2879, 1193, -2584, -1801, 1567, 2778, -617, -2614, -469, 2185, 1764, -1953, -2366, 621, 2791, 651, -2554, -1672, 2084, 2361, -1120, -2833, -143, 2527, 1035, -2025, -2174, 1078, 2629, -69, -2880, -1140, 2284, 1774, -1628, -2580, 283, 2555, 546, -2170, -1577, 1802, 2215, -710, -2728, -642, 2386, 1513, -1728, -2124, 1150, 2562, 221, -2495, -1176, 1887, 2122, -1149, -2468, 151, 2259, 885, -2155, -2071, 1370, 2485, -272, -2669, -352, 2370, 1593, -1316, -2155, 350, 2292, 617, -2092, -1683, 1582, 2147, -1101, -2486, -108, 1883, 975, -1860, -2028, 1134, 2391, -242, -2694, -1208, 1951, 1797, -1185, -2264, 276, 2401, 740, -1959, -1803, 1435, 2314, -573, -2288, -705, 2032, 1471, -1524, -2028, 451, 2413, 476, -2310, -1197, 1941, 1928, -813, -1971, -52, 2059, 1003]
5383A003k667l3K809R00k132k095J424K688l23k792j100K699J810j832k227O02
5399a266K908M47k799j574K019K266o82k787l14K409J628k150k388J097L012k50
5415A576k791q63K220J845r85k881K35L088O87k518j461J359K244l83k695o54
5431a977K544J322j608k002N46K735K14k461j214J942J960j262k127l58K849Q20
5447A923k047j832J409K184m40k226n88J644J920j281k514N78K612L02k110j344
5463a810J444K255p28k611k82K198J328j599k202Q86K457K48k422j003J962J699
5479A820j264k041J02K365R15k353j512J158K478m24k189l78J668J345j196k195
5495a701M96K431M39k324r78J416J936r99k241P4K418R63j687k020J078K129k87
$$ y = [1003, -1664, -1697, 1112, 2012, -120, -2215, -791, 1897, 1574, -1218, -2318, 381, 2191, 359, -1868, -1266, 1642, 2089, -710, -2284, -265, 2001, 1319, -1468, -1782, 627, 2255, 105, -2283, -1186, 1826, 1576, -1215, -2078, 142, 1987, 1002, -1879, -1644, 1444, 2131, -387, -1848, -489, 1755, 1372, -1323, -1977, 567, 1889, 281, -1721, -1175, 1560, 1774, -687, -1901, 41, 2001, 739, -1388, -1746, 1103, 1923, -124, -1956, -547, 1637, 1197, -1029, -1617, 27, 1947, 666, -1848, -1270, 1342, 1644, -466, -1810, -366, 1889, 1161, -1450, -1732, 466, 1794, 195, -2007, -1121, 1336, 1584, -838, -1841, 121, 1820, 556, -1485, -1383, 982, 1897, -456, -1968, -810, 1668, 1244, -945, -1323, 345, 1690, 494, -1701, -1205, 1226, 1665, -659, -1637, -221, 1715, 716, -1525, -1451, 967, 1930, 243, -1777, -699, 1430, 1143]
5512A143j977o96J751J631j211k020J69K236L43j765j518J613J881r62j746l34
5528a462K046J205j303k023P07K028j72j771q18J731J362o78k341L52J758Q46
5544A467j573j725J360J808J4k361m50J968J062j213j930O78K092K03j983r67
5560a550J717J414j129j532jJ773R32j653j611J103J941k57k045m93J604J417
5576A630j091j823M03J631L89j269j164J022J619p60j616m62J924J076j504j341
5592a336Q93J405L81j780j053J450J246p94j627M13J428M80j299j140J055J714
5608A436n68j935J03J025J365j084j722O73J450K51j518o42Q88J660m07k062Q
5625a079J841M19j368r11Q34J387k25j551p11J511J124q48j372K25J255M84j386
$$ y = [1143, -834, -1530, 221, 1852, 641, -1379, -1210, 1026, 1369, -396, -1914, -301, 1580, 618, -1128, -1462, 584, 1789, 486, -1537, -830, 1198, 1026, -745, -1563, 168, 1530, 852, -1489, -1137, 621, 1467, -106, -1831, -471, 1337, 1351, -1010, -1460, 508, 1570, 357, -1573, -895, 1197, 1400, -583, -1550, 167, 1581, 452, -1080, -1081, 692, 1624, -29, -1640, -537, 1404, 1147, -898, -1391, 213, 1630, 539, -1284, -881, 750, 1139, -130, -1294, -272, 1347, 587, -1029, -1491, 433, 1509, 5, -1336, -443, 962, 1343, -437, -1490, -40, 1206, 412, -1215, -802, 626, 1106, -193, -1333, -278, 1436, 868, -1067, -964, 61, 1426, 342, -1380, -707, 743, 994, -524, -1166, -278, 1382, 975, -1087, -1079, 762, 1181, -187, -1098, -264, 1123, 898, -653, -1364, 147, 1271, 423, -949, -724, 531, 1015, -371]
5642c71p94Q21J400o50j289l20J393R13r13j199L32J513j21j327j44Q25J077o56
5660D90j410J56J330J59j027o91P08J127l87j038l32J458O08r65j196M98J240
5677G28K20j406m30P87R79m33j431K97J250L99j040r53P75J172k45j300j61J082
5695B90O87o91j172J14J667qj058n73P76P35k31j260%J163Q53j459o58M79J079
5714G33k1r85p93J199O41n36j015L21R76L49j049r87R30R38l03j157q4J334M63
5733I54r07j228Q69J079k60j094l60R85O49n39q20J21J028K22j033n77R87O41
5751G17k59j058k57J220P19j214m04K6J315j48r12m13P81P10r11n60O0J223M7
5770F82r88l92N29R96l63j037J10N54L56o06p47M94R72J01q87m92P49M94l13j059
$$ y = [-371, -1165, -344, 1056, 406, -883, -1203, 190, 1103, 190, -1009, -677, 836, 715, -612, -756, 69, 1146, 490, -920, -764, 566, 725, -302, -993, -285, 842, 455, -583, -915, 543, 1151, 186, -1010, -512, 728, 948, -458, -888, -101, 878, 445, -986, -689, 561, 960, -80, -1033, -258, 914, 669, -631, -792, 290, 977, 286, -886, -772, 895, 887, -171, -744, 32, 767, 536, -724, -724, 439, 1292, -167, -825, -346, 733, 712, -273, -1066, 133, 774, 238, -777, -456, 520, 869, -180, -1167, -237, 701, 398, -759, -843, 491, 954, 47, -1181, -312, 767, 507, -587, -947, 38, 687, 148, -672, -551, 477, 699, -334, -911, 76, 717, 458, -600, -857, 363, 1082, -132, -536, -510, 805, 657, -255, -668, 113, 823, -88, -648, -588, 635, 682, -306, -698, -169, 827, 464, -573, -463, 91, 447, -159, -906, -412, 560, 661, -226, -718, 31, 525, 212, -847]
5790h47M49Q60K27o98p69P31N94l19n70k27R23M43p56p31M94P92j23q71m45Q91
5810D8O37l18j096J88Q53K72o68m84M64R53n34r04j71J107L79q76l77J72R24O9
5830F38j223K44N55L20l83p00L7Q04R8n67l60N22O42k60o97l53Q03N19m02r05
5850f68N32M95M7p04l49J052K97n33o60K24O58K03n53m04K60Q12n84q36K3R60
5870B72M02q31l44K51R40l3j045k70R65L61m90o56j5R11J31n21o74N38O16o4n92
5891a48k88N69O82p87o05L06J146n05m98k18O92L59q85o43O40N30K87p87l27J12
5911c68J189o03q40K36O23L32p62k11J05P71m5q54l71P97P04l72j005J75P75M10
5931F86q08o80R98N77n95r63L79N98L73o00p83O39O27Qo47m19Q50M99o46p00J89
$$ y = [-847, -398, 462, 689, -9, -778, -47, 547, 228, -342, -569, 354, 797, 41, -690, -196, 596, 473, -398, -843, 48, 685, 367, -729, -541, 312, 584, -84, -568, -104, 849, 315, -589, -760, 347, 726, -150, -527, -355, 569, 638, -585, -341, 214, 534, 151, -549, -512, 292, 390, -177, -537, -15, 627, 367, -330, -683, 120, 639, 237, -668, -136, 359, 406, -298, -647, 405, 702, 169, -491, -267, 391, 594, 41, -363, -103, 709, 125, -711, -688, 272, 674, -157, -501, -250, 690, 657, -388, -658, 307, 668, 178, -478, -493, 418, 549, 28, -646, -108, 508, 444, -148, -436, 133, 815, 28, -577, -271, 875, 370, -128, -346, 346, 705, -180, -823, -183, 347, 634, -153, -480, -368, 821, 218, -622, -386, 237, 569, -193, -404, -299, 472, 427, -427, -798, -1, 703, 331, -674, -499, 276, 686, -122, -802, 196, 773, 178, -785, -406, 192, 565, -35, -818, -179, 448, 456, -191, -610, 240, 739, 93, -607, -418]
5952d18J080J14p87p07N91Q54m83q75L04P46J82o47n78j3J433k14j099j61R32
5971B54N09p85n08K9J024r7o18l85N53P61m39q41L2P59M63r50n82K44J124l53
5991A94m31l16M98Q35p97o35L22Q63K03j039n92Q22R29o24o99j40P69P25q59o33
6011f05L25Q71K3j114m04R57P61n52r87K69P95M34p53q31M47J175l58j054L7Q13
6031B49M62q26o54L41J255j44j079m11O53P19k86j047k0J282L52q29j010R85R74
6050I66m43j072k67J245M35r69m51N3J015K30j138m21N86J284o72j106KJ290K23
6069G90q35j001O81J458n84j261q6J131P60p75j315J94J518K8r36r13J208P03
6087G65l08j029m77J472N68r82r16P07J163j04j244o10J336P35r12j138M49J115
$$ y = [-418, 662, 776, -11, -718, -127, 727, 244, -631, -327, 419, 601, -46, -624, -637, 796, 582, -517, -678, 254, 763, -22, -530, -501, 523, 426, -192, -577, -24, 737, 298, -543, -511, 248, 711, -239, -821, -577, 547, 194, -237, -553, -55, 780, -17, -652, -330, 533, 736, -303, -895, -73, 856, 232, -467, -607, 162, 887, 28, -605, -280, 591, 614, -500, -904, 53, 814, 262, -725, -456, 339, 773, 20, -811, -364, 811, 453, -601, -564, 249, 711, -115, -769, -428, 827, 683, -396, -807, -154, 565, 279, -768, -788, 494, 846, 17, -993, -8, 966, 523, -549, -816, 429, 864, -105, -556, -503, 512, 742, -396, -817, -231, 1053, 381, -725, -723, 567, 790, -45, -1046, -365, 1093, 509, -752, -838, 293, 1053, 278, -1037, -843, 675, 703, -233, -1146, 62, 765, 457, -572, -1049, 423, 991, 9, -907, -200, 963, 859, -385, -995, 341, 1076, 164, -974, -525, 590]
6105E90O6p50r69Q19J508p59r84l62J051R19j114q41N18J119j70r10p99J102J099
6124A133p94j143K92J310K24j308p27P88J212j8j597l98J271Q65j127r60M49J272
6142G44K66j315q48J193J106o20j368M5J224M82o63j286N15J594m02j417l94J271
6160A27R59j129r37l0J625P82j861n03P34J275m30j407l17J590P23j164j087N42
6178e08J547l44j152p42R32J506q34j594K64J329P40j435j046J069J561m33j513
6195f53m74J651N03n85j816P56J603j2j095j225J121J341n12j549J31J468N03
6212A156j120j146N36J495j82j383o69J734P06j069j300L39J830J49j246j310
6228a480J523J355p73j765Q8J506Q81j331j148L24J915P4k100m54J619R25m83
$$ y = [590, 656, -94, -1063, -244, 1264, 505, -479, -841, 210, 1129, 15, -826, -308, 811, 641, -269, -1068, 34, 1133, 339, -804, -512, 798, 1022, -286, -1013, -225, 987, 969, -628, -1026, 245, 1110, -17, -977, -528, 744, 1010, -305, -1153, 40, 1146, 526, -842, -797, 427, 909, 246, -1040, -525, 1069, 667, -750, -1144, 127, 1086, -43, -980, -1010, 615, 1397, -464, -967, -233, 1042, 612, -795, -1112, 478, 1201, 37, -1050, -508, 1039, 695, -457, -1199, -267, 1239, 405, -1189, -925, 404, 1144, -291, -1337, -268, 1293, 860, -653, -1127, 524, 1027, 442, -1374, -618, 985, 973, -122, -1347, -226, 1115, 603, -946, -815, 653, 1156, 36, -1110, -574, 921, 739, -644, -1313, 421, 1127, 58, -1242, -903, 927, 1076, -170, -1480, 43, 1398, 625, -1140, -1052, 454, 1335, 4, -1144, -820, 1095, 1169, -931, -1385, 234, 1159, 676]
6245F76j846K39J565P21j702r55J245J401n54j526n13J482J117j299j196L17J953
6262A125j01j688p23J049J634o79j879J45J700P99j401j035J58K214l99j596m08
6279a085J520Q43j060j453L65J774K31j324j254J243J258n03j608l14J844Q50
6295A327p70j876O33J985j77j755p87J437J565j096j586J18J984K60j413j339
6311a490J018J674k99j865l59J631J235j312j502M52J629O58k287r48J729J558
6327A522j076j703L3J971P72j600j253P02K175k97k309n82J660J504j452j316
6343a249J18K344Q2j604j109J022J644k68k051j26J590J257j752j457J007J745
6359A193j59j925p25J760J234q77j800L42J758O59j840j266R80J980j2k385m44
$$ y = [676, -1170, -931, 634, 1355, -347, -1302, -57, 1344, 790, -736, -1249, 233, 1350, 51, -1145, -828, 1125, 1024, -664, -1387, -338, 1296, 617, -1262, -1117, 583, 1382, -19, -1054, -896, 1318, 919, -677, -1085, 435, 1278, 218, -1235, -870, 904, 1135, -189, -1443, -200, 1058, 555, -1053, -1367, 477, 1327, 557, -1319, -686, 1299, 1122, -633, -1420, 17, 1582, 486, -1100, -982, 1002, 1262, -151, -1490, -472, 1202, 903, -962, -1321, 310, 1545, 233, -1269, -817, 812, 1470, -817, -1765, -36, 1522, 446, -1257, -1224, 747, 1519, -81, -1334, -632, 1543, 1246, -1063, -1645, 15, 1519, 67, -1249, -1131, 1213, 1295, -309, -1418, -396, 1248, 980, -1071, -1197, 393, 1650, -102, -1559, -552, 1193, 1034, -891, -1616, 144, 1378, 501, -1299, -957, 801, 1460, -380, -1646, -666, 1314, 1302, -1083, -1527]
6376a527J973J077j051j966N54J825M21j667j009J602J190p75j984N5K053Q26
6392A597j620j571J095J943k20k040p05J905J145j163j475J30J872M51j689j452
6408a797J536J516l79k030k94J965Q94j130j782P90J814L08k010j037J741J609
6424A714j045j929k0K189P17j725j661J296J846m17k243k29K116J147j381k138
6440a763O69K172L52k228j135J694J828p71k211l8K145R18j709j475Q08K211j03
6457A364k153o80J535J710j190k088M33J940Q13j924j396J156K129p83j681p70
6473a585J799J677j620k004R02K099J05k115r86J631J925j299k086L11K010J053
6489A817k016j542J032K130k97k030o38J695J478j295k030Q13K138L08j745j501
$$ y = [-1527, 446, 1523, 472, -1494, -940, 885, 1306, -361, -1370, 232, 1422, 647, -1337, -1282, 771, 1597, -23, -1594, -499, 1444, 1224, -816, -1521, 384, 1529, 366, -1109, -979, 893, 1344, -345, -1797, -261, 1255, 876, -1154, -1448, 517, 1411, 281, -1501, -711, 1103, 1411, -599, -1636, 105, 1714, 669, -1260, -1280, 909, 1626, -99, -1760, -464, 1382, 965, -1278, -1507, 609, 1756, 375, -1763, -1094, 1078, 1430, -798, -1933, -239, 1589, 818, -1393, -1431, 714, 1632, -77, -1552, -744, 1467, 1364, -789, -1469, 66, 1776, 586, -1502, -1069, 871, 1684, -240, -1636, -480, 1649, 866, -815, -1585, 214, 1891, 271, -1733, -831, 1268, 1373, -742, -1728, -97, 1828, 529, -1557, -1246, 764, 1817, -199, -1741, -709, 1421, 1124, -906, -1544, 151, 1629, 334, -1696, -883, 1255, 1563, -182, -1683]
6505a683J409J839n17k726M51J866J026j556j711Q16K162K58k359j080K046J513
6521A754j006k482N46K206P72j859j314J069J898m92k071n42K243R29j460k039
6537a848O48K715J35k047j495J950J236m35k337L18K031Q05j403j958J041K276
6553A632m44k279n07K060J228j059j940J54K175O92k094j618J481J872m42k157
6569a246k75K292J107j827j783R33K091K92j997j392J805J692p21k263n7K348
6585I99Q62j894j850J294K358n66k447l46K042J395j372k171P24K338J15k198
6601g17j081J624J549k68k539k96K034J528j846j685Q33K355k72j973j238J936
6617e6J956j188k152K04K250O23j819j719J456K019l62k281n39K126J283j583
$$ y = [-1683, -274, 1565, 1048, -1678, -1227, 639, 1665, 109, -1602, -786, 1376, 1634, -725, -1805, 241, 1754, 748, -1734, -1188, 1018, 1790, -69, -1383, -314, 1584, 1092, -979, -1521, 722, 1651, 191, -1848, -1200, 1515, 1650, -397, -1892, 58, 1294, 859, -1478, -1160, 871, 1676, 273, -1685, -644, 1632, 1188, -1091, -1598, 462, 1690, 631, -1309, -1155, 1020, 1712, -382, -2000, -519, 1353, 911, -1246, -1521, 771, 1878, 51, -1732, -799, 1292, 1584, -413, -1805, 0, 1692, 971, -1292, -1349, 999, 1861, -33, -1883, -589, 1769, 1203, -1244, -1590, 452, 1847, 475, -1696, -972, 1366, 1481, -717, -1798, -174, 1375, 1107, -1432, -1728, 306, 1834, -12, -1697, -864, 1491, 1219, -754, -1992, -56, 1900, 712, -1440, -1236, 1014, 1637, -182, -1901, -445, 1574, 1212, -1069, -1608, 518, 1801, 218]
6633B18j804L81K717N8k225j221J803J959j016k095m37K414J243k182j606J283
6649e10K133m31k340k93J676J547j236k363O71K506J86k062j205J350K006o60
6665I75k332k39K223J354j714j854L56K534L07k244j113J628J569m72k718Q4K576
6682I20Q34k093j587J503K005l47k141q13J914J660j699k064Q27K497K14j819
6698a89j590J726J870p60k581J50J981J237j738j786O98K347R8k318j230K265
6714A80J553r31k274Q3K252O26j691j747J573K135o85k318k27K033J504j568k171
6731a673P13K042O08k311j156J568J954p81k424J12K433Q26k054j664J093K454
6747A740m58k530n31K059J437j398k150N70K715M56k409j569J941J542n70k159
$$ y = [218, -1586, -1205, 1512, 1570, -655, -1876, -73, 1886, 870, -1225, -1662, 752, 1995, -187, -1793, -510, 1623, 1192, -1148, -1441, 235, 1782, 546, -1817, -1146, 1360, 1546, -516, -1721, -371, 1635, 975, -1357, -1596, 627, 1981, 267, -1587, -1231, 1303, 1610, -634, -1747, -119, 1450, 978, -1740, -1656, 920, 1754, -339, -1926, -423, 1582, 1235, -906, -1719, 195, 1855, 156, -1908, -1081, 1416, 1630, -189, -1779, -53, 1817, 1057, -1524, -1374, 607, 1844, 106, -1680, -982, 1365, 1463, -855, -2085, 180, 1733, 802, -1472, -1389, 863, 1489, -202, -1949, -376, 1759, 1074, -1244, -1471, 562, 2066, 498, -1673, -960, 1082, 1690, -621, -1777, -209, 1745, 964, -1460, -1348, 1085, 1911, -143, -1807, -714, 1740, 1282, -1248, -1779, 280, 1717, 319, -1831, -1261, 1454, 1910, -499, -2068, -127, 1415, 845, -1314]
6763a314k36K147J285j639j963Q37K523j80k366r45J863J611p74k497L93K044
6779G89P83j620j762J505K083m53k540l69J614K033j899j785K67K625L17k407
6795h19j160J698J955q56k222p7K327J161k001j968J333K041lk558q28J991J622
6812A636j096k323L88K617N31k125j601J780J942n28k358n02K172J080j153k357
6828a897R73K412N4k120j168J692J669q74k230m1K417Q45j789j877J502J883N6
6845A507k512p02K014J638j756j927N82K339K72j961j163J289K267p63k443r8
6861a417K074J145j611j645O52K195J54k373j096K108J466o99k092k68K391P17
6877A701j632j702J046J945k49j937q85K119J625j558k350O21K575K93j969j426
$$ y = [-1314, -1550, 597, 1882, 243, -1720, -883, 1640, 1460, -906, -1851, 12, 1623, 849, -1648, -1255, 789, 1572, -48, -1810, -305, 1778, 1325, -1215, -1584, 30, 2063, 164, -1621, -1354, 1271, 1588, -819, -1979, -281, 1674, 818, -1404, -1481, 846, 2007, 6, -1962, -629, 1412, 1409, -1149, -1977, 14, 1636, 540, -1783, -1395, 1222, 1753, -372, -1973, -193, 1749, 1221, -1137, -1639, 533, 1613, 460, -1897, -924, 1488, 1542, -578, -1746, -54, 1615, 741, -1489, -1530, 887, 1732, -57, -1934, -432, 1451, 1507, -1005, -1707, 307, 1945, 189, -1738, -1156, 1183, 1455, -506, -1669, -380, 1887, 1124, -1319, -1417, 657, 1802, 191, -1454, -802, 1393, 1547, -826, -1922, 186, 1652, 953, -1139, -1407, 984, 1701, 69, -1633, -587, 1358, 1109, -828, -1713, 406, 2031, 473, -1877, -1256, 1319, 1612, -357, -1783]
6893a783J549J937o85k372M6J841J270j893j679Q21K373M5k233j129J926J689
6909A723j079k471M71K291R04j881j867J363J986l03k094r18K514J394j672j964
6925a603L81K562N72k643r56J439K045o65k672j61K485J422k169j716J104K211
6941A636n36k057q61K060J573j216k318N29K132P70k307j286J695J865p17k060
6957a098n71K195J338j843j930J081K179L3k349o98J911J492q42k379N36J895
6973I50O75j871j541J166K113k69k148p62K270R18j131j969O67K287K50k217j436
6990b048J814J975n86k121k73K013J091k064j456Q71K524k59k379q98J873J416
7006A493r53k162L51K317M73j827j712J519K341p83k345O2J708J393j396k407
$$ y = [-1783, -234, 1703, 1018, -1354, -1308, 533, 1803, -90, -1769, -948, 1425, 1470, -763, -1892, 34, 1723, 644, -1827, -1356, 935, 1839, -42, -1909, -546, 1440, 1137, -957, -1875, 639, 2033, 361, -1603, -1222, 1340, 1912, -731, -1687, -248, 1797, 1132, -1540, -1701, 784, 2206, 37, -1679, -575, 1636, 1100, -957, -1818, 242, 1815, 599, -1719, -1190, 942, 1712, -595, -1881, -186, 1679, 962, -1098, -1669, 526, 1864, 21, -1909, -828, 1351, 1384, -965, -1663, 248, 1740, 898, -1481, -945, 950, 1625, -246, -1787, -621, 1492, 1223, -925, -1687, 583, 1501, 370, -1599, -932, 1355, 1605, -612, -2048, -234, 1741, 1155, -966, -1239, 774, 1865, -199, -1655, -784, 1740, 1481, -898, -1796, 77, 1493, 540, -1622, -1271, 1046, 1519, -308, -2020, -501, 1840, 1057, -1288, -1226, 482, 1875, 479, -1928]
7022a928J299J870L82k238j171J512K024r91k219j59K110J242j713j700P90K274
7038A384K3k424o08K090J037q26k415O11K228L61j795j616J588J976o31k219k60
7055a496J842J224j300j907P73K132L21k232r19J683J405o84k045k48K510O11
7071A670j737j476J024J920l29k026p12J682J760j383k028M63K155N83k065j355
7087a854J674J750o08k210r3K065R83j710j854J125K141O7k086j012J573J522
7103A473j043j734P0J890J332k194j893J834J975p16j809p81J949J342j519j799
7119a623O32K276J42k178o91J143K258j400j950J19J895P60j449j834J143K555
7135A798m28k207n23J779J167j128j764N35J772O87k251j214J576J799n67k386
$$ y = [-1928, -629, 1241, 1623, -615, -1786, -274, 1750, 759, -1460, -1619, 491, 1733, 20, -1680, -890, 1384, 1407, -1017, -1625, 465, 1502, 676, -1739, -1128, 1100, 1461, -334, -1950, -362, 1614, 983, -1236, -1496, 346, 1570, 270, -1637, -864, 1268, 1589, -643, -1562, 121, 1526, 842, -1203, -1451, 1059, 1670, -67, -1543, -519, 1401, 1072, -954, -1666, 16, 1776, 393, -1635, -1172, 983, 1566, -499, -1854, -180, 1570, 962, -1248, -1341, 724, 1707, -3, -1857, -732, 1409, 1476, -610, -1622, -49, 1473, 430, -1304, -1234, 656, 1988, -206, -2099, -265, 1710, 994, -815, -1596, 353, 1695, 176, -1623, -991, 1285, 1427, -751, -1442, -299, 1959, 559, -1391, -1272, 623, 1383, -66, -1900, -757, 1798, 1370, -837, -1360, 419, 1586, 458, -1306, -771, 1001, 1688, -563, -1777, -201, 1598, 1031, -1355]
7151a355o2K008R70j468j772Q13K028K38j921j043J561J755j069k156K22K352
7167A101M66j684j546J223J964m38k051n14J782J087j022j710M83J654N76j732
7183c61j510J646J669o01j991q6J969R59k064j048P33K048j98j751p93J444J783
7200A848j281k198M60J828P95j519j528J118J515Lk019o19K362Q59j206j674K78
7217i78K179K71k227q20J785J343r41j600l61J958P49j486j321Q45J820k17j955
7234i56o40J673J394j222j409O8K001O17j835j300J227J984n53k200j36J785J059
7251A557j329j641P43J710O1j724o56J327J352j060j635K61J877M65j167j644
7267a503J110J471K47k019q93J740J080q82j595L77J621M54j823r36J108J604
$$ y = [-1355, -1417, 591, 1561, 93, -1679, -866, 1162, 1400, -521, -1564, -3, 1752, 683, -1473, -1251, 1101, 1567, -117, -1663, -440, 1524, 1086, -965, -1479, 303, 1390, 368, -1342, -859, 795, 1371, -361, -1871, -225, 1444, 843, -1148, -1234, 735, 1694, -370, -1418, -685, 1363, 1165, -586, -1379, 65, 1848, 567, -1631, -1171, 657, 1452, -67, -1595, -477, 1038, 1041, -978, -1597, 765, 1624, 418, -1256, -978, 1201, 1472, -755, -1575, 210, 1553, 612, -988, -1349, 609, 1358, -128, -1449, -604, 1216, 999, -956, -1596, 77, 1471, 249, -1160, -1092, 909, 1526, -309, -1609, -382, 1602, 1049, -1151, -1287, 498, 1557, 228, -1413, -670, 1040, 1101, -623, -1279, 48, 1400, 340, -1295, -1034, 843, 1308, 141, -1503, -393, 1078, 1325, -694, -1587, 153, 1233, 351, -1244, -867, 754, 1208, -615, -1551, -443, 1161]
7283A161o12j659j89K094O41j257j599R69J588J26j868o86J559J114r64j509q8
7300a179K041M47j349j481J025J532l15j481o83J724R64j057j634R06J494K05
7316A159j457j047J395J517j045j525r9J807O43j618j188P50J660R8j566o68J325
7333A41J311r49j655L09J661J91j387j013J202J508j62k242q8J711R51j569j125
7350a205O85J441j25j372p42J115J402o08j583p2J691O35j384j249O38J705Kj720
7368g46m74J381J159r47j245J8J707L58j645j022J280J325n05j574l05J815P20
7385A300j086j336N70J640o5j486q94J409J254q31j372K59J387L40j125j151O41
7402e46J790n21j665n22J742P81r96j079O04R70M65j484p19R94J469o75j610j00
$$ y = [1161, 549, -1110, -1299, 795, 1436, 179, -1420, -451, 1137, 1263, -605, -1291, 268, 1382, 418, -1091, -1179, 862, 1309, -40, -1521, -496, 1036, 721, -760, -1443, 281, 1245, 188, -1446, -540, 954, 1159, -298, -1345, 50, 1567, 522, -1003, -1102, 705, 1348, -270, -1458, -708, 952, 1050, -516, -1184, 141, 1452, 503, -1152, -843, 818, 1009, -378, -1391, -189, 1319, 1157, -1085, -1173, 538, 1489, -80, -1205, -520, 921, 796, -576, -1318, -203, 1199, 591, -992, -1064, 627, 1262, -122, -1371, -733, 972, 974, -746, -1220, 161, 1320, 373, -872, -854, 853, 1211, -434, -1456, -176, 1149, 644, -930, -1235, 580, 1300, 214, -1122, -552, 1088, 1023, -463, -1357, 52, 1306, 475, -897, -638, 749, 1089, -36, -1187, -546, 1244, 723, -942, -1464, 278, 1059, 63, -1016, -412, 558, 1023, -461, -1180, -186, 1283, 608, -1002, -1102]
7420a102J535P17j234j135J155J004K2j568l78J069R91o68j600L91J519L21j503
7437d64n47N46J640m62j451l82J513N96p46j171P2J647K79j291r01J042J060l75
7455F05j567j19J503N15j036r06L84J426J98j720m85J350R76p60j382M76J229
7472F87K50j027p93M94J514o08j228l56J205Q69r29j107Q5J722K1j252p19J086
7490h6J254p51j301OJ601K56j038j197Q12J672m50j409n87J516P60p98j267J27
7508h80J536q6j166m40Q52J320n03j436K76O78R05j047q72N35R59J21j281l91
7526i20P67J325p31r87MJ272K95j052j001Q01J176m36j024k61R45O34n66j270
7544a029L62J337K08j375q70J209J295o52j154k04J372M64j244n00L98J172j50
$$ y = [-1102, 433, 1150, -84, -1219, -64, 940, 962, -606, -984, 85, 1076, 408, -1192, -801, 718, 1039, -464, -1011, -465, 1175, 713, -738, -1120, 393, 989, 243, -928, -856, 791, 1070, -221, -1122, -80, 980, 605, -962, -1081, 422, 937, -99, -1005, -621, 805, 1003, -717, -1202, 148, 1124, 364, -1018, -542, 687, 937, -90, -883, -389, 1125, 517, -711, -1067, 138, 1007, 78, -1029, -944, 778, 799, -453, -1172, -86, 1168, 417, -884, -878, 723, 979, -59, -1256, -444, 1228, 778, -631, -1218, 298, 1058, 260, -1007, -880, 656, 570, -596, -1036, -184, 1136, 633, -803, -527, 151, 1056, 9, -863, -328, 631, 752, -529, -920, -153, 1172, 441, -546, -542, 730, 1025, -27, -1028, -227, 949, 513, -511, -772, 173, 807, 241, -1029, -667, 670, 878, -497, -1367, -158, 1137, 485, -669, -873, 499, 963, -281, -781, -383, 789, 639]
7561F39j094l64R17P30n02j048K43J135M14j241r91R68J164l03j294k27J139N71
7579H56p16j077M01J432q5j280n67J117O44j34j226n5J018P06r88q31M29R54J47
7598G45j335j71P49R39o42j058J38J102K73p34j067J025Q39n62r73q3J109K53
7616E47n62r36N78J006K74j082p09Q64Q60n96r55K51P53O30j145n97N21R94k77
7635D19p92j71O95Q92o44j084R7P73P82j255p34R32J010n58j054J48J232L08j207
7654b11o68O30P18J47j081l66Q54N26j38j227N85Q85N9q28o36O65P57k12q91o05
7674a037J160N67n98q44K40Q39J42n89m87N03R11o82q03K08R33L08r07n86J98
7693e24J068J18r10l88Q11R23p72j254L54J252j36q55o31R15M54J00j246N0R37
$$ y = [639, -455, -819, 98, 828, 326, -722, -479, 656, 1070, -171, -1162, -194, 970, 667, -627, -854, 285, 856, 140, -937, -536, 896, 811, -469, -1036, 81, 725, 591, -635, -690, 328, 1034, 46, -785, -356, 598, 745, -590, -761, -12, 927, 285, -773, -635, 467, 740, 6, -1061, -36, 803, 241, -732, -815, 294, 547, -15, -951, -373, 633, 907, -175, -884, -20, 840, 244, -711, -460, 293, 923, -222, -819, -298, 696, 419, -373, -544, 151, 1043, 399, -685, -588, 185, 967, -288, -1022, -90, 920, 362, -692, -544, 688, 996, -211, -879, -249, 469, 616, -465, -831, 23, 549, 411, -816, -231, 654, 713, -115, -751, -86, 671, 459, -432, -1037, 123, 690, 92, -752, -512, 327, 469, -120, -607, -104, 807, 125, -678, -470, 463, 771, -136, -722, -524, 544, 662, -248, -636, 175, 1098, 326, -928, -574, 678, 542, -313, -944, -29, 425, 525, -721, -671, 266]
7712B66N86n75q91J86J078M6j110j48N81O31k79j035N0J044J55q68p26Q78P55
7731F24m72o62RO23M19j05r70K27P60K55j091j42O7J165n11p72N1O74N11n94q11
7752g45M65O75O4r65j61N69O17o5q53j02J023J73o08q69O51O66k11q29J66M31
7772I2L82l83m90%Q63j50n69n37O82O76l78q38L19P61K13m62q10L27P96L8j031
7793d99MR00K73r17l91M10M59J02m28n26O42N17j72q00r3P63M84q44l31M24N35
7814E12J19p03l70N51L68l79m31j85P25M38p42o55N60L31J54q74J85N03K30N0
7834C87r21L09K70K28o11j93N45O09l42n91n5P46J56p67j52M07N79n20p11K85
7854c42M34L66m10l99k8P06q8l28l06J83O80m54j56l66P79L28m81o56L23P76j27
$$ y = [266, 852, 277, -614, -428, 650, 696, -414, -562, 19, 650, 371, -664, -614, 430, 585, -283, -1009, -131, 624, 152, -510, -501, 122, 541, 436, -534, -307, 453, 708, -383, -525, -458, 707, 196, -576, -525, 149, 660, 66, -745, -280, 395, 459, -506, -667, -98, 519, 454, -399, -501, 522, 695, 87, -782, -131, 535, 324, -505, -339, 92, 474, 91, -399, -399, 464, 314, -255, -792, -110, 566, 188, -650, -331, 430, 643, 181, -629, -302, 494, 532, -499, -495, 405, 678, -239, -630, -220, 239, 341, -87, -613, 29, 546, 374, -426, -519, 244, 728, -116, -447, -23, 512, 631, -72, -442, 109, 477, 98, -333, -518, 207, 645, -97, -752, -192, 139, 293, -581, -396, 107, 337, 387, -534, -225, 45, 273, -338, -531, 14, 623, 281, -310, -365, 381, 537, -230, -382, 25, 604, 84, -627, -342, 92, 458, 48, -351, -379, 327, 239, -89, -395, -212, 468, 14, -142, -508, 271, 599, 118, -538, -215, 561, 434]
7875D34n89j71L19O18p14j79K7O12K0o34k65L15O99O4o98p5N28j47m27q5P9Q35
7897E66l63k46l37L67M17l94l82M4M68K25l82n28K79Q63J9p72k48N23K86l65j73
7918a33r9M11J76m89k80M94J66l48k44N1M92P9k54q2j68K07L16l01l38M56L70
7939D82m09n6k14M85qk29l70J83N08on78q5O25j8l90j45K63J86N5m91L9N6O63
7962E46o20pJ45J31O7n43O3K09K89j36m09k08L65K96j34m80J08O60k8k75j42O9
7984c4K72j78k3n73M61M08l36l19K06M42L6l29k93N07M9n48l9Q8M48l1l19k45
8006c50M52L4K15n45J7M87j50j95j92N49l03K07l86OJ70K51j96oj26L09k61l30
8028c43K1L31L29l59k78M14k22M26j42l12J11K26r4k41K04k05L60j47l83K82L38
$$ y = [434, -155, -326, -7, 611, -103, -282, -255, 357, 377, -257, -522, -207, 492, 556, -142, -217, 311, 164, -263, -348, -269, 566, 203, -43, -380, -13, 404, 10, -372, -328, 140, 365, -17, -545, -266, 597, 616, -156, -404, 119, 405, 40, -133, -232, 179, 355, -134, -414, 80, 246, -102, -346, -295, 197, 276, 22, -60, -228, -21, 295, -6, -344, 112, 482, 73, 17, -197, 288, 280, 51, -319, -136, 372, 366, -212, -297, 328, 310, -80, -225, 38, 224, 279, -212, -173, -117, 546, -74, -81, 64, 195, 262, -281, -218, -9, 280, 144, -265, -473, -108, 188, 54, -426, -318, 342, 314, 39, -103, -34, 238, 60, 37, -536, -75, 333, -3, -322, -116, 326, 362, 33, -260, 247, 296, -252, -291, -203, 245, 214, -105, -350, 102, 136, 351, -194, -177, 310, 160, -35, -227, 322, 19, 226, -160, -154, 16, 267, 71, 65, -61, 248, -13, -343, -322, 9, 338, -21, -299, 115, -107, 319, 177, -135, -24, 202, 108, -133, 71, -134, 226, 79, -304, -22, 316]
8049C16j23l65k78L69K97l10j10J2N07j29j88j31m0M92l6j18m08K83J80Km27j60
8071c65O09j16k84k99M56N29q76J2Q1J68M38m80%P6L50K4m11j36K57P9N6l80J77
8094c5K14m5n12L9N83k01p7n9J92Q5j16q5j84J50J19J16k87L3K04j90n9o9L01
8117A17Mk08j29N2K96j39N7k87K11j5K37p39N71l25N52k58l27J16K65Q7l4q7j30
8140a13M92k02m41n7J72P9J30j82N5L31P3n75J14k4K78O3k83J37j44M88o28J38
8162i9K87j64k84L92n98L00K93m1k86o2L68r1j16k04J04L71j4j48j12L33N5n08
8184b24J74K62k4J2o05J03N13
$$ y = [316, 193, -172, -450, -81, 216, -94, -204, -192, 315, 186, -2, -133, -173, 319, 283, 165, -243, 40, 220, 222, -205, -365, 244, 128, -156, -455, 1, 530, -346, -334, -253, -85, 353, -127, -127, -51, 299, 323, -88, -224, 33, 112, 168, -212, -35, 179, 134, -378, -339, 244, 43, -34, -93, 99, 184, 68, -17, -201, -51, 68, 184, -103, -70, 134, -56, -115, -184, 117, 121, -87, -216, -164, 132, -7, 50, -237, -26, -41, 196, -543, 28, -297, 255, -3, -330, -214, 51, 138, 104, 17, -113, 379, 177, -264, -321, -149, -70, 60, -122, -67, 264, 337, -238, -124, -148, 130, 193, -90, 47, -97, 391, -237, -99, 188, 24, -260, 132, -466, -166, 127, 86, -200, -262, 106, 15, -101, -305, -201, 170, 156, 8, -104, 229, 284, -224, -50, 212, 188, 200, -405, -302, 211]
8191B11
$$ Imaginary data points
##PAGE= N=2
##DATA TABLE= (X++(I..I)), XYDATA
0@%%%%%%Qq%qJ6j6J6k4L2m0N6p2Q1r7J20j44J68j96K36k74L15l65M22m84N53o30
32c35P15q09R14j028J152j292J446j611J789j988K208k442K697k981L289l624
48a900L994m402M848n340N889o498P180p956Q840r853J1034j2433J4118j6192
62h671J8820k2272K7018l3981M5194o6129J18052m82374o75621J148544N39988
73F08568o32913l18233M76973J58327j07354k281j65688j96391M94544M54399
83G69951n90345o78813N04340N68964n35898n27494M87847M35972l10767l19365
93a95608J8900O2753K46353K27021l63381m08346M34314M59437n29872n29998
103e78427N39505N53210m43930m93807K47738K56255j01294J9788O221k11632
$$ y = [0, 0, 0, 0, 0, 0, 0, 8, 0, 0, -8, 8, -8, 8, -16, 16, -24, 32, -40, 41, -56, 64, -80, 88, -108, 128, -146, 169, -196, 226, -258, 295, -335, 380, -429, 485, -543, 609, -683, 763, -848, 941, -1047, 1161, -1281, 1416, -1565, 1724, -1900, 2094, -2308, 2540, -2800, 3089, -3409, 3771, -4185, 4655, -5198, 5836, -6597, 7521, -8671, 10149, -12123, 14895, -19086, 26108, -40021, 78031, -404343, -1079964, 68580, 608568, -24345, -342578, 134395, 292722, 185368, 183087, 17399, -178992, 315552, 769951, 179606, -499207, 5133, 574097, 38199, -489295, -1448, 434524, 123757, -195608, -176708, -113955, 132398, 359419, -3962, -412308, 22006, 481443, -48429, -578427, -38922, 514288, 70358, -423449, -175711, 80544, -20750, -962, 5259, -206373]
113b06373J69918M10017l58436o54777L90322Q04839k42236o91864J44705M65406
123B31521j22139k55391R0852P5183N0333K41581j03773n58027K8635O68027l9717
134C07085o98547Q4127O71037j14735o18242Q129L84973Q4544k8502l4023k24631
145a78785J1228M60813M4854o08566o5790P35067J44876p17464k04695N48089
155A69627J74472l23053j14183N0761J0025J67043L3624m15639j26589N81660
165B07748K32470o43829l40619N52154L40240m07618k49930K81629J85039o0726
175I6558o2434j89724j10468M07513L13709m88109m11993N03919M09579n22737
185e4187m38538M16158M06438k24906k71373L2468O7607J08819J34713k13134
$$ y = [-206373, -36455, 373562, 15126, -639651, -249329, 555510, 313274, -378590, -233885, 231521, 109382, -146009, -55157, 20026, 70359, 311940, 208167, -349860, -321225, 346802, 307085, -391462, -307335, 363702, 248967, -369275, -361146, 23827, 108371, 79869, 45846, -178785, -167557, 293256, 338110, -270456, -336246, 398821, 543697, -173767, -378462, 169627, 344099, 21046, -93137, -42376, -32351, 134692, 168316, -247323, -373912, 207748, 440218, -203611, -544230, 7924, 348164, -59454, -309384, -27755, 157284, 96558, 34124, -155600, -266068, 141445, 455154, -32955, -444948, 58971, 468550, -54187, -492725, -76567, 329871, 104965, -166408, -133940, -66333, 42486, 177199, -35935]
195c5935k82501L48141M62761l79705n59594L34515N45585k41849m39897J24300
205a24179K71212p383q7403j24320j43690J82794L29126k15342m84830J96744
215b07271N67908j47106n55046Q9826M58658k0624k75828k6217Q0865J03552J65827
226B34544j27985l75889J03034N01393p1284n64651J4883N38616K0190m73702
236b00851q6767K92125Q6920p9746n3488j25717K9983L40916K9467m82427p5768
247c25353N66260J53951n18211j72258M26053J86501k74123j77507O2777R3318
257B1408J26089J3755k90287j35061L86055J98494m71579k77515M56910L15312
267C43581l41303k71238J97299J90805m3001r2279r8982O443K62402J38562l48331
$$ y = [-35935, -318436, 29705, 492466, 112761, -446833, -112318, 433267, 191418, -248479, -124179, 147033, 139650, 52247, -72073, -215763, -32969, 296157, 80815, -404015, -207271, 360637, 213531, -341515, -251689, 206969, 186345, -89483, -115700, -34835, 68717, 234544, 106559, -269330, -166296, 335097, 263813, -300838, -285955, 252661, 272851, -200851, -287618, 4507, 91427, 11681, -41807, -167524, -137541, 203375, 232842, -249585, -325353, 240907, 394858, -123353, -295611, 130442, 316943, 42820, -134687, -71910, 21408, 147497, 161252, -129035, -264096, 121959, 320453, -151126, -428641, 28269, 343581, 2278, -268960, -71661, 119144, 76143, -16136, -115118, -108675, 153727, 292289, -56042]
278e6042k74942L49626L38735l24055l53524K57407L08261j64461k35680R582
288a45093Q8259J25871Q3116k10202k20320K63880L35971k53943l83258K32916
298h2803M11535j55552l66213O1195K51898K6708q5243r1436j06499J10186K37800
309B11576j57817l72750J57802M57629j07225m65444J6762L69509M1564k27026
319g5420m9032J16415R8959N2319j14052k36756P9559L87177L210m25426m7230
330b10277L97446M6514l66349j00666K43915J38917o6926j33325j21508N8290
340a13969K38616J1272l07880m8883L80828J21506l81072j74908L15627K00517
350B41654j74596j54793L0927Q3192R1793l0917k23996m2662L16369J19306l66990
$$ y = [-56042, -330984, 18642, 357377, 33322, -320202, -62795, 245466, 81005, -154675, -145093, -56834, 69037, 152153, -58049, -278369, -14489, 321482, 67539, -315719, -82803, 328732, 173180, -193033, -131838, 120060, 146768, 61525, -29911, -136410, -26224, 211576, 53759, -318991, -161189, 296440, 189215, -276229, -259467, 110042, 151606, -75420, -124452, -8037, 90922, 143241, 29189, -207567, -128008, 259169, 262379, -163047, -210277, 187169, 233683, -132666, -233332, 10583, 149500, 82574, -50751, -172259, -113969, 124647, 135919, -171961, -220844, 159984, 281490, -99582, -274490, 41137, 241654, 67058, -87735, -56808, 26384, 118177, 87260, -136736, -179398, 136971, 256277, -110713]
361a10713k20586L14670K55580k24024k24613J44371J79544m4348j10936p6032
371a17087K2116K17260J34431k61238k38708K52041K69605k37446k80610J95817
381d3819K83540j04731k54765m3487J13962J12088K6851j37439j32803J67312
391a3291K25444j91463l13199J68295L67716o7509l00941k172J99324N3413r4481
402C1136j01968j1602J47853J33819j63253k66939J01940L22043m2388l25227
412a74586q658K77584M0324k04803p8978R8783J28834O2674j17692j93679P7406
423i2791K77347j9391k97107j3821L05218N7456k90205j31988J85936J48445n4319
434G4780j14332p3381M9174J55471j8242k46130k2266L22641J11878k98706j66491
$$ y = [-110713, -331299, -16629, 238951, 14927, -209686, -65315, 114229, 69881, -41055, -117087, -94971, 122289, 256720, -4518, -243226, 8815, 278420, 40974, -239636, -43819, 239721, 134990, -119775, -163262, -49300, 62788, 89639, -47800, -180603, -13291, 212153, 20690, -292509, -124214, 243502, 175993, -124948, -127120, 72204, 125617, 31136, -70832, -82434, 65419, 199238, 35985, -230954, -129014, 193029, 150641, -174586, -183244, 94340, 134664, -70139, -149117, -50334, 78500, 141174, 23482, -170197, -92791, 184556, 165165, -131942, -145763, 159455, 216911, -73294, -205282, -19346, 129099, 74780, -39552, -112933, -63759, 91712, 73470, -172660, -194926, 127715, 239593, -59113, -225604]
445b25604K21829J79696j20695j45997M8969J30137N3125q5657j70523j9579K27661
456I3362J11618k43854j79598K12045J88901j83875k03445J04304J88240P932
466I5630j24489j01712M0215J69119O1663j79870j25855J90755J95743j67609
476E3590k39210J14125K42818l4391j92150m9151Q9715R1606p402j38795p9806
487a49051J66975J65684j59113k39206J00738K63572k1787k22918j7241J80769
497F8422O4114j10378j10310M339J33648J18147j14270k09281O4816K33164l9678
508A02733k51598j2160K30359P3067j68080j22467O9975J30309L2540r9394j03385
519a18101P8279J87230k6167k34041k7372K45645Q4037k01948j18755J23248J23004
$$ y = [-225604, -3775, 175921, 55226, -90771, -41802, 88335, 141460, 55803, -114720, -134299, 93362, 204980, -38874, -218472, -6427, 182474, -1401, -204846, -100542, 87698, 95630, -28859, -130571, -90356, 78763, 140426, -39444, -165299, 25456, 221199, 53590, -185620, -71495, 171323, 136932, -55218, -104369, -14654, 76952, 69550, -69245, -149051, 17924, 183608, 24495, -214711, -113973, 149599, 127812, -95106, -112347, 68422, 132536, 22158, -88152, -83813, 49835, 167982, 53712, -155569, -90753, 142411, 102733, -148865, -161025, 69334, 142401, -25679, -148146, -78171, 52138, 84678, -14716, -118101, -39822, 147408, 121241, -112800, -140172, 105473, 189510, -12438, -131193, -7945, 115059]
530A15059m5581j26757n2700R3165J24500n2318j88344j8346K10747Q7075j94344
541d7844j26237J63025J53886r7054j43723K7985J28493P1398o8666j41682j741
552h2160J73416N9567j83402j17347J59610J56325j21795j91466L9719J65752
562E8219K5499j13826p6379N2651J24001K0577j54663r2764J62317J63461j15509
573E3584j82589O4063J77505q003j58591n6110J10105J07079l9222j37916n2175
584a22270J24606J17157j04220j66043P3980J96233k1484j84786l0472J46657
594B9358Q7927o9928j10740K503J21543O8270j08546j30047O9475J68955k4006
605A04764j94119m1222J65446P5605j23463j02616N6513J08511J3033j04663q3807
$$ y = [115059, 69478, -57279, -109979, -16814, 107686, 55368, -132976, -151322, 59425, 146500, -47844, -174081, -11056, 142830, 45776, -97947, -69962, 58531, 129929, 61263, -80419, -82160, 91256, 150823, -32579, -149926, 9684, 166009, 44214, -147252, -107533, 58219, 83718, -30108, -106487, -53836, 70165, 90742, -63921, -156685, 5632, 169093, 53584, -129005, -64942, 112563, 104560, -54031, -110141, -36, 107043, 67821, -70095, -122270, 2336, 119493, 15273, -150770, -76790, 119443, 97959, -86827, -117299, 29358, 117285, 47357, -63383, -60880, 60663, 128933, 20387, -109660, -40185, 128770, 104764, -89355, -130577, 34869, 110474, -12989, -115605, -59092, 49419, 62452, -42211, -126018]
616a26018Q7072J52046k9072j67173k0053J64846P0248j37023j04088J01404J33598
627A25787l8341j37543m6744R0530R8478m4976j39819n454J55928M6993j58630
638e3791j00774J17928J39177m4673j31765j0171J16939O3764p9433j01235L5615
649d8419J40199L3812j44053r7245J12834J25021p6709j37635K4533J24459K5928
660H2725j06266q6539N8954J25537L887j28222n7611J12601J04780p7382j29101
671i6637M5887J48412N876j35288o1831Q4807R5679k5122j12498l5266J05611
682A9630P1813j00433j20545N9525J48558K843j40426n3608J10726Q6018o5629
693A8472r4627K8797J14792M0894r9764j00794N9704J31636j2811j31416k9895
$$ y = [-126018, -38946, 113100, 84028, -83145, -103198, 61648, 131896, -5127, -109215, -7811, 125787, 87446, -50097, -96841, -6311, 92167, 47191, -92628, -98082, 57846, 104839, -53791, -154565, -36637, 102540, 57867, -73898, -84069, 32870, 96634, 17201, -84034, -48419, 91780, 125592, -18461, -115706, -2872, 122149, 45440, -92195, -67662, 56797, 82725, -23541, -110080, -51126, 74411, 78298, -49924, -107535, 5066, 109846, 32464, -96637, -50750, 97662, 103538, -31750, -93581, -8774, 86905, 61783, -50715, -85981, 19630, 91443, -8990, -129535, -70010, 78548, 81391, -59035, -112643, -1917, 84101, 18472, -76155, -47358, 67434, 108328, 8564, -92230, -32526, 99110, 86299, -45117, -75012]
704g5012J11523O1083r4617j09425M0525J25690J7128j12949o8562P5850R9990
715G1224l3040j15189r57J30629N2937j06729q8436O3148J09991l292j02672m6668
727f9054Q1531P8004o0755j12258J4132J20409L6578j11182q8295P1319J07729
738F8158l0880j04129l377J00828N2912p4107r4448L3398J21472K3300j05826
749a2699n9099P8088Q1883n2952j10575P782J17768M0163j01397q4858N0420R6011
761E0535o208r7046k9996R7643P4189p0812j02889K8751J15026L0812r2281o6565
773f8841O7065R1154l8588j08236o045J01829M9509q1404r2739L4548J00489J554
785E0295r6260l6631P7984P0510m6325r5467Q036J10311M3880q6671p0343N6580
$$ y = [-75012, 36511, 97594, 2977, -106448, -65923, 59767, 76895, -36054, -104616, -28766, 71224, 38184, -77005, -77962, 52667, 105604, -1125, -89561, -26413, 83578, 80286, -22386, -69054, 12477, 90481, 29726, -82532, -68400, 52009, 88587, -22595, -110890, -39571, 68158, 37278, -66851, -70228, 30600, 83512, 9405, -85043, -51645, 69827, 93127, -12699, -71798, 6290, 88173, 35221, -75354, -67572, 50196, 90359, -11038, -95896, -45476, 50535, 44327, -52719, -82715, 14928, 89117, 18305, -84584, -55833, 59193, 90005, -2276, -68841, -1776, 89378, 50790, -57446, -63491, 38338, 87847, 6443, -86296, -51748, 48741, 50295, -45965, -82596, -4612, 65898, 19573, -75894, -67858, 42453, 86333, -338, -70681, -14101]
797a4101Q9222j8313r6333k0116R3732N9248p4821r4753K4618R4291J5191q5709
809b7844n1184O7340P7044m3200r5760K370R7093N0625o4609p7811L5363R5970
821F5397k285r7958k9455Q9011O7068n9670r4934J1400R1377K0352q0189n1433
833g1319N2409P2078k0060q9896k3024Q9655O4096o3387q0992L5214R1023M324
845F0121q2477l6198P0052O9047m0126q7674l242Q0468L8945o6656p1395L8332
857c0803Q3932j5754r2800j8933P9688N3966m5560p2512J0758Q1141K5630p0258
869a1505m8543N8701P8499k5833r2936j3638Q4663M1967o5330o1401L3309O6489
881D4442m201p3874m0879N9798P3698l2332q6751L328Q6317K7402p1517m9638
$$ y = [-14101, 75121, 56808, -39525, -59641, 34091, 93339, 18518, -76235, -51617, 42674, 57865, -27844, -79028, -11688, 65356, 22156, -73604, -71234, 25859, 76484, 11875, -65936, -30573, 65397, 63112, -34846, -64301, 24710, 91778, 32108, -62826, -51426, 39951, 60303, -19886, -71319, -18910, 53168, 33108, -56788, -79812, 9843, 73939, 10552, -70440, -35226, 55797, 60121, -22356, -58554, 11498, 80545, 40419, -47255, -50497, 29971, 68916, 2260, -69135, -30803, 53129, 37375, -55425, -74358, 5330, 59296, 13736, -58776, -48018, 33123, 58753, -11505, -60048, -1347, 77152, 51319, -41617, -55255, 29408, 71375, 6045, -55356, -22047, 44442, 40241, -33633, -74512, -14714, 58984, 26652, -60099, -56771, 29546, 56948, -14569, -64207]
893f4207N6225P4513j9826p5850j6516O1452M7530l7437p1683Q107Q0608J5465
905E8381q5452m7085O4449O4019l4240p2515p37O7269L1548m8976n0922K9606
917b4655P2326O419p3958l7933O6700O3976m4781p2095J7939O7098O361o1002
929a3605m2044L6730O3132q377p3227k5115O3173M7994m7736o3853L1658P9800
941D8530q38p2890k4719N3591M7633j9177n5181r603N8987L5792n8504o4291L6622
954b4048P5341j0819p7090j9087O0256L6130m2164m8889J7523N7010J9197m8116
966d756m8276L5322P1536j1434p3983o344O9193K5806n4901m7240K8053N5112
978C8088K53n5153l2125L5641M9468j7970o3877l003P1689K6051o4178m2806M6150
$$ y = [-64207, -7982, 66531, 46705, -29145, -45661, 15791, 63321, 25884, -45799, -37692, 42916, 58381, -27071, -74156, -9707, 54312, 20072, -52443, -53180, 14089, 45637, -3339, -54261, -24655, 47671, 54090, -19868, -57801, 8899, 72875, 28094, -44001, -26062, 41036, 47397, -13605, -55649, -18919, 44213, 35836, -37391, -62506, 667, 48661, 925, -62928, -31270, 48530, 47692, -25198, -49917, 3674, 51307, 32130, -23051, -32654, 26333, 62125, 3621, -60670, -24048, 51293, 40474, -36616, -55703, 4553, 40683, -1481, -50370, -32847, 24163, 43360, -4756, -53032, -17710, 53826, 42392, -31591, -37935, 31258, 57064, 2163, -45077, -17024, 38088, 38341, -16812, -48937, -13296, 36172, 18202, -45675, -48678, 23011, 49062, -15116, -57922, -11772]
991a1772N3968j2314m6623j1516M0485L6098k8139n6251P034O5947J8555o4336
1003h864m4854M5256N1332l1038n6640R925N1013J5748l5507m1146J2173N7662
1015B5060J6634n5215l1031N2119M7683l6789n8259J6448O0667P970m9812k9542
1027c4067K4499L7040l209m6376k3208M5956M3426m0044n9639K3324O3412N43
1039C1657n0429j6272L7729L2605j6949m0172k959M3593L0540l5524n2559J7024
1051b1716N9544m516o1063j0573M9950K1839l5219l6565P530M0838K0325l2443
1063b069l6396K3122N0847p521n6076o658N9509K6882m6037l7454K3688L5876
1075B7713l217l2319k0891K2306L8751j3758n5670o748N6378K3601m6272l3750
$$ y = [-11772, 42196, 29882, -16741, -28257, 12228, 48326, 20187, -36064, -29030, 36917, 55472, -8864, -53718, -8462, 42870, 11832, -44808, -34883, 16130, 31878, -3629, -44775, -32602, 25060, 41694, -13521, -44552, 7567, 55250, 18461, -39798, -23350, 37317, 45287, -4525, -34067, -9568, 27472, 24263, -22113, -45321, 635, 44061, 4017, -55622, -32298, 31114, 31657, -18772, -35044, 2685, 35290, 18341, -21831, -24790, 18803, 49343, 13819, -38740, -21716, 37828, 33312, -27751, -38324, 11626, 33465, -1754, -38319, -30789, 10049, 30374, -2069, -38465, -15343, 35504, 27983, -28093, -34751, 24758, 51640, 5603, -31851, -8163, 27713, 24496, -7823, -28714, -6408, 32343, 18585, -37085, -43833, 12545, 36146, -10126, -43876]
1087d3876L3244M0716j4866l8447j315L4164K5317j5654l9715l964M7122K0536
1099D3262m7121l2946L8440L7822k7535m4419M367L7389J4621k5122k8919P832
1111b2329L5727J0424l7048k4716L8398M3502k6898m8318J3147M4561K781l1839
1123b608j5824J6808K5975k828l7008j9638L3845L4545k4908m5556J1491M7109
1135B1403q75m3386q867L5372K2316j3850k6152o831K7648K6800k1196l7806J4107
1148a1317M4652n113m7524j1393L8514K0888k6667k7834Q094K4059Q243j9467
1160d865k4566J3329M0450p95m5039q969M3741K0480l0338k3719J7836K6647l340
1173B0852k6032j4447J6538K6902m887l7174j1600L6324J9409l5065k6685K8124
$$ y = [-43876, -10632, 30084, 15218, -23229, -24544, 9620, 34937, 19283, -20432, -24396, 22726, 43262, -3859, -36805, 1635, 39457, 11922, -32497, -28130, 9259, 23880, -1242, -30161, -22329, 13398, 23822, -13226, -37942, 456, 43958, 17060, -31258, -18111, 26450, 29231, -2608, -18432, -1624, 24351, 21523, -15485, -35123, -1278, 33267, 8359, -37197, -25706, 21403, 20528, -22858, -31725, 3647, 25963, 12113, -14039, -20870, 6778, 33578, 12382, -25424, -11317, 33335, 28222, -19302, -30695, 7819, 28707, 2040, -25794, -17700, 6359, 14602, -4865, -29431, -16102, 24348, 23553, -21486, -30455, 13286, 33766, 3428, -20291, -2455, 24192, 20852, -5180, -19627, -3089, 23813, 18926, -18248, -29848, 6476, 25885, -9180, -35865, -7741]
1185g741L0496j2922k7558k712K0571J9495o753k5941k033L1727J4529l2250k6874
1198b7966K5918L3900j6766l5742L718K6782M115j7855j6162M286K4639J0145
1210A9012k7991k2130K5096L2389j5280l2607P747L3608K933k6571j1682J5930
1222D54J7868j035k0795j5669J6364K5342j5217l3620Q164L4519m22l1600q880
1235b4527K1871J6922p933j6735k447J7083J5741j2164k5078O516L3514K562l4474
1248i149j0514K7247J2417j9285j6152N790J5749N649j4292j9072O766K6624K545
1261A4323k7536r068K8759J6259k2744j8931J5960K0452k776j5103q373O595J6924
1274A4741r88k4024p513K4633J3222k3659k0764J5010K2310o969j9123j64J4221
$$ y = [-7741, 22755, 9833, -17725, -20437, 134, 19629, 12876, -13065, -15098, 16629, 31158, -1092, -27966, -2048, 31852, 15086, -20656, -16938, 9844, 13959, -3896, -20058, -15772, 8867, 19012, -8979, -31109, -6013, 26376, 11096, -21511, -13764, 19844, 22777, -3794, -15476, 454, 18322, 17287, -3508, -19177, -2813, 22529, 7312, -26308, -18144, 16375, 15953, -15647, -24527, -2656, 14266, 6333, -10402, -12849, 4234, 19975, 7811, -17267, -10751, 22763, 25325, -9149, -19663, 7584, 20001, 716, -15436, -9646, 6103, 11752, -2540, -21612, -14846, 11778, 14323, -13213, -22281, 6478, 22737, -7, -18938, -2978, 17474, 14698, -405, -8778, -2183, 14741, 13753, -10271, -17784, 6849, 20071, -3588, -24352, -9342, 12968, 5999, -13124, -13288, 933]
1287I33R178n599j3907k751K0224J4490j9554k0080J5656K2290j0502k1906K786
1300h742J7528L688j3448j1993K594J3770O529j3693j4989J1930K1431q593k3610
1313a7598N459K4552K405j6629o738Q551J0421L75j1656q488J0596J5298r050
1326G498k2035J000K2397L233k1283p217J5755Q657q451q918j88R649J1569n208
1340F458j6663K185J9968K956j8964o791J6616R788j2308j2869L977J0000K168
1353F521o650r945R26J3816L151j7429o591J8047J1398j2973j1903P874J2333
1366H575q22q042l801N364Q418l49j2510o757J2357J0947j2276j4661Q708J2923
1380H074n896j1686N71Q136N587k333q000k942J0181Q702p975j1080P437J4136
$$ y = [933, 10111, 4512, -9395, -12146, 8078, 22568, 3014, -17066, -1410, 20880, 10378, -11528, -8742, 8786, 12474, -974, -12967, -10373, 3397, 9926, -3767, -18756, -6826, 14605, 6012, -17598, -12139, 12413, 14818, -1811, -8549, 2, 10423, 10798, -858, -9346, 1250, 16548, 7498, -14537, -13537, 8860, 12093, -9190, -16407, -652, 8005, -446, -9364, -9552, 97, 11666, 6458, -10205, -8020, 11948, 14904, -4060, -10851, 5765, 15553, 3245, -9624, -5647, 4353, 6521, -129, -10074, -9148, 4668, 7819, -9610, -16201, 1846, 13244, 271, -11632, -3758, 8575, 7753, -289, -4090, 1274, 9692, 9343, -3167, -9924, 2433, 13380, 1104, -13557, -4849, 8074, 2178, -9508, -8937, -801, 4786, 2453, -5547, -8489, 1692, 10394, 2419, -8661, -1224, 12912]
1394A2912m218j4783M79J1935J536p141n054O37M649L975p000r092N942J1958
1408F735l039j3304N53J2653L464q643l914O651N060r07m423m503L054R340j566
1423G211j2335j245J1475J754j1492m178P455N209l753n353p25M119N002r63o261
1438d080p42R598L975r823n242R175O444o175n876K214L313L48k720m597O0N734
1454A606K010p136n395O695P136m896p059M460O799j213l887l47J641L440J879
1469E733m781m011M629M797m712o707K743O125j775o125q50L575J231n43j589
1484b260j510K449M713j907n742K514P219q58n398j93M077O85k722j558K14J213
1500I36Q89j632l726l05M303Q07n029j023N430J326l603q94K586J340M21n0j760
$$ y = [12912, 8694, -6089, -5610, 6325, 7861, 720, -4334, -3697, 952, 4927, -2073, -11165, -5223, 6735, 3696, -9608, -9055, 3598, 7062, -1581, -5495, 1156, 6216, 5309, 886, -3617, -563, 8777, 7211, -5124, -6369, 5106, 6860, -4632, -8810, -1355, 3854, 101, -5252, -5977, -1858, 3144, 2181, -4080, -4822, 4776, 8751, -1072, -6314, 2861, 9305, 3130, -2746, -532, 2781, 3129, 409, -4188, -4128, 1606, 3616, -3520, -8915, -2220, 4916, 20, -7039, -2579, 4220, 3007, -880, -1227, 414, 3854, 5733, 952, -3059, 1570, 6367, 1655, -5052, -2309, 3816, 2041, -4084, -4934, -1359, -128, -671, -2260, -3770, -1321, 3392, 1485, -4257, -1743, 5476, 4618, -780, -973, 3104, 3789, 1067, -491, -277, 936, 1825, 193, -3533, -3838, 465, 1272, -3757, -4780, 650, 1976, -1627, -2521, 65, 1405, 1826, 1776, 16]
1517A6K09K666O99l238j684L011J763l598k490J917J204j756o44J53l26Q35J467
1534B04j240j700K385K659j523j477J608J693p60j198O14N11j115N18l08j872
1550a001o46K136n38k631P27J466o39r08O92N22K48O29O23l49o05J319J418j503
1568I60r41J137J067j333j149P05p11k64O55j330j611J333J584r60j783P20K380
1585D59L69j361k03J385J177k33m46r83P33J627n24k912J10K402L4l204j133J825
1603h78J340j209j789o5J812J592p45k106P28L299J008k875j743K657K586j409
1619B203l108J66K167Q00j963k665Q34K625N06l728j776K632L224j633l587Q47
1635b456M130Q79k921j763K123L480k56l637j686L200K823k516m119O05M405K42
$$ y = [16, 225, 2891, 3590, 352, -1332, 1679, 3442, -156, -2646, -729, 475, -1281, -1925, -1772, -2098, -1263, 204, -1036, -2736, -351, 2308, 785, -692, 916, 2609, 1849, 651, 1265, 1776, 661, 1179, 871, -1001, -1647, 489, -49, -2680, -1953, -487, -1126, -2034, -1342, -820, -572, 57, 680, 331, -274, 1045, 2463, 960, 19, 1156, 2223, 890, -259, 446, -265, -529, 126, -1204, -2815, -1482, 102, -858, -2641, -1921, 459, 828, -533, -736, 649, 1826, 1593, 1147, 164, 897, 2524, 2000, -912, -802, 1600, 1634, -1570, -2703, -878, 462, -747, -2536, -2601, -789, 803, 58, -2048, -1320, 1979, 2987, 112, -1631, 1026, 3612, 2203, -905, -739, 1428, 2228, 265, -2400, -1566, 1059, 1565, -2163, -3939, -1307, 1917, 284, -3303, -2456, 1674, 2553, -368, -2131, -8, 3472, 3216, -421, -2107, 1093, 3916, 1400, -2719, -2114, 2291, 2533]
1651B533m683k249L322L399j445l966n82L938K773k601l810J725N245M19m661
1666f43k560M228M159k921m872N71M503R65m005l757J978M788j24n276k109N074
1682aL812l546n032K265O060Q59n328k914M130M452j581n191j131N213K997m465
1698E99o204K864O346m42o146k303N101M179l355n210Q81O166K502n201m799L187
1714a835O850o30p245j191O450L667n197n755K022O318P67n792m104L996N815
1729D136j631p455m74P614M132o398n568L794O942o91o411k464N581N128l617
1744B618o851m69P713L292p385n568M564P084k297p656p02P105L840m453o372
1759e537J643P652K062p028m911O067P613l775r223P81Q366K636o677n469L109
$$ y = [2533, -2150, -4399, -1077, 2322, 877, -3089, -3671, 267, 3040, 439, -3371, -1646, 3599, 4018, -643, -3203, 1025, 5184, 2263, -2609, -2038, 2465, 3430, -575, -4332, -2354, 2434, 2310, -2966, -5075, -1, 3811, 265, -4767, -2502, 3558, 4417, -911, -3825, 305, 4757, 3176, -2015, -3146, 2067, 5064, 599, -5605, -2741, 3605, 3163, -2983, -5286, -185, 3994, 639, -4571, -3690, 2476, 4978, -223, -5022, -1835, 5015, 4385, -2860, -4051, 2399, 6066, 869, -4886, -2864, 3454, 4221, -1571, -5675, -1679, 4136, 2505, -4950, -5424, 2190, 6322, -76, -5644, -1850, 5092, 4401, -2010, -4474, 1107, 6235, 2618, -4233, -4702, 3011, 6303, -1082, -6650, -2086, 4998, 2701, -4955, -5657, 1448, 5288, 835, -5537, -3894, 3758, 5820, -1208, -6119, -52, 7561, 3786, -5437, -4656, 3710, 6346, -331, -5800, -2691]
1774b691O706qp595l085O698O619m547q721J190R657K007p808m601N584P093k340
1790D158q032j569P119N858n247q824K321R153Q00r065m511Q063O604m806q049
1805f027O60P886L714n725o972L466R051j2r978l561R261O767o217q647K394Q254
1821D314J385p683n114N383Q037k037r250l000R565O071p055q420M211J0021o41
1836E787r152l396P054P251l779q679r07R017M302p939p816N415J0175k060j1057
1851e784j966R104N525n401p753J665Q789L012q745o782O774J0099l041j1269
1865e773j063J0050M712p902p485M545Q925j99r449n139P868Q560l828j0771N43
1880f406J1195L085j0011o288O745R467k419r564k493Q169O039n294r185J738
$$ y = [-2691, 4015, 4007, -3588, -6673, 25, 6644, 2097, -6624, -5434, 4223, 6230, -1578, -6179, -595, 6498, 4158, -3874, -5443, 1676, 7534, 2287, -6537, -4216, 4937, 5737, -3328, -7839, 224, 6828, 2022, -6027, -5367, 2519, 6233, 508, -6464, -2998, 6053, 6041, -3937, -7498, 1763, 8530, 2313, -6334, -3940, 4314, 5699, -1984, -7098, -1715, 6322, 4285, -4965, -7965, 1600, 7671, 616, -7804, -3593, 6428, 5787, -3365, -6761, 293, 7544, 3765, -4914, -5821, 3196, 7498, -441, -8257, -2842, 7333, 5273, -5784, -7750, 1354, 6879, 1478, -6275, -4610, 4179, 7191, -1554, -8336, -1562, 8537, 5496, -5773, -6836, 3214, 7926, 24, -7461, -2916, 6009, 5810, -3639, -8778, -910, 7650, 3822, -6949, -6406, 4789, 7874, -2137, -8425, -1680, 7787, 5368, -4196, -6689, 1480, 7519, 2225, -6960, -5222]
1894e222J1245K059j1504o201R209Q388m559r956M55R419L759p196p708L858J0998
1909G044L30j1074n189R521Q689o756j0309K995J0274J824r620o029N748R439
1923F887j569j0319l103R963O884q156r800M458J2234R2j1279m423P940P867l993
1938C683r609l72J0186N222r472r612O040J2094j633j1870l029J0209O556p205
1952A188r349K985J0717K849r541p760O502J1110k895j2333j072J1823N128r619
1966b67q695M857J0591N07j0158n371P966R001m734j1329j5J2618M727j0872q460
1981i634P355J0458k661j0591k139R493O734o578j1040K381J2281K388j0879p440
1995i872Q687J0358n571j1544Q33J1356M377q398q422L749J1020R81j1427n223
$$ y = [-5222, 6023, 8082, -3422, -9623, -414, 7974, 3415, -6541, -6086, 3333, 7092, -104, -7812, -3954, 7044, 7374, -3700, -8889, 632, 9321, 2565, -7744, -4749, 5525, 7349, -2271, -8300, -2552, 6887, 5318, -5001, -8104, 1859, 8743, 587, -9213, -4755, 7479, 7571, -3708, -8131, -191, 7676, 3683, -5926, -6298, 3888, 9110, -362, -9974, -3934, 8160, 6527, -5343, -8372, 1837, 8393, 1188, -8161, -5176, 5541, 8390, -1151, -8911, -2409, 8701, 5806, -6527, -7599, 4224, 9352, -267, -8962, -4105, 6486, 6993, -3165, -8536, -570, 8431, 3697, -7632, -7647, 4971, 9698, -1174, -9634, -2279, 8179, 5518, -5073, -7212, 2281, 9015, 2437, -8603, -6222, 6059, 8447, -2432, -9872, -1185, 9173, 3602, -7942, -7109, 4247, 8624, 226, -8196, -4447, 6573, 7554, -3873, -9096]
2009i096J0214Q991o930j2222K478J2452K716j0302p431P016R482k549j0850l008
2023i039J1049Q233q519j1401M054J3014L06j1715m489R176Q484m701j1767k03
2037g518J1312N659q970r683M822J2093j093j2830l222J1284Q016p662j0652K264
2051f180J1371L300j0014p150O850J1254l265j3112j737J2543O672r661j0287
2064i416N292J1101n30j0628n084Q976R388m629j2566j80J2629N156j0383q644
2078i518P178J1527k783j2241k837J1001P454p018j0622J413J2039K978j1653
2091c082p976R583J1191m896j2709k62J1484N772q738r323N383J1031K19j1662
2105c985n760J0169J0352o215j3242J666J2890K785j0924p262P501J0758k463
$$ y = [-9096, 1118, 10109, 3179, -9043, -6565, 5887, 8603, -1699, -9130, -2114, 7368, 4819, -6031, -9039, 2010, 10243, 1724, -9677, -5623, 7391, 7697, -4018, -8507, 669, 9153, 4452, -7315, -7518, 3794, 9453, 483, -9200, -4378, 7715, 6622, -6208, -9430, 1854, 9870, 2208, -8444, -6180, 5191, 8491, -1523, -8673, -1823, 9431, 6166, -6946, -8683, 3860, 10532, 871, -9416, -4124, 6977, 6447, -4181, -9265, -289, 9099, 4470, -8096, -8276, 4353, 9509, -874, -9518, -2340, 9187, 6404, -5837, -8674, 2327, 9781, 2763, -7859, -6446, 5593, 8571, -3082, -11058, -1475, 9716, 4820, -7889, -8151, 3333, 9105, 367, -8956, -3573, 7458, 7677, -3985, -9745, 424, 10776, 4561, -8681, -7015, 5875, 8660, -2264, -9526, -2025, 8733, 6270]
2118F270j2249l800J1196Q153p747j1007L626J2751J425j2896n907J0145J0216
2131A0176m776j1937p83J1061N453q656j0329N667J2392n71j3497m743J1034Q909
2145I400o506j1835K921J2046K460j0604p241P024J1535j919j3012l121J2060
2158C208O786r223j0380N243J2066N16j2631n924R341R769m451j1511n31J2030
2172D308N519j0699j0031P491J2972k244j2479l545J0427P872o778j0986K565
2185e608J2222K465j1594q082P790J1925l347j3061j805J2845N546r735q938M940
2199d437J1851J103j2086o162R702J0165o051j2012J352J2624L898j1528r137
2212a0718P657J1730k782j1771k713J0050P751p673j1461L458J3747K281j2739
$$ y = [6270, -5979, -9779, 1417, 9570, 1823, -9184, -5558, 7193, 8618, -4278, -10185, -40, 10176, 5400, -6537, -7320, 3741, 9194, 538, -9791, -4124, 8268, 7697, -5800, -10543, 491, 9400, 2894, -8941, -6020, 6026, 8486, -2118, -9359, -2335, 9200, 7281, -5731, -8852, 3208, 9994, 771, -9609, -4366, 7700, 8216, -4415, -10339, -998, 8771, 4320, -7191, -7722, 4308, 9827, -872, -10903, -3412, 9560, 7316, -5163, -8708, 1719, 9591, 2813, -8173, -5608, 6614, 9079, -2515, -10597, -2807, 9118, 5771, -7290, -9095, 3750, 9296, -439, -9377, -4437, 7414, 8517, -3569, -9731, -29, 10136, 4085, -7927, -6575, 6049, 9947, -1581, -10718, -3061, 8669, 5887, -5884, -8597, 1453, 9204, 1531, -9930, -6472, 7275, 9556, -3183]
2225c183o808Q947J0695m519j2223l02J2073N474j0108r602N004J2117O76j2565
2239d324n753J0794R033p558j1749K614J2660L619j0786q545P469J1383k576j1841
2253e560k758J1535P563q650j2201M095J3522J029j2687n398Q772R435m847j1898
2267h048m59J3194N294j0365r889N781J2813p70j2827l912J1864Q024q209j0940
2281h449K275J2113L317j0609q307P332J1101l444j3006j545J2275O858r358j0469
2295i916M682J2475K31j1149n048R161R603n169j2861L12J3402M896j1343q912
2309i636O634J1482k569j2336k842J1173Q002p920j1290K571J2292L251j1530
2322b718p818R983J0856n349j2690q5J2028N866q861j0110M905J1572k19j2195
$$ y = [-3183, -9991, -1044, 9651, 5132, -7091, -7393, 4680, 10154, 46, -9556, -4552, 7565, 8241, -4324, -10077, 717, 9750, 2192, -9557, -6943, 5717, 9336, -1450, -9995, -2526, 8857, 6281, -5560, -8318, 3217, 10780, 2130, -10071, -5976, 7546, 8575, -4112, -9510, -738, 8697, 3850, -8048, -8507, 4687, 9981, -384, -10273, -4492, 8321, 7551, -5276, -9188, 2676, 10700, 2491, -8449, -6174, 5939, 9256, -1353, -9660, -2328, 8773, 5329, -7677, -9222, 3053, 9911, 553, -9916, -5234, 7241, 7472, -3677, -8725, 436, 10039, 4870, -7991, -7679, 5723, 10619, -724, -9636, -3002, 8480, 5911, -6425, -9267, 1906, 9908, 1988, -9302, -6731, 5561, 8812, -2718, -10536, -553, 10303, 4954, -7736, -7821, 4207, 10073, 1212, -8898, -3993, 7579, 7360, -4835]
2336d835m997J0545R412o296j3105J445J3286L326j1107p204P594J0483k089j2534
2350f076k948J1852P944q188j1260L176J2767J310j2390o163R906R963n911j1889
2364g907M5J0971N685q653j0067N763J2757j035j3558l900J1805Q620p203j1819
2378h496K667J1963K427j1054o811P230J1292k943j3127l049J2576P165r669r927
2392i756N220J1874P7j2051n406R855J0045m998j2022l2J1946N038j0431r751
2406a0392P830J2214k936j3268k457J0666P270o797j0792K399J2339K441j1947
2419c430p123Q599J1749l958j3058p97J2682M971j0027q415N515J1104O48j2346
2433c886o173R915J0465o460j2478J242J2981L148j1410q143P806J1814k768j1592
$$ y = [-4835, -9832, 713, 10125, 3829, -9276, -7831, 5455, 8781, -2326, -9530, -1936, 8547, 6458, -6076, -9024, 2828, 10772, 2584, -8676, -5500, 7267, 8577, -3813, -9976, -70, 9893, 3982, -7907, -7862, 3109, 8794, 141, -9926, -4163, 8594, 7559, -5999, -9899, 1906, 10526, 3323, -8496, -5829, 6134, 8561, -2493, -9304, -2074, 9218, 6275, -6852, -9901, 2675, 9840, 171, -9756, -4536, 7338, 7415, -4636, -10042, -187, 9858, 4860, -7162, -7194, 4752, 9790, -641, -10392, -2562, 9652, 6716, -6552, -9009, 1657, 8927, 2130, -8662, -6263, 6076, 8517, -3430, -10553, -1954, 9795, 5837, -7221, -8018, 4664, 9635, -392, -8807, -3292, 7812, 8460, -3886, -10059, -144, 10321, 3861, -8617, -7375, 5606, 8754, -2656, -10799, -2993, 8821, 6053, -5539]
2447e539k862J0257P691o957j1610L537J3334J358j3031o000R331R937m956j1909
2461g419n0J1532M520r227r505N547J2252J99j2754n156J1328Q896p942j1005
2475h784L327J1751K711j0585q094P403J1436k672j2457k679J1523P121r147j1370
2489a0516M948J3287k2j2208m636Q806Q752m110j1139q02J2305N776j0509j0003
2503a0071O528J2469j671j2624l461J0925P187p896j0127K447J1578L548j0568
2516a736q879P883J2114m057j2894o04J2602N478r551r540N026J1881J1j0892
2530c158n445Q492R415n150j2665M52J3552M047j1523q121P252J0389k110j0845
2544e418k783J0197P559p309j0723K146J2752L094j1912p201R350J0146o013j1280
$$ y = [-5539, -8401, 1856, 9547, 2590, -9020, -5483, 7851, 9209, -3822, -9822, -491, 9446, 4490, -7419, -7469, 4063, 8583, -644, -10149, -4602, 7650, 7849, -4905, -10061, 1267, 10163, 2221, -8784, -5457, 6294, 9005, -1580, -9674, -2271, 9165, 6493, -5964, -8643, 2880, 10001, 854, -10516, -5568, 7719, 7697, -4511, -9147, -341, 8411, 4301, -6838, -7640, 4665, 10441, -68, -10071, -3543, 8926, 7255, -5369, -8830, 2095, 9282, 1386, -8741, -6294, 5284, 8832, -1736, -10615, -2732, 9382, 5325, -7569, -8173, 4429, 9907, 356, -9184, -4158, 7723, 7734, -3158, -8603, -111, 9304, 4154, -8511, -8059, 5493, 9540, -1983, -10104, -2852, 7537, 5427, -5418, -8201, 1996, 9555, 2246, -8477, -6331, 6421, 9515, -2397, -9598, -248, 9898, 3885, -7395]
2558g395L18J0540N320q221r852M131J2064M02j2126m886J0747Q771o849j1709
2572h745K006J2468L210j0435o594O265R658j651j1680l390J1222Q530q996j1554
2586i686M229J1770N75j0725n189Q925Q572m771j0831m61J1180N865q658r855
2600i060N435J2327j736j2672k552J0671O754o772j0229J657J0796L408j0009
2613a982p340O961J0966l056j2426k195J2447O250r104r225N241R983L30j0167
2627c317n006Q462R714n191j2317L86J1792M743j0565q068P025J0365k672j1350
2641e999k106R353P034n738r817J149J1842L001j1649o246Q832R880m637j1394
2655f495o03J0323N077q240q225M350J0102P96j1443n495R664R988o646j1491
$$ y = [-7395, -7077, 3463, 8783, 562, -9290, -5159, 6905, 7307, -4819, -9705, 1042, 9813, 2964, -8745, -6739, 5729, 8939, -1496, -8090, -1825, 7833, 6182, -5498, -8888, 2334, 10864, 1868, -9686, -5457, 6313, 6888, -3837, -9026, -101, 8471, 3700, -7131, -7592, 3588, 9453, 795, -9060, -3625, 8702, 6966, -5706, -8258, 2413, 9167, 2395, -7834, -6177, 4619, 8027, -1982, -9322, -2361, 8605, 5549, -6877, -9072, 3375, 9625, 521, -8704, -3463, 6520, 6850, -3317, -8323, 139, 9853, 4662, -7655, -7269, 4523, 9266, -1299, -9367, -2342, 8023, 5351, -5999, -8105, 1248, 8282, 2544, -7273, -6124, 5718, 8719, -2930, -9176, -344, 9536, 4899, -6495, -7098, 3225, 8302, 62, -8163, -3813, 6289, 7085, -4358, -9853, -189, 9799, 3153, -8338]
2669h338K640J0871K244r304o259O384R827j930j1185k930R912P196o911j1036
2683h819L581J2047L18j1599m400Q721P939l983r926q45R872N475q303r132N953
2698c101J1167p87j2013l858J0425P231p051r123K488R667K255q956p585O384
2712b857J0983k409j2382j314J0924N538q530q492M849J0911m59j0055m564P733
2726a24Q228l814j0551n24J1651L975j0446p628O996R913k509j0466k389Q597
2740I09O747o071r053K337J0652K456j0119p103Q250J0015m806j0798J033R433
2754C882L684p851p391L816J0188O15j0603m924Q335Q558n685j0714K184J1561
2768E655K021j0127n547O128Q683j680r673k591R064P020p254r947L680J1567
$$ y = [-8338, -5698, 5173, 7417, -1887, -8146, -1762, 8065, 6135, -5050, -7980, 1932, 9128, 2217, -8819, -5238, 6809, 7127, -4472, -8872, -151, 7788, 3805, -6121, -6966, 2906, 8381, 78, -9054, -3101, 8066, 7279, -4734, -8592, 1833, 9064, 2013, -7110, -4622, 5045, 7300, -1656, -9241, -2857, 8126, 5717, -6665, -7979, 2945, 8483, -47, -8539, -3690, 7221, 6762, -3293, -7857, -124, 8104, 4290, -6261, -6785, 4866, 8841, -1605, -9233, -2237, 7676, 5167, -5299, -7688, 909, 7656, 1585, -7468, -5131, 5521, 7977, -2142, -9245, -995, 9020, 4214, -6584, -5551, 3882, 7566, -285, -7676, -3860, 6328, 6943, -3660, -8584, -249, 8309, 2624, -8090, -5906, 5655, 7676, -2451, -7998, -1870, 6813, 5133, -4540, -7131, 1933, 8953, 1699, -8248, -4568, 6999]
2782F999K07j0675m725P787P602m428q996L10R112M317p155q631M157J1667j032
2797F516j1218k907R805N941o529q150K072R616K043q579o579N788Q877j932j0414
2812e650k214J0884N701q813q339M990R456j71q584m010O902P684m264r782q0
2827f290J0643M154q883p881N920R738k750r983j313Q659M990n680q060R82J0275
2842D521K964r550o345P788Q652m153r973K6R965L969p558p287L742Q592L65q834
2858c116m479P792Q089n486j0818K379J0349K050q148n727N331Q013j725q974
2872d470j984Q039O162n318r582K179J0933J010j0149m292P990O473m086q473
2886e568m57Q334M856o972p779M193R522p23r810l297R452O462o388q334K308
$$ y = [6999, 7206, -3469, -8194, -407, 7195, 2767, -6229, -5919, 3193, 7510, 355, -8276, -4119, 7548, 6516, -4702, -7609, 2196, 8137, 1608, -6542, -4470, 5146, 7189, -1390, -7969, -2181, 6696, 4764, -5650, -7864, 3020, 8721, -92, -8431, -3441, 6015, 5844, -2740, -6750, 152, 7836, 3572, -6210, -6290, 4353, 8507, -376, -8257, -2337, 7401, 4651, -5332, -6645, 2014, 7004, 1324, -6736, -5754, 4521, 7485, -2065, -8410, -622, 8030, 3877, -6096, -6070, 3895, 7864, 306, -6981, -3239, 5353, 5718, -3116, -7595, 197, 8286, 2800, -8018, -5639, 4710, 6760, -1388, -7115, -1784, 6229, 4504, -4470, -6454, 1585, 7747, 2429, -7153, -4974, 5959, 6969, -3180, -7472, 518, 6991, 2905, -5568, -6025, 2309, 7165, 193, -7586, -3393, 6129, 5406, -4404, -7701, 1751, 8213, 1825, -6509, -4201]
2901d201Q535J650p026n358M668Q670k084j0271j543R444N228p296p466L793Q871
2916E614k45q842l095O749O647l151q894n47R076M577q474p007O119Q445k735
2931D237q635k021P612N603n368p448J646Q378J897p929n638O361Q787l378r887
2946e783L96Q661L054o533n505L324P591M25q636m193P138P136m407q853J035
2961e150R262J833q009n070O062O885j909p430k513O800O286n175q199K727R081
2976E481L28q750l763O733O790m385p665K07P346L655o154o129L245Q622n3r330
2992c822l022Q023N542n181p074K034P649J515p045m682M794P168j718q187k215
3007f221Q038M910o757o742L934Q237j047p080l284N744O066k887p704j09P811
$$ y = [-4201, 4334, 5984, -1042, -6400, -1732, 6938, 4854, -5417, -6960, 2484, 7712, 416, -7050, -3257, 5614, 5369, -3473, -6568, 181, 6828, 3677, -5217, -5764, 3312, 7889, -585, -7592, -1473, 6972, 4237, -4398, -6419, 1193, 6796, 1428, -6020, -4374, 4004, 5901, -2028, -7666, -1305, 7482, 4104, -5783, -5387, 3274, 6328, -205, -5710, -2386, 5205, 5630, -3006, -7199, -61, 7075, 2668, -6185, -5150, 4112, 5945, -2064, -7134, -1072, 5813, 3904, -3526, -6039, 761, 7047, 1872, -6327, -3600, 5481, 5809, -2941, -6704, 29, 6819, 2434, -5231, -5024, 2322, 5977, -177, -6306, -3061, 5561, 5508, -3822, -6844, 1179, 6721, 1540, -5534, -3500, 4149, 5664, -1381, -6063, -1269, 5899, 4181, -4006, -6221, 1817, 6727, -30, -6772, -2838, 5399, 4352, -2728, -6012, -268, 5798, 2911, -4793, -4902, 2909]
3022B909L807p284o082M714Q112j752q237j623P087L890m549o303J054P990J996
3037E729p446n216N762P277k742q370J48P742L150o228n706L881O549J13o881
3052b238l586N788O331m006q022J389Q281J794p338m485M755O415j855o912j107
3067d796N974M505m539o643J869Q017J228p989l531O282N395l824o051K20O210
3082B327L259n712n927L433P273n14p224k568O674N209n145o756K550O825Q61
3097D565n605m288M005O150j162p421j201O999L968n712o134L109P393o00o769
3112b703k433N382M603k822o181j63O931L336o504n551M611O629j775o764j032
3127d436O015L400m321n488J773O167J197n716m002M526O300l267o764L87O903
$$ y = [2909, 6716, -568, -6650, -1936, 6176, 4424, -3813, -5436, 1651, 5541, 992, -5311, -4257, 3733, 5729, -1717, -6933, -1171, 6106, 3364, -5006, -4858, 2884, 6034, -194, -5900, -2019, 4530, 4643, -2238, -5824, -36, 6295, 2289, -5733, -4344, 3937, 5731, -1607, -6092, -1337, 5078, 3223, -3689, -4796, 1178, 5683, 1144, -5499, -3630, 4387, 5615, -2374, -5905, 377, 5772, 1948, -4103, -3883, 2327, 5586, -126, -6053, -2620, 4653, 4139, -3085, -5653, 1021, 6230, 1085, -5671, -3121, 3704, 4565, -1040, -5328, -1323, 4827, 3665, -3756, -4957, 2042, 6010, 298, -5836, -2727, 4666, 4066, -2703, -5136, 246, 4849, 2027, -4154, -4317, 2614, 5950, -554, -6105, -1494, 5135, 3360, -3404, -4436, 1579, 4979, 658, -4830, -3057, 3110, 4307, -1409, -5411, -885, 5415, 2148, -4616, -4229, 2674]
3142B674K367n203m454K776N746j48n990k698N489M722l617o324J062O845K005
3157E252o646l750M847M796k067n598r40N398M005m190n973J769O858O24o360
3172a975k983N270M695l396n834O29O154J823m426m261K535N623K7o916j969O247
3188A243L848m008n671J757N661J290n348l182L842M775j498n809j250N583M100
3203E333m806n318K696O307q54n887j723M690L838k528n202k83N697K173m821
3218f88l842L250N711j347o387o92N440K984l803m347J410N033R45m634l640M236
3234c71M951k319n793j62N631K176m327m007L075M528o27m895j755L797M556k715
3250A743n563Q69N780R47n237l054M071M353j667n307l55M616K580l498l958J494
$$ y = [2674, 5041, -162, -4616, -1840, 3906, 3758, -2232, -4930, 559, 5281, 1664, -4660, -3598, 3247, 5252, -1394, -5144, -297, 4499, 2432, -3166, -4106, 1292, 5297, 1107, -4866, -3097, 3761, 4385, -1975, -4958, 312, 5007, 1611, -4223, -3594, 2560, 4383, -43, -4304, -1769, 3854, 3881, -3035, -5004, 1243, 5091, 1083, -4588, -2831, 2830, 4120, -1228, -4410, -568, 4207, 2709, -3100, -4350, 1233, 5333, 527, -4791, -2095, 4212, 3358, -2529, -4252, 438, 4276, 1748, -3454, -3737, 1960, 4133, -688, -4530, -1280, 4431, 3084, -3303, -3995, 1445, 4429, 626, -3721, -2311, 2722, 3667, -967, -4607, -371, 4580, 2261, -3532, -3694, 1937, 4113, -214, -4221, -1146, 3382, 2755, -2140, -3895, -98, 4458, 1743, -3820, -2951, 2829, 3776, -1461, -4515, -444, 3909, 2242, -3065, -3420, 1196, 3776, 278, -3680, -2186]
3266b186M956Q51n354k575M611M165k757m702M10M611J407l873l534K578M795
3281C403l16m928k050M454L632l248m854J666N079K17m537k020K684M065r47m858
3297b558p21M623K683l638l967K032M750l07n050j505M052L280k470l872K48M205
3313A785J678l746l849K952M893j329m653o52M190J989k843l736J769M346J08
3328B902l925k499L082M181j963m553K1M805J369m136k780K305L653p1m185j390
3344c184L583L085k413m054O12M547J171m216k938L452L618j753l594l98L511
3359A029K089k718l762J553M262K27l915k206L574L132k197l960P61M327N71l197
3375d30k523J894L550j92l928j393M109K302l063l539J428L877Q05l865k184K866
$$ y = [-2186, 2770, 3621, -1733, -4308, 303, 4468, 1711, -2991, -2581, 2030, 3437, -436, -3970, -1392, 3403, 3087, -1841, -3891, 563, 4195, 947, -3907, -2241, 2838, 3055, -1482, -3502, -818, 3247, 2300, -2558, -3279, 1344, 4027, 389, -3578, -1546, 3204, 2897, -2153, -3658, 394, 3674, 1204, -2668, -2420, 1785, 3463, -283, -4132, -1180, 3713, 2384, -2269, -2921, 1269, 3258, 415, -3321, -1552, 2794, 2902, -1023, -3522, -440, 3741, 1778, -2775, -2754, 2051, 3420, -716, -3496, -1191, 2462, 2391, -1794, -3184, 399, 3484, 1071, -2983, -2371, 2176, 3347, -869, -3807, -355, 3263, 1510, -2084, -2482, 1029, 3118, 400, -3362, -1809, 2453, 2680, -1235, -3441, 133, 3265, 1068, -2892, -2131, 2196, 2767, -430, -2953, -1059, 2491, 2299, -1629, -3022, 1087, 3389, 326, -3213, -1785, 2092, 2897, -968, -3152, -286]
3391b86L050j403l460j99L528J873k923l713K531L951q27l884q70L165K272k006
3407G99l282P21L554R16l050k705K103L474p64l611q88M020J390k753k515J459
3423a132K985K10l168j857K989K740j497l458N0L691J173k883k647K118L232r71
3439A575l125p72K690J972j656l264R29L418M69l078j683K589K527j198l598L54
3455a851L011J285k410k421J307K709M80l543j278L156K200k152l127J220K934
3470A520R14k983j724J686K713r69k791l18K922J673k099l002J294L215n10k903
3486a362o68K092K114j310k917k0L168J078k587j753J737K601n05k919p23K599
3502F25J529j881k389J080K304O87k334j893K007K563j583k524M0K654J335k211
$$ y = [-286, 2764, 1361, -2099, -2298, 1230, 3103, 180, -3533, -1002, 2949, 2122, -1762, -2632, 533, 2805, 799, -2483, -1762, 1792, 2708, -342, -3047, -944, 2530, 1766, -1845, -2733, 1287, 2677, -76, -2591, -1132, 1853, 2063, -1105, -2962, 27, 2767, 1270, -2188, -2138, 1553, 2726, -157, -2804, -686, 2546, 1575, -1550, -2322, 368, 2340, 684, -2580, -1651, 1767, 2236, -842, -2525, 64, 2591, 1393, -2205, -1851, 1160, 2445, 35, -2386, -1079, 1630, 2110, -1433, -2711, 445, 2645, 493, -2634, -1414, 1520, 2434, -549, -2273, -587, 2126, 1157, -1634, -1952, 970, 2643, 544, -2458, -1164, 2051, 1541, -1362, -2030, 62, 2176, 866, -2051, -2071, 1097, 2175, -412, -2165, -428, 2173, 1668, -1251, -1974, 625, 2154, 273, -2116, -1036, 1268, 1955, -379, -2272, -265, 2298, 715, -1809, -1769, 885, 2220, 9]
3518Ik160J453K457m40k855k94K079J894j483k407K44K941N15k769j113J767K100
3535A938j028k402m47K366J563k097j823Q77K342M18k651j138K321J946j438k398
3551a651O97J990N35j664j740J165K514o29k395m08K103J300j554k228Q19K544
3567A398n29j769q40J653J536o66k023Q4J983R49j801j747J334J671P7k347q86
3584a923K368J520j623j699N21J408M97j468j458J549K102j204k170K57K005O84
3600A366j563j216Q26K051n49j708l02J481J089j138j854L33K204M24j931q13
3616a300J129J061l36j405n19J661J068j213j523Q93J475J92j755r99J731J380
3632A540j027j572L02J223N81j240j121J048J255k03j713k30J593Q35j147j139
$$ y = [9, -2151, -698, 1759, 1319, -1536, -1830, 249, 2143, 660, -1747, -1503, 1438, 1953, -816, -1929, -162, 1938, 910, -1492, -1939, 427, 1990, -107, -1930, -1053, 1289, 1707, -944, -2082, 239, 2185, 747, -1651, -954, 1036, 1571, -93, -1833, -668, 1846, 1217, -1178, -1586, 517, 1817, 263, -1965, -1146, 1398, 869, -900, -1740, -87, 1449, 783, -1240, -1156, 827, 1776, -25, -1772, -438, 1233, 1310, -1037, -1923, 445, 1965, 342, -1357, -836, 572, 1069, -399, -1857, -308, 1794, 590, -1580, -1323, 682, 1366, -197, -1413, -587, 1464, 915, -793, -1095, 386, 1475, 337, -1517, -1184, 1020, 1444, -487, -1300, -171, 890, 554, -851, -1370, 291, 1359, 146, -1377, -484, 991, 1183, -572, -1571, 160, 1540, 513, -1059, -757, 466, 1047, -193, -1314, -266, 989, 786, -927, -1157, 436, 1271, 124, -1015]
3648a015K26J891j39j477n20J119J089p21r64n03J563P01j709r11J040J159R7
3665I26j782m84J781M01p64j282P25J055L57j092p30R69J261p64j494L35J027
3682D45N73j397n90O46J082k17j242k56Q13J198p64j359L01J323L17j483k13Q49
3700B6R74p25j105J07J226N61j171q37J069P75m11j077l10P25J143j127r00N17
3718e40R69J3o71o45P38J111n96j218J75J189L39r77p78J177N69k02j276p6J131
3737D32O53j146r66K65J500j00j166m64J194R10p65r46j08J065O47j031o82Q97
3755A89P98m69j066k20R24O33q34j028O18J095j77j172l4O97O97n90j113M80J319
3774G47J13p75q79R47R07l97j207k97J361L12r95n94K30J365l59q96o10J076Q55
$$ y = [-1015, -789, 1102, 963, -514, -1034, 85, 1174, 453, -511, -1014, 549, 1250, -459, -1370, -330, 829, 926, -856, -1340, 441, 842, 78, -1204, -479, 576, 933, -159, -889, 80, 1341, 577, -917, -582, 445, 1018, -379, -969, -323, 759, 542, -700, -956, -143, 1055, 291, -1068, -767, 556, 873, -610, -823, 26, 1000, 275, -830, -723, 503, 1064, -107, -944, 125, 900, 489, -588, -898, -173, 970, -157, -1057, -540, 429, 442, -229, -874, -136, 975, 379, -839, -664, 525, 864, -113, -891, 286, 855, 653, -623, -699, 432, 1085, -61, -1027, -762, 738, 638, -528, -992, 202, 1112, 347, -599, -707, 358, 1005, -26, -708, 189, 987, 518, -548, -768, 156, 789, -45, -1073, -455, 640, 463, -709, -743, -46, 651, 61, -1052, -572, 747, 860, 85, -794, 153, 1060, 663, -544, -841, 520, 832, -163, -757, -527, 838, 479, -417, -1027, 49, 904]
3793I04r83r35L32J284J52j055p79J245R10n46j200l4J179N43p40j044L05J301
3811H39q2j431k92R11R51r44q60J48J296J53j160k16O45Q83k47j271k95J689M03
3830A120j319n67M12J063k39r49k02J195N31j215p94L16J250R8j135n62R11R13
3848H27m04j171j71J448M33r79j132P71J238k65j122k20R55P36r37j093K81J589
3866G84j13j252l63N71J377o91j471L45J489Q08j373j144Q28J314l66j381n34
3883a172J384R79r55j033L34R95L84j394p35J051J062m80j623L36J534N39j205
3900Aj280O75J800j90j639n18J627Q92q60j752L01J906J12j299j233J356Q74l66
3918D07j459J0J373Q97r50j549P77J764l82j593m82J345J478j375j346L16J527
$$ y = [904, -79, -1014, -682, 602, 754, -301, -1080, 165, 1075, 529, -671, -705, 474, 1017, 277, -767, -462, 839, 757, -674, -966, -55, 896, -48, -908, -760, 536, 689, -471, -687, -42, 841, 594, -677, -972, 717, 1120, -199, -766, -354, 709, 470, -479, -681, 514, 1045, -170, -964, -648, 602, 700, -435, -997, -86, 827, 423, -748, -919, 529, 962, -17, -1149, -378, 860, 595, -527, -747, 208, 944, 7, -1086, -805, 784, 671, -581, -944, -373, 1004, 313, -1158, -813, 676, 1484, 111, -1033, -205, 1109, 743, -638, -1172, 212, 1191, 236, -797, -463, 532, 916, -478, -1213, -162, 900, 420, -1203, -867, 667, 1206, 1, -1279, -604, 1196, 1006, -633, -1151, 476, 1368, 508, -1244, -943, 963, 1075, -224, -1457, -101, 773, 407, -1052, -1042, 331, 1228, 278, -1271, -494, 1270, 888, -705, -1187, 158, 1636, 261, -1085, -769, 758]
3935G58O06j377j424J147J633q07j734k34J760R68j172j616O23J987J71k078n09
3952a298J665J262j187j337l80K463M14j707j338J345J200k72j731o07J949Q39
3968A280j358j540O28K001J4j574r53J515J618r30k055J45K493K87j603j681J381
3985c32J645k38k403l91K039J205j486j679N06K267N25k371j089J802J394o41
4001G53j965k3J967J160j827j721J094K023j40k130p18J728J329j214j970M94
4017a160J997N73j983j376J665K160r73k183j90K165J562j876k011O51K377J13
4033A511k148j142J754J713j030k331K89K380P70j968j828J436K575p68k196r49
4049a932K446J552j704k031P08K352M40k389j165J727K131j009k876K34K465R75
$$ y = [758, 1364, -13, -1437, -290, 1343, 536, -1198, -1432, 328, 1296, 124, -1492, -869, 1118, 1289, -789, -1298, 367, 1629, 442, -895, -1275, 1188, 1602, -105, -1443, -98, 1102, 830, -901, -1508, 441, 1280, -78, -1618, -990, 1011, 1025, -549, -1502, 13, 1631, 701, -1354, -1209, 1284, 1571, -32, -1713, -332, 1313, 1075, -1328, -1719, 320, 1525, 39, -1640, -1134, 1133, 1658, -713, -1802, 0, 1394, 753, -1212, -1235, 732, 1892, 65, -1656, -562, 1461, 1321, -809, -1527, 201, 1530, 316, -1654, -1160, 837, 1410, -573, -1949, -284, 1876, 903, -1280, -1470, 695, 2257, 381, -1630, -979, 1398, 1511, -637, -1779, -25, 1688, 658, -1673, -1384, 996, 1766, -202, -2030, -594, 1981, 1213, -983, -1932, 514, 2066, 362, -1669, -961, 1391, 1831, -558, -1723, 4, 2135, 1126, -1750, -1516, 949, 1924]
4065A924k289j739J016K691pk980p59K447K044j626k752O50K818P99k765j438
4081a966J759K469q54l017j13K526J301k060k315J281K468q5k223j424K160K116
4097B023j094k667J07L111P28k398k008J808K831j068k973k94K484J801j777k636
4113b022O80K758L70k814j298J978K580j249k818j22L154J256k552k112J465K813
4129B067m97k617j095K335K419j803k944O41K841Q67k984j606J717K934r33l165
4145a823m34K841J925k092k647J060L251k21k793j528K670K331j370l275K62L214
4161A371Q52k462k170J381L344m85l531p14L004K146k406k458P98L053O34l035
$$ y = [1924, -365, -2104, -1088, 1603, 1596, -1384, -2143, 304, 2348, 722, -2030, -1380, 1438, 2237, -528, -1966, -207, 2262, 1408, -1609, -1722, 804, 2105, 45, -2270, -989, 1479, 1394, -829, -2253, -93, 2023, 929, -1738, -1631, 1480, 2208, -190, -2198, -390, 2441, 1373, -1600, -1894, 590, 2391, 614, -2022, -1342, 1416, 1786, -1028, -2326, -348, 2232, 983, -1835, -1957, 1197, 2453, -99, -2211, -746, 2067, 1570, -1047, -2142, 193, 2612, 809, -2135, -1494, 1347, 2214, -770, -2376, -659, 2275, 1342, -1823, -2257, 584, 2509, 417, -2230, -1170, 2081, 1860, -933, -2461, 209, 2540, 1170, -2105, -1843, 1371, 2223, -239, -2409, -1028, 2316, 1831, -1700, -2414, 590, 2736, 330, -2128, -1330, 1723, 2357, -678]
$$ [...]
8191D57
##END NTUPLES=NMR FID
##END=
