##TITLE=1H_TG-2234-2
 CDCl3, 8 sc, 
 6.2.2019
##JCAMPDX= 6.0         $$ Bruker NMR JCAMP-DX V2.0
##DATA TYPE= NMR FID
##DATA CLASS= NTUPLES
##ORIGIN= UXNMR, Bruker Analytische Messtechnik GmbH
##OWNER= root
$$ XWIN-NMR		Version 3.5
$$ Wed Feb  6 14:18:53 2019 Russian Standard Time (UT+4h)  she@DPX200
##.OBSERVE FREQUENCY= 200.1313
##.OBSERVE NUCLEUS= ^1H
##.DELAY= (6, 6)
##.ACQUISITION MODE= SIMULTANEOUS
##.ACQUISITION SCHEME= undefined
##.AVERAGES= 8
##.DIGITISER RES= 18
##SPECTROMETER/DATA SYSTEM= spect
##.PULSE SEQUENCE= zg30
##.SOLVENT NAME= CDCl3
##.SHIFT REFERENCE= (INTERNAL, CDCl3, 0, 15.7039)
##AUDIT TRAIL= $$ (NUMBER, WHEN, WHO, WHERE, WHAT)
$$ ##TITLE= Audit trail, XWIN-NMR		Version 3.5
$$ ##JCAMPDX= 5.01
$$ ##ORIGIN= Bruker BioSpin GmbH
$$ ##OWNER= she
$$ F:/spectra/data/she/nmr/H-F/1/audita.txt
$$ ##AUDIT TRAIL=  $$ (NUMBER, WHEN, WHO, WHERE, WHAT)
(   1,<2019-02-06 14:17:49.17 +0400>,<she>,<DPX200>,
      <created by zg, POWCHK disabled, PULCHK disabled
       configuration hash MD5:
       00 E9 B6 7A A2 85 ED C7 34 08 36 98 17 FE 4E 26
       data hash MD5: 16K
       A5 25 39 2A 99 08 00 95 23 FD 1D 94 21 CD 9A 46>)
$$ ##END=
$$ 
$$ hash MD5
$$ F6 93 C5 15 BC 60 B2 12 7F 22 A0 AD EA 5A FE 7A
##$RELAX= 
##$RELAX= 
##$RELAX= 
##$RELAX= 
##$RELAX= 
##$RELAX= 
$$ Bruker specific parameters
$$ --------------------------
##$DU= <F:/spectra>
##$EXPNO= 1
##$NAME= <H-F>
##$PROCNO= 1
##$TYPE= <nmr>
##$USER= <she>
##$AMP= (0..31)
100 100 100 100 100 100 100 100 100 100 100 100 100 100 100 100 100 100 
100 100 100 100 100 100 100 100 100 100 100 100 100 100 
##$AQSEQ= 0
##$AQ_mod= 1
##$AUNM= <au_zg>
##$AUTOPOS= <>
##$BF1= 200.13
##$BF2= 200.13
##$BF3= 200.13
##$BF4= 200.13
##$BF5= 200.13
##$BF6= 200.13
##$BF7= 200.13
##$BF8= 200.13
##$BYTORDA= 1
##$CFDGTYP= 0
##$CFRGTYP= 5
##$CHEMSTR= <none>
##$CNST= (0..31)
1 1 145 1 1 1 1 1 1 1 1 1 1 1 1 1 1 1 1 1 1 1 1 1 1 1 1 1 1 1 1 1 
##$CPDPRG= <>
##$CPDPRG1= <>
##$CPDPRG2= <>
##$CPDPRG3= <>
##$CPDPRG4= <mlev>
##$CPDPRG5= <mlev>
##$CPDPRG6= <mlev>
##$CPDPRG7= <mlev>
##$CPDPRG8= <mlev>
##$CPDPRGB= <>
##$CPDPRGT= <>
##$D= (0..31)
0 1.2 0 0 0 0 0 0 0 0 0 0.03 0 0 0 0 0 0 0 0 0 0 0 0 0 0 0 0 0 0 0 0 
##$DATE= 1549448268
##$DBL= (0..7)
120 120 120 120 120 120 120 120 
##$DBP= (0..7)
150 150 150 150 150 150 150 150 
##$DBP07= 0
##$DBPNAM0= <>
##$DBPNAM1= <>
##$DBPNAM2= <>
##$DBPNAM3= <>
##$DBPNAM4= <>
##$DBPNAM5= <>
##$DBPNAM6= <>
##$DBPNAM7= <>
##$DBPOAL= (0..7)
0.5 0.5 0.5 0.5 0.5 0.5 0.5 0.5 
##$DBPOFFS= (0..7)
0 0 0 0 0 0 0 0 
##$DE= 6
##$DECBNUC= <off>
##$DECIM= 32
##$DECNUC= <off>
##$DECSTAT= 4
##$DIGMOD= 1
##$DIGTYP= 9
##$DL= (0..7)
0 120 120 120 120 120 120 120 
##$DP= (0..7)
150 150 150 150 150 150 150 150 
##$DP07= 0
##$DPNAME0= <>
##$DPNAME1= <>
##$DPNAME2= <>
##$DPNAME3= <>
##$DPNAME4= <>
##$DPNAME5= <>
##$DPNAME6= <>
##$DPNAME7= <>
##$DPOAL= (0..7)
0.5 0.5 0.5 0.5 0.5 0.5 0.5 0.5 
##$DPOFFS= (0..7)
0 0 0 0 0 0 0 0 
##$DQDMODE= 0
##$DR= 18
##$DS= 0
##$DSLIST= <SSSSSSSSSSSSSSS>
##$DSPFIRM= 0
$$ [...]
##$SUBNAM2= <"">
##$SUBNAM3= <"">
##$SUBNAM4= <"">
##$SUBNAM5= <"">
##$SUBNAM6= <"">
##$SUBNAM7= <"">
##$SUBNAM8= <"">
##$SUBNAM9= <"">
##$SW= 20.0189088683792
##$SWIBOX= (0..15)
0 0 2 0 0 0 0 0 0 0 0 0 0 0 0 0 
##$SW_h= 4006.41025641026
##$TD= 16384
##$TD0= 1
##$TE= 0
##$TE2= 300
##$TE3= 300
##$TEG= 300
##$TL= (0..7)
0 120 120 120 120 120 120 120 
##$TP= (0..7)
150 150 150 150 150 150 150 150 
##$TP07= 0
##$TPNAME0= <>
##$TPNAME1= <>
##$TPNAME2= <>
##$TPNAME3= <>
##$TPNAME4= <>
##$TPNAME5= <>
##$TPNAME6= <>
##$TPNAME7= <>
##$TPOAL= (0..7)
0.5 0.5 0.5 0.5 0.5 0.5 0.5 0.5 
##$TPOFFS= (0..7)
0 0 0 0 0 0 0 0 
##$TUNHIN= 0
##$TUNHOUT= 0
##$TUNXOUT= 0
##$USERA1= <user>
##$USERA2= <user>
##$USERA3= <user>
##$USERA4= <user>
##$USERA5= <user>
##$V9= 5
##$VALIST= <valist>
##$VCLIST= <CCCCCCCCCCCCCCC>
##$VD= 0
##$VDLIST= <DDDDDDDDDDDDDDD>
##$VPLIST= <PPPPPPPPPPPPPPP>
##$VTLIST= <TTTTTTTTTTTTTTT>
##$WBST= 1024
##$WBSW= 4
##$XGAIN= (0..3)
0 0 0 0 
##$XL= 0
##$YL= 0
##$YMAX_a= 139504
##$YMIN_a= -242865
##$ZGOPTNS= <>
##$ZL1= 120
##$ZL2= 120
##$ZL3= 120
##$ZL4= 120
##$ABSF1= 10
##$ABSF2= 0
##$ABSG= 5
##$ABSL= 3
##$ALPHA= 0
##$AQORDER= 0
##$ASSFAC= 0
##$ASSFACI= 0
##$ASSFACX= 0
##$ASSWID= 0
##$AUNMP= <proc_1d>
##$AZFE= 0.1
##$AZFW= 0.1
##$BCFW= 1
##$BC_mod= 2
##$BYTORDP= 1
##$COROFFS= 0
##$CY= 11.3945322036743
##$DATMOD= 1
##$DC= 2
##$DFILT= <>
##$DTYPP= 0
##$F1P= 18.9103706918063
##$F2P= -1.10871071338519
##$FCOR= 0.5
##$FTSIZE= 0
##$FT_mod= 4
##$GAMMA= 1
##$GB= 0.15
##$INTBC= 1
##$INTSCL= 1
##$ISEN= 128
##$LB= 0.24
##$LEV0= 0
##$LPBIN= 0
##$MAXI= 10000
##$MC2= 0
##$MEAN= 0
##$ME_mod= 0
##$MI= 1.114404
##$NCOEF= 0
##$NC_proc= 0
##$NLEV= 6
##$NOISF1= 3.799351
##$NOISF2= 2.8
##$NSP= 1
##$NTH_PI= 0
##$NZP= 0
##$OFFSET= 15.70392
##$PC= 1
##$PHC0= -9036.795
##$PHC1= 9.400042
##$PH_mod= 1
##$PKNL= yes
##$PPARMOD= 0
##$PSCAL= 0
##$PSIGN= 0
##$REVERSE= no
##$SF= 200.130013532006
##$SI= 16384
##$SIGF1= 3
##$SIGF2= 2
##$SINO= 400
##$SIOLD= 16384
##$SREGLST= <1H.CDCl3>
##$SSB= 0
##$STSI= 0
##$STSR= 0
##$SW_p= 3612.71676300578
##$SYMM= 0
##$S_DEV= 0
##$TDeff= 0
##$TDoff= 0
##$TI= <>
##$TILT= no
##$TM1= 0
##$TM2= 0
##$TOPLEV= 0
##$USERP1= <user>
##$USERP2= <user>
##$USERP3= <user>
##$USERP4= <user>
##$USERP5= <user>
##$WDW= 1
##$XDIM= 8192
##$YMAX_p= 0
##$YMIN_p= 0
$$ End of Bruker specific parameters
$$ ---------------------------------
##NTUPLES= NMR FID
##VAR_NAME=  TIME,          FID/REAL,        FID/IMAG
##SYMBOL=    X,             R,               I
##VAR_TYPE=  INDEPENDENT,   DEPENDENT,       DEPENDENT
##VAR_FORM=  AFFN,          ASDF,            ASDF
##VAR_DIM=   8192,          8192,            8192
##UNITS=     SECONDS,       ARBITRARY UNITS, ARBITRARY UNITS
##FACTOR=    0.0002496,     1,               1
##FIRST=     0,             0,               0
##LAST=      2.0444736,     0,               0
##MIN=       0,             -242865,         0
##MAX=       2.0444736,     139504,          0
$$ Real data points
##PAGE= N=1
##DATA TABLE= (X++(R..R)), XYDATA
$$ [...]
$$ plain form
1817 -258 -392 -87 -430 -134 -65 -120 -212 309 45 239 426 253 133 361 192 -146 -23 41 -351 -42 -175
1838 -175 -495 -159 -114 -310 -337 -208 -441 -44 -60 -434 124 254 -101 39 333 170 249 431 -55 -23 464 283
1860 283 23 220 81 -167 29 -364 -142 275 84 -173 22 -140 -226 109 306 13 74 694 260 218 279
1881 279 -13 287 469 -44 -231 19 -295 -118 -98 -275 -370 161 -401 -162 -35 -13 -248 378 329 -194 300
1902 300 306 -134 333 396 112 -98 104 -59 181 78 6 -107 243 -246 -326 253 -43 -201 -231 -186 -169 50 -92
1925 -92 -142 290 437 140 89 383 135 59 151 -111 137 319 -74 56 -50 -355 38 -139 -232 -155 52 1 9
1948 9 257 -57 237 326 161 42 332 -45 -94 167 23 -485 337 71 -158 -169 84 -131 -78 -108 -248 -153 81
1971 81 -109 -145 609 -100 -109 315 46 218 442 -36 -31 257 129 9 243 -64 -156 -240 -113 -496 -124 20 -149
$$ packed form
1817b58j34L05l43K96O9n5r2N21k64J94J87j73j20K28j69l38J23O4l92L09j33
1838a75l20L36M5j96k7J29k33L97j6l74N58J30l55J40K94j63P9J82m86L2M87j81
1860B83k60J97j39k48J96l93K22M17j91k57J95j62q6L35J97k93O1O20m34m2O1
1881B79k92L00J82n13j87K50l14J77K0j77r5N31n62K39J27K2k35O26m9n23M94
1902C00Om40M67O3k84k10K02j63K40j03p2j13L50m89q0N79k96j58l0M5J7K19j42
1925i2n0M32J47k97n1K94k48p6R2k62K48J82l93J30j06l05L93j77r3P7K07n1Q
1948IK48l14K94Q9j65j19K90l77m9K61j44n08Q22k66k29j1K53k15N3l0j40R5K34
1971H1j90l6P54p09rM24k69J72K24m78NK88j28j20K34l07r2q4J27l83L72J44j69
$$ plain form
1994 -149 206 45 -56 -169 277 -67 182 139 448 4 -38 -127 211 -126 29 -205 99 -145 -302 -89 -271
2015 -271 -207 -102 -143 -237 -168 -189 -61 -78 199 -12 160 214 31 170 513 -97 -30 357 -130 58 119 -60 -240
2038 -240 125 -273 -94 -140 -2 -103 148 134 -42 199 -60 73 436 135 44 424 34 -313 437 -18 -150
2059 -150 -16 143 -158 20 237 -247 145 -216 -82 51 -175 -229 57 121 -15 -130 -43 -129 279 345 303 68
2081 68 219 17 -266 -131 321 -123 142 -181 -164 72 -29 -86 -21 84 -3 -158 -43 20 54 182 70 -77
2103 -77 215 127 8 0 78 -34 -37 97 -234 -123 -99 -172 -177 -152 -48 -25 52 0 -68 56 76 74 12 -23 231 258 139
2130 139 210 278 -7 -136 166 95 -106 57 -3 0 -7 -51 -107 -44 6 -33 129 228 65 59 187 116 62 -68 64 308
2156 308 113 151 -4 -62 56 267 -121 -19 -48 31 349 -184 -106 11 29 -29 -181 217 24 -17 184 -88 252
$$ packed form
1994a49L55j61j01j13M46l44K49m3L09m44m2q9L38l37J55k34L04k44j57K13j82
2015b71O4J05m1r4O9k1J28j7K77k11J72N4j83J39L43o10O7L87m87J88O1j79j80
2038b40L65l98J79m6J38j01K51j4j76K41k59J33L63l01r1L80l90l47P50m55j32
2059a50J34J59l01J78K17m84L92l61J34J33k26n4K86O4j36j15Q7q6M08O6m2k35
2081F8J51k02k83J35M52m44K65l23J7K36j01n7O5J05q7j55J15O3L4J28j12j47
2103g7K92q8j19qP8j12lJ34l31J11K4p3nK5J04K3P7n2o8J24K0ko2l5K54K7j19
2130A39P1O8k85j29L02p1k01J63o0Lpm4n6O3N0l9J62R9j63oJ28p1n4j30J32K44
2156C08j95L8j55n8J18K11l88J02k9P9L18n33P8J17J8n8j52L98j93m1K01k72L40
$$ plain form
2179 252 -13 69 14 -188 -48 108 -58 -80 70 -197 100 -32 -179 112 -290 -25 -158 -34 -165 -244 94
2200 94 -5 21 10 4 24 99 66 145 38 7 -1 -3 -180 -1 73 83 -120 -165 -59 -19 -15 275 -330 58 -37 -57 -168 114
2228 114 273 215 200 223 -278 103 -129 -42 248 -106 -155 31 61 35 -90 -44 2 108 87 -243 33 -26 -157 -98
2252 -98 -187 332 79 -53 161 180 -152 -54 -185 12 -49 -135 -102 89 -65 118 219 -99 -304 -213 -159 -65 -163 260
2276 260 123 169 91 -219 47 -32 -76 162 -211 185 -35 -252 -153 27 -222 45 213 -77 -178 -16 45 -161
2298 -161 -122 167 -31 40 -53 73 -44 173 -40 -73 -43 -56 50 -166 -189 -210 114 47 -169 221 48 150 251
2321 251 -8 107 -17 126 83 31 131 62 -97 57 217 -264 186 108 -76 195 -25 27 -96 -38 116 38
2343 38 318 39 22 -201 40 145 -227 64 74 -190 99 26 91 266 161 78 129 -81 -265 -144 108 97 -221
$$ packed form
2179B52k65Q2n5k02J40J56j66k2J50k67K97j32j47K91m02K65j33J24j31p9L38
2200I4r9K6j1oK0P5l3P9j07l1qkj77J79P4J0k03m5J06M0MK90o05L88r5k0j11K82
2228A14J59n8j5K3n01L81k32Q7K90l54m9J86L0k6j25M6M6J06k1l30K76n9j31N9
2252i8q9N19k53j32K14J9l32R8j31J97o1q6L3J91j54J83J01l18k05R1N4R4r8M23
2276B60j37M6p8l10K66p9m4K38l73L96k20k17R9J80k49K67J68k90j01J62O1k06
2298a61L9K89j98P1r3J26j17K17k13l3L0j3J06k16k3k1L24o7k16L90j73J02J01
2321B51k59J15j24J43m3n2J00o9j59J54J60m81M50p8j84K71k20N2j23N8J54p8
2343C8K80k79j7k23K41J05l72K91J0k64K89p3O5J75j05q3N1k10j84J21K52j1l18
$$ plain form
2366 -221 -216 -106 154 -125 2 286 166 -54 -25 71 214 -36 241 -142 -93 73 -224 -105 100 9 158 -17
2388 -17 83 -62 33 -206 -107 -32 -1 187 -114 -89 219 62 -70 -227 -45 300 6 -271 0 -185 104 85
2410 85 35 -175 119 -195 -104 16 -274 -30 -2 -194 105 85 67 43 198 62 -137 63 -79 12 -16 194 -93
2433 -93 200 -122 -185 104 -68 111 166 40 -14 71 -162 119 124 117 242 -49 -133 -15 190 103 54 262 -149 -4
2457 -4 -4 -9 -106 -226 22 241 105 -43 79 234 -117 62 47 94 9 -184 45 -192 -405 -123 220 72 -141
2480 -141 -126 -49 -248 16 -87 -101 -204 -21 1 115 -21 62 53 -50 -24 -17 199 -42 73 -108 238 -88 -187 -53
2504 -53 144 110 -411 -257 -92 -101 44 -67 -18 6 -352 60 -110 31 -132 256 162 -185 135 34 -76 -205
2526 -205 -100 60 -11 191 154 158 -140 38 2 -48 -39 -195 112 -182 343 6 -132 118 -87 -19 -28 -82 -207 115
$$ packed form
2366b21NJ10K60k79J27K84j20k20K9R6J43k50K77l83M9J66k97J19K05r1J49j75
2388a7J00j45R5k39R9P5L1J88l01K5L08j57j32j57J82L45k94k77K71j85K89j9
2410H5n0k10K94l14R1J20k90K44K8j92K99k0j8k4J55j36j99K00j42R1k8K10k87
2433i3K93l22o3K89j72J79N5j26n4Q5k33K81NpJ25k91q4J18K05q7m9K08m11J45
2457d%nr7j20K48K19j36j48J22J55l51J79j5M7q5j93K29k37k13K82L43j48k13
2480a41J5P7j99K64j03j4j03J83K2J14j36Q3rj03K6PK16k41J15j81L46l26r9J34
2504e3J97l4n21J54J65rJ45j11M9K4l58M12j70J41j63L88r4l47L20j01j10j29
2526b05J05J60p1K02l7Mk98J78l6n0Rj56L07k94N25l37j38K50k05O8rn4j25L22
$$ plain form
2550 115 -85 -215 96 55 251 54 87 -49 -149 -7 135 378 -4 190 118 14 -94 -18 -214 79 118 115
2572 115 -189 268 -5 -298 -226 23 30 -213 42 -28 80 -74 13 -158 243 10 22 -3 6 177 -163 68 142
2595 142 44 64 -70 112 -26 -53 89 -364 9 156 37 -104 77 141 234 152 -23 189 -155 23 -185 196
2617 196 -82 -105 123 370 31 -245 275 1 29 3 -208 -98 -35 -122 -22 75 20 25 -20 -48 34 -179 -53 28
2641 28 -27 98 -110 28 135 -200 -59 -168 25 238 280 -235 -55 -14 -241 63 -27 205 -87 -147 -19 141
2663 141 -11 37 -48 156 -73 -63 -278 62 -48 -39 -189 -128 20 80 75 48 -38 238 42 -216 216 39 367 -73
2687 -73 20 -183 -203 -129 -165 143 142 -154 111 79 -135 248 26 135 75 23 100 -68 123 36 4 27 230 -171 -51
2712 -51 -19 -211 112 -97 57 -3 -67 -69 3 50 -254 -33 230 9 -141 -4 -58 -178 21 -35 -105 -101 142 -37
$$ packed form
2550A15k00j30L11m1J96j97L3j36j00J42J42K43l82J94p2j04j08P6j96K93L9l
2572A15l04M57k73k93P2K49Pk43K55p0J08j54Q7j71M01k33J2k5RJ71l40K31P4
2595A42r8K0j34J82j38k7J42m53L73J47j19j41J81O4R3q2j75K12l44J78k08L81
2617A96k78k3K28K47l39k76N20k74K8k6k11J10O3q7J00R7n5Nm5k8Q2k13J26Q1
2641B8n5J25k08J38J07l35J41j09J93K13M2n15J80M1k27L04r0K32k92o0J28J60
2663A41j52M8q5K04k29J0k15L40j10Rj50O1J48O0nk7q6K76j96k58M32j77L28m40
2687g3R3k03k0P4l6L08jk96K65l2k14L83k22J09o0n2P7j68J91q7l2K3K03m01J20
2712e1L2j92L23k09J54o0o4kP2M7l04K21K63k21j50J37n4j20J99n6p0MK43j79
$$ plain form
2736 -37 121 17 80 297 -49 -104 -135 -39 21 -8 90 159 88 100 89 -30 -286 -155 167 13 -395 -36 147 -152
2760 -152 -166 -119 -153 -130 -95 -24 54 22 79 156 271 -17 -14 52 -36 205 -35 -81 10 57 -64 59 -242 71 -59 119
2786 119 -79 -95 -78 32 -187 -75 -140 89 82 5 167 136 81 -193 148 -40 -114 85 38 125 383 -183 -92 125
2810 125 259 -77 -84 235 -384 -146 -150 -8 59 31 215 -74 61 -187 286 -43 80 124 127 48 -150 31 -113
2833 -113 -160 89 105 -106 -137 -38 -191 -184 52 -46 -206 -33 -118 183 -39 -276 -32 -1 56 71 35 197 81 18
2857 18 -234 46 141 256 -168 63 -3 56 184 49 14 -217 -268 -91 136 22 92 252 -44 -68 -69 413 65
2880 65 -246 102 286 62 191 -95 11 147 52 114 198 0 -17 -4 -100 135 -28 -8 -109 148 169 159 -58
2903 -58 16 -195 137 153 46 85 -158 -42 74 -180 -133 142 5 -91 -50 -162 -193 -153 -104 -231 109 -119 -57 -36
$$ packed form
2736c7J58j04O3K17l46n5l1R6O0k9R8O9p1J2j1j19k56J31L22j54m08L59J83k99
2760a52j4M7l4K3L5P1P8l2N7P7J15k88LO6q8K41k40m6R1M7j21J23l01L13j30J78
2786A19j98j6J7J10k19J12o5K29pp7J62l1n5k74L41j88p4J99m7Q7K58n66R1K17
2810A25J34l36pL19o19K38mJ42O7k8J84k89J35k48M73l29J23M4Lp9j98J81j44
2833a13m7K49J6k11l1R9j53PK36r8j60J73q5L01k22k37K44L1N7J5l6J62j16o3
2857A8k52K80R5J15m24K31o6N9J28j35l5k31n1J77K27j14P0J60k96k4jM82l48
2880F5l11L48J84k24J29k86J06J36r5O2Q4j98j7J3r6K35j63K0j01K57K1j0k17
2903e8P4k11L32J6j07L9k43J16J16k54M7K75j37r6M1j12l1M0M9j27L40k28O2K1
$$ plain form
2927 -36 -111 -67 -216 210 -47 -221 97 -199 73 -265 -106 -187 126 66 -102 58 -260 77 -14 25 50 -64 -229
2950 -229 -231 -18 162 113 66 303 231 -253 132 35 -154 216 -151 -226 -31 207 -200 -89 -54 -133 350 148 -44
2973 -44 143 -193 35 3 232 24 -177 31 58 13 -16 57 -34 290 -162 80 258 -124 92 55 13 39 -184
2996 -184 199 24 240 -26 -120 -46 -67 188 -232 -45 41 70 -191 -75 -70 -71 48 -17 -105 -57 20 8 -26 236 -53
3021 -53 62 31 95 -53 193 98 -30 -184 78 80 -259 98 210 51 80 19 -144 -125 -56 -49 -121 -31 162 -162 241
3046 241 121 -21 14 -201 47 205 170 -108 282 160 -184 12 98 -169 42 56 -172 -274 -23 -237 -13
3067 -13 64 -24 -164 9 66 207 5 -105 10 -25 40 50 -39 116 -16 76 323 140 119 -239 -113 -6 -151
3090 -151 -96 310 173 26 39 -189 -32 324 -170 -223 -3 202 -65 37 -58 -192 29 36 183 38 194 -127
$$ packed form
2927c6p5M4j49M26k57j74L18k96K72l38J59q1L13o0j68J60l18L37r1L9K5j14j65
2950b29kK13J80m9m7K37p2m84L85r7j89L70l67p5J95K38m07J11L5p9M83k02j92
2973d4J87l36K28l2K29k08k01K08K7m5k9P3r1L24m52K42J78l82K16l7m2K6k23
2996a84L83j75K16k66r4P4k1K55m20J87Q6K9k61J16NjJ19o5q8M8P7j2l4K62k89
3021e3J15l1O4j48K46r5j28j54K62Kl39L57J12j59K9o1j63J9O9Pp2R0J93l24M03
3046B41j20j42L5k15K48J58l5k78L90j22l44J96Q6k67K11J4k28j02K51k14K24
3067a3P7q8j40J73N7J41k02j10J15l5O5J0q9J55j32R2K47j83k1l58J26J07j45
3090a51N5M06j37j47J3k28J57L56m94n3K20K05k67J02r5j34K21PJ47j45J56l21
$$ plain form
3112 -127 -72 -112 126 -228 264 197 -101 -28 -89 13 195 56 -150 55 316 70 85 12 -291 -64 -268 -47
3134 -47 -75 -56 58 23 -26 -125 -209 119 -193 -86 -102 32 -82 100 3 -150 165 57 -10 24 17 -83 57 -20 -345
3159 -345 246 -304 -230 -43 -158 -255 -96 -298 -20 62 156 56 39 -143 -26 -29 -115 138 -194 19 148 -26 -117
3182 -117 -159 -79 45 32 -135 142 -25 -156 -91 97 71 27 175 114 11 160 -110 25 278 -7 -72 247 -40
3205 -40 -101 -54 -191 3 115 -157 -89 140 46 -60 126 -47 76 220 17 7 102 264 348 32 -49 -111 262
3228 262 -98 -81 -203 -137 185 -243 -106 -7 159 -84 27 -90 219 -78 136 263 -32 2 228 192 62 177
3250 177 128 -81 -179 192 -160 -160 -110 169 -69 -79 -199 74 -114 -87 -59 -42 111 -277 -111 -32 -42 -63 -95 -83 20
3275 20 -47 -75 211 147 -151 -125 -212 -192 96 239 -97 -55 -1 -66 273 49 102 -22 247 -186 -445 338 -183 10
$$ packed form
3112a27N5m0K38l54M92o7k98P3o1J02J82j39k06K05K61k46J5p3l03K27k04K21
3134d7k8J9J14l5m9r9q4L28l12J07j6J34j14J82r7j53L15j08o7L4pj00J40p7l25
3159c45N91n50P4J87j15r7J59k02K78Q2R4j00j7j82J17lq6K53l32K13J29j74r1
3182a17m2Q0J24j3j67K77j67j31O5J88k6m4J48o1j03J49k70J35K53k85o5L19k87
3205d0o1M7j37J94J12k72O8K29r4j06J86j73J23J44k03j0R5J62Q4l16q1o2L73
3228B62l60J7j22O6L22m28J37R9J66k43J11j17L09k97K14J27k95L4K26l6j30J15
3250A77m9k09r8L71l52%N0K79k38j0j20K73j88K7K8J7J53l88J66P9j0k1l2J2J03
3275B0o7k8K86o4k98K6q7K0K88J43l36M2N4o5L39k24N3j24K69m33k59P83n21J93
$$ plain form
3299 10 287 147 52 -79 105 88 244 84 -42 40 -79 -101 232 29 40 -92 -214 21 -282 -41 -142 10
3321 10 3 71 163 338 4 -63 145 105 -338 328 12 -299 66 -81 103 86 115 -217 104 32 -211 -176 -144 9
3345 9 -52 -11 -6 -268 103 52 140 29 3 -67 140 26 76 166 -20 -193 76 -157 -360 177 61 -17 185 -293
3369 -293 -187 210 -79 -334 152 -82 67 249 416 -154 146 302 -51 -95 -72 -82 -140 134 36 85 102 107 -67
3392 -67 -122 -50 -24 -94 183 179 -18 -38 -50 -18 -157 -41 12 265 90 -103 162 25 130 326 110 -169 13 -187
3416 -187 -156 -73 -295 317 -1 -23 135 118 67 -172 216 302 51 -161 -7 -124 108 -94 -273 -116 -67 -168
3438 -168 -49 103 8 254 34 -221 44 325 -136 147 -75 169 46 61 -92 150 318 -37 -257 289 -121
3459 -121 -67 283 -190 141 -33 -201 -256 78 86 93 103 267 -98 -171 25 -163 146 -60 132 175 133 137 86 179 -139
$$ packed form
3299A0K77j40r5j31J84j7J56j60j26Q2j19k2L33k03J1j32j22K35l03K41j01J52
3321A0pO8R2J75l34o7K08m0m43O66l16l11L65j47J84j7K9l32L21p2k43L5L2J53
3345Io1M1Nk62L71n1Q8j11k6p0K07j14N0R0j86j73K69k33k03N37j16p8K02m78
3369b93J06L97k89k55M86k34J49J82J67n70L00J56l53m4K3j0n8K74r8M9J7Nj74
3392f7n5P2K6p0K77mj97k0j2L2j39J16N3K53j75j93K65j37J05J96k16k79J82k00
3416a87L1Q3k22O12l18k2J58j7n1k39L88Q6k51k12J54j17K32k02j79J57M9j01
3438a68J19J52r5K46k20k55K65K81m61K83k22K44j23J5j53K42J68l55k20N46m10
3459a21N4L50m73L31j74j68n5L34QPJ0J64l65p3J96j88L09k06J92M3m2Mn1R3l18
$$ plain form
3484 -139 99 -7 -163 -168 45 -51 -34 135 -190 170 35 -180 -68 -98 -54 -18 94 -295 -65 -4 133 111 -17
3507 -17 147 -275 23 -105 -4 -3 71 -92 -93 305 6 -171 78 -308 182 80 -97 -192 12 -39 133 33 224
3530 224 -129 -137 153 -202 -47 1 -134 -318 -62 -290 -44 302 248 54 -59 -103 -265 156 55 -53 149 108
3552 108 -14 89 -62 -302 -77 -131 -236 247 -163 41 285 167 -301 -293 -259 -70 -106 223 50 61 57 58 92 300
3576 300 -46 -204 105 -291 -186 222 136 44 -73 -174 -45 111 40 226 -37 -135 -111 205 130 -102 122 11
3598 11 -58 84 70 22 109 111 30 -140 -64 -83 -103 -54 -202 13 55 -27 -174 -4 90 -124 146 204 -14 60 -145 -134
3624 -134 -62 197 119 335 229 -217 -110 -84 -145 -240 216 -34 -158 -113 -110 -315 13 -58 -57 30 301 112 -131 -51
3648 -51 151 -8 -24 169 14 -38 3 73 34 -179 -238 -18 -305 2 -54 6 -178 -129 -435 -121 -100 -82 -19 -32 -291
$$ packed form
3484a39K38j06j56nK13r6J7J69l25L60j35k15J12l0M4L6J12l89K30O1J37k2j28
3507a7J64m22K98j28J01JP4j63jL98k99j77K49l86M90j02j77r5K04n1J72j00J91
3530B24l53qK90l55J55M8j35j84K56k28K46L46n4j94j13m4j62M21j01j08K02m1
3552A08j22J03j51k40K25n4j05M83m10K04K44j18m68QL4J89l6L29j73J1mJL4K08
3576C00l46j58L09l96J05M08q6r2j17j01J29J56p1J86k63r8K4L16p5k32K24j11
3598A1o9J42j4m8Q7Kq1j70P6j9k0M9j48K15M2q2j47J70R4k14K70N8k18P4k05J1
3624a34P2K59p8K16j06m46J07K6o1r5M56k50j24M5Lk05L28p1JQ7K71j89k43Q0
3648e1K02j59j6J93j55n2M1P0l9k13n9K20k87L07n6O0j84M9l06L14K1J8O3j3k59
$$ plain form
3673 -291 179 212 -168 -69 -46 211 -291 243 -119 -232 -24 -17 -26 137 171 -124 -4 231 -196 47 -40 -92 73
3696 73 178 -105 -60 83 -164 -129 -113 -25 -62 141 52 -254 -106 27 40 -39 -222 -209 -41 81 -63 84 230
3719 230 -294 -208 197 97 250 139 -74 -189 -127 -141 177 245 -21 45 298 44 -32 195 -97 81 96 94 -130
3742 -130 23 -219 115 -238 238 19 23 -66 -86 -12 29 -311 -1 95 -94 -302 71 -13 75 -188 -62 -77 -125 -5
3766 -5 87 -101 -108 80 138 15 186 -54 -114 -55 170 229 -134 327 -209 -132 196 97 -73 -95 140 -329 -7 57
3790 57 -97 -211 22 237 228 50 23 -14 -32 -222 -222 -106 -112 92 -135 44 -131 43 42 -155 208 74 -76 -76 -156
3815 -156 -257 110 379 -292 80 20 -102 187 192 36 224 253 -33 275 171 142 -305 -100 -85 -21 257 -213
3837 -213 -161 36 42 -459 -186 117 -63 181 18 107 134 80 -267 18 -75 -199 -141 66 -176 -242 131 -149 -196
$$ packed form
3673b91M70L3l80R9K3K57n02N34l62j13K08PrJ63L4k95J20K35m27K43q7n2J65
3696G3J05k83M5J43k47L5J6Q8l7K03q9l06J48J33J3p9j83J3J68J22j44J47J46
3719B30n24Q6M05j00J53j11k13j15O2j4L18O8k66O6K53k54p6K27k92J78J5kk24
3742a30J53k42L34l53M76k19Mq9k0P4M1l40L10R6j89k08L73q4Q8k63J26j5m8J20
3766eR2j88pJ88N8j23J71k40o0N9K25N9l63M61n36P7L28r9j70k2K35m69L22O4
3790E7j54j14K33K15rj78k7l7j8j90%J16oK04k27J79j75J74jj97L63j34j50%q0
3815a56j01L67K69o71L72o0j22K89Nj56J88K9k86L08j04k9m47K05J5O4K78m70
3837b13N2J97On01K73L03j80K44j63Q9K7n4l47K85r3j24N8K07k42o6L73k80m7
$$ plain form
3860 -196 84 -152 -7 -78 -98 -100 124 202 69 -321 361 -268 151 37 -105 -60 -11 174 27 79 -229 72 68
3883 68 -73 -243 -130 -315 176 197 -248 48 246 -63 -319 40 56 37 -154 -128 122 -122 -53 -16 -18 463 -39
3906 -39 -23 -224 -267 -16 165 5 14 -46 -102 -13 201 -151 232 258 -121 -68 254 103 -104 182 -34 -16 264 107
3930 107 33 240 110 -153 -72 -3 -165 -41 -54 70 -137 -30 -157 -213 -138 -155 -205 271 217 -121 -172 -288 -33
3953 -33 137 -159 -16 46 -91 -150 133 47 -353 -13 96 67 -82 -63 201 -223 -57 -74 -13 -7 -101 165 -63 93
3977 93 115 323 161 48 237 -247 165 -53 -52 52 31 -91 -181 -3 -104 117 255 -11 -66 274 229 -18 240
4000 240 109 76 313 -215 -181 -204 90 -110 57 162 55 -105 -374 1 -83 20 -138 149 74 207 -44 126
4022 126 63 -72 236 145 61 117 -41 -56 -58 -273 -69 -169 -117 -264 254 142 92 -51 72 -213 -14 -8 24 -20
$$ packed form
3860a96K80k36J45p1k0kK24P8j33l90O82o29M19j14j42M5M9J85j47N2l08L01m
3883F8j41j70J13j85M91K1m45K96J98l09k56L59J6j9j91K6K50k44O9L7kM81n02
3906c9J6k01m3K51J81j60Ro0n6Q9K14l52L83K6l79N3L22j51k07K86k16J8K80j57
3930A07p4K07j30k63Q1O9j62J24j3J24k07J07j27n6P5j7n0M76n4l38n1j16K55
3953c3J70k96J43O2j37n9K83q6m00L40J09k9j49J9K64m24J66j7O1Or4K66k28J56
3977I3K2K08j62j13J89m84M12k18JJ04k1j22r0J78j01K21J38k66n5L40m5k47K58
4000B40j31l3K37n28L4k3K94k00J67J05j07j60k69L75q4J03j58K87p5J33k51J70
4022A26o3j35L08r1q4N6j58j5kk15K04j00N2j47N18j12n0j43J23k85J99OL2m4
$$ plain form
4046 -20 24 68 -173 168 -205 35 95 -90 -212 162 -26 -196 36 41 -6 159 56 143 -104 -78 -206 -156 26
4069 26 70 -189 51 -61 180 164 13 43 -124 47 -37 130 88 -123 34 16 -1 167 -343 -270 72 -118 49
4092 49 251 -80 -82 182 -68 -162 -199 283 -121 319 201 -194 -120 114 -31 -304 11 -61 -165 -41 43 -263 88
4115 88 245 10 30 -98 -110 111 -47 -72 -24 128 -85 66 179 -123 -85 123 156 133 -59 -12 -64 158 53
4138 53 42 -165 -148 15 281 -369 85 79 -115 51 189 155 202 25 48 -92 52 -72 -429 65 -177 -37 64
4161 64 -41 -22 -86 400 -31 -301 115 -120 -86 122 201 83 263 -17 240 105 60 116 210 131 -106 -167 21
4184 21 -161 65 -66 -21 -7 136 48 -152 -143 -310 4 153 -223 183 68 51 -36 59 -61 -33 34 -16 -13 20 17 -99
4210 -99 41 82 -91 196 -200 -21 80 -97 -37 250 -23 75 12 61 -68 -13 -134 -59 -80 23 91 -242 -59
$$ packed form
4046b0M4M4k41L41l73K40O0j85j22L74j88j70K32Nm7J65j03Q7k47K6j28N0J82
4069B6M4k59K40j12K41j6j51L0j67J71q4J67m2k11J57j8j7J68n10P3L42j90J67
4092D9K02l31kK64k50r4l7M82m04M40j18l95P4K34j45k73L15p2j04J24Q4l06L51
4115H8J57k35K0j28j2K21j58k5M8J52k13J51J13l02L8K08L3k3j92M7n2K22j05
4138E3j1k07J7J63K66o50M54oj94J66J38l4M7j77K3j40J44j24l57M94k42J40J01
4161F4j05J9o4M86m31k70M16k35L4K08P9j18J80k80K57j35m5N6R4p9k37o1J88
4184B1j82K26j31M5J4J43q8k00Rj67L14J49l76M06j15j7q7R5j20K8O7n0LL3lj16
4210i9J40M1j73K87l96J79J01j77O0K87k73R8o3M9j29N5j21P5k1J03O8l33J83
$$ plain form
4233 -59 -145 -303 139 -115 -198 -191 -50 74 -127 166 100 157 103 111 -280 234 -207 -104 -132 -161 115 -107 -292 -325
4257 -325 -66 -66 -10 227 -113 50 137 -80 197 111 -176 -122 60 228 287 -44 -13 -131 -95 250 37 -273 -82
4280 -82 -113 276 213 129 -50 -36 -221 -407 -247 -225 -189 -85 247 -52 163 -170 120 -264 171 223 22 205 13
4303 13 252 63 -14 -87 -31 -233 -46 28 -4 54 273 -1 -102 -53 401 -19 62 -318 -12 95 -50 -73 247
4326 247 103 -85 187 -23 117 76 323 -19 -239 79 -109 -106 -162 -122 -95 65 -89 -188 -4 -38 -19 -157 -12
4349 -12 18 212 105 -41 -49 -123 -110 -93 71 -10 -19 49 122 46 -143 -151 206 -125 -256 40 -88 281 170 66 -52
4374 -52 -68 -76 -120 124 128 -133 -154 -121 17 -24 13 72 -264 289 -51 30 -186 -23 79 -17 -120 23 50 22 59 -215
4400 -215 30 71 -107 -7 223 -58 139 -123 11 106 -319 280 120 -49 -14 7 -78 83 -59 -11 -33 208
$$ packed form
4233e9q6j58M42k54q3PJ41J24k01K93o6N7n4Ql91N14m41J03k8k9K76k22j85l3
4257c25K59%N6K37l40J63Q7k17K77q6k87N4J82J68N9l31L1j18L6L45k13l10J91
4280h2l1L89o3q4j79J4j85j86J60K2L6J04L32k99K15l33K90l84M35N2k01J83j92
4303A3K39j89p7p3N6k02J87P4l2N8K19k74j01M9M54m20Q1l80L06J07j45k3L20
4326B47j44j88K72k10J40m1K47l42k20L18j88Ln6M0K7J60j54r9J84l4J9j38J45
4349a2L0J94j07j46qp4J3J7J64q1rO8P3p6j89qL57l31j31K96j28L69j11j04j18
4374e2j6qm4K44Mk61k1L3J38m1L7N9l36N53l40Q1k16J63J02r6j03J43K7k8L7k74
4400b15K45M1j78J00K30k81J97k62J34R5m25N99j60j69L5K1q5J61j42M8k2K41
$$ plain form
4422 208 -256 -301 74 -34 65 187 183 -53 -221 128 -127 -366 152 -151 -287 210 -300 61 262 156 -85
4443 -85 49 275 -27 332 -43 110 286 5 54 98 84 -44 119 169 -151 -223 153 -284 130 230 39 -162
4465 -162 -56 -258 -191 -158 89 145 -73 -201 -8 202 121 22 -64 -169 -140 -10 -44 -249 -21 -113 -212 -188 -55 307
4489 307 80 69 -105 462 156 -48 -84 114 -78 -66 38 -50 -176 218 106 105 154 -13 93 123 -57 277 -76
4512 -76 33 -134 -116 58 -24 -168 9 79 -114 -287 83 93 136 -51 -82 -217 64 167 -44 -106 -8 51 -301
4535 -301 -116 -105 -80 29 175 217 126 -114 -39 -149 122 -177 -129 -93 106 49 -139 250 31 -38 75 -48 151
4558 151 -220 -13 -22 114 -205 -24 -70 51 -69 42 -292 -107 133 50 8 123 42 109 -111 -117 38 33 30 223
4582 223 51 205 112 -64 46 73 45 1 -150 -206 -11 -24 235 115 78 -255 -22 -83 328 -192 72 223 207
$$ packed form
4422B08m64m5L75j08R9J22mk36j68L49k55k39N18l03j36M97n10L61K01j06k41
4443h5J34K26l02L59l75J53J76k81M9M4j4j28J63N0l20p2L76m37M14J00j91k01
4465a62J06k02O7L3K47N6k18j28J93K10q1r9q6j05K9J30l4k05K28r2r9K4J33L62
4489C07k27j1j74N67l06k04l6J98j92J2J04q8j26L94j12jM9j67J06L0j80L34l53
4512g6J09j67J8J74q2j44J77P0j93j73L70J0M3j87l1j35K81J03k11o2R8N9l52
4535c01J85J1K5J09J46M2r1k40P5j10K71k99M8L6J99n7j88L89k19o9J13j23J99
4558A51l71K07rJ36l19J81m6J21j20J11l34J85K40q3m2J15q1O7k20oJ55nlJ93
4582B23j72J54r3j76J10K7k8m4j51n6J95j3K59j20l7l33K33o1M11n20K64J51j6
$$ plain form
4605 207 74 -296 28 -207 -148 -75 -83 92 -211 30 -113 -85 -142 146 -124 -132 192 51 -178 55 52 -48 -26 -86
4629 -86 125 -29 107 -48 128 79 -10 -102 -29 47 -61 137 40 -38 -82 108 -49 -161 139 -31 59 -115 -5
4652 -5 149 236 -154 21 -269 -10 10 39 -61 14 135 -88 68 180 77 151 -15 -117 -82 154 -32 236 -87
4675 -87 52 23 -349 -103 62 -18 258 229 -8 -34 -94 47 212 63 141 213 82 74 260 -42 93 -87 354
4698 354 -110 32 110 -162 -92 -6 -190 -280 -10 -242 -10 154 -51 -133 108 -175 -6 -62 173 69 80 -56
4720 -56 -34 -35 320 -12 22 67 -52 -18 -48 66 -76 170 -27 -39 -56 -246 114 148 -88 100 112 4 -70 12 123
4745 123 69 98 -18 23 -60 196 -28 136 22 -64 63 323 40 270 208 7 -292 165 -324 -131 -207 0
4767 0 151 -54 105 87 -22 -33 68 46 187 -124 111 -155 -205 139 150 -179 182 36 -196 76 -24 -14 -89
$$ packed form
4605B07j33l70L24k35N9P3qJ75l03K41j43K8n7K88k70qL24j41k29K33lj00K2o0
4629h6K11j54J36j55J76m9q9r2P3P6j08J98r7p8m4J90j57j12L00j70R0j74J10
4652eJ54Q7l90J75k90K59K0K9j00P5J21k23J56J12j03P4j66j02L5K36j86K68l23
4675h7J39k9l72K46J65q0K76k9k37k6o0J41J65j49P8P2j31qJ86l02J35j80M41
4698C54m64J42P8k72P0Q6j84r0K70k32K32J64k05q2K41k83J69n6K35j04J1j36
4720e6K2jL55l32L4M5j19L4l0J14j42K46j97j2j7j90L60L4k36J88J2j08p4Q2J11
4745A23n4K9j16M1q3K56k24J64j14q6J27K60k83K30o2k01k99M57m89J93p6K07
4767@J51k05J59j8j09j1J01k2J41l11K35k66n0L44J1l29L61j46k32K72j00J0p5
$$ plain form
4790 -89 -140 -113 -11 45 87 28 75 -210 -43 -293 288 -197 75 176 -223 -170 -65 -62 -144 -270 -25 230 -64 28
4814 28 -48 -160 110 -155 198 -326 -215 29 17 27 207 -132 125 -80 -68 -24 -123 295 94 -110 201 -184
4836 -184 -22 142 100 154 -81 107 6 -19 38 -461 -65 99 17 -25 51 -284 184 -125 161 15 343 43
4858 43 59 67 -86 69 -137 100 -80 2 89 41 9 -192 -15 -21 -221 96 172 -44 -278 246 -43 9 -49 60
4882 60 93 210 77 -168 -96 121 35 -263 -91 54 21 184 98 19 -34 -144 227 59 76 -73 -85 -257 67
4905 67 113 48 101 17 68 -114 221 -73 201 24 174 -13 5 -10 91 109 268 -64 68 27 -145 202 123 -253
4929 -253 -53 26 -36 -132 -293 121 -109 182 -191 -38 -2 159 -115 83 -60 232 146 -29 -128 48 33 -277
4951 -277 -51 -199 10 153 145 -201 -104 -37 -27 55 -109 -16 88 217 14 -207 -121 142 -28 -1 -69 -224 -131 244
$$ packed form
4790h9n1K7J02N6M2n9M7k85J67k50N81m85K72J01l99N3J05Lq2j26K45K55k94R2
4814B8p6j12K70k65L53n24J11K44j2J0J80l39K57k05J2M4r9M18k01k04L11l85
4836a84J62J64m2N4k35J88j01k5N7m99L96J64q2m2P6l35M68l09K86j46L28l00
4858D3J6Qj53J55k06K37j80Q2Q7m8l2k01J77ok00L17P6k16k34N24k89N2n8J09
4882F0L3J17j33k45P2K17q6k98J72J45l3J63q6p9n3j10L71j68J7j49j2j72L24
4905F7M6o5N3q4N1j82L35k94K74j77J50j87J8j5J01J8J59l32J32m1j72L47p9l76
4929b53K00P9o2r6j61M14k30K91l73J53L6J61k74J98j43K92q6j75r9J76j5l10
4951b77K26j48K09J43ql46R7O7J0Q2j64R3J04J29k03k21Q6K63j70K7o8j55R3L75
$$ plain form
4975 244 108 -79 36 -240 90 167 384 96 -52 73 -41 -361 -39 -36 -59 -125 -83 88 21 95 61 -167 41
4998 41 87 -13 203 -102 -115 85 23 -69 144 -1 169 -197 140 -218 -267 151 -268 10 17 138 -66 91 -85
5021 -85 33 16 164 -68 -48 -129 -105 -132 151 -280 30 -53 -329 84 -160 36 -133 131 -10 -83 160 -20 -124
5044 -124 228 118 44 -162 -83 234 -95 -251 -246 -18 50 -55 -58 -48 115 -66 -124 22 -51 85 -280 -132 -36 -90
5068 -90 171 -333 -273 164 -99 126 146 -109 -107 47 -186 160 -238 11 140 -29 8 93 -123 157 -198 -307
5090 -307 270 210 -15 67 -43 -42 -125 108 -4 -137 228 -134 112 -38 -11 -234 -95 -11 139 -240 205 139 36
5113 36 108 8 -116 -46 -19 31 -55 -184 -354 -53 74 40 -189 -55 250 248 163 42 24 139 77 -15 12 13 -86 -89
5139 -89 273 -252 -10 -226 -114 4 9 -8 197 2 128 26 60 194 56 -140 -138 -235 -343 137 79 -43 49
$$ packed form
4975B44j36j87J15k76L30P7K17k88j48J25j14l20L22Lk3o6M2J71o7P4l4k28K08
4998D1M6j00K16l05j3K00o2r2K13j45J70l66L37l58m9M18m19K78PJ21k04J57j76
5021h5J18j7J48k32K0q1K4k7K83m31L10q3k76M13k44J96j69K64j41p3K43j80j04
5044a24L52j10p4k06P9L17l29j56NK28O8j05lJ0J63j81n8J46p3J36l65J48R6n4
5068i0K61n04O0M37k63K25K0k55KJ54k33L46l98K49J29j69L7Q5k16K80l55j09
5090c07N77o0k25Q2j10Jq3K33j12j33L65l62K46j50K7k23J39Q4J50l79M45o6j03
5113C6P2j00j24P0K7N0q6j29j70L01J27l4k29J34L05kq5j21j8J15o2r2K7Jr9l
5139h9L62n25K42k16J12J18Nj7K05j95J26j02L4J34j38j96Kr7j08M80n8j22R2
$$ plain form
5162 49 -108 73 342 -195 -50 327 111 35 -28 -106 186 -158 27 -47 -209 52 -24 21 183 -80 108 78 36
5185 36 -174 98 -99 60 -58 -10 -60 212 -240 6 -236 204 -115 -202 117 37 -42 127 80 152 327 -39 -123
5208 -123 -148 -18 218 -99 -50 16 -42 -292 168 149 82 -39 5 -33 -218 18 -43 56 -25 293 212 121 -181 37
5232 37 -192 15 122 66 -219 -14 194 -112 75 -151 29 13 97 -191 234 -124 -64 313 5 88 -40 395
5254 395 122 85 16 -196 221 166 73 129 -109 -127 -21 -4 71 -170 -101 60 21 99 -180 169 -169 102 10 -143
5278 -143 -91 2 -167 -124 84 86 -114 -92 36 -176 241 34 166 -191 189 0 -79 192 -97 4 224 -30
5300 -30 109 22 31 -124 100 165 -96 -91 -152 78 51 -55 93 -72 -95 -172 79 93 -30 164 34 -130 -33 -235
5324 -235 49 -101 -170 -29 108 169 -78 16 160 290 209 394 228 240 80 40 -77 19 -96 -44 -96 9 313
$$ packed form
5162D9j57J81K69n37J45L77k16p6o3p8K92l44J85p4j62K61p6M5J62k63J88l0m2
5185C6k10K72j97J59j18M8n0K72m52K46k42M40l19q7L19q0p9J69m7P2J75l66q4
5208a23k5J30K36l17M9O6n8k50M60j9o7j21M4l8j85K36o1R9q1L18q1r1l02K18
5232C7k29K07J07n6k85K05K08l06J87k26J80j6Q4k88M25l58O0L77l08Q3j28M35
5254C95k73l7o9k12M17n5r3N6k38j8J06J7P5k41O9J61l9P8k79L49l38K71r2j53
5278a43N2R3j69M3K08Kk00K2J28k12M17k07J32l57L80j89p9K71k89J01K20k54
5300c0J39q7Rj55K24O5k61No1K30k7j06J48j65k3p7K51J4j23J94j30j64R7k02
5324b35K84j50o9J41J37O1k47R4J44J30q1J85j66J2j60m0j17R6j15N2n2J05L04
$$ plain form
5347 313 -32 37 -89 308 -98 114 96 54 22 -191 22 -95 39 -32 -125 210 41 103 96 -21 43 -212 94
5370 94 62 199 185 127 -34 6 -97 -192 -23 -34 106 -47 -29 36 101 26 -5 -40 66 -229 -167 196 -198 -60 314
5395 314 -118 -5 294 -64 -23 -6 -201 234 39 -66 -66 -16 -122 -172 23 267 -171 -132 144 83 -59 -29 -102
5418 -102 33 26 -40 -84 -106 27 88 -250 115 -98 -68 -84 -229 -17 28 7 -99 155 -68 173 -189 -119 62 -232
5442 -232 -200 130 -42 116 109 62 7 68 -91 -225 115 25 -137 16 -11 -187 146 -102 154 33 102 -113 -263
5465 -263 -88 38 -53 -14 62 -36 202 41 74 136 93 -45 169 187 44 -71 132 -48 -438 35 -377 15 18
5488 18 -130 107 6 -26 156 78 89 -202 -147 -44 12 -55 50 362 160 -97 -255 121 -65 160 -282 -226 -50
5511 -50 -5 -150 -10 -18 -142 -322 -48 -108 88 -141 324 153 215 55 26 158 -52 53 55 -178 -116 -8 -164
$$ packed form
5347C13l45O9j26L97m06K12j8m2l2k13K13j17J34p1r3L35j69O2pj17O4k55L06
5370I4l2J37j4n8j61M0j03r5J69j1J40j53J8O5O5p5l1l5J06k95O2L63l94J38L74
5395C14m32J13K99l58M1J7j95M35j95j05%N0j06n0J95K44m38L9K76o1j42L0p3
5418a02J35po6m4k2J33O1l38L65k13L0j6j45K12M5k1j06K54k23K41l62P0J81k94
5442b32L2L30j72J58pm7n5O1j59j34L40r0j62J53k7j76L33k48K56j21O9k15j50
5465b63J75J26r1L9P6r8K38j61L3O2m3j38K14J8j43j15K03j80l90M73m12L92L
5488A8j48K37j01l2J82p8J1k91N5J03N6o7J05L12k02k57j58L76j86K25m42N6J76
5511e0M5j45J40qj24j80K74o0J96k29M65j71O2j60k9J32k10J05Kk33O2J08j56
$$ plain form
5534 -164 -182 -387 -209 1 27 53 -77 116 225 -255 -13 102 -20 -359 -99 -259 115 -111 163 155 -27 92
5556 92 127 4 97 -164 -95 77 7 97 -72 182 7 -44 -148 22 -79 -55 -4 -198 104 102 -150 -199 274 98
5580 98 116 61 -225 93 151 -96 -143 -17 42 52 -85 -244 -51 10 -68 -23 15 35 -96 80 -19 -118 -91 -206 90
5605 90 137 212 -27 226 30 -175 -214 -19 90 -64 17 121 -134 2 -163 108 27 -17 -155 -308 4 -20 171
5628 171 -306 -68 81 -311 195 -154 -113 191 174 -125 -62 -63 14 -74 -74 -156 -201 25 34 14 39 13 -185 116 22 -27
5654 -27 -113 390 -80 4 27 -100 354 -81 99 -301 -47 93 92 121 106 -138 -150 -311 316 -114 -59 1 -234 -62
5678 -62 55 -104 -108 -241 13 -130 153 -47 177 113 -58 -4 22 -17 271 276 -164 -274 -106 111 82 243 -12
5701 -12 -215 -5 21 332 -207 -155 139 322 -111 -83 22 27 166 164 86 62 -44 70 53 -126 -24 150 175 42
$$ packed form
5534a64j8k05J78K10K6K6j30J93J09m80K42J15j22l39K60j60L74k26K74qj82J19
5556I2L5j23R3k61O9J72p0R0j69K54j75n1j04J70j01K4N1j94L02kk52m9M73j76
5580I8J8n5k86L18N8k47m7J26N9J0j37j59J93O1p8M5L8K0j31J76r9r9K7j15K96
5605I0M7P5k39K53j96k05l9J95J09j54Q1J04k55J36j65K71q1m4j38j53L12k4J91
5628A71m77K38J49l92N06l49M1L04j7k99O3jP7q8%q2m5K26Rk0K5k6j98L01r4m9
5654b7q6N03m70Q4K3j27M54m35J80m00K54J40jK9j5k44j2j61O27m30N5O0k35J72
5678f2J17j59mj33K54j43K83k00K24o4j71N4K6l9K88Nm40j10J68K17k9J61k55
5701a2k03K10K6L11n39N2K94J83m33K8J05NJ39kp8k4j06J14j7j79J02J74K5j33
$$ plain form
5725 42 152 -311 -225 -68 2 8 -5 -24 334 -151 -121 -13 53 44 148 -238 -219 136 96 -20 -250 -56 218 131 -5
5750 -5 -120 83 -103 177 -8 32 161 266 36 -158 88 -138 -101 -58 -67 -12 187 30 -80 -148 -99 82 -127
5773 -127 30 62 44 -45 23 75 98 -165 -314 29 -94 87 -195 -100 20 -83 43 -168 101 -70 340 -130
5795 -130 75 220 113 143 11 126 66 -31 -226 18 -59 -200 -122 1 -269 77 -80 -118 -107 -13 11 73 299
5818 299 -175 -90 -63 -55 85 -186 175 -292 214 -4 231 233 -99 -146 113 -99 32 358 100 -83 37 100 46
5841 46 -181 92 85 82 75 82 10 -57 -11 85 63 -14 -34 -64 431 42 -63 242 -133 -28 82 -110 -377 152 -64 -101
5867 -101 -164 -194 11 -208 21 189 138 -42 249 40 90 -133 -58 -227 8 28 324 -1 6 -142 -3 86 118
5890 118 -46 131 -185 119 53 -72 -176 -48 -184 -197 -223 -202 49 -224 90 -217 -112 154 -21 40 -300 -19
$$ packed form
5725D2J10m63Q6J57P0Oj3j9L58m85L0J08O6rJ04l86J9L55m0j16k30J94K74q7j36
5750ej15K03j86K80j85M0J29J05k30j94K46k26L7M3rN5J99j57j10o8M9J81k09
5773a27J57L2j8q9O8N2K3k63j49L43j23J81k82R5J20j03J26k11K69j71M10m70
5795a30K05J45j07L0j32J15o0r7j95K44p7j41P8J23k70L46j57l8J1R4K4O2K26
5818B99m74Q5K7QJ40k71L61m67N06k18K35Kl32m7K59k12J31L26k58j83J20O3n4
5841D6k27K73plpPp2o7M6R6k2p7k0l0M95l89j05L05l75J05J10j92k67N29k16l7
5867a01o3l0K05k19K29J68n1j80K91k09N0k23P5j69K35K0K96l25Pj48J39Q9L2
5890A18j64J77l16L04o6j25j04J28j36j3k6K1K51k73L14l07J05K66j75O1l40K81
$$ plain form
5912 -19 74 -45 -15 -191 125 -123 -428 -180 159 -23 42 270 -3 64 116 -88 -28 -126 131 111 299 298 65 0
5936 0 79 -15 -246 -17 76 -76 202 103 22 -6 78 76 -46 75 292 -201 26 58 -15 199 351 95 -226 348
5960 348 -35 -134 -112 -236 -60 43 -223 87 -83 -140 151 96 -137 -35 31 182 -131 -97 -72 -171 -5 -105 -276
5983 -276 176 126 25 184 126 28 -6 221 -76 42 79 49 -82 -23 -100 -3 -198 40 -217 -7 -82 151 70 29
6007 29 7 98 -158 247 -13 -92 66 5 107 -237 -61 -141 -294 107 62 -2 -27 -11 59 167 80 32 -47 77 -104
6032 -104 -140 358 -48 166 -127 -343 109 39 147 26 -237 200 -48 -192 117 179 -214 58 209 -97 79
6053 79 -47 -105 26 12 -95 -173 -8 -93 86 -157 71 166 -18 -126 -8 67 145 -14 -269 60 -238 5 -154
6076 -154 157 313 26 -55 -33 25 124 162 -18 52 116 16 192 176 212 39 -177 167 -112 193 58 -199 -194 -148
$$ packed form
5912a9R3j19L0j76L16k48l05K48L39j82O5K28k73O7N2k04O0r8K57k0J88jk33o5
5936@P9r4k31K29R3j52K78r9q1k8Q4kj22J21K17m93K27L2p3K14J52k56l21N74
5960C48l83r9K2j24J76J03k66L10j70n7K91n5k33J02O6J51l13L4K5r9J66j00j71
5983b76M52n0j01J59n8r8l4K27k97J18L7l0j31N9p7R7j95K38k57K10p5K33q1m1
6007B9k2R1k56M05k60p9J58o1J02l44J76q0j53M01m5o4k5J6P0J08q7m8p9J24j81
6032a04l6M98m06K14k93k16M52p0J08j21k63M37k48j44L09O2l93K72J51l06J76
6053G9j26n8J31j4j07p8J65q5J79k43K28R5j84j08J18P5P8j59k55L29k98K43j59
6076a54L11J56k87q1K2N8R9L8j80P0O4j00J76j6L6j73k16L44k79L05j35k57NM6
$$ plain form
6100 -148 -193 187 126 -34 -116 20 291 144 255 387 -352 -140 71 8 35 -233 61 -95 52 -62 121 147
6122 147 -149 138 -164 220 -44 -245 -170 -207 -70 105 33 -108 -293 -95 179 -57 -69 188 379 318 -96 253
6144 253 30 151 185 -122 -12 -109 -70 46 -383 -103 136 -60 73 -206 -18 -49 11 22 -338 156 -23 -118
6166 -118 9 -190 3 185 -188 -239 -163 -147 -182 -305 246 -35 9 177 75 -78 -155 -32 -119 77 245 269 -12
6189 -12 -8 -28 -77 33 -27 12 -92 -155 70 185 89 120 109 -41 100 -172 114 198 -284 -241 -35 188 -196 -1
6213 -1 82 27 36 -10 -28 292 91 26 -9 -152 -14 245 -120 -110 13 174 -238 37 33 104 -96 -57 112 -78 107
6238 107 151 196 -197 86 52 177 -190 -257 -103 201 -25 167 38 -305 -27 7 -70 4 -137 -120 -156 60 42
6261 42 19 -30 227 -24 117 -177 5 22 -70 -48 -3 -130 -262 -129 -164 3 272 116 52 -107 -8 -169 -75 89
$$ packed form
6100a48m5L80o1j60q2J36K71j47J11J32p39K12K11o3K7k68K94j56J47j14J83K6
6122A47k96K87l02L84k64k01P5l7J37J75p2j41j85J98K74k36j2K57J91o1m14L49
6144B53k23J21L4l07J10r7L9J16m29K80K39j96J33k79J88l1O0J1l60M94j79r5
6166a18J27j99J93J82l73n1P6J6l5j23N51k81M4J68j02j53p7J23q7J96J68K4k81
6189a2Mk0m9J10o0L9j04o3K25J15r6L1j1j50J41k72K86Q4m82M3K06K23l84J95
6213aQ3n5Rm6j8L20k01o5l5j43J38K59l65J0J23J61m12K75mP1k00L9J69j90J85
6238A07M4M5l93K83l4J25l67o7J54L04k26J92j29l43K78L4p7P4j41J7l6K16j8
6261D2k3m9K57k51J41k94J82J7r2K2M5j27j32J33l5J67K69j56o4j59R9j61R4J64
$$ plain form
6285 89 145 271 -130 -240 175 249 -329 98 13 -13 44 -29 -65 84 249 212 6 68 -113 94 -123 296 -142
6308 -142 187 16 -219 34 -139 -54 -91 388 -11 -115 216 -150 -141 -54 -113 -42 -78 -34 27 -99 59 -41 -120 182
6332 182 230 8 161 -38 91 -91 -262 -71 27 47 294 -83 105 130 -115 -160 19 75 32 55 81 219 -247
6355 -247 -146 -15 -90 161 30 72 131 203 -101 34 141 -114 302 -83 9 116 -126 -81 -156 68 -142 33
6377 33 -1 -257 38 110 -94 -43 -158 -165 24 32 -286 11 142 -115 -167 24 33 -89 34 40 -252 -57 -74 -203 -56
6402 -56 -84 -41 -100 57 -124 -64 -124 -232 251 343 35 -6 -113 87 176 -118 17 263 169 242 39 -213 39 -84
6426 -84 -107 -344 -87 122 51 -44 -298 -59 -69 106 147 34 -85 -68 169 172 -9 -37 26 89 293 -76 -112 29
6450 29 209 161 -16 112 159 157 -228 83 -80 97 90 63 -124 35 84 8 192 176 136 -303 -13 69 9 35 59
$$ packed form
6285H9N6J26m01j10M15P4n78M27q5k6N7p3l6J49J65l7k06O2j81K07k17M19m38
6308a42L29j71k35K53j73Q5l7M79l99j04L31l66RQ7n9P1l6M4O1j26J58j00p9L02
6332A82M8k22J53j99J29j82j71J91R8K0K47l77J88K5k45m5J79N6m3K3K6J38m66
6355b47J01J31p5K51j31M2N9P2l04J35J07k55M16l85R2J07k42M5p5K24k10J75
6377C3l4k56K95P2k04N1j15pJ89Ql18K97J31k57n2J91Rj22J23Ok92J95j7j29J47
6402e6k8M3n9J57j81O0o0j08M83R2l08m1j07K00Q9k94J35K46r4P3k03k52K52j23
6426h4k3k37K57K09p1r5k54K39j0J75M1j13j19J7K37Lj81k8O3O3K04l69l6J41
6450B9J80m8j77J28M7kl85L11j63J77pk7j87J59M9p6J84j6m0m39K90Q2o0K6K4
$$ plain form
6475 59 -87 106 -21 -189 -113 77 -28 -65 161 6 -170 -148 -84 168 4 -52 78 63 -18 138 48 -211 -162
6498 -162 -84 -24 -186 -111 -213 -50 -226 246 -60 82 38 -214 215 56 -35 238 -17 22 -189 -138 136 92 47
6521 47 -306 155 -28 -46 371 -70 -62 57 98 -154 15 -99 -185 -206 150 363 105 -184 -109 54 -177 58 -37
6544 -37 85 36 233 -143 -91 21 -64 6 -152 17 -238 -17 -144 37 -21 49 -202 -257 -129 46 -298 -97 -155
6567 -155 -87 99 -279 79 42 77 99 32 2 84 8 -101 -275 -510 -155 -149 -150 -11 265 121 23 264 -35 -58 -16
6592 -16 -167 52 14 12 -72 -29 -139 34 -30 -83 103 -2 -45 232 -19 -93 189 143 -125 188 -62 -127 10 -96
6616 -96 74 10 272 -115 -208 119 -30 160 117 -12 127 16 -63 -64 -8 -172 82 -296 92 151 -20 90 22
6639 22 114 107 118 -88 148 202 -52 164 -136 234 -38 -3 2 136 39 -342 245 -38 24 73 335 -70 132 242
$$ packed form
6475E9j46J93j27j68P6J90j05l7K26j55j76K2O4K52j64n6J30j5q1J56r0k59M9
6498a62P8O0j62P5j02J63j76M72l06J42m4k52M29j59r1K73k55L9k11N1K74m4m5
6521D7l53M61j83j8M17m41QJ19M1k52J69j14q6k1L56K13k58k89P5J63k31K35r5
6544c7J22m9J97l76N2J12q5P0j58J69k55K21j27J81n8P0k51n5J28J75l44K01n8
6567a55O8J86l78L58l7L5K2o7l0Q2p6j09j74k35L55OjJ39K76j44r8K41k99k3M2
6592a6j51K19l8kq4M3j10J73o4n3J86j05m3K77k51p4K82m6k68L13k50o5J37j06
6616i6J70o4K62l87r3L27j49J90m3j29J39j11p9jN6j64K54l78L88N9j71J10o8
6639B2R2pJ1k06K36N4k54K16l00L70k72L5NJ34r7l81N87k83O2M9K62m05K02J10
$$ plain form
6663 242 -104 224 -146 268 -36 -43 206 20 -68 49 -221 28 50 20 331 8 -153 -64 -43 -91 -152 5 -23
6686 -23 144 201 -70 68 -37 -99 -133 -209 -4 90 103 -96 153 215 -28 88 -9 -13 -56 89 146 48 -219 227 88
6711 88 -257 217 5 264 -190 94 168 -9 -134 146 -86 -127 59 -234 -98 -167 103 155 -77 -240 -26 -59
6733 -59 95 -111 147 -223 -45 220 -50 36 9 272 93 181 36 78 4 107 -108 -352 -161 -119 5 60 337
6756 337 -13 -206 76 -33 -78 114 85 291 -96 -283 79 97 -52 -70 -155 -72 117 -90 -93 83 49 104 -5
6779 -5 -274 43 269 -57 -99 127 202 38 -28 -307 39 -53 118 -21 45 67 -16 -114 -279 -109 -200 13 -26 225
6803 225 -121 -129 36 30 -55 111 1 -218 10 50 76 83 272 219 11 -111 184 98 219 22 -173 200 145 -353
6827 -353 301 -95 -338 83 -34 42 -151 181 -62 -144 -71 45 -155 -314 37 172 -22 75 97 -189 212 28
$$ packed form
6663B42l46L28l70M14l04pK49j86q8J17k70K49K2l0L11l23j61Q9K1m8o1J57k8
6686b3J67N7k71J38j05o2l4p6K05R4J3j99K49O2k43J16r7mm3J45N7r8k67M46j39
6711H8l45M74k12K59m54K84P4j77j25K80k32m1J86k93J36o9K70N2k32j63K14l3
6733e9J54k06K58l70J78K65k70Q6k7K63j79Q8j45M2p4J03k15k44J91M2J24N5K77
6756C37l50j93K82j09m5J92k9K06l87j87L62J8j49j8q5Q3J89k07lJ76l4N5j09
6779ek69L17K26l26m2K26P5j64o6k79L46r2J71j39O6K2q3r8j65J70r1K13l9K51
6803B25l46qJ65oq5J66j10k19K28M0K6PJ89n3k08j22K95q6J21j97j95L73n5m98
6827c53O54l96k43M21j17P6j93L32k43q2P3J16k00j59L51J35j94R7K2k86M01j84
$$ plain form
6849 28 -96 248 54 85 145 114 -69 68 154 -179 129 -184 -145 -108 -159 -162 127 177 -115 -235 10 -4 14 232
6873 232 -292 241 -47 -91 -196 -54 224 91 112 -51 203 28 -192 -204 75 80 -104 7 106 -174 -75 366
6895 366 -140 -80 -46 12 43 7 -81 136 -33 155 2 -91 90 108 102 176 122 -47 192 -193 77 235 132 -22
6919 -22 37 -183 -55 -122 58 -136 259 -88 252 -21 131 188 82 49 39 139 -103 -37 -113 91 -114 -271 -6
6942 -6 113 -380 -16 -152 194 -133 3 -75 -128 -50 42 -39 -109 234 -105 30 97 -84 -50 45 -30 -32 -79 -138 -139 0
6968 0 -69 -165 130 39 -185 36 83 4 -61 -135 336 51 -79 -70 -124 -55 -216 12 8 -45 65 -12 -309 79 -126 -66
6994 -66 -195 -91 102 -9 -90 -103 -231 -13 102 174 180 -85 -144 -155 -39 124 -10 134 -103 109 253 47 -5
7017 -5 -396 -30 -40 141 -57 -40 290 -36 -168 -69 25 -96 222 -148 49 -178 -39 183 78 84 -89 18 99
$$ packed form
6849B8j24L44j94L1O0l1j83J37Q6l33L08l13L9L7n1lK89N0k92j20K45j4J8K18
6873B32n24N33k88m4j05J42K78j33K1j63K54j75k20j2K79Nj84J11R9k80R9M41
6895C66n06O0L4N8L1l6q8K17j69J88j53r3J81J8oP4n4j69K39l85K70J58j03j54
6919b2N9k20J28o7J80j94L95l47L40k73J52N7j06l3j0J00k42O6p6K04k05j57K65
6942fJ19m93L64j36L46l27J36p8n3P8R2q1p0L43l39J35O7j81L4R5p5km7n9jJ39
6968@o9r6K95r1k24K21M7p9o5p4M71k85j30Rn4O9j61K28mn3J10p7k97L88k05O0
6994f6j29J04J93j11q1j3j28K18J15P2Ok65n9j1J16J63j34J44k37K12J44k06n2
7017el91L66j0J81j98J7L30l26j32R9R4j21L18l70J97k27J39K22j05Oj73J07Q1
$$ plain form
7040 99 -49 -58 -108 -102 -18 79 -118 96 -274 -11 -37 -6 -214 -12 191 -68 -78 126 98 -86 -168 -204 159 214 -147
7065 -147 -42 65 154 52 -67 23 22 49 -146 -56 83 240 -101 191 -57 99 -63 160 -35 -90 -200 -182 -17
7088 -17 15 312 -128 55 123 -117 87 -53 -36 51 -29 51 -61 -251 311 -40 -181 85 -77 -9 55 -84 32
7111 32 154 201 40 -254 68 -75 -118 -115 53 -64 300 83 79 -3 190 -29 26 135 175 167 29 224 128 84 -27
7136 -27 -108 325 95 64 194 111 405 -68 19 362 -52 -40 -71 -10 -32 35 17 280 19 105 57 -60 -122 -80 -7
7161 -7 121 -95 -29 16 35 -451 -110 -82 79 78 -406 -101 30 248 158 -296 198 -222 -52 -31 -10 170 119 -101
7185 -101 -283 -160 183 -79 90 -244 -76 26 -30 -183 149 -81 108 23 -47 -192 110 115 61 121 18 -15 -41
7208 -41 -113 -75 55 1 -71 80 126 -32 147 178 107 -3 -164 -241 8 233 149 4 56 -42 -112 -82 7 35 175
$$ packed form
7040I9j48rn0OQ4R7j97K14l70K63k6L1k08K02K03k59j0K04k8j84q2l6L63N5l61
7065a47J05J07Q9j02j19R0jK7j95R0J39J57l41K92k48J56j62K23j95n5j10J8J65
7088a7L2K97m40J83O8k40K04j40J7Q7q0Q0j12j90N62l51j41K66j62O8O4j39J16
7111C2J22M7j61k94L22j43m3LJ68j17L64k17mq2J93k19N5J09M0qj38J95r6m4j11
7136b7q1M33k30l1J30q3K94m73Q7L43m14J2l1O1k2O7j8K63k61Q6m8j17o2M2P3
7161gJ28k16O6M5J9m86L41K8J61jm84L05J31K18r0m54M94m20J70K1K1J80n1k20
7185a01j82J23L43k62J69l34J68J02n6j53L32k30J89q5p0j45L02Nn4O0j03l3k6
7208d1p2L8J30n4p2J51M6j58J79L1p1j10j61p7K49K25q4j45N2r8p0L0Q9K8J40
$$ plain form
7233 175 83 -132 -118 328 21 -48 125 -64 88 17 42 151 -377 -132 -96 18 -68 100 -276 -277 230 36 101
7256 101 38 68 122 -464 160 245 -158 29 59 -192 -115 -21 116 -297 -68 -128 -237 35 79 158 -29 23 80 -19
7280 -19 -6 114 115 20 0 86 -222 -108 -80 -178 136 -61 -28 193 -34 38 -21 25 31 129 25 83 11 -254 118 -160
7306 -160 190 -142 160 68 -146 39 -78 81 -144 57 -45 53 85 -15 195 -124 -177 0 -150 -195 164 102
7328 102 -17 155 42 -191 78 -31 -189 93 -158 241 -17 100 120 226 3 -25 28 -22 -205 82 174 -7
7350 -7 99 133 202 287 -59 -408 233 59 42 12 -73 0 -2 70 -40 23 -6 225 144 31 116 -46 -323 -6 26 26
7376 26 175 62 -42 21 -19 15 -174 198 176 -118 -70 224 282 95 158 -218 -205 162 -75 6 253 165 107 82
7400 82 75 -79 -211 -61 80 30 -234 50 115 -11 -28 68 -128 451 -58 -160 173 -126 190 -254 -94 -20 88
$$ packed form
7233A75r2k15J4M46l07o9J73j89J52p1K5J09n28K45L6J14q6J68l76jN07j94O5
7256A01o3L0N4n86O24Q5m03J87L0k51P7R4J37m13K29o0j09K72M4P9j87N2N7r9
7280a9J3J20Jr5k0Q6l08J14K8r8L14j97L3K21k27P2n9M6OR8j04N8p2k65L72k78
7306a60L50l32L02r2k14J85j17J59k25K01j02R8L2j00K10l19n3J77j50m5L59o2
7328A02j19J72j13k33K69j09j58K82k51L99k58J17K0J06k23k8N3n0j83K87R2j81
7350gJ06L4O9Q5l46l49O41j74j7l0q5P3kP2j10O3k9K31q1j13Q5j62k77L17L2%
7376B6J49j13j04O3m0L4j89L72k2k94M8K94N8j87O3l76J3L67k37Q1K47q8n8k5
7400H2pj54j32J50J41n0k64K84O5j26j7R6j96N79n09j02L33k99L16m44J60P4J08
$$ plain form
7423 88 24 96 188 165 154 -161 102 117 -11 -40 -219 -73 180 184 -95 38 94 -16 65 -213 139 -101 167 -142
7447 -142 -27 -71 178 -76 96 71 -364 -205 -46 178 33 278 -59 -13 246 229 -12 52 94 52 -251 80
7469 80 -147 206 247 0 42 15 31 123 159 270 126 -95 -33 242 186 -117 -32 108 -78 -168 -95 -258 -29 -274
7493 -274 180 -66 -123 -133 117 35 91 102 -47 43 -75 -88 -30 41 -145 104 120 -43 -191 16 27 -120 -112 14
7517 14 -105 -209 -90 -309 60 175 112 244 166 21 -164 11 34 -26 -188 -232 11 65 94 -4 61 -8 151 -16
7541 -16 63 -71 -159 239 164 -112 -215 -122 33 246 -12 -109 -10 65 -90 -4 72 -130 89 52 -148 149 172 221
7565 221 -143 -265 -60 5 35 171 -153 62 -40 -94 47 -304 -94 -107 165 87 171 156 302 -163 -153 -138 -216
7588 -216 -83 -41 100 361 2 305 8 197 78 64 76 12 -11 -5 144 -40 216 -343 89 -141 147 29
$$ packed form
7423H8o4P2R2k3j1l15K63J5j28k9j79J46K53Mk79J33N6j10Q1k78L52k40K68l09
7447a42J15m4K49k54J72k5m35J59J59K24j45K45l37M6K59j7k41O4M2m2l03L31
7469H0k27L53M1k47M2k7J6R2L6J11j44k21O2K75n6l03Q5J40j86r0P3j63K29k45
7493b74M54k46n7j0K50q2N6J1j49R0j18j3N8P1j86K49J6j63j48K07J1j47QJ26
7517A4j19j04J19k19L69J15o3J32p8j45j85J75K3o0j62m4K43N4K9r8O5o9J59j67
7541a6P9j34q8L98p5k76j03R3J55K13k58r7R9P5j55Q6P6k02K19l7k00K97K3M9
7565B21l64j22K05O5L0J36l24K15j02n4J41l51K10j3K72p8Q4j5J46m65J0J5p8
7588b16J33M2J41K61l59L03k97J89j19j4J2o4k3OJ49j84K56n59M32k30K88j18
$$ plain form
7610 29 -65 24 -17 52 -233 -146 34 -106 169 -8 119 241 -165 92 -54 -198 100 122 -255 69 118 126 -14
7633 -14 45 -155 27 -32 -72 111 -172 14 185 -171 -100 58 -363 -210 156 26 173 -53 -230 42 -52 -164
7655 -164 76 68 -12 -237 2 -39 86 284 -2 -126 -241 -54 283 -23 -73 128 21 120 7 -108 157 -36
7677 -36 11 -12 -101 43 311 14 -120 -109 47 -86 -261 -119 -315 -233 30 48 -66 95 -62 -47 -105 10 32
7700 32 -217 76 233 330 374 -120 -53 -77 59 -55 89 191 96 -251 -125 175 102 -302 -114 444 32 -197
7722 -197 -86 -48 15 36 118 -93 111 -302 55 -23 265 34 185 -18 236 -118 -109 22 -152 103 129 -237 177
7745 177 -58 8 -1 -259 180 -164 46 87 -261 -105 -19 -106 -84 -94 -120 -64 138 -18 169 55 263 -43 -23 -99
7769 -99 111 101 -40 -95 -63 -67 -18 -3 -28 -123 60 111 4 -139 -349 -107 158 84 -128 -55 266 88 -191 70
$$ packed form
7610B9r4Q9m1O9k85Q7J80j40K75j77J27J22m06K57j46j44K98K2l77L24M9Qj40
7633a4N9k00J82n9m0J83k83J86J71l56P1J58m21J53L66j30J47k26j77K72r4j12
7655a64K40qq0k25K39m1J25J98k86j24j15J87L37l06n0K01j07R9j13j15K65j93
7677c6M7k3q9J44K68k97j34J1J56j33j75J42j96Q2K63J8j14J61j57J5n8J15K2
7700C2k49K93J57R7M4m94O7k4J36j14J44J02r5l47J26L00p3m04J88N58m12k29
7722a97J11L8O3K1Q2k11K04m13L57p8K88k31J51k03K54l54RJ31j74K55K6l66M14
7745A77k35O6rk58M39l44K10M1l48J56Q6q7K2j0k6N6K02j56J87j14K08l06K0p6
7769i9K10j0j41n5L2mM9J5k5r5J83N1j07j43k10K42K65p4k12P3L21j78k79K61
$$ plain form
7793 70 24 141 -144 151 -40 -176 -94 -318 -133 -35 -58 162 137 135 6 -266 332 -89 59 -45 -123 -82 -289
7816 -289 -17 248 69 35 92 -109 -29 -103 27 134 -12 -268 -211 -88 -163 150 192 3 -120 -139 -17 136 85
7839 85 -98 163 -23 19 175 120 78 -84 179 125 186 -217 -57 244 -136 168 75 93 -25 -86 -1 116 111 -125
7863 -125 -60 -40 108 -33 -25 229 36 -42 4 -16 56 5 -21 84 -24 60 138 -208 137 49 129 97 38 31 -26 138
7889 138 -226 67 -181 -78 -43 106 66 -105 93 289 -15 -145 -72 122 -25 117 -31 -9 -173 -18 46 -74
7911 -74 -89 -132 -15 189 -45 -193 328 -56 171 62 -68 -35 141 120 66 -123 37 18 -268 -75 246 -261
7933 -261 166 -135 102 -189 -55 255 -26 -147 -312 185 131 132 126 61 98 80 -89 121 -62 172 -49 18 -60
7956 -60 28 275 17 -180 117 -242 -83 63 -175 -83 158 219 132 376 -67 89 -22 -61 -101 -218 81 141 -218
$$ packed form
7793G0m6J17k85K95j91j36Q2k24J85R8k3K20k5kj29k72N98m21J48j04p8M1k07
7816b89K72K65j79l4N7k01Q0p4J30J07j46k56N7J23p5L13M2j89j23j9J22J53n1
7839H5j83K61j86M2J56n5m2j62K63n4O1m03J60L01l80L04r3J8j18o1Q5J17nk36
7863a25O5K0J48j41QK54j93p8M6k0P2n1k6J05j08Q4P8l46L45q8Q0l2n9pn7J64
7889A38l64K93k48J03L5J49m0j71J98J96l04j30P3J94j47J42j48K2j64J55O4j20
7911g4j5m3J17K04k34j48N21l84K27j09j30L3J76k1n4j89J60j9k86J93L21n07
7933b61M27l01K37k91J34L10k81j21j65M97n4Joo5L7j8j69K10j83K34k21O7p8
7956f0Q8K47k58j97K97l59J59J46k38R2K41O1q7K44m43J56j11l9m0j17K99O0l59
$$ plain form
7979 -218 174 47 322 36 124 75 -133 -24 -129 87 -60 186 114 -106 -126 -133 96 -15 85 343 -53 12
8001 12 19 -173 232 -93 -58 15 -210 95 131 -19 68 -36 62 18 53 313 41 68 -116 -73 38 -271 -308 98
8025 98 20 -90 73 302 25 -234 -80 6 70 134 177 167 48 -161 7 14 5 -150 -168 282 -82 -6 -12 -74 -18 -138
8051 -138 60 77 104 -30 327 -147 16 7 -23 26 68 140 -154 144 -20 -70 -297 257 -108 -77 -19 173 -117 -143
8075 -143 -144 -138 -299 121 123 181 139 105 -6 -203 118 97 -96 130 -254 -174 228 -36 -226 71 -169 -74 -53 -19 -98
8100 -98 114 194 68 212 259 181 -123 -110 -196 -60 -218 -223 104 234 -158 -17 57 102 -90 -20 -194 -25 168 -59
8124 -59 40 -169 -199 -21 74 -12 -43 -38 -49 -124 176 -141 141 240 -227 -51 28 -224 -209 125 -200 92 3 5 184
8149 184 164 -101 -214 -138 98 -40 -188 108 164 -53 -108 -68 -8 26 50 -58 74 12 -122 162 26 -305 88
$$ packed form
7979b18L92j27K75k86Q8m9k08J09j05K16j47K46p2k20k0pK29j11J00K58l96O5
8001A2Pj92M05l25L5P3k25L05L6j50Q7j04R8m4L5K60k72K7j84M3J11l09l7M06
8025I8p8j10J63K29k77k59J54Q6O4O4M3j0j19k09J68Prj55j8M50l64P6oo2N6j20
8051a38J98J7K7j34L57m74J63rl0M9M2P2k94K98j64n0k27N54l65L1N8J92k90k6
8075a43jOj61M20KN8m2l4j11j97L21k1j93K26l84Q0M02k64j90K97k40R5K1L4p9
8100i8K12Q0j26J44M7p8l04J3q6J36j58nL27J30l92J41P4M5j92P0j74J69J93k27
8124e9R9k09l0J78R5q6l1Nj1p5L00l17K82R9m67J76P9k52J5L34l25K92q9KJ79
8149A84k0k65j13P6K36j38j48K96N6k17n5M0O0L4K4j08J32o2j34K84j36l31L93
$$ plain form
8172 88 51 -83 12 154 234 -113 -17 93 33 -318 -117 -231 30 -26 -171 -1 62 -61 136
$$ packed form
8172H8l7j34R5J42Q0l47R6J10o0l51K01j14K61n6j45J70O3j23J97
8191A36
$$ Imaginary data points
##PAGE= N=2
##DATA TABLE= (X++(I..I)), XYDATA
$$ plain form
0 0 0 0 0 0 0 0 0 0 0 0 0 0 0 -8 8 -8 8 -8 8 -16 16 -23 24 -30 32 -40 47 -53 61 -70 80 -88 102 -114 129
35 129 -145 164 -182 205 -228 253 -281 312 -344 381 -421 464 -512 564 -621 685 -755 833 -919
54 -919 1016 -1126 1253 -1396 1567 -1765 2008 -2310 2692 -3198 3904 -4958 6689 -10066 19081
69 19081 -96426 -242865 -39340 69961 26468 -16670 44949 82120 67562 42578 78133
80 78133 103283 74711 64251 105157 71134 -21702 -52437 -18887 11784 35455 5542 -60020
92 -60020 -62349 -141 21851 -7177 -27958 6839 62555 37865 -48551 -45012 18962 7955 -25101
105 -25101 13572 30853 -32534 -75822 -27058 42798 22176 -54457 -33849 51418 20617 -74468
117 -74468 -58421 11503 13017 -8828 -5419 -6300 -14571 -14061 1995 32426 39548 21434 21879 22782
$$ packed form
0@%%%%%%%%%%%%%qJ6j6J6j6J6k4L2l9M7n4O2p2Q7j00J14j31J50j68J90k16K43
35A29k74L09l46L87m33M81n34N93o56P25q02Q85r76J076j185J306j440J588j752
54i19J935k142K379k649K963l332L773m318N002n890P102q862J1647j6755K9147
69A9081j15507j46439K03525J09301m3493m3138O1619L7171j4558k4984L5555
80G8133K5150k8572j0460M0906l4023r2836l0735L3550L0671K3671k9913o5562
92f0020k329O2208K1992k9028k0781L4797N5716k4690q6416L539O3974j1007l3056
105b5101L8673J7281o3387m3288M8764O9856k0622p6633K0608Q5267l0801r5085
117g4468J6047O9924J514k1845L409q81q271N10J6056L0431P122j8114M45R03
$$ plain form
131 22782 6569 11000 11662 -18391 -5092 37177 2279 -63808 -49853 464 6228 -15767 -14916
144 -14916 19739 31494 -10950 -19101 40702 51934 4966 12038 52131 31858 -15822 -22237 7908
157 7908 27339 1345 -28176 -9410 190 -35847 -41234 -9011 -6718 -15088 -6656 -15286 -25767
170 -25767 -8424 481 -6089 3077 21060 28427 13524 -12266 1408 38686 21618 -10979 15460
183 15460 30337 -16891 -39013 -6900 5408 -16528 -30899 -16284 4787 -12368 -42048 -16665
195 -16665 23818 13153 869 19632 19217 5869 13427 22568 23285 23923 12847 4444 8301 -3010
209 -3010 -16170 -8313 -8379 -12937 -540 -11631 -42988 -29800 5311 459 -16280 -7143 10071 13562
223 13562 -1843 -8065 19217 32017 6827 8828 34308 13557 -18686 -3895 17660 8808 -6875
$$ packed form
131B2782j6213M431O62l0053J3299M2269l4898o6087J3955N0317N764k1995Q51
144a4916L4655J1755m2444q151N9803J1232m6968P072M0093k0273m7680o415L0145
157G908J9431k5994k9521J8766R600l6037n387L2223K293q370Q432q630j0481
170b5767J7343Q905o570R166J7983P367j4903k5790J3674L7278j7068l2597K6439
183A5460J4877m7228k2122L2113J2308k1936j4371J4615K1071j7155k9680K5383
195a6665M0483j0665j2284J8763m15j3348P558R141P17O38j1076q403L857j1311
209c010j3160P857o6m558J2397j1091l1357J3188L5111m852j6739R137J7214L491
223A3562j5405o222K7282J2800k5190K001K5480k0751l2243J4791K1555q852j5683
$$ plain form
236 -6875 -14266 -11601 -7688 -19183 -23244 -7281 -5980 -12249 1353 2850 -15201 -6529 13703 11599
250 11599 12137 19092 10268 2302 5252 8186 11667 4516 -10041 -70 11754 -15071 -32763 -7727
264 -7727 4618 -10131 -12064 -3837 -1869 -4691 -7783 3209 21675 12388 -1072 15947 22700 1906
278 1906 436 14162 9589 4026 4725 -6341 -13809 -11490 -11202 -7330 -8301 -18308 -12279 -1991 -14427
293 -14427 -16064 5138 7436 -2015 10139 17813 6053 2307 10042 18133 19046 5284 -2256 10808
307 10808 5568 -15866 -9998 3827 -7869 -15498 -8232 -9385 -13613 -12478 -10069 71 6843 -1515
321 -1515 268 10433 4848 4457 18224 14548 4734 13235 14175 -168 -3099 960 82 -1492 -8551
336 -8551 -12636 -5538 -11299 -22575 -8692 3068 -9610 -9603 5125 3099 -2680 4112 10546 13904 12645
$$ packed form
236f875p391K665L913j1495m061J5963J301o269J3602J497j8051Q672K0232k104
250A1599N38O955q824p966K950K934L481p151j4557R971J1824k6825j7692K5036
264g727J2345j4749j933Q227J968k822l092J0992J8466r287j3460J7019O753k0794
278A906j470J3726m573n563O99j1066p468K319K88L872r71j0007O029J0288j2436
293a4427j637K1202K298r451J2154P674j1760l746P735Q091R13j3762p540J3064
307A0808n240k1434N868J3825j1696p629P266j153m228J135K409J0140O772q358
321a515J783J0165n585l91J3767l676r814Q501R40j4343k931M059q78j574p059
336h551m085P098n761j1276J3883J1760j2678PJ4728k026n779O792O434L358j259
$$ plain form
351 12645 5438 9254 14483 823 -3163 9405 4965 -8323 -4715 -4633 -13797 -11496 -7379 -9636 -6510
366 -6510 -5612 -6794 -1254 -1722 -4385 8309 14371 2865 5402 17006 8537 765 7711 9436 5881
381 5881 1911 -4297 -3313 -1872 -12838 -12899 -732 -6181 -15502 -5524 -1924 -10066 -5132 4086 4309 5703
397 5703 6050 5526 11402 9423 2747 10417 13624 1837 1188 5932 -5247 -9806 -1471 -4081 -10218
412 -10218 -8595 -8896 -8214 -6810 -10400 -5296 6414 622 -3992 8521 10716 1070 5756 13059 9577
427 9577 7726 5638 1744 3150 298 -5915 -1160 -586 -11902 -9688 -2488 -11032 -13079 -2971 -1644
442 -1644 -4398 -601 574 2012 5752 3946 6520 13875 7599 2950 10841 7168 -2816 2536 5796
457 5796 -3601 -5932 -4112 -6971 -8034 -9264 -10052 -2595 -1642 -9397 -4286 4592 -1043 -1038 8892 7802
$$ packed form
351A2645p207L816N229j3660l986J2568m440j3288L608Q2r164K301M117k257L126
366f510Q98j182N540m68k663J2694O062j1506K537J1604q469p772O946J725l555
381E881l970o208R84J441j0966o1J2167n449r321R978L600q142M934R218K23J394
397E703L47n24N876j979o676P670L207j1787o49M744j1179m559Q335k610o137
412a0218J623l01O82J404l590N104J1710n792m614J2513K195r646M686P303l482
427I577j851k088l894J406k852o213M755N74j1316K214P200q544k047J0108J327
442a644k754L797J175J438L740j806K574P355o276m649P891l673r984N352L260
457E796r397k331J820k859j063j230p88P457R53p755N111Q878n635NR930j090
$$ plain form
473 7802 4712 9292 7797 4826 6398 3663 3422 5347 -2120 -6605 -431 -4584 -13075 -6307 -2101
488 -2101 -9164 -8384 -3648 -4923 -2733 -363 147 5979 6968 2032 6828 11102 3096 3627 11225 5602
504 5602 -1427 1898 1044 -3967 -4348 -6204 -5591 -3154 -7795 -10028 -2956 -3485 -7321 620 3575 -1615
520 -1615 2676 7649 4095 4800 7557 6687 7595 5910 -52 2494 4221 -4448 -5096 742 -4574 -9163
536 -9163 -5220 -5690 -8108 -4470 -3553 -2865 552 -889 -461 5865 4011 946 8708 10099 2065 3433
552 3433 6939 2150 499 1550 -1216 -1789 -2719 -6985 -5116 -3692 -8133 -5846 -215 -4436 -5083 1980
568 1980 1283 -729 3741 6009 5088 6394 4187 3287 7108 4059 -973 2904 2459 -4291 -2924 -1748
584 -1748 -6464 -6314 -3278 -5109 -4251 -3279 -4546 -1064 1819 -1569 1373 7428 3117 1262 6974 6077
$$ packed form
473G802l090M580j495k971J572k735k41J925p467m485O174m153q491O768M206
488b101p063P80M736j275K190K370N10N832R89m936M796M274q006N31P598n623
504E602p029L325q54n011l81j856O13K437m641k233P072n29l836P941K955n190
520a615M291M973l554P05K757q70R08j685n962K546J727q669o48N838n316m589
536i163L943m70k418L638R17O88L417j441M28O326j854l065P762J391q034J368
552C433L506m789j651J051k766n73r30m266J869J424m441K287N631m221o47P063
568A980o97k012M470K268r21J306k207r00L821l049n032L877m45o750J367J176
584a748m716J50L036j831Q58R72j267L482K883l388K942O055m311j855N712q97
$$ plain form
600 6077 2285 4336 4077 1268 1359 -738 -3105 -1685 -4407 -6102 -1762 -3484 -8376 -3712 4 -3986
616 -3986 -2484 2591 1320 1966 3863 2988 4341 6303 2809 3256 5804 1575 -569 2352 -1086 -4239
632 -4239 -1271 -2358 -5487 -4430 -4146 -4890 -2311 -2578 -3786 1073 1836 -926 2409 5395 2629 3144
648 3144 5991 3829 2734 3659 1620 604 624 -2094 -1708 -206 -5243 -5922 -1168 -3398 -6105 -1764
664 -1764 -881 -2340 368 1118 549 2997 3411 2554 4773 4564 1483 3527 4038 -850 -51 1944 -1888
681 -1888 -3686 -2058 -3710 -3864 -2582 -4406 -3921 -577 -2172 -2470 1869 1391 257 3748 4232 1868
697 1868 3584 4142 2241 2784 1814 129 1645 -75 -3962 -2165 -635 -4703 -4358 -1209 -3178 -3754
713 -3754 -1016 -1609 -1074 1375 1000 1852 3760 2285 2308 5132 2791 599 3517 2626 -1089 -143 -69 -2567
$$ packed form
600F077l792K051k59k809R1k097k367J420k722j695M340j722m892M664L716l990
616c986J502N075j271O46J897q75J353J962l494M47K548m229k144K921l438l153
632d239K968j087l129J057K84p44K579k67j208M859P63k762L335K986k766N15
648C144K847k162j095R25k039j016K0k718L86J502n037o79M754k230k707M341
664a764Q83j459K708P50n69K448M14q57K219k09l081K044N11m888P99J995l832
681a888j798J628j652j54J282j824M85L344j595k98M339m78j134L491M84k364
697A868J716N58j901N43r70j685J516j720l887J797J530m068L45L149j969n76
713c754K738n93N35K449l75Q52J908j475K3K824k341k192K918q91l715R46P4k498
$$ plain form
731 -2567 -2265 -2214 -4367 -2858 -2020 -4090 -2194 -179 -1812 -129 2931 529 719 3880 3075 2306 3651
748 3651 2556 2203 2770 -63 -1212 1007 -876 -3581 -1609 -1701 -4551 -2872 -1568 -3260 -2129 -216
764 -216 -745 470 1241 232 2497 3993 1503 2460 4914 2013 309 2395 736 -875 162 -1478
780 -1478 -2880 -1664 -2987 -3693 -1673 -2424 -3450 -346 -51 -2011 576 2284 1233 2114 3286 2095
796 2095 3169 3218 670 1421 2444 -660 -711 482 -1975 -2885 -1057 -2635 -3902 -1882 -1685 -2115 -531
813 -531 -1048 -717 2158 1554 486 3421 3752 1174 2212 3132 981 1098 1593 -575 -798 -453 -2230 -1901
831 -1901 -1829 -3470 -2778 -676 -2585 -2681 150 -235 -974 1686 1570 1008 3151 2387 1427 3012 2621 613
849 613 1868 1227 -1712 -493 -138 -2781 -2465 -1260 -2754 -2605 -1806 -2687 -1095 267 -1261 -226 2219
$$ packed form
731b567L02N1k153J509Q38k070J896K015j633J683L060k402J90L161q05p69J345
748C651j095l53N67k833j149K219j883k705J972r2k850J679J304j692J131J913
764b16n29J215P71j009K265J496k490R57K454k901j704K086j659j611J037j640
780a478j402J216j323p06K020p51j026L104K95j960K587J708j051Q81J172j191
796B095J074M9k548P51J023l104n1J193k457r10J828j578j267K020J97m30J584
813e31n17L31K875o04j068K935L31k578J038R20k151J17M95k168k23L45j777L29
831a901P2j641O92K102j909r6K831l85p39K660j16n62K143p64r60J585l91k008
849F13J255o41k939J219L55k643L16J205j494J49P99q81J592J362j528J035K445
$$ plain form
866 2219 1194 1036 3383 2310 1169 3162 2189 554 1243 725 -663 -233 -1381 -2561 -1175 -2038 -3989
883 -3989 -1946 -549 -2389 -1410 542 -834 459 2199 1233 1809 3000 1554 1755 3190 780 415
899 415 2096 289 -1750 -167 -797 -2620 -1536 -2085 -2851 -1175 -1426 -2282 -437 405 -668 986 2261
916 2261 409 1655 3582 1724 1302 2395 1125 807 1025 -574 -909 120 -1950 -2788 -912 -2014
932 -2014 -2867 -1062 -1109 -2264 -56 275 -422 989 1802 1249 2282 2283 918 1980 2926 490 325 1263
950 1263 -836 -1087 -506 -1910 -2370 -1458 -2244 -2333 -864 -1499 -1712 324 84 -548 1871 1994 705 2251
968 2251 2393 1225 1749 1486 164 903 715 -1275 -996 -312 -2360 -1721 -861 -2286 -2310 -401 -1335 -1154
986 -1154 17 -213 44 1468 708 929 2878 1719 944 2134 1800 -64 823 405 -1157 -709 -637 -2164
$$ packed form
866B219j025j58K347j073j141J993r73j635O89n18j388M30j148j180J386q63j951
883c989K043J397j840R79J952j376J293J740r66N76J191j446K01J435k410l65
899D15J681j807k039J583o30j823J084n49p66J676k51q56J845Q42j073J654J275
916B261j852J246J927j858m22J093j270l18K18j599l35J029k070q38J876j102
932b014q53J805m7j155K208L31o97J411Q13n53J033Jj365J062R46k436j65R38
950A263k099k51N81j404m60R12p86q9J469o35k13K036k40o32K419J23j289J546
968B251J42j168N24k63j322P39j88j990K79O84k048O39Q60j425k4J909r34J81
986a154J171k30K57J424p60K21J949j159p75J190l34j864Q87m18j562M48P2j527
$$ plain form
1004 -2164 -1454 -1151 -2353 -1335 -437 -2033 -890 1308 -49 69 1875 1456 1361 2123 1242 993 2127
1021 2127 922 5 1010 -23 -1426 -257 -824 -2488 -1260 -768 -2423 -1224 -640 -1313 -97 265
1037 265 -301 913 2179 426 1446 2555 1069 1168 2151 377 -84 844 -349 -1372 -694 -1686 -1922
1054 -1922 -787 -1804 -2355 -680 -479 -1631 -77 713 85 1058 1644 718 1461 1932 827 1402 1565 78
1072 78 416 1077 -968 -1300 -102 -1246 -2039 -983 -1198 -1817 -555 -931 -1212 660 417 32 1679 1519
1090 1519 588 1754 2106 571 889 1669 330 -119 606 -1091 -908 -482 -1899 -1962 -524 -1594 -2042 -177
1108 -177 -757 -923 910 518 129 1714 1500 1029 1535 1449 531 1502 1023 -456 283 446 -1313 -1109 -573
1127 -573 -2019 -1329 -1071 -1903 -1146 -72 -894 -355 1078 92 233 2167 1121 252 2156 1735 780 1311
$$ packed form
1004b164P10L03j202J018Q98j596J143K198j357J18J806m19r5P62q81k49J134
1021B127j205r17J005j033j403J169n67j664J228M92j655J199N84o73J216L62
1037B65n66J214J266j753J020J109j486R9R83j774m61R28j193j023O78r92k36
1054a922J135j017n51J675K01j152J554P90o28R73N86r26P43M71j105N75J63j487
1072G8L38O61k045l32J198j144p93J056k15o19J262l76k81J872k43l85J647j60
1090A519r31J166L52j535L18P80j339m49P25j697J83M26j417o3J438j070m48J865
1108a77n80j66J833l92l89J585k14m71N06q6r18R71m79j479P39J63j759K04N36
1127e73j446O90K58q32P57J074q22N39J433r86J41J934j046q69J904m21r55N31
$$ plain form
1145 1311 784 -88 341 -246 -1606 -457 -721 -2250 -1131 -868 -2017 -867 73 -963 -312 1094 119
1162 119 856 1481 861 1414 2236 945 285 1403 711 -479 492 -499 -1612 -431 -973 -1812 -1156 -917
1180 -917 -1877 -486 -295 -1191 446 1007 -236 1101 1722 658 841 1829 803 1070 1660 307 -191 212
1198 212 -728 -921 -272 -1640 -2035 -583 -1018 -1869 -351 9 -1029 285 590 -61 1276 1561 151 1536
1216 1536 1942 599 1044 1402 -271 -138 531 -968 -1258 -210 -1664 -1663 -849 -1470 -1343 -16 -532 -884
1234 -884 729 385 -170 1408 1255 524 1712 1315 374 1271 789 -186 672 -134 -1400 -662 -154 -1710
1252 -1710 -1355 -543 -1303 -1140 127 -741 -573 710 133 59 1430 991 834 1797 1140 178 1152 737 -870
1271 -870 163 177 -1094 -682 -624 -1933 -916 -384 -1634 -810 -153 -720 -163 671 176 223 1720 948 809
$$ packed form
1145A311n27q72M29n87j360J149k64j529J119K63j149J150R40j036O51J406r75
1162A19P37O25o20N53Q22j291o60J118o92j190R71r91j113J181n42q39O56K39
1180i17r60J391J91q96J637N61j243J337O21j064J83R88j026K67N90j353m98M03
1198B12r40j93O49j368l95J452m35q51J518L60j038J314L05o51J337K85j410J385
1216A536M06j343M45L58j673J33O69j499k90J048j454JQ14o21J27J327n16l52
1234h84J613l44n55J578j53p31J188l97r41Q97m82r75Q58q06j266P38N08j556
1252a710L55Q12p60J63J267q68J68J283n77p4J371m39j57R63o57r62R74m15j607
1271h70J033J4j271M12N8j309J017N32j250Q24O57n67N57Q34m95M7J497p72j39
$$ plain form
1290 809 1708 1036 442 1060 260 -370 834 -226 -1327 -247 -657 -1617 -683 -613 -1639 -617 138 -833
1308 -833 20 519 -24 873 1303 218 903 1983 764 274 1120 230 -188 170 -801 -946 23 -1089 -1572
1327 -1572 -580 -876 -1331 -132 -24 -842 40 872 29 697 1112 434 1190 1368 133 871 1131 -114 -322
1346 -322 231 -793 -989 -202 -936 -1278 -366 -913 -1236 150 -512 -503 453 514 21 1079 1273 422 1134 1437
1366 1437 536 732 693 -495 36 313 -767 -840 -413 -1357 -920 -146 -1176 -1028 15 -205 -318 623 311
1385 311 285 1106 577 464 1246 1130 106 765 602 -500 -10 -3 -966 -532 -237 -1286 -927 -731 -1097 -573
1405 -573 125 -582 -163 997 60 399 1433 742 589 1310 542 210 865 377 -470 456 -295 -803 -334
1424 -334 -529 -1238 -415 -202 -994 -639 183 -464 253 632 -67 490 1138 364 704 1246 543 393 992 210
$$ packed form
1290H09Q99o72n94O18q00o30J204j060j101J080m10r60R34P0j026J022P55r71
1308h33Q53M99n43Q97M30j085O85J080j219m90Q46q90m18L58r71j45R69j112m83
1327a572R92k96m55J199J08q18Q82Q32q43O68M15o78P56J78j235P38K60j245k08
1346c22N53j024j96P87p34l42R12n47l23J386o62RR56O1m93J058J94q51P12L03
1366A437r01J96l9j188N31K77j080p3M27r44M37P74j030J48J043k20j13R41l12
1385C11k6Q21n29j13P82j16j024O59j63j102M90Pr63M34K95j049L59J96l66N24
1405e73O98p07M19J160r37L39J034o91j53P21p68l32O55m88q47R26p51n08M69
1424c34j95p09Q23K13p92L55Q22o47P17L79o99N57O48p74L40N42p03j50N99p82
$$ plain form
1444 210 -226 350 -370 -805 -500 -781 -1137 -298 -754 -1347 -168 -72 -271 296 307 78 697 1185 348 876
1464 876 1241 -44 432 764 -268 -187 200 -810 -537 -175 -936 -969 -358 -788 -724 133 -250 -319 522 266
1484 266 -106 846 925 165 932 960 -128 359 701 -403 -244 491 -721 -361 -216 -1002 -809 -146 -708 -465
1504 -465 -51 -348 -407 548 234 178 868 764 391 759 432 143 349 398 -429 44 80 -698 -345 -32 -802
1525 -802 -592 -197 -717 -516 305 -580 -87 346 -300 223 788 257 397 851 367 318 730 504 -347 230
1545 230 -12 -549 -534 -146 -1021 -610 -334 -903 -268 153 -664 -245 571 11 634 815 301 208 877 512 382
1566 382 602 0 -320 210 -311 -875 -2 -265 -916 -325 -391 -783 -369 11 -325 158 567 -227 610 860
1586 860 512 498 810 225 441 484 -98 -302 219 -353 -545 -239 -723 -967 -227 -451 -623 -135 -222 -336 140
$$ packed form
1444B10m36N76p20m35L05k81l56Q39m56n93J179R6j99N67J1k29O19M88q37N28
1464H76L65j285M76L32j032Q1L87j010K73L62p61l3O11m30O4Q57l83o9Q41k56
1484B66l72R52P9p60P67K8j088M87L42j104J59P35j212L60J45p86J93O63n62K43
1504d65M14k97n9R55l14n6O90j04l73L68l27k89K06M9q27M73L6p78L53L13p70
1525h02K10L95n20K01Q21q85M93M33o46N23N65n31J40M54m84m9M12k26q51N77
1545B30k42n37J5L88q75M11K76n69O35M21q17M19Q16n60O23J81n14r3O69l65j30
1566C82K20o02l20N30n21n64Q73k63o51N91o6l92M14L80l36M83M09p94Q37K50
1586H60l48j4L12n85K16M3n82k04N21n72j92L06m84k44P40k24j72M88q7j14M76
$$ plain form
1607 140 283 155 643 708 296 494 541 143 303 469 -114 -82 259 -454 -424 -33 -532 -543 -365 -614 -632 152
1629 152 -263 -257 623 146 42 783 442 47 527 567 69 203 303 -390 377 32 -580 -136 -34 -571 -599
1650 -599 -415 -300 -142 -140 -275 54 412 46 -24 700 332 235 635 380 124 531 405 -493 114 37 -279 -284
1672 -284 -189 -443 -482 -459 -567 -316 11 -261 -278 198 3 522 631 130 378 477 380 269 632 -42 -202 97
1694 97 -171 -444 -15 47 -643 -273 -404 -559 -111 258 -130 -268 335 63 512 415 50 366 481 -78 114
1715 114 456 28 -44 224 -284 -457 44 -559 -332 -451 -419 -675 119 -292 -436 164 504 -35 473 282 358
1736 358 861 382 327 354 360 55 -175 17 -371 -308 61 -441 -487 103 -352 -477 144 -206 -306 53 188 98
1758 98 719 511 166 255 329 126 147 294 -166 -1 -277 -357 -32 7 -315 -115 -198 -497 -357 -223 -410 -36
$$ packed form
1607A40J43j28M88O5m12J98M7l98J60J66n83L2L41p13L0L91m99j1J78k49j8P84
1629A52m15OQ80m77j04P41l41l95M80M0m98J34J00o93P67l45o12M44J02n37k8
1650e99J84J15J58Kj35L29L58l66p0P24l68r7M00k55k56M07j26q98O07p7l16n
1672b84R5k54l9K3j08K51L27k72j7M76j95N19J09n01K48R9r7j11L63o74j60K99
1694I7k68k73M29O2o90L70j31j55M48L69l88j38O03k72M49r7l65L16J15n59J92
1715A14L42m28p2K68n08j73N01o03K27j19L2k56P94m11j44O00L40n39N08j91P6
1736C58N03m79n5K7Ol05k30J92l88O3L69n02m6N90m55j25O21l50j00L59J35r0
1758I8O21k08l45Q9P4k03K1J47m60J65k76q0L25L9l22K00q3k99J40J34j87L74
$$ plain form
1780 -36 306 -2 201 127 220 253 472 201 236 304 116 150 357 -71 -409 75 58 -135 -68 -147 -527 -227 -2
1803 -2 -532 -8 19 -197 103 470 142 31 435 106 222 338 143 -90 274 -383 -412 36 -240 -428 -94
1824 -94 -30 -93 69 96 -159 30 358 55 244 322 10 -55 385 208 212 291 -3 -264 495 -121 -225 155 -414
1847 -414 -453 -139 -456 -570 14 -296 -261 97 -44 -75 109 214 -100 443 424 -54 108 282 -35 61 148 -329
1869 -329 -51 30 -448 -391 -132 -691 -173 -39 -417 -221 104 102 -101 336 40 69 214 278 -21 331 297 -86
1891 -86 -49 101 -294 -175 -128 -276 -226 -59 -94 17 189 -147 -66 265 -212 -92 403 -58 197 163 90 367 181
1914 181 190 13 141 75 -330 -213 19 -409 -76 69 -303 56 83 -250 -107 86 -31 13 187 27 275 561
1936 561 -14 227 94 -65 176 99 101 -236 103 -114 -490 -220 -231 -321 -20 -81 -343 -112 152 -169 159 158 118
$$ packed form
1780c6L42l08K03p4R3L3K19k71L5O8j88L4K07m28l38M84j7j93O7p9l80L00K25
1803bn30N24K7k16L00L67l28j11M04l29J16J16j95k33L64o57k9M48k76j88L34
1824i4O4o3J62K7k55J89L28l03J89P8l12o5M40j77MP9k94k61P59o16j04L80n69
1847d14l9L14l17j14N84l10L5L58j41l1J84J05l14N43j9m78J62J74l17R6Q7m77
1869c29K78Q1m78N7K59n59N18J34l78J96L25kk03M37k96K9J45O4k99L52l4l83
1891h6L7J50l95J19M7j48N0J67l5J11J72l36Q1L31m77J20M95m61K55l4p3K77j86
1914A81Rj77J28o6m05J17K32m28L33J45l72L59K7l33J43J93j17M4J74j60K48K86
1936E61n75K41j33j59K41p7Kl37L39k17l76K70j1r0L01o1k62K31K64l21L28jm0
$$ plain form
1959 118 224 301 -39 144 262 159 65 -24 -80 -41 -37 74 48 52 -386 -428 113 21 -187 274 -113 -125 22 340
1983 340 251 218 385 -61 147 -60 -107 -80 75 -185 -389 -294 -378 -271 -209 -335 40 108 -259 -29 287 -215 123
2006 123 163 37 -24 305 219 31 39 288 -44 142 305 -129 62 80 -208 -181 110 25 -116 230 -70 110 89
2029 89 39 198 74 157 -142 329 34 -58 -96 228 -204 -117 -38 -400 17 -154 -136 14 154 -79 -41 63 -77
2052 -77 -144 286 105 -95 230 -20 -157 173 128 302 221 173 82 41 58 -15 119 -330 -88 191 82 -103 118
2075 118 32 147 54 216 -141 45 0 9 80 -127 69 2 92 69 -87 -118 -51 -131 -36 -192 -150 -120 -56 -359 -110
2100 -110 166 -17 138 67 -260 267 -21 20 46 -215 -178 37 110 -68 179 -124 35 -356 -82 -260 -217 -1
2122 -1 -192 -465 15 -39 -177 -19 -24 89 -22 -99 10 183 19 -234 196 286 181 -70 -20 32 101 -49 -278
$$ packed form
1959A18J06P7l40J83J18j03r4q9n6L9MJ11k6Mm38m2N41r2k08M61l87j2J47L18
1983C40q9l3J67m46K08k07m7K7J55k60k04R5q4J07O2j26L75O8l67K30L16n02L38
2006A23M0j26o1L29q6j88QK49l32J86J63m34J91J8k88K7K91q5j41L46l00J80k1
2029H9n0J59j24Q3k99M71k95r2l8L24m32Q7P9l62M17j71J8J50J40k33L8J04j40
2052g7o7M30j81k00L25k50j37L30m5J74q1m8r1m1J7p3J34m49K42K79j09j85K21
2075A18q6J15r3J62l57J86m5RP1k07J96o7R0k3j56l1O7q0R5j56M2L0O4l03K49
2100a10K76j83J55p1l27N27k88M1K6k61L7K15P3j78K47l03J59l91K74j78M3K16
2122aj91k73M80n4j38J58nJ13j11p7J09J73j64k53M30R0j05k51N0N2O9j50k29
$$ plain form
2145 -278 -35 -7 20 -214 -122 63 -82 -12 132 -43 58 53 -142 -15 209 95 105 77 321 42 -51 -273 122
2168 122 -132 -251 -36 103 -38 365 302 -310 104 -126 39 107 98 8 206 354 -20 123 -40 61 146 29
2190 29 56 -57 52 -157 -106 -30 -110 -138 -78 -35 103 91 -226 -170 140 476 -159 -159 124 -226 -249 306 -180 324
2214 324 -325 -287 -48 -142 -146 32 24 -289 37 65 109 5 117 -184 89 201 96 198 -88 -21 -41 163 212 118
2238 118 -61 96 -14 -33 -122 -147 -296 8 -10 -192 42 325 26 -102 -129 -157 186 -12 95 0 -117 -166 45
2261 45 -75 146 -78 -206 -39 82 36 -178 -40 -154 -77 3 249 -309 133 -43 199 -30 187 -77 91
2282 91 61 86 -166 -29 11 -23 7 81 95 -283 14 24 83 -134 -241 -64 224 -207 104 36 -19 289 -30 163
2306 163 37 -197 63 -154 300 36 -164 267 -219 -39 113 99 -107 -141 29 85 -21 -34 59 -111 102 -247
$$ packed form
2145b78K43K8K7k34R2J85j45P0J44j75J01nj95J27K24j14J0k8K44k79r3k22L95
2168A22k54j19K15J39j41M03o3o12M14k30J65O8rr0J98J48l74J43j63J01Q5j17
2190B9K7j13J09k09N1P6q0k8O0M3J38j2l17N6L10L36o35%K83l50k3N55m86N04
2214C24o49L8K39r4mJ78ql13L26K8M4j04J12l01K73J12j05J02k86O7k0K04M9r4
2238A18j79J57j10j9q9k5j49L04j8j82K34K83k99j28k7k8L43j98J07r5j17m9K11
2261D5j20K21k24j28J67J21m6k14J38j14P7Q0K46n58M42j76K42k29K17k64J68
2282I1l0K5k52J37M0l4L0P4J4l78K97J0N9k17j07J77K88m31L11o8n5L08l19J93
2306A63j26k34K60k17M54k64k00M31m86J80J52j4k06l4J70N6j06j3R3j70K13l49
$$ plain form
2328 -247 151 2 209 230 -13 57 -275 -12 54 143 60 -234 -68 -159 50 -139 52 41 35 70 -216 154 245 284
2352 284 -100 71 -340 295 120 94 161 41 71 157 -189 115 -34 -240 1 -62 -96 68 -180 -74 -84 -246
2374 -246 176 -23 94 -10 -1 77 -103 70 -137 -21 205 100 -125 -48 -52 86 104 3 48 -96 -125 -6 127
2397 127 320 -95 -161 -77 -175 -45 -27 -81 -194 40 -55 -1 -155 -197 28 -226 -15 3 -319 -181 -111 -182 30 -136
2421 -136 -119 -160 -190 -142 83 -145 71 25 -69 -173 -75 -3 1 255 78 -42 -132 28 -93 33 33 59 -27 -59 43
2446 43 -276 -168 -257 -2 -109 244 198 -394 -83 122 15 5 -114 81 181 65 102 138 152 24 -86 -78 162
2469 162 -313 -265 -262 -148 45 -252 188 -55 -55 -161 -112 -99 13 257 188 65 112 -110 26 -179 231 40 -12
2492 -12 158 -93 32 100 -100 33 -243 -77 -275 -48 130 -45 26 86 -84 63 58 -108 15 -93 -264 25
$$ packed form
2328b47L98j49K07K1k43P0l32K63O6Q9q3k94J66r1K09j89J91j1oL5k86L70R1L9
2352B84l84J71m11O35j75k6O7j20L0Q6l46L04j49k06K41o3l4J64k48J06j0j62
2374b46M22j99J17j04RP8j80J73k07J16K26j05k25P7mJ38J8j01M5j44k9J19J33
2397A27J93m15o6Q4r8J30J8n4j13K34r5N4j54m2K25k54K11J8l22J38P0p1K12j66
2421a36J7m1l0M8K25k28K16m6r4j04R8P2MK54j77j20r0J60j21J26%K6q6l2J02
2446D3l19J08q9K55j07L53m6n92L11K05j07j0j19J95J00j16L7L6J4j28j10QK40
2469A62m75M8LJ14J93k97M40k43%j06M9J3J12K44o9j23M7k22J36k05M10j91n2
2492a2J70k51J25O8k00J33k76J66j98K27J78j75P1O0j70J47nj66J23j08j71K89
$$ plain form
2514 25 -238 163 -19 -124 -82 -77 29 -159 -89 63 171 -298 253 69 -106 74 -157 255 -96 146 -24 103
2536 103 -97 -95 23 -49 -155 341 267 60 98 154 51 -58 20 98 24 75 113 74 -348 43 62 -144 68 -19 -9
2561 -9 90 -125 139 -24 -124 -124 113 -71 134 209 -67 -13 -14 50 -95 -77 236 -287 -189 168 -328 -216 28 -123
2585 -123 53 28 -48 -26 14 -57 22 -144 20 183 -40 29 58 250 -170 -24 208 245 -356 -94 45 -203 -139
2608 -139 -54 251 205 104 -95 120 143 9 12 36 144 -54 89 64 -104 -35 207 212 -202 -25 44 105 -8 212
2632 212 -90 -32 66 182 -229 -257 168 -15 19 31 125 -229 6 -306 -22 -51 -142 -224 -220 183 72 -178 103 255
2656 255 19 -77 195 -8 48 -118 98 20 -2 281 -254 149 -18 10 317 -35 237 2 -44 103 -27 -88
2678 -88 -52 85 19 -101 141 -121 -33 -6 80 109 219 -26 -126 42 33 -29 -272 108 38 -17 52 185 -231 -84
$$ packed form
2514B5k63M01j82j05M2NJ06j88P0J52J08m69N51j84j75J80k31M12l51K42j70J27
2536A03k00KJ18p2j06M96p4k07L8N6j03j09P8P8p4N1L8l9m22L91J9k06K12q7J0
2561iR9k15K64j63j00%K37j84K05P5k76N4jO4j45J8L13n23R8L57m96J12K44j51
2585a23J76k5p6K2M0p1P9j66J64J63k23O9K9J92m20J46K32L7o01K62J39k48O4
2608a39Q5L05m6j01j99K15K3j34LK4J08j98J43k5j68O9K42Nm14J77O9O1j13K20
2632B12l02N8R8J16m11k8M25j83L4J2R4l54K35l12K84k9r1q2MM03j11k50K81J52
2656B55k36r6K72k03N6j66K16p8k2K83n35M03j67K8L07l52K72k35m6J47j30o1
2678h8L6J37o6j20K42k62Q8K7Q6K9J10k45j00J68ro2k43L80p0n5O9J33m16J47
$$ plain form
2702 -84 -144 60 45 41 246 216 37 191 -81 -169 -193 -95 -56 217 -51 3 163 -146 -54 46 331 116 -11 218
2726 218 75 156 348 7 89 58 44 58 173 53 -118 29 -130 -89 62 98 -29 102 84 173 78 -356 -27
2749 -27 176 185 -236 -137 4 -45 178 -160 147 -63 41 -44 -119 -122 -375 -44 0 -33 79 -17 254 121 42 162
2773 162 46 -34 -103 -108 61 -14 -13 -90 9 6 211 77 93 110 -8 126 2 155 109 -187 -20 337 -161 61 -31
2798 -31 -129 100 166 -104 -14 -142 -95 14 -24 -44 76 1 -137 7 -21 -187 -92 -137 -98 84 -262 13 -48 10 80
2823 80 -198 -260 -131 20 -207 62 -78 33 -19 63 34 57 -337 -117 -110 15 -31 -7 41 -260 61 21 53 233
2847 233 19 47 175 93 228 -97 305 84 97 -174 15 35 -170 122 -95 17 143 -63 237 211 233 89
2869 89 36 -289 -244 -149 108 129 -149 4 -179 267 24 6 89 -93 81 134 -54 250 369 -202 -115 -32 99
$$ packed form
2702h4o0K04j5mK05l0j79J54k72q8k4R8L9K73k68N4J60l09R2J00K85k15j27K29
2726B18j43Q1J92l41Q2l1j4J4J15j20j71J47j59M1J51L6j27J31j8Q9r5m34L29
2749b7K03Rm21R9J41m9K23l38L07k10J04q5p5lk53L31M4l3J12r6K71j33p9J20
2773A62j16q0o9nJ69p5Jp7R9lK05j34J6J7j18J34j24J53m6k96J67L57m98K22r2
2798c1r8K29O6k70R0j28M7J09l8k0J20p5j38J44k8j66R5m5L9J82l46K75o1N8P0
2823H0k78o2J29J51k27K69j40J11n2Q2k9K3l94K20PJ25m6K4M8l01L21m0L2J80
2847B33k14K8J28q2J35l25M02k21J3k71J89K0k05K92k17J12J26k06L00k6K2j44
2869H9n3l25M5R5K57K1k78J53j83M46k43j8Q3j82J74N3j88L04J19n71Q7Q3J31
$$ plain form
2892 99 -20 33 -92 69 102 -178 -14 -8 -113 -161 82 -314 -38 -65 -149 -136 -64 196 192 342 -199 276 56 -272
2916 -272 105 64 288 -180 -31 -161 62 97 71 -45 153 -105 -343 -8 13 155 32 332 27 -51 -8 -192
2938 -192 40 161 -135 -54 -132 -3 61 38 -158 -159 56 192 -38 96 -154 8 102 38 140 70 254 188 -81
2961 -81 101 80 -95 -62 252 224 -125 -226 -132 -47 -185 91 -63 -71 -116 -132 224 15 -23 -56 76 219 -41 -28
2985 -28 3 54 -249 -178 154 -115 -249 -95 -85 -29 24 -123 155 -223 45 136 223 39 16 230 7 20 -169 83
3009 83 150 -42 -26 22 -79 -29 37 228 134 -138 147 284 -131 -138 -208 -351 -173 -178 232 -175 98 109 75 301 209
3034 209 75 90 160 -265 8 -16 -2 -240 -54 258 16 24 -129 126 -66 -269 212 41 48 149 -107 124 -14
3057 -14 132 -244 -5 245 -360 -63 -93 -48 229 -102 -100 66 -3 -196 -30 193 -198 -84 -20 154 -19 60 425
$$ packed form
2892I9j19N3j25J61L3k80J64Oj05m8K43l96K76k7q4J3P2K60mJ50n41M75k20l28
2916b72L77m1K24m68J49j30K23L5k6j16J98k58k38L35K1J42j23L00l05p8M3j84
2938a92K32J21k96Q1p8J29O4k3j96jK15J36k30J34k50J62R4o4J02p0J84o6k69
2961h1J82k1j75L3L14k8l49j01R4Q5j38K76j54qm5j6L56k09l8l3J32J43k60J3
2985b8L1N1l03P1L32k69j34J54J0N6N3j47K78l78K68R1Q7j84k3K14k23J3j89K52
3009H3O7j92J6M8j01N0O6J91r4k72K85J37m15pp0j43J78nM10m07K73J1l4K26r2
3034B09j34J5P0m25K73k4J4k38J86L12k42Qj53K55j92k03M81j71PJ01k56K31j38
3057a4J46l76K39K50o05K97l0M5K77l31KJ66o9j93J66K23l91J14O4J74j73P9L65
$$ plain form
3080 425 39 146 189 29 401 24 -124 24 -83 -79 -27 -66 -386 66 169 54 -27 -95 142 -205 250 -293
3102 -293 145 -57 -219 93 221 161 -20 -63 259 18 -22 84 -180 174 -76 -105 -17 82 -12 -112 114 69 1
3125 1 152 -79 61 26 4 -219 214 -87 219 157 96 66 246 155 -173 162 -253 -179 29 104 -135 179 -157
3148 -157 -254 -19 11 -136 -89 199 144 -27 59 127 -71 -123 -150 -309 210 121 1 131 -299 -204 61 90 -394 69
3172 69 -236 -102 74 -60 -206 18 -30 197 95 136 -85 -98 330 171 228 39 -302 -88 -74 13 122 24 -113
3195 -113 -180 -55 69 37 235 -29 -98 71 -260 -77 -23 -67 -14 -85 258 124 17 -12 37 -53 114 55 228 43
3219 43 58 -76 -162 40 92 -31 -168 -13 202 218 177 131 19 156 335 98 101 42 -17 -156 83 -49 -87 60
3243 60 47 54 -6 72 -159 6 -25 -36 82 313 -44 54 179 -214 69 17 -22 133 135 -36 181 -111 70 -176
$$ packed form
3080D25l86J07M3j60L72l77j48J48j07MN2l9l20M52J03j15q1o8K37l47M55n43
3102b93M38k02j62L12J28o0j81m3L22k41m0J06k64L54k50k9Q8R9r4j00K26m5o8
3125AJ51k31J40l5k2k23M33l01L06o2o1l0J80r1l28L35m15P4K08P5k39L14l36
3148a57r7K35L0j47M7K88n5j71Q6O8j98n2k7j59N19q9j20J30m30R5K65K9m84M63
3172F9l05J34J76j34j46K24m8K27j02M1k21j3M28j59N7j89l41K14J4Q7J09r8j37
3195a13o7J25J24l2J98k64o9J69l31J83N4m4N3p1L43j34j07k9M9r0J67n9J73j85
3219D3J5j34q6K02N2j23j37J55K15J6m1m6j12J37J79k37Ln9n9j39K39j32l8J47
3243F0j3Po0P8k31J65l1j1J18K31l57R8J25l93K83n2l9J55Kj71K17k92J81k46
$$ plain form
3267 -176 18 198 -133 240 -5 -199 -43 -202 36 -7 77 -225 115 -96 126 103 -27 207 29 15 164
3288 164 -102 308 -188 -146 101 -152 57 48 -51 -386 -147 -49 203 -133 46 108 -3 -22 166 253 -149 51 232
3311 232 -27 70 -19 219 -22 83 231 -34 1 -3 113 27 -59 -249 -178 100 143 -103 126 -35 175 161 47
3334 47 206 -95 262 -363 -122 -16 -380 -164 80 13 -133 68 -382 -298 135 -95 261 246 -31 70 258
3355 258 -16 -80 -8 12 -128 140 197 130 -114 144 -41 302 121 -37 167 -62 -229 19 264 -122 -157 371
3377 371 180 86 170 55 -111 125 -29 94 138 162 71 46 -111 -278 53 -103 -474 37 -156 -313 -52 55
3399 55 21 -131 23 -182 15 -141 -1 260 138 -81 202 276 60 -108 266 -16 16 -4 -344 -134 54 -149
3421 -149 -82 -256 -64 -75 61 160 165 237 62 26 235 70 -226 265 144 -170 26 31 -16 0 -24 158 -8 -175
$$ packed form
3267a76J94J80l31L73k45j94J56j59K38m3Q4l02L40k11K22k3j30K34j78j4J49
3288A64k66M10m96M2K47k53K09rr9l35K39R8K52l36J79O2j11j9J88Q7m02K00J81
3311B32k59R7q9K38k41J05J48k65L5mJ16q6q6j90P1K78M3k46K29j61K10j4j14
3334D7J59l01L57o25K41J06l64K16K44o7j46K01m50Q4M33k30L56j5k77J01J88
3355B58k74o4P2K0j40K68N7o7k44K58j85L43j81j58K04k29j67K48K45l86l5N28
3377C71j91r4Q4j15j66K36j54J23M4K4r1k5j57j67L31j56l71N11j93j57K61J07
3399E5l4j52J54k05J97j56J40K61j22k19K83P4k16j68L74k82L2k0l40K10J88k03
3421a49O7j74J92j1J36R9NP2j75l6K09j65k96M91j21l14J96Nm7J6k4J82j66j67
$$ plain form
3445 -175 -14 -47 62 2 -35 5 -126 132 80 294 -52 31 43 -14 224 -80 129 58 85 -27 206 334 -133
3468 -133 -168 -342 -153 -162 237 127 -249 181 -137 -246 131 155 159 430 257 112 182 -173 -46 97 143 9 -18
3491 -18 13 132 -40 170 -153 -187 12 34 -146 -25 18 141 -47 -188 154 291 -37 100 311 451 139 31
3513 31 79 -112 -31 121 -113 110 61 -171 234 121 -42 29 -27 -31 21 212 -31 110 157 57 120 182 38 -80
3537 -80 9 -212 -158 172 -289 -102 205 6 -250 127 117 82 -72 194 -137 178 350 -286 147 -171 -278 -207
3559 -207 29 -198 -117 -130 47 42 -25 -261 -105 5 53 33 -10 -51 -84 15 109 -78 -93 -125 -90 -53 79 -196 -210 255
3585 255 -74 147 131 47 -67 53 -64 -338 -213 -378 -17 101 -360 -60 208 -54 -186 179 -8 -286 232
3606 232 -120 -191 -54 -123 -75 257 25 -423 120 -217 31 -123 -136 -31 162 -95 -123 1 143 169 243 245 10
$$ packed form
3445a75J61l3J09o0l7M0j31K58n2K14l46Q3J2n7K38l04K09p1K7j12K33J28m67
3468a33l5j74J89rL99j10l76M30l18j09L77K4MK71j73j45P0l55J27J43M6j34k7
3491a8L1J19j72K10l23l4J99K2j80J21M3J23j88j41L42J37l28J37K11J40l12j08
3513C1M8j91Q1J52k34K23m9k32M05j13j63P1n6mN2J91k43J41M7j00O3O2j44j18
3537h0Q9k21N4L30m61J87L07j99k56L77j0l5j54K66l31L15J72o36M33l18j07P1
3559b07K36k27Q1j3J77no7k36J56J10M8k0m3m1l3R9R4j87j5l2L5L7J32k75j4M65
3585B55l29K21j6q4j14J20j17k74J25j65L61J18m61L00K68k62j32L65j87k78N18
3606B32l52p1J37o9M8L32k32m48N43l37K48j54j3J05J93k57k8J24J42K6P4Kk35
$$ plain form
3629 10 149 114 -130 -91 246 1 -23 153 -23 -291 137 94 -26 -4 85 -278 -157 72 -95 9 123 3
3651 3 -177 232 -231 83 -187 -313 -34 278 -200 -73 16 -124 79 153 -74 147 89 13 -252 6 131 -104
3673 -104 87 -128 -46 -103 -36 -314 25 51 -2 -118 82 17 91 248 224 -113 152 8 -151 -68 -237 45 126
3696 126 -345 -17 407 -87 -34 6 186 -255 73 -82 -8 36 148 234 143 165 -95 -143 -91 117 215 44 -5 -53
3720 -53 122 -138 -41 186 220 -120 41 125 -234 41 -248 24 126 -26 4 -12 358 -266 78 12 -77 -230 334
3743 334 -93 29 38 -92 -73 237 -84 90 -61 13 123 388 -233 32 91 160 -90 -94 -57 -71 75 -128 98
3766 98 152 -21 -86 -57 293 99 7 -138 -268 63 -146 4 -18 -121 -30 65 236 -120 -202 -36 -116 283 10
3789 10 -38 -79 -109 -116 15 -62 9 125 77 142 -17 -41 -40 -101 -73 140 -210 260 318 -197 151 49 -85 -222 102
$$ packed form
3629A0J39l5k44L9L37k45k4J76j76k68M28m3j20K2Q9l63J21K29j67J04J14j20
3651Cj80M09m63L14k70j26K79L12m78J27Q9j40K03P4k27K21n8p6k65K58J25k35
3673a04J91k15Q2n7O7k78L39K6n3j16K00o5P4J57k4l37K65j44j59Q3j69K82Q1
3696A26m71L28M24m94N3M0J80m41L28j55P4M4J12Q6r1K2k60m8N2K08R8j71m9m8
3720e3J75k60R7K27L4l40J61Q4l59K75k89K72J02j52L0j6L70o24L44o6q9j53N64
3743C34m27J22Rj30J9L10l21J74j51P4J10K65o21K65N9O9k50mL7j4J46k03K26
3766I8N4j73o5K9L50j94r2j45j30L31k09J50k2j03R1R5J71l56q2J66q0L99k73
3789A0m8m1l0pJ31p7P1J16m8O5j59k4Jo1K8K13l50M70N8n15L48j02j34j37L24
$$ plain form
3814 102 -30 -9 97 -55 -237 -39 -44 288 31 120 113 246 198 -150 24 229 -43 196 157 -38 274 -132 109
3837 109 3 -224 28 -96 195 -61 -62 -19 -100 187 -58 -196 299 187 -158 123 -124 300 133 338 57
3858 57 -65 86 175 -131 -101 -99 40 0 -92 -194 183 52 -192 124 131 -56 -1 -160 -9 80 -5 -78 63 189
3882 189 285 -53 174 8 -16 194 -43 -27 -24 -184 -150 19 -173 -74 -180 128 -105 -1 -81 -47 262 13 -119
3905 -119 -262 181 54 -257 297 56 99 -50 77 -288 -191 -111 -62 7 75 -63 192 331 -400 63 -300 -236
3927 -236 108 -99 -107 165 281 19 -21 199 -40 247 60 -120 -302 210 -2 127 162 -154 -29 -97 -116 -88
3949 -88 169 8 -230 99 106 -145 -2 93 -42 51 114 -123 206 -136 -171 -175 -174 105 -201 -18 -117 126 29 -108
3973 -108 -1 -29 4 92 235 117 208 273 44 67 17 52 103 -63 93 104 -89 -50 -11 -89 86 70 50 -64 -207
$$ packed form
3814A02j32K1J06j52j82J98nL32k57Q9pJ33m8l48J74K05k72K39l9j95L12m06K41
3837A09j06k27K52j24K91k56jM3q1K87k45j38M95j12l45K81k47M24j67K05k81
3858E7j22J51Q9l06L0KJ39m0r2j02L77j31k44L16Pj87N5j59J51Q9q5p3J41J26
3882A89R6l38K27j66k4K10k37J6Lj60L4J69j92R9j06L08k33J04q0L4L09k49j32
3905a19j43M43j27l11N54k41M3j49J27l65R7Q0M9O9O8j38K55J39p31M63l63O4
3927b36L44k07qK72J16k62m0K20k39K87j87j80j82N12k12J29L5l16J25o8j9K8
3949h8K57j61k38L29Pk51J43R5j35R3O3k37L29l42l5mJK79l06J83r9K43r7j37
3973a08J07k8L3Q8J43j18R1O5k29K3n0L5N1j66J56J1j93L9L9p8J75j6k0j14j43
$$ plain form
3998 -207 -48 118 -78 -25 226 58 113 51 42 43 1 -33 -277 -132 21 15 192 101 75 -244 155 -39 -65 135 -172
4023 -172 -125 10 -97 228 47 36 92 34 59 246 196 -177 20 -147 -85 -211 75 80 -14 -8 -193 -204 -62 -13 -213
4048 -213 -114 96 157 -76 33 -36 182 187 116 -137 -32 -64 1 160 -242 26 32 -42 -185 -87 -174 159 -261 -146
4072 -146 -64 134 -39 -28 33 282 51 -186 -27 46 230 56 109 -64 64 -28 17 -128 -93 51 239 91 212
4095 212 -228 103 -175 109 -54 396 -8 -124 44 -48 46 -170 -87 -38 153 -141 0 -102 -87 16 158 -73
4117 -73 95 -180 -137 -84 -283 -221 -195 -91 104 262 57 -111 -15 -64 165 121 140 -371 147 69 116 -185 126 -95
4141 -95 116 121 -358 -70 -160 90 142 66 -199 -18 28 -133 -192 78 -93 122 115 224 -211 41 -287 0 137
4164 137 -86 13 53 20 55 11 -91 -54 16 95 94 75 383 149 319 76 -29 -148 33 -31 62 94 -219 -100 240
$$ packed form
3998b07J59J66j96N3K51j68N5o2rJm2l4k44J45J53oJ77r1k6l19L99j94k6K00l07
4023a72M7J35j07L25j81j1N6n8K5J87n0l73J97j67O2j26K86Nr4Oj85j1J42M9k00
4048b13R9K10O1k33J09o9K18Np1k53J05l2O5J59m02K68Op4j43R8q7L33m20J15
4072a46Q2J98j73J1O1K49k31k37J59P3J84j74N3j73J28r2M5j45L5J44J88j48J21
4095B12m40L31k78K84j63M50m04j16J68r2R4k16Q3M9J91k94J41j02J5J03J42k31
4117g3J68k75M3N3j99O2K6J04J95J58k05j68R6m9K29m4J9n11N18p8M7l01L11k21
4141i5K11Nm79K88r0K50N2p6k65J81M6j61n9K70j71K15pJ09m35K52l28K87J37
4164A37k23R9M0l3L5m4j02L7P0P9jj9L08k34J70k43j05j19J81o4R3L2l13J19L40
$$ plain form
4189 240 94 -36 -164 -46 79 236 5 -27 -111 -113 -92 9 155 -45 -67 98 -17 118 -60 -103 39 64 23
4212 23 -1 -17 -79 -161 77 -103 -15 153 123 7 -123 62 -82 163 -46 200 76 141 -9 24 -121 170 56
4235 56 94 68 108 -232 156 136 -154 24 53 157 -109 -8 41 158 183 265 129 84 -70 -47 182 68 -292 9
4259 9 107 59 -129 8 -101 -208 -152 246 -115 76 -46 -26 -6 289 -32 203 123 -28 -17 110 -46 -36 -20 -21
4283 -21 -83 147 161 -16 -191 138 -100 100 -11 -111 183 45 -170 -139 -41 -189 146 101 -90 -36 43 -97 -120
4306 -120 -36 -21 143 -246 -184 39 53 42 -44 154 -19 -190 5 18 14 237 246 17 -11 -100 -171 30 16 -46 -230
4331 -230 72 -85 -158 197 78 5 115 -143 -167 -7 -23 194 66 -82 -97 71 -151 -105 36 33 250 -19 -59
4354 -59 -103 -209 -13 -206 -116 12 -324 159 1 -163 52 220 169 -53 155 -148 130 -140 182 3 -190
$$ packed form
4189B40j46j30j28J18J25J57k31l2q4kK1J01J46k00k2J65j15J35j78m3J42K5m1
4212B3k4j6o2q2K38j80Q8J68l0j16j30J85j44K45k09K46j24O5j50L3j45K91j14
4235E6L8k6M0l40L88k0k90J78K9J04k66J01M9J17K5Q2j36m5j54K3K29j14l60L01
4259IR8m8j88J37j09j07N6L98l61J91j22K0K0K95l21K35q0j51J1J27j56J0J6j
4283b1o2K30J4j77j75L29k38K00j11j00K94j38k15L1R8j48L35m5j91N4P9j40k3
4306a20Q4J5J64l89O2K23J4j1q6J98j73j71J95J3mK23Rk29k8q9p1K01j4o2j84
4331b30L02j57p3L55j19p3J10k58k4J60j6K17j28j48j5J68k22M6J41lK17k69m0
4354e9m4j06J96j93R0J28l36M83j58j64K15J68n1k22K08l03K78k70L22j79j93
$$ plain form
4375 -190 -152 226 39 165 -135 311 75 128 88 119 -1 -281 -43 -123 13 219 22 -158 192 -8 76 90
4397 90 -71 198 86 -289 -153 -279 -160 -28 68 206 -60 257 -35 -37 -146 -68 3 45 30 -204 -85 63 -376
4420 -376 142 47 194 60 -136 -228 19 -7 -110 -28 -109 43 -95 259 95 -115 -201 -6 121 7 -10 83 -47
4443 -47 18 248 70 -106 23 164 -155 4 124 257 19 258 106 -70 -105 93 129 164 -72 5 -42 -53 -173
4466 -173 11 -63 -70 96 144 28 103 -205 -77 -95 95 163 5 119 106 -42 53 28 -164 15 129 124 -140 48
4490 48 -10 -143 7 81 -51 106 32 171 233 -132 323 111 -306 -47 -13 133 189 -35 -106 -127 -108 48 -135
4513 -135 -91 135 160 8 -14 -26 -6 6 -233 -19 42 -127 -22 -67 145 64 -21 -103 60 50 402 4 99 -70
4537 -70 -48 256 60 -32 166 270 36 -24 -66 -44 -178 238 -343 -64 123 -419 14 -50 -117 -139 62 87 -192
$$ packed form
4375a90L8L78j87J26l00M46k36N3m0L1j20k80K38q0J36K06j97j80L50k00Q4J4
4397I0j61K69j12l75J36j26J19J32R6J38k66L17k92kj09P8P1M2j5k34J19J48m39
4420c76N18r5J47j34j96r2K47k6j03Q2q1J52j38L54j64k10q6J95J27j14j7R3j30
4443d7O5K30j78j76J29J41l19J59J20J33k38K39j52j76l5J98L6L5k36P7m7j1j20
4466a73J84p4pJ66M8j16P5l08J28j8J90O8j58J14j3j48R5k5j92J79J14nk64J88
4490D8n8j33J50P4j32J57p4J39O2l65M55k12m17K59L4J46N6k24p1k1J9J56j83
4513a35M4K26K5j52k2j2K0J2k39K14O1j69J05m5K12q1q5q2J63j0L52l98R5j69
4537g0K2L04j96r2J98J04k34o0m2K2j34M16n81K79J87n42M33o4o7k2K01K5k79
$$ plain form
4560 -192 209 18 140 -105 92 -106 -102 133 -62 63 -81 315 82 288 -103 129 17 94 100 233 63 56
4582 56 138 -197 97 -137 119 140 114 -223 106 216 -145 -2 -56 -130 71 -144 81 123 -64 -133 -147 -24 71
4605 71 -64 200 -92 -32 152 -87 -151 176 44 135 242 51 0 20 -230 -174 128 143 -185 57 -116 98 -135
4628 -135 -26 109 134 168 -296 -179 -111 -248 94 60 -324 15 146 -18 161 -97 -79 -212 -150 197 -307 -230
4650 -230 -20 0 47 203 175 257 88 -10 -141 111 -253 -18 185 99 -122 -132 28 77 -15 -125 225 -23 57
4673 57 -197 206 -111 -121 -43 -36 -208 16 33 -97 143 0 324 62 185 -227 58 137 -121 -27 64 5 -136
4696 -136 33 -28 -137 -87 128 -68 53 13 43 -146 68 -112 -48 60 173 114 -184 -158 56 17 -4 -22 23 11
4720 11 97 -268 28 113 -59 -148 -35 113 -139 35 -161 -81 -38 -348 223 -43 50 -219 144 48 -40 83 12
$$ packed form
4560a92M01j91J22k45J97j98MK35j95J25j44L96k33K06l91K32j12P7OJ33j70p
4582E6Q2l35K94k34K56K1k6l37L29J10l61J43n4p4K01k15K25M2j87o9j4J23R5
4605G1j35K64k92O0J84k39o4L27j32R1J07j91n1K0k50N6L02J5l28K42j73K14k33
4628a35J09J35K5L4m64J17O8j37L42l4l84L39J31j64J79k58J8j33O2L47n04P7
4650b30K10K0M7J56k8Q2j69r8j31K52l64K35K03q6k21j0J60M9r2j10L50k48Q0
4673E7k54M03l17j0P8Pj72K24J7j30K40j43L24k62J23m12K85P9k58R4R1n9j41
4696a36J69o1j09N0K15j96J21m0L0j89K14j80O4J08J13n9k98K6K14l9k1j8M5j2
4720A1Q6l65K96Q5j72q9J13J48k52J74j96Q0M3l10N71k66R3k69L63r6q8J23p1
$$ plain form
4743 12 -67 -52 85 -28 -4 61 216 101 229 -150 -198 -138 -190 -19 75 7 185 74 137 116 -146 -63 58 -180
4767 -180 -197 -195 -37 -171 141 -58 276 6 3 93 70 27 -27 178 -200 138 -172 -231 -101 -108 112 40 -235 133
4791 133 -136 -99 -345 83 -119 232 -215 200 249 -49 96 -70 61 -94 59 -53 -56 242 -190 -134 -334 105
4813 105 156 -84 4 22 -109 -90 177 -137 -22 -66 208 9 -57 23 -42 -211 7 -78 -59 131 -130 -74 -58 32
4837 32 -14 -99 -82 216 129 1 -227 46 132 -249 89 25 -58 -169 148 -19 107 56 245 -284 337 35 121
4860 121 -163 -37 -6 -108 -242 44 -106 -15 -180 106 138 -267 -307 33 148 -37 -313 -62 136 -76 -89 175
4882 175 -20 -109 -7 411 -163 -228 -67 0 75 -86 37 -152 -74 -160 -153 136 -129 -18 -105 -357 -86 80 -45
4905 -45 -223 -62 -60 130 -87 -13 63 -142 5 -233 -1 -16 -25 -20 -147 269 -104 -110 162 153 -237 -59 165 -169 81
$$ packed form
4743A2p9J5J37j13K4O5J55j15J28l79m8O0n2J71R4o8J78j11O3k1k62Q3J21k38
4767a80j7KJ58j34L12j99L34k70lR0k3m3n4K05l78L38l10n9J30pK20p2k75L68
4791A33k69L7k46M28k02L51m47M15M9k98J45j66J31j55J53j12lK98m32N6k00M39
4813A05N1k40Q8J8j31J9K67l14J15m4K74j99o6Q0o5j69K18q5J9J90k61N6J6R0
4837C2m6q5J7K98q7j28k28K73Q6l81L38o4q3j11L17j67J26n1J89n29O21l02Q6
4860A21k84J26L1j02j34K86j50R1j65K86L2m05m0L40J15j85k76K51J98k12j3K64
4882A75j95q9J02M18n74o5J61O7P5j61J23j89P8q6PK89k65J11q7k52K71J66j25
4905d5j78J61KJ90k17P4P6k05J47k38K32j5rNj27M16l73oK72rl90J78K24l34K50
$$ plain form
4930 81 -46 52 13 -63 216 234 -177 -215 -157 -83 -78 -88 -7 85 -252 -8 426 39 -10 109 -12 29 34 -396 -80 -213
4956 -213 -391 -4 -64 468 349 -151 0 -135 114 123 8 293 -100 -71 291 -78 98 -44 -235 -76 -75 108
4978 108 97 -36 -37 -37 -44 -2 -116 -210 0 -99 270 12 38 149 56 -151 -151 23 -55 296 -38 -55 -50 -117 -74 -102 72
5005 72 308 195 161 160 -87 -80 162 -197 148 -153 -60 -220 -369 -48 -11 -35 69 -156 -271 -30 -171 -73 117
5028 117 -140 109 40 13 24 235 107 -39 -41 21 182 6 -130 -64 135 24 -43 109 -236 85 241 -277 -315
5051 -315 -71 -141 -99 44 84 -93 -59 181 -122 190 -230 -226 -83 -134 49 -86 -50 -123 -115 13 -245 214 -138 -243
5075 -243 141 -224 290 -253 164 126 190 101 35 -287 26 -222 67 -49 18 66 89 39 -275 -158 -371 -5 -161
5098 -161 -205 -118 -322 -247 306 -125 -63 -29 41 -12 125 -16 -124 59 14 17 -193 -99 -11 -409 -49 128 118 -14
$$ packed form
4930H1j27R8l9p6K79J8m11l8N8P4Nj0Q1R2l37K44M34l87m9J19j21M1Nm30L16j33
4956b13j78L87o0N32j19n00J51j35K49Rj15K85l93K9L62l69J76j42j91J59JJ83
4978A08j1j33j%pM2j14r4K10r9L69k58K6J11r3k07%J74p8L51l34j7No7M3k8J74
5005G2K36j13l4jk47PK42l59L45l01R3j60j49L21L7k4J04k25j15K41j41R8J90
5028A17k57K49o9k7J1K11j28j46kO2J61j76j36O6J99j11o7J52l45L21J56n18l8
5051c15K44p0M2J43M0j77L4K40l03L12m20MJ43n1J83j35L6p3QJ28k58M59l52j05
5075b43L84l65N14n43M17l8O4q9o6l22L13k48K89j16O7M8K3n0l14J17k13L66j56
5098a61m4Q7k04P5N53m31O2L4P0n3J37j41j08J83m5Lk10R4Q8l98L60J77j0j32
$$ plain form
5122 -14 5 2 246 -82 -54 72 56 210 172 -62 -89 48 -204 63 28 87 -153 21 179 -79 -21 -185 -114 -126
5146 -126 13 114 81 51 -56 55 -114 -123 145 37 219 -11 -19 -154 -147 51 -82 -38 51 -24 151 -166 -162 -97 142
5171 142 120 -139 -46 -101 -79 -121 82 65 -243 161 -3 -1 -204 26 -28 289 3 119 19 162 -18 142 54
5194 54 114 -8 175 180 -226 -27 -310 -25 33 -60 -133 -36 -72 -294 -56 6 -101 42 13 -136 -174 18 146 289
5218 289 -263 -73 192 -99 -98 -236 -236 40 -228 -182 -9 22 -246 -33 -8 -11 71 -161 45 45 9 82 28 121 -281
5243 -281 -41 -52 -227 -111 68 -103 -188 202 58 -91 137 -135 45 -90 -30 -72 -18 -26 120 130 141 254 -137
5266 -137 -54 28 -169 -180 -206 70 -109 72 -103 103 180 -117 303 -40 -207 15 -238 17 -14 9 165 -104
5288 -104 190 123 -101 -136 -138 -197 -188 83 -34 106 -3 9 -47 105 79 -68 -10 -176 -32 -88 224 161 -44 130
$$ packed form
5122a4J9lK44l28K8J26j6J54l8k34k7J37k52K67l5N9k40J74J58k58N8j64P1j2
5146a26J39J01l3l0j07J11j69rK68j08J82k30qj35PJ98j33M4Q9p5J75l17MO5K39
5171A42k2k59R3n5K2m2K03j7l08M04j64Kk03K30n4L17k86J16j00J43j80J60q8
5194E4O0j22J83Nm06J99k83K85N8r3p3R7l6k22K38O2j07J43k9j49l8J92J28J43
5218B89n52J90K65k91Jj38%K76k68M6J73L1k68K13K5lQ2k32K06%l6P3n4R3m02
5243b81K40j1j75J16J79j71q5L90j44j49K28k72J80j35O0m2N4qJ46J0J1J13l91
5266a37Q3Q2j97j1k6K76j79J81j75K06P7k97M20l43j67K22k53K55l1K3J56k69
5288a04K94o7k24l5kn9RK71j17J40j09J2n6J52k6j47N8j66J44n6L12o3k05J74
$$ plain form
5312 130 179 -374 -23 -304 -131 99 -150 20 -145 -95 30 39 -133 -107 -15 -7 117 -93 -281 -97 -14 129 146
5335 146 -242 -239 80 384 134 203 147 131 55 42 -33 40 9 -185 58 -53 29 -153 -68 -109 -132 22 -102 -199 61
5360 61 95 -224 -26 -59 111 -290 0 -129 33 98 252 -162 96 -33 -20 174 98 76 120 -304 30 -119 -181
5383 -181 260 87 -148 38 273 -132 -82 40 10 60 -436 143 -50 44 5 16 -29 -109 18 90 -77 31 -44
5406 -44 -270 9 138 322 -111 39 215 73 -25 -112 -62 108 -34 -211 52 178 -36 59 90 118 47 -77 -181
5429 -181 -16 -61 -102 -161 -99 -187 -168 30 -158 15 103 -35 142 -180 -50 -118 -89 284 136 -186 214 191 21
5452 21 -32 -10 212 241 -213 -61 -7 41 38 145 96 37 102 67 -28 86 41 -44 33 -54 -295 24 -14 217 147 -54
5478 -54 -87 -174 107 -86 93 7 -208 -99 78 -18 84 225 4 -54 -34 112 -118 -48 117 -171 212 115 -29
$$ packed form
5312A30M9n53L51k81J73K30k49J70j65N0J25Rj72K6R2QJ24k10j88J84Q3J43J7
5335A46l88LL19L04k50O9n6j6p6j3p5P3l1j94K43j11Q2j82Q5m1k3J54j24r7K60
5360F1L4l19J98l3J70m01K90j29J62O5J54m14K58j29J3J94p6k2M4m24L34j49o2
5383a81M41j73k35J86K35m05N0J22l0N0m96N79j93R4l9J1m5q0J27P2j67J08p5
5406d4k26K79J29J84m33J50J76j42r8q7N0J70j42j77K63J26k14R5L1K8p1j24j04
5429a81J65m5m1n9O2q8J9J98j88J73Q8j38J77l22J30o8K9L73j48l22M00k3j70
5452B1n3K2K22K9m54J52N4M8lJ07m9n9O5l5r5J14m5q5P7q7k41L19l8K31p0k01
5478e4l3q7K81j93J79q6k15J09J77r6J02J41k21n8K0J46k30P0J65k88L83r7j44
$$ plain form
5501 -29 -265 -129 -145 23 6 80 177 -43 117 75 -11 47 -245 256 76 53 -26 88 -188 133 -24 -148 76
5524 76 -140 145 61 -72 45 143 220 74 -166 203 131 218 104 19 -33 -133 166 -142 136 -47 86 103 -123
5547 -123 192 340 103 -53 -79 -87 41 -14 96 13 60 -99 258 -37 -33 -29 24 -113 -146 1 106 157 -154 -126 -138
5572 -138 -232 156 42 19 258 4 -269 -12 94 13 -145 141 -241 -15 171 -95 279 -1 27 117 106 -121
5594 -121 152 264 -157 104 -99 108 -40 56 134 -156 121 90 183 -62 13 -74 -93 27 107 -47 37 42 -52 97
5618 97 -44 107 -166 -86 260 -158 21 -310 91 96 -46 83 -206 85 -28 -153 -201 -325 331 -97 -13 -62
5640 -62 73 -231 95 188 187 -41 -268 142 98 -102 30 87 -211 168 -293 -235 -186 80 34 95 -223 -372 168
5663 168 208 -244 -34 157 30 -77 269 -111 -189 -34 -149 147 13 111 235 76 83 4 -168 97 -115 87
$$ packed form
5501b9k36J36j6J68j7P4R7k20J60m2q6N8k92N01j80k3p9J14k76L21j57j24K24
5524G6k16K85q4j33J17R8P7j46k40L69p2Q7j14q5n2j00K99l08K78j83J33J7k26
5547a23L15J48k37j56k6qJ28n5J10q3M7j59L57k95MMN3j37l3J47J05N1l11K8j2
5572a38r4L88j14k3K39k54k73K57J06q1j58K86l82K26J86k66L74k80K8R0j1k27
5594a21K73J12m21K61k03K07j48R6P8k90K77l1R3k45P5q7j9J20Q0j54Q4Nr4J49
5618I7j41J51k73Q0L46m18J79l31M01Nj42J29k89K91j13j25m8j24O56m28Q4m9
5640f2J35l04L26R3jk28k27M10m4k00J32N7k98L79m61N8M9K66m6O1l18j49N40
5663A68M0m52K10J91j27j07L46l80p8J55j15K96j34R8J24j59Pp9j72K65k12K02
$$ plain form
5685 87 161 -85 -102 178 288 -249 -201 -207 84 -194 -88 140 -156 8 -74 -342 -51 8 21 200 -237 -8 -1 119
5709 119 -79 -101 141 262 -6 -8 101 276 -33 -112 187 61 -81 -220 -181 -15 54 45 113 111 37 -112 102 158
5733 158 -48 -249 -133 -56 -135 -126 -58 68 -8 -50 -118 94 65 -250 -26 56 219 206 -13 249 157 -35 27 178
5757 178 35 329 14 -351 94 185 -47 -33 13 -112 6 185 -212 33 83 31 8 41 -101 26 -277 148
5779 148 107 -96 105 -201 36 16 174 -59 31 -74 -181 17 263 -95 32 -171 -237 56 17 -115 -5 134
5801 134 -176 -98 116 -77 -219 188 -27 224 -74 -72 19 27 108 -20 54 -68 11 -2 -92 -7 -61 168 59 -40 413
5826 413 -64 -82 -132 -269 -96 -56 -127 38 -252 -285 -12 47 -105 -33 64 -116 -114 3 24 -134 -40 -164 -145 184
5850 184 154 86 9 -68 -147 -26 -96 -43 320 -119 18 148 -31 -53 -118 116 -369 147 -66 -85 183 -21 -117 22
$$ packed form
5685H7P4k46j7K80J10n37M8oK91k78J06K28k96J64q2k68K91N9J3J79m37K29PJ20
5709A19j98k2K42J21k68kJ09J75l09p9K99j26j42j39L9J66O9rO8kp4j49K14N6
5733A58k06k01J16P7p9RO8J26p6m2o8K12k9l15K24Q2J63j3k19K62r2j92O2J51
5757A78j43K94l15l65M45R1k32J4M6j25J18J79l97K45N0n2k3L3j42J27l03M25
5779A48m1k03K01l06K37k0J58k33R0j05j07J98K46l58J27k03o6K93l9j32J10J39
5801A34l10P8K14j93j42M07k15K51k98KR1QQ1j28P4j22P9j3r0Q5n4K29j09r9M53
5826D13m77j8n0j37J73M0p1J65k90l3K73N9j52P2R7j80KJ17K1j58R4j24J9L29
5850A84l0o8p7p7p9J21p0N3L63m39J37J30j79k2o5K34m85N16k13j9K68k04r6J39
$$ plain form
5874 22 215 -34 88 238 -169 67 -197 -213 -49 230 19 34 -173 -26 53 -213 181 21 5 287 -39 155
5896 155 -52 152 248 -2 182 -141 97 171 119 123 134 -8 -109 131 -56 -202 -207 78 -171 -102 -11 119 -45
5919 -45 -410 -97 -94 -213 -54 151 59 340 -50 42 -68 165 -44 33 5 -147 -56 257 -306 -161 -160 11 14 -116
5943 -116 -8 368 -344 -173 40 -136 -241 -208 -191 -101 113 -157 95 -111 130 -141 -165 39 -19 -91 105 34
5965 34 77 -85 261 -90 -300 52 124 25 -121 179 293 -60 -179 54 31 -111 -89 298 162 -308 -108 163
5987 163 -20 -27 -123 -28 156 65 -145 143 141 2 165 220 -57 143 -25 -133 32 11 182 166 147 44 -81 -168
$$ packed form
5874B2J93k49J22J50m07K36k64j6J64K79k11J5k07J47P9k66L94j60j6K82l26J94
5896A55k07K04R6k50J84l23K38P4n2MJ1j42j01K40j87j46nK85k49O9R1J30j64
5919d5l65L13Lj19J59K05r2K81l90R2j10K33k09P7k8j52R1L13n63J45JJ71Lj30
5943a16J08L76p12J71K13j76j05L3J7R0K14k70K52k06K41k71k4K04n8p2J96p1
5965C4M3j62L46l51k10L52P2r9j46L00J14l53j19K33k3j42K2L87j36m70K00K71
5987A63j83pr6R5J84r1k10K88kj39J63N5k77K00j68j08J65k1J71j6j9j03j25q7
$$ [...]
8191b59
##END NTUPLES=NMR FID
##END=
