##TITLE=1H_TG-2234-1
 CDCl3, 8 sc, 
 6.2.2019
##JCAMPDX= 6.0         $$ Bruker NMR JCAMP-DX V2.0
##DATA TYPE= NMR FID
##DATA CLASS= NTUPLES
##ORIGIN= UXNMR, Bruker Analytische Messtechnik GmbH
##OWNER= root
$$ XWIN-NMR		Version 3.5
$$ Wed Feb  6 14:10:05 2019 Russian Standard Time (UT+4h)  she@DPX200
##.OBSERVE FREQUENCY= 200.1313
##.OBSERVE NUCLEUS= ^1H
##.DELAY= (6, 6)
##.ACQUISITION MODE= SIMULTANEOUS
##.ACQUISITION SCHEME= undefined
##.AVERAGES= 8
##.DIGITISER RES= 18
##SPECTROMETER/DATA SYSTEM= spect
##.PULSE SEQUENCE= zg30
##.SOLVENT NAME= CDCl3
##.SHIFT REFERENCE= (INTERNAL, CDCl3, 0, 15.7039)
##AUDIT TRAIL= $$ (NUMBER, WHEN, WHO, WHERE, WHAT)
$$ ##TITLE= Audit trail, XWIN-NMR		Version 3.5
$$ ##JCAMPDX= 5.01
$$ ##ORIGIN= Bruker BioSpin GmbH
$$ ##OWNER= she
$$ F:/spectra/data/she/nmr/H-F/1/audita.txt
$$ ##AUDIT TRAIL=  $$ (NUMBER, WHEN, WHO, WHERE, WHAT)
(   1,<2019-02-06 14:09:07.98 +0400>,<she>,<DPX200>,
      <created by zg, POWCHK disabled, PULCHK disabled
       configuration hash MD5:
       00 E9 B6 7A A2 85 ED C7 34 08 36 98 17 FE 4E 26
       data hash MD5: 16K
       EF DE 9C 1D 31 CF 6C B9 B3 C6 3F 12 B4 11 99 DC>)
$$ ##END=
$$ 
$$ hash MD5
$$ DE 76 96 04 AF E5 FF 3D EB 03 B6 66 51 88 DA 36
##$RELAX= 
##$RELAX= 
##$RELAX= 
##$RELAX= 
##$RELAX= 
##$RELAX= 
$$ Bruker specific parameters
$$ --------------------------
##$DU= <F:/spectra>
##$EXPNO= 1
##$NAME= <H-F>
##$PROCNO= 1
##$TYPE= <nmr>
##$USER= <she>
##$AMP= (0..31)
100 100 100 100 100 100 100 100 100 100 100 100 100 100 100 100 100 100 
100 100 100 100 100 100 100 100 100 100 100 100 100 100 
##$AQSEQ= 0
##$AQ_mod= 1
##$AUNM= <au_zg>
##$AUTOPOS= <>
##$BF1= 200.13
##$BF2= 200.13
##$BF3= 200.13
##$BF4= 200.13
##$BF5= 200.13
##$BF6= 200.13
##$BF7= 200.13
##$BF8= 200.13
##$BYTORDA= 1
##$CFDGTYP= 0
##$CFRGTYP= 5
##$CHEMSTR= <none>
##$CNST= (0..31)
1 1 145 1 1 1 1 1 1 1 1 1 1 1 1 1 1 1 1 1 1 1 1 1 1 1 1 1 1 1 1 1 
##$CPDPRG= <>
##$CPDPRG1= <>
##$CPDPRG2= <>
##$CPDPRG3= <>
##$CPDPRG4= <mlev>
##$CPDPRG5= <mlev>
##$CPDPRG6= <mlev>
##$CPDPRG7= <mlev>
##$CPDPRG8= <mlev>
##$CPDPRGB= <>
##$CPDPRGT= <>
##$D= (0..31)
0 1.2 0 0 0 0 0 0 0 0 0 0.03 0 0 0 0 0 0 0 0 0 0 0 0 0 0 0 0 0 0 0 0 
##$DATE= 1549447747
##$DBL= (0..7)
120 120 120 120 120 120 120 120 
##$DBP= (0..7)
150 150 150 150 150 150 150 150 
##$DBP07= 0
##$DBPNAM0= <>
##$DBPNAM1= <>
##$DBPNAM2= <>
##$DBPNAM3= <>
##$DBPNAM4= <>
##$DBPNAM5= <>
##$DBPNAM6= <>
##$DBPNAM7= <>
##$DBPOAL= (0..7)
0.5 0.5 0.5 0.5 0.5 0.5 0.5 0.5 
##$DBPOFFS= (0..7)
0 0 0 0 0 0 0 0 
##$DE= 6
##$DECBNUC= <off>
##$DECIM= 32
##$DECNUC= <off>
##$DECSTAT= 4
##$DIGMOD= 1
##$DIGTYP= 9
##$DL= (0..7)
0 120 120 120 120 120 120 120 
##$DP= (0..7)
150 150 150 150 150 150 150 150 
##$DP07= 0
##$DPNAME0= <>
##$DPNAME1= <>
##$DPNAME2= <>
##$DPNAME3= <>
##$DPNAME4= <>
##$DPNAME5= <>
##$DPNAME6= <>
##$DPNAME7= <>
##$DPOAL= (0..7)
0.5 0.5 0.5 0.5 0.5 0.5 0.5 0.5 
##$DPOFFS= (0..7)
0 0 0 0 0 0 0 0 
##$DQDMODE= 0
##$DR= 18
##$DS= 0
##$DSLIST= <SSSSSSSSSSSSSSS>
##$DSPFIRM= 0
$$ [...]
##$SUBNAM2= <"">
##$SUBNAM3= <"">
##$SUBNAM4= <"">
##$SUBNAM5= <"">
##$SUBNAM6= <"">
##$SUBNAM7= <"">
##$SUBNAM8= <"">
##$SUBNAM9= <"">
##$SW= 20.0189088683792
##$SWIBOX= (0..15)
0 0 2 0 0 0 0 0 0 0 0 0 0 0 0 0 
##$SW_h= 4006.41025641026
##$TD= 16384
##$TD0= 1
##$TE= 0
##$TE2= 300
##$TE3= 300
##$TEG= 300
##$TL= (0..7)
0 120 120 120 120 120 120 120 
##$TP= (0..7)
150 150 150 150 150 150 150 150 
##$TP07= 0
##$TPNAME0= <>
##$TPNAME1= <>
##$TPNAME2= <>
##$TPNAME3= <>
##$TPNAME4= <>
##$TPNAME5= <>
##$TPNAME6= <>
##$TPNAME7= <>
##$TPOAL= (0..7)
0.5 0.5 0.5 0.5 0.5 0.5 0.5 0.5 
##$TPOFFS= (0..7)
0 0 0 0 0 0 0 0 
##$TUNHIN= 0
##$TUNHOUT= 0
##$TUNXOUT= 0
##$USERA1= <user>
##$USERA2= <user>
##$USERA3= <user>
##$USERA4= <user>
##$USERA5= <user>
##$V9= 5
##$VALIST= <valist>
##$VCLIST= <CCCCCCCCCCCCCCC>
##$VD= 0
##$VDLIST= <DDDDDDDDDDDDDDD>
##$VPLIST= <PPPPPPPPPPPPPPP>
##$VTLIST= <TTTTTTTTTTTTTTT>
##$WBST= 1024
##$WBSW= 4
##$XGAIN= (0..3)
0 0 0 0 
##$XL= 0
##$YL= 0
##$YMAX_a= 102073
##$YMIN_a= -138230
##$ZGOPTNS= <>
##$ZL1= 120
##$ZL2= 120
##$ZL3= 120
##$ZL4= 120
##$ABSF1= 10
##$ABSF2= 0
##$ABSG= 5
##$ABSL= 3
##$ALPHA= 0
##$AQORDER= 0
##$ASSFAC= 0
##$ASSFACI= 0
##$ASSFACX= 0
##$ASSWID= 0
##$AUNMP= <proc_1d>
##$AZFE= 0.1
##$AZFW= 0.1
##$BCFW= 1
##$BC_mod= 2
##$BYTORDP= 1
##$COROFFS= 0
##$CY= 11.3945322036743
##$DATMOD= 1
##$DC= 2
##$DFILT= <>
##$DTYPP= 0
##$F1P= 18.9103706918063
##$F2P= -1.10871071338519
##$FCOR= 0.5
##$FTSIZE= 0
##$FT_mod= 4
##$GAMMA= 1
##$GB= 0.15
##$INTBC= 1
##$INTSCL= 1
##$ISEN= 128
##$LB= 0.24
##$LEV0= 0
##$LPBIN= 0
##$MAXI= 10000
##$MC2= 0
##$MEAN= 0
##$ME_mod= 0
##$MI= 1.114404
##$NCOEF= 0
##$NC_proc= 0
##$NLEV= 6
##$NOISF1= 3.799351
##$NOISF2= 2.8
##$NSP= 1
##$NTH_PI= 0
##$NZP= 0
##$OFFSET= 15.70392
##$PC= 1
##$PHC0= -9037.513
##$PHC1= 9.400042
##$PH_mod= 1
##$PKNL= yes
##$PPARMOD= 0
##$PSCAL= 0
##$PSIGN= 0
##$REVERSE= no
##$SF= 200.130013532006
##$SI= 16384
##$SIGF1= 3
##$SIGF2= 2
##$SINO= 400
##$SIOLD= 16384
##$SREGLST= <1H.CDCl3>
##$SSB= 0
##$STSI= 0
##$STSR= 0
##$SW_p= 3612.71676300578
##$SYMM= 0
##$S_DEV= 0
##$TDeff= 0
##$TDoff= 0
##$TI= <>
##$TILT= no
##$TM1= 0
##$TM2= 0
##$TOPLEV= 0
##$USERP1= <user>
##$USERP2= <user>
##$USERP3= <user>
##$USERP4= <user>
##$USERP5= <user>
##$WDW= 1
##$XDIM= 8192
##$YMAX_p= 0
##$YMIN_p= 0
$$ End of Bruker specific parameters
$$ ---------------------------------
##NTUPLES= NMR FID
##VAR_NAME=  TIME,          FID/REAL,        FID/IMAG
##SYMBOL=    X,             R,               I
##VAR_TYPE=  INDEPENDENT,   DEPENDENT,       DEPENDENT
##VAR_FORM=  AFFN,          ASDF,            ASDF
##VAR_DIM=   8192,          8192,            8192
##UNITS=     SECONDS,       ARBITRARY UNITS, ARBITRARY UNITS
##FACTOR=    0.0002496,     1,               1
##FIRST=     0,             0,               0
##LAST=      2.0444736,     0,               0
##MIN=       0,             -138230,         0
##MAX=       2.0444736,     102073,          0
$$ Real data points
##PAGE= N=1
##DATA TABLE= (X++(R..R)), XYDATA
$$ plain form
0 0 0 0 0 0 0 0 0 0 0 0 0 0 0 8 -8 8 -8 8 -16 16 -16 24 -24 32 -37 40 -48 56 -64 77 -87 98 -112 127 -143
35 -143 162 -182 204 -229 255 -282 314 -349 387 -428 472 -521 575 -633 697 -768 847 -934 1031
54 1031 -1137 1260 -1398 1557 -1740 1960 -2221 2541 -2945 3472 -4192 5238 -6913 10025 -17847
69 -17847 85170 102073 -7291 46799 80323 78588 22945 2546 25088 41295 -15813 -32017
81 -32017 2512 6885 -10859 24456 41456 739 -62371 -84017 -35861 23812 -20369 -92182
93 -92182 -67972 -13805 -30015 -57304 -44156 -151 41433 36388 2139 5576 8215 -21446 -7721
106 -7721 43304 31246 -25532 -50337 -34273 513 7353 -27240 -15070 51941 57856 3780 -15047
119 -15047 2682 26811 45293 29638 4683 5885 -10964 -39826 -17111 17203 9115 1168 9218
$$ packed form
0@%%%%%%%%%%%%%Qj6J6j6J6k4L2l2M0m8N6o9P7q8J04j20J41j64J85k10K39k70
35a43L05l44L86m33M84n37N96o63P36q15R00r93J096j208J330j465J615j781J965
54A031k168K397k658K955l297L700m181M762n486O417p664R430j2151J6938k7872
69a7847J03017J6903j09364N4090L3524j735n5643k0399K2542J6207n7108j6204
81c2017L4529M373j7744L5315J7000m0717o3110k1646M8156N9673m4181p1813
93i2182K4210N4167j6210k7289J3148M4005M1584n045l4249L437K639k9661J3725
106g721N1025j2058n6778k4805J6064L4786O840l4593J2170O7011N915n4076j8827
119a5047J7729K4129J8482j5655k4955J202j6849k8862K2715L4314q088p947Q050
$$ plain form
132 9218 12226 15109 -828 -23388 11580 60275 33938 -15068 -19844 -11887 -6315 -3475 -9087 6782
146 6782 28485 -2061 -34291 -10019 6221 -10659 -8124 6764 3502 -15984 -51466 -59235 -12017
159 -12017 9021 -21383 -17943 14062 5658 -17237 -12199 15060 49791 47421 7231 4835 29756
172 29756 5257 -24360 139 27384 22978 2878 -21399 -19832 575 -8522 -14249 22399 30363
185 30363 -11919 -28542 -12791 -3002 1341 -2864 -1771 25703 26456 -16361 -21400 13762 25042
198 25042 24003 25294 8803 -5542 -11418 -25235 -17826 4670 -9545 -27852 -12601 -10678 -29338
211 -29338 -29247 -16018 8080 36918 22110 -15478 -10078 10117 8766 12943 17320 10827 13746 8370
225 8370 -14503 -10827 7872 3933 10150 26570 9202 -18222 -24209 -19638 1367 18390 -4732
$$ packed form
132I218L008K883j5937k2560L4968M8695k6337m9006m776P957N572K840n612J5869
146F782K1703l0546l2230K4272J6240j6880K535J4888l262j9486l5482p769M7218
159a2017K1038l0404L440L2005q404k2895N038K7259L4731k370m0190k396K4921
172B9756k4499k9617K4499K7245m406k0100k4277J567K0407r097n727L6648P964
185C0363m2282j6623J5751R789M343m205J093K7474P53m2817n039L5162J1280
198B5042j039J291j6491j4345n876j3817P409K2496j4215j8307J5251J923j8660
211b9338R1J3229K4098K8838j4808l7588N400K0195j351M177M377o493K919n376
225H370k2873L676J8699l939O217J6420j7368k7424n987M571K1005J7023k3122
$$ plain form
238 -4732 -24211 -5969 -2402 -19646 -14851 1073 14858 29157 17974 -4373 -1139 700 -6858
251 -6858 13698 28700 2343 -19179 -16120 -11888 -4291 -3970 -11779 8692 31472 5690 -19578
264 -19578 -5184 8202 13146 20679 12521 1285 -1995 -18119 -22078 4431 8948 -8529 -2312
277 -2312 5536 -9105 -18294 -18861 -11416 14007 18491 -9718 -17610 -9646 -14983 -8428 10580 11894
291 11894 13158 17169 5145 1716 12542 8480 12134 30761 22512 -3171 -11944 -17457 -16856 -1327
305 -1327 -913 -12111 -5060 -6159 -21703 -16133 -3176 650 13337 17759 1684 -2565 -839 -10491
319 -10491 -2505 18108 14298 4563 1579 -9174 -8160 4352 453 1569 17854 10048 -12776 -15055
333 -15055 -13715 -11335 2893 4919 -1921 3639 -3133 -17583 -3854 14553 12804 16845 20682 7127
$$ packed form
238d732j9479J8242L567j7244M795J5924J3785J4299j1183k2347L234J839p558
251f858K0556J5002k6357k1522L059M232P597L21p809K0471K2780k5782k5268
264a9578J4394J3386M944P533q158j1236l280j6124l959K6509M517j7477O217
277b312P848j4641r189n67P445K5423M484k8209p892P964n337O555J9008J314
291A1894J264M011j2024l429J0826m062L654J8627q249k5683q773n513O01J5529
305a327M14j1198P051j099j5544N570J2957L826J2687M422j6075m249J726r652
319a0491P986K0613l810r735k984j0753J014J2512l899J116J6285p806k2824k279
333a5055J340K380J4228K026o840N560o772j4450J3729J8407j749M041L837j3555
$$ plain form
347 7127 -675 -3748 -10501 887 13446 -1274 -11299 -7094 -17322 -24261 -9472 346 5733 11694
361 11694 -701 -10101 770 588 -4084 12136 20020 7390 1204 -4498 -10663 983 9051 4083
375 4083 10723 12286 -7738 -14262 -6409 -7446 -1314 7369 -2079 -9252 -7724 -16540 -14251 4605 9739
390 9739 9866 18286 9970 -2650 4153 8520 8645 19046 15540 -1028 -4308 -9458 -19499 -10308 339
405 339 -4446 -1709 -1715 -16830 -17003 -5047 -3517 3488 12907 3324 -3585 -1729 -9187 -6348 11896 12809
421 12809 6274 10191 3971 -5709 -448 2614 4659 15711 10259 -8442 -9610 -8304 -14601 -5657
435 -5657 4312 501 1419 204 -11352 -7390 5013 5063 10971 19401 6312 -5549 -3889 -7285 -5581
450 -5581 5440 3200 -2386 -516 -9401 -17372 -4099 4362 3064 11619 11750 67 -1575 -1429 -3451
$$ packed form
347G127p802l073o753J1388J2559j4720j0025M205j0228o939J4789R818N387N961
361A1694j2395r400J0871j82m672J6220P884j2630o186n702o165J1646Q068m968
375D083O640J563k0024o524P853j037O132Q683r448p173J528q816K289J8856N134
390I739J27Q420q316j2620O803M367J25J0401l506j6568l280n150j0041R191J0647
405C39m785K737oj5115j73J1956J530P005R419r583o909J856p458K839J8244R13
421A2809o535L917o220r680N261L062K045J1052n452j8701j168J306o297Q944
435e657R969l811R18j215j1556L962J2403N0N908Q430j3089j1861J660l396J704
450e581J1021k240n586J870q885p971J3273Q461j298Q555J31j1683j642J46k022
$$ plain form
465 -3451 9556 16484 4899 1500 1927 -8774 -8300 2187 1165 3395 7554 -5934 -15255 -11842
479 -11842 -14591 -11321 1502 -1840 -10108 -6981 -10302 -13981 -376 8827 10050 17417 14808 2886
493 2886 5317 9096 5268 13655 19075 6971 -89 -3431 -13137 -9492 1719 -221 -222 3258 -7423
508 -7423 -12792 -5221 -5118 -1708 10625 8488 -1551 -1391 -5276 -6628 5656 9755 5349 10392 6704
523 6704 -7066 -6507 -1034 -2362 2767 4012 -7712 -11234 -11241 -19671 -13683 140 -959 -1443 2600 -4594
539 -4594 -6814 3172 5759 9733 18645 12606 2532 4667 405 -4225 6604 11533 4795 4660 -374
554 -374 -9243 -4439 1117 -768 6531 9974 -2772 -7624 -4799 -7595 -2579 6442 2270 597 3041
569 3041 -6226 -10526 -953 1312 2228 8177 605 -10005 -7262 -7796 -9824 -280 3131 -2959 -497
$$ packed form
465c451J3007O928j1585l399M27j0701M74J0487j022K230M159j3488r321L413
479a1842k749L270J2823l342q268L127l321l679J3605R203J223P367k609j1922
493B886K431L779l828Q387N420j2104p060l342r706L645J1211j940jL480j0681
508g423n369P571J03L410J2333k137j0039J60l885j352J2284M099m406N043l688
523F704j3770N59N473j328N129J245j1724l522pq430N988J3823j099m84M043p194
539d594k220R986K587L974Q912o039j0074K135m262m630J0829M929o738j35n034
554c74q869M804N556j885P299L443j2746m852K825k796N016R021m172j673K444
569C041r267m300R573K265R16N949p572j0610K743n34k028R544L411o090K462
$$ plain form
584 -497 -2464 -9963 -2483 6690 6308 11386 13676 2635 -738 2010 -1067 3475 10128 3015 -3029
599 -3029 -2176 -9907 -12237 -2287 -527 -883 5080 391 -7996 -4630 -2851 -656 11020 12012 2188 3526
615 3526 4626 -1809 2443 8850 7393 10039 8206 -5381 -7686 -3503 -7665 -5646 458 -6394 -13129
630 -13129 -12337 -16855 -15142 -3628 -2443 -2292 4610 1666 -4430 2134 6362 7116 15768 16053 6898 5314
646 5314 3583 -1944 4919 10321 4026 3091 3305 -5872 -8146 -3633 -5015 -146 5696 -3031 -9407 -5897
662 -5897 -8498 -7433 2395 3660 1338 4944 -674 -6963 -55 3617 2261 7363 5872 -3038 -3902
677 -3902 -4633 -9426 -2299 5337 530 -645 125 -6107 -4028 3911 3440 6634 11767 4112 -1929 1545
693 1545 -1343 -1546 6077 4993 -991 -521 -5590 -10501 -3587 -609 -2067 3534 2277 -7247 -6777 -2689
$$ packed form
584d97j967p499P480R173l82N078K290j1041l373K748l077M542O653p113o044
599c029Q53p731k330R950J760l56N963m689q387L366J779K195J1676R92r824J338
615C526J100o435M252O407j457K646j833j3587k305M183m162K019O104o852o735
630a3129P92m518J713J1514J185J51O902k944o096O564M228P54Q652K85r155j584
646E314j731n527O863N402o295r35K14r177k274M513j382M869N842q727o376L510
662e897k601J065R828J265k322L606n618o289O908L672j356N102j491q910q64
677c902p31m793P127P636m807j175P70o232K079P939m71L194N133p655o041L474
693A545k888k03P623j084n984M70n069m911O914K978j458N601j257r524M70M088
$$ plain form
709 -2689 -3678 2527 7304 2544 3114 3994 -4141 -2408 6819 7051 6690 7936 -396 -5334 -2190 -5351
725 -5351 -5554 2394 122 -7053 -5330 -7935 -10929 -3053 1957 1763 6719 5790 -1921 514 4766 3392
741 3392 8829 12265 4404 1312 1758 -4531 -3342 2558 557 62 2421 -6575 -11586 -6302 -5229 -3675
757 -3675 2746 105 -5708 -2200 -3303 -5760 2518 7465 5608 8378 5888 -1848 430 4391 1836
772 1836 5422 7603 -847 -4786 -4626 -8715 -5825 1519 -1587 -2381 1156 -4332 -7286 -1188 859 3072
788 3072 9613 5842 -1217 930 -165 -1764 4757 6291 1318 2210 307 -7121 -4961 -529 -2019
803 -2019 1951 3635 -4586 -6291 -3191 -5423 -2583 5196 3462 1612 3425 -1844 -3025 4478 4487 3748
819 3748 8331 4147 -3330 -2579 -4091 -5372 1226 2451 -3842 -3304 -4231 -8843 -4609 1255 -30 3945
$$ packed form
709b689r89O205M777m760N70Q80q135J733R227K32l61J246q332m938L144l161
725e351k03P948k272p175J723k605k994P876N010j94M956r29p711K435M252j374
741C392N437L436p861l092M46o289J189N900k001m95K359q996n011N284J073J554
757c675O421k641n813L508j103k457Q278M947j857K770k490p736K278L961k555
772A836L586K181q450l939J60m089K890P344l106p94L537n488k954O098K047K213
788C072O541l771p059K147j095j599O521J534m973Q92j903p428K160M432j490
803b019L970J684q221j705L100k232K840P779j734j850J813n269j181P503Rp39
819C748M583m184p477P51j512j281O598J225o293N38r27m612M234N864j285L975
$$ plain form
835 3945 6550 -140 -1754 2114 670 3339 9002 4780 1467 2639 -2743 -5255 1134 1567 -359
850 -359 2297 -1955 -8142 -4983 -4070 -5295 1209 3080 -1954 -781 -1185 -4888 976 6580 4532 6172
866 6172 7076 628 -588 2285 -118 1869 6457 991 -4197 -3414 -7038 -7488 -1069 -840 -1973 1960
882 1960 -1354 -6330 -1785 1025 582 6311 6623 792 1828 1661 -2921 784 5397 2198 2384 1920
898 1920 -4967 -5888 -1016 -2643 -1701 2554 -1770 -4862 -2515 -4900 -4512 3321 4275 1532 4212 1986
914 1986 -1824 2280 4045 2496 6855 5973 -1686 -2441 -2058 -5475 -2076 1663 -2980 -2852 -1743 -6949
930 -6949 -6263 -798 -537 1746 5529 1106 -1935 2058 864 578 6555 5953 2532 3777 -102 -4409
946 -4409 124 1822 -1006 1600 484 -5842 -5129 -3813 -6254 -2032 2341 -1303 -1612 96 -3710 -1598
$$ packed form
835C945K605o690j614L868j444K669N663m222l313J172n382k512O389M33j926
850c59K656m252o187L159R13j225O504J871n034J173m04l703N864N604k048J640
866F172R04o448j216K873k403J987M588n466n188P83l624m50O419K29j133L933
882A960l314m976M545K810m43N729L12n831J036j67m582L705M613l199J86m64
898A920o887r21M872j627R42M255m324l092K347k385L88P833R54k743K680k226
914A986l810M104J765j549M359q82p659p55L83l417L399L739m643J28J109n206
930f949O86N465K61K283L783m423l041L993j194k86N977o02l421J245l879m307
946d409M533J698k828K606j116o326P13J316k441M222M373l644l09J708l806K112
$$ plain form
962 -1598 4419 3085 4080 7328 2626 -794 1614 380 61 4661 2116 -2868 -1064 -3412 -6971 -2593
978 -2593 -54 -1876 1187 363 -4802 -2656 553 -884 2614 6210 2023 1233 2268 -1723 -747 4307
994 4307 2424 1462 3156 -2087 -4986 -1304 -2412 -3108 1602 642 -3909 -2325 -3183 -4598 879 3326
1010 3326 709 3243 3694 -1667 186 3042 1542 4262 5551 -579 -2040 -447 -4305 -3428 943
1025 943 -1073 -1798 -32 -4218 -5838 -490 -138 -114 4453 3166 -434 1538 990 -689 4390 6057
1041 6057 2278 2952 1831 -3572 -1603 879 -1812 -269 1036 -3957 -5337 -3810 -6054 -3547 1484
1056 1484 -416 -2090 1059 -937 -1946 2626 3075 2947 6935 4252 -493 1470 1675 -909 2530 2846
1072 2846 -1167 -555 -1645 -6418 -3316 155 -1915 -455 1285 -2851 -2926 164 -1649 608 5394 2901
$$ packed form
962a598O017j334R95L248m702l420K408j234l19M600k545m984J804k348l559M378
978b593K539j822L063q24n165K146L209j437L498L596m187p90J035l991R76N054
994D307j883r62J694n243k899L682j108o96M710r60m551J584q58j415N477K447
1010C326k617K534M51n361J853K856j500K720J289o130j461J593l858Q77M371
1025I43k016p25J766m186j620N348L52K4M567j287l600J972n48j679N079J667
1041F057l779O74j121n403J969K482k691J543J305m993j380J527k244K507N031
1056A484j900j674L149j996j009M572M49j28L988k683m745J963K05k584L439L16
1072B846m013O12j090m773L102L471k070J460J740m136p5L090j813K257M786k493
$$ plain form
1088 2901 996 2640 -127 -1463 3132 2866 844 2895 150 -4065 -2151 -1952 -3863 243 625 -3395
1104 -3395 -2934 -2068 -4482 -1182 2185 668 2746 4135 -214 -662 2963 1569 2142 4958 1534 -643
1120 -643 461 -2412 -3799 781 644 -1705 -46 -1728 -4829 -1416 -555 -1465 2636 3469 -657 261
1136 261 1328 -1056 1664 4567 2057 1986 2642 -2053 -2576 691 -1271 -1067 1783 -1807 -4726 -2586
1152 -2586 -3792 -3770 1043 343 -1218 1803 784 -2203 1239 3384 2334 4843 4234 58 1335 2024
1168 2024 -1636 418 2988 1 -1325 -985 -4342 -3994 -743 -1743 -1382 1679 -1016 -2967 -417 -786
1184 -786 -360 3696 3298 1027 2856 1460 -1360 1709 2900 715 2358 1589 -2676 -2685 -1926 -3519 -1403
1201 -1403 1052 -2254 -2529 -915 -3386 -3041 1157 1388 1833 3744 965 -711 2672 1671 482 3881
$$ packed form
1088B901j905J644k767j336M595k66k022K051k745m215J914J99j911M106L82m020
1104c395M61Q66k414L300L367j517K078J389m349m48L625j394N73K816l424k177
1120f43J104k873j387M580j37k349J659j682l101L413Q61r10M101Q33m126R18
1136B61J067k384K720K903k510p1O56m695n23L267j962K04K850l590k919K140
1152b586j206K2M813p00j561L021j019k987L442K145j050K509o09m176J277O89
1168B024l660K054K570k987j326L40l357L48L251j000L61L061k695j951K550l69
1184g86M26M056l98k271J829j396k820L069J191k185J643p69m265rP59j593K116
1201a403K455l306k75J614k471L45M198K31M45J911k779j676L383j001j189L399
$$ plain form
1217 3881 3295 27 836 -1449 -3653 53 529 -1953 -320 -94 -3684 -2767 -980 -2075 1008 2833
1233 2833 -196 -309 1630 -683 -59 3780 2233 1810 3248 217 -1914 144 -836 -1629 1633 -190
1249 -190 -3651 -2043 -2528 -3862 -1042 859 -372 1274 957 -2153 375 2840 1121 2527 4309 1482
1265 1482 585 1127 -1619 -615 2630 503 -1538 -83 -2232 -3984 -1276 -1901 -2115 1327 -141 -2795
1281 -2795 -590 -46 -1649 1925 3035 1267 2449 2122 -652 367 2436 255 1571 2593 -1445
1296 -1445 -2442 -663 -2847 -2137 183 -1350 -1768 293 -2197 -3357 860 1215 482 2681 2107 -14
1312 -14 1659 940 -620 2627 3435 243 265 214 -2388 -1410 -42 -1850 -605 624 -2867 -3188 -744
1329 -744 -1428 -677 1881 615 -91 1730 -90 -674 2593 2301 1210 2880 1433 -1225 37 60 -1679
$$ packed form
1217C881n86l268Q09k285k204L706M76k482J633K26l590R17J787j095L083J825
1233B833l029j13J939k313O24L839j547m23J438l031k131K058r80p93L262j823
1249a90l461J608m85j334K820J901j231J646l17l110K528K465j719J406J782k827
1265A482q97N42k746J004L245k127k041J455k149j752K708o25k14L442j468k654
1281b795K205N44j603L574J110j768J182l27k774J019K069k181J316J022m038
1296a445r97J779k184P10K320j533m18K061k490j160M217L55p33K199n74k121
1312a4J673p19j560L247Q08l192K2n1k602R78J368j808J245J229l491l21K444
1329g44o84P51K558j266p06J821j820n84L267k92j091J670j447k658J262K3j739
$$ plain form
1346 -1679 414 358 -2233 -1631 -1413 -3895 -1777 630 -512 171 1136 -863 -355 2069 362 1070 4212
1363 4212 2223 184 1047 -334 -1004 1450 283 -1139 509 -1040 -3711 -2129 -1210 -2085 23 176
1379 176 -1675 -673 265 -1222 374 2657 1172 1810 2602 81 398 1947 659 639 2089 -155 -1928
1396 -1928 -647 -1842 -2865 -244 -772 -1377 -169 -1000 -2437 266 919 -401 2117 2330 310 787
1412 787 1364 71 1529 2798 355 -40 1299 -1317 -1953 -455 -1265 -1025 509 -1735 -2497 -608 -1269
1429 -1269 -1631 1049 917 -179 1347 642 -476 1495 2259 886 1903 1920 -784 -373 448 -1405 -626
1446 -626 780 -1502 -1494 -1103 -2863 -2102 579 -786 -674 985 166 -898 843 450 358 2931 2197 -36
1464 -36 1284 619 -880 545 720 -563 347 -153 -2606 -1532 -888 -1664 -770 549 -1136 -714 137 -935
$$ packed form
1346a679K093n6k591O02K18k482K118K407j142O83R65j999N08K424j707P08L142
1363D212j989k039Q63j381o70K454j167j422J648j549k671J582R19q75K108J53
1379A76j851J002R38j487J596K283j485O38P92k521L17J549j288k0J450k244j773
1396a928J281j195j023K621n28o05J208q31j437K703O53j320K518K13k020M77
1412G87N77j293J458J269k443l95J339k616o36J498q10K40J534k244p62J889o61
1429a269l62K680j32j096J526p05j118J971P64j373J017J7k704M11Q21j853P79
1446f26J406k282QL91j760P61K681j365J12J659q19j064J741l93r2K573p34k233
1464c6J320o65j499J425J75j283R10n00k453J074O44p76Q94J319j685M22Q51j072
$$ plain form
1482 -935 -199 2055 1098 878 2245 807 -262 1360 677 71 1603 630 -1298 -660 -1028 -2561 -540
1499 -540 -101 -1758 -489 -472 -1672 -662 563 -584 1149 2424 502 89 1568 614 487 2079 468
1516 468 335 1160 -589 -2038 -289 -508 -1070 6 -790 -2181 -756 -620 -1417 336 1251 5 718
1533 718 1350 -510 694 2049 574 1144 2192 71 -390 243 -1043 -912 599 -406 -1521 -523 -1751
1550 -1751 -1951 -242 -408 -603 1074 588 -784 485 1026 194 1720 1937 535 934 1100 -589 -194
1567 -194 811 -357 -317 -85 -1599 -1616 -226 -1627 -1326 145 -338 -666 84 -700 -683 1158 1190 623 1758
1586 1758 1395 -311 693 715 -200 946 874 -868 -345 -315 -1863 -856 -115 -1138 -644 191 -1378 -1153
1604 -1153 238 -334 369 1750 744 114 1369 517 -57 1465 994 266 738 60 -1373 -254 -159 -1318
$$ packed form
1482i35P36K254r57k20J367j438j069J622o83o06J532r73j928O38l68j533K021
1499e40M39j657J269J7j200J010J225j147J733J275j922m13J479r54j27J592j611
1516D68j33Q25j749j449J749k19n62J076p96j391J425J36p97J753R15j246P13
1533G18O32j860J204J355j475N70J048k121m61O33j286J31J511j005j115R98j228
1550a751k00J709j66j95J677m86j372J269N41q32J526K17j402L99J66j689L95
1567a94J005j168M0K32j514j7J390j401L01J471m83l28P50p84J7J841L2n67J135
1586A758l63j706J004K2r15J146p2j742N23L0j548J007P41j023M94Q35j569K25
1604a153J391n72P03J381j006o30J255q52n74J522m71p28M72o78j433J119R5j159
$$ plain form
1622 -1318 -231 -127 -1591 -953 -630 -1558 -423 903 83 239 1310 265 -10 1461 677 584 1763
1639 1763 509 -345 269 -380 -1060 240 -190 -1179 -107 -566 -1656 -772 -266 -580 548 416 -426 335
1657 335 823 -75 522 1583 545 883 1300 -329 -428 564 -109 -649 323 -645 -1537 -597 -1222 -1295 326
1676 326 134 -1008 275 135 -546 534 1195 311 1435 1675 -155 464 954 -288 267 871 -587 -868
1694 -868 21 -1268 -1442 -326 -1036 -863 258 -827 -984 62 36 -291 1228 918 331 898 663 -23
1712 -23 794 1195 -43 690 559 -543 -525 -8 -1388 -684 350 -916 -1219 -451 -999 -885 315 -41 1
1731 1 1013 587 -192 924 440 167 1175 603 -375 342 183 -1150 -431 -3 -694 -142 -316 -1512 -995
1750 -995 -239 -524 1 315 16 44 858 306 384 1290 724 390 1131 324 -292 654 -24 -565 195 -88 -1244
$$ packed form
1622a318J087J04j464O38L23r28J135J326q20J56J071j045k75J471p84r3J179
1639A763j254q54O14o49o80J300m30r89J072m59j090Q84N06l14J128j32q42P61
1657C35M88q98N97J061j038L38M17j629r9R92o73n40R72r68q92R40o25p3J621
1676C26j92j142J283j40o81J080O61q84J124K40j830O19M90j242N55O04j458k81
1694h68Q89j289j74J116p10J73J121j085j57J046k6l27J519l10n87N67k35o86
1712b3Q17M01j238P33j31j102J8N17j380P04J034j266l03P68n48J14J200l56M2
1731AJ012m26p79J116m84k73J008n72r78P17j59j333P19M28o91N52j74j196N17
1750i95P56k85N25L14k99K8Q14n52P8R06n66l34P41q07o16R46o78n41P60k83j156
$$ plain form
1771 -1244 -662 -524 -1017 -313 296 -620 -23 421 -474 206 713 135 769 1175 218 -44 951 -112 -241
1790 -241 402 -182 -685 142 -927 -1268 -270 -403 -960 72 -179 -522 17 343 -535 442 873 176 782
1809 782 959 58 631 922 -10 236 764 -345 -568 -253 -646 -684 37 -605 -1045 -49 -597 -764 83 193
1829 193 123 547 588 -67 828 788 316 726 794 32 201 197 -684 -431 68 -567 -575 -304 -920 -731 -192 -683 -494
1852 -494 363 -46 -191 587 106 249 903 683 165 834 580 -258 155 245 -372 -135 210 -791 -428 -100
1872 -100 -700 -457 -137 -609 -194 344 36 -202 524 84 255 930 407 513 612 189 -25 502 -44 -597
1892 -597 0 -73 -768 -268 -318 -783 -54 -42 -558 61 32 -22 314 993 246 317 844 300 246 608 140 140 395
1915 395 46 -243 22 -205 -857 -144 -331 -527 -227 -456 -764 -138 61 3 311 488 201 359 674 223
$$ packed form
1771a244N82J38m93P04O09r16N97M44q95O80N07n78O34M06r57k62R95j063j29
1790b41O43n84n03Q27j069l41R98j33n57J032k51l43N39L26q78R77M31o97O06
1809G82J77r01N73K91r32K46N28j109k23L15l93l8P21o42m40R96n48j67Q47J10
1829A93p0M24M1o55Q95m0m72M10O8p62J69mq81K53M99o35qK71o16J89N39m91J89
1852d94Q57m09j45P78m81J43O54k20n18O69k54q38M13R0o17K37L45j001L63L28
1872a00o00K43L20m72M15N38l08k38P26m40J71O75n23J06R9m23k14N27n46n53
1892e97N97p3o95N00n0m65P29J2n16O19k9n4L36O79p47P1N27n44n4L62m68%K55
1915C95l49k89K65k27o52P13j87j96L00k29l08O26J99n8L08J77k87J58L15m51
$$ plain form
1935 223 386 807 242 -67 267 -362 -331 182 -351 -596 188 -281 -799 -57 -296 -387 309 197 -177 413 327
1956 327 25 620 519 363 477 673 -129 -57 42 -443 -69 -16 -499 -656 -287 -585 -637 251 -73 -305 141
1977 141 -330 -383 272 301 147 566 522 86 326 475 -121 534 185 -551 -310 -21 -412 -19 -152 -486 -259
1998 -259 -2 -439 -289 333 -95 -252 492 213 64 451 334 141 423 399 -14 355 324 -289 187 37 -628
2019 -628 -454 -200 -498 -447 -142 -255 -166 247 -299 29 430 110 67 456 86 326 551 109 76 267 -40
2040 -40 -128 -308 -276 -404 -254 -42 -279 -157 -321 -569 90 85 -130 121 527 62 141 600 254 140 424 154
2062 154 156 104 -138 -375 94 -306 -314 -323 -332 -456 52 -229 -355 184 -30 -200 400 259 28 404 289 355 144
2085 144 601 93 87 278 -51 -69 174 -307 -159 229 -353 -549 250 -122 -380 -70 -29 -189 26 364 155
$$ packed form
1935B23J63M21n65l09L34o29L1N13n33k45P84m69n18P42k39r1O96j12l74N90q6
1956C27l02N95j01j56J14J96q02P2R9m85L74N3m83j57L69k98n2Q88l24k32M46
1977A41m71n3O55K9j54M19m4m36K40J49n96O55l49p36K41K89l91L93j33l34K27
1998b59K57m37J50O22m28j57P44k79j49L87j17j93K82k4m13L69l1o13M76j50o65
2019f28J74K54k98N1L05j13Q9M13n46L28M01l20m3L89l70K40K25m42l3J91l07
2040d0q8j80L2j28J50K12k37J22j64k48O59nk15K51M06m65P9M59l46j14K84k70
2062A54Kn2k42k37M69m00qrrj24N08k81j26N39k14j70O00j41k31L76j15O6k11
2085A44M57n08oJ91l29j8K43m81J48L88n82j96P99l72k58L10M1j60K15L38k09
$$ plain form
2106 155 347 314 258 -28 44 70 17 235 -192 -274 204 -399 -445 -99 -324 -177 -257 -73 -17 378 -119 -276 378
2129 378 23 105 393 213 -148 94 -150 -25 489 86 -243 -211 -179 -460 -220 -306 -153 -143 65 -355 -238 332
2151 332 -113 189 497 260 553 471 151 -88 241 182 1 205 -232 -229 -192 -244 -82 88 63 -238 -93 -239
2173 -239 -317 -264 7 -81 47 379 44 119 518 43 259 507 413 241 -116 -213 -300 -249 192 -62 -77 61 -445
2196 -445 -249 -52 -168 65 50 -321 44 185 -224 217 280 225 172 199 -61 -253 173 -125 1 370 -251 -259
2218 -259 -254 -226 -146 74 219 -31 51 6 -106 140 98 -91 425 152 15 -212 78 226 84 250 -258 162
2240 162 -8 -358 -131 -263 -16 -98 290 49 -158 140 -168 -115 208 159 8 57 146 -127 268 -14 53 78
2262 78 -54 -98 -49 -152 -399 -467 7 -204 -5 -38 -140 -179 281 170 178 294 180 357 198 233 -97 -28 90
$$ packed form
2106A55J92l3n6k86P2K6n3K18m27q2M78o03m6L46k25J47q0J84N6L95m97j57O54
2129C78l55Q2K88j80l61K42k44J25N14m03l29L2L2k81K40q6J53J0K08m20J17N70
2151C32m45L02L08k37K93q2l20k39L29n9j81K04m37LL7n2J62J70k5l01J45j46
2173b39p8N3K71q8J28L32l35P5L99m75K16K48r4j72l57r7q7N1M41k54j5J38n06
2196d45J96J97j16K33j5l71L65J41m09M41O3n5n3K7k60j92M26k98J26L69o21q
2218b59NK8Q0K20J45k50Q2m5j12K46m2j89N16k73j37k27K90J48j42J66n08M20
2240A62j70l50K27j32K47q2L88k41k07K98l08N3L23m9j51M9Q9k73L95k82O7K5
2262G8j32m4M9j03k47o8M74k11J99l3j02l9M60j11QJ16j14J77j59L5l30O9J18
$$ plain form
2285 90 -165 -77 -195 -464 -79 -226 -231 -81 -172 -381 -145 17 -21 79 269 -68 -11 163 104 -106 120 268 23
2308 23 521 166 -180 -167 -30 29 109 383 -354 -258 -235 -359 -44 132 49 -169 316 -185 299 -97 -76 175 160
2331 160 156 -38 -210 65 -89 0 173 126 67 -193 -366 -64 -54 -304 -142 112 -128 -203 -57 -143 213 250 -43
2354 -43 -218 -89 -157 -27 169 -28 135 178 11 102 104 -65 41 -89 309 -5 86 -226 -129 215 318 206 197
2377 197 338 -286 108 -266 46 115 243 46 67 -85 -359 -250 197 89 1 390 242 -121 159 -222 226
2398 226 370 142 31 -98 -47 -2 229 319 127 221 81 -360 -200 33 -223 103 -69 -259 -20 -207 -260 62
2420 62 7 45 136 320 -86 -162 68 52 65 261 217 -55 41 -62 -167 28 -33 11 193 113 -135 -337 -73 224
2444 224 -184 43 -10 -42 -125 -125 -184 30 -21 301 17 72 -19 -175 189 -36 242 -42 -193 -5 -207 -48 -270
$$ packed form
2285I0k55Q8j18k69L85j47nJ50r1k09K36J62l8J00J90l37N7J74n9k10K26J48k45
2308B3M98l55l46J3J37N9Q0K74p37R6K3j24L15J76q3k18M85n01M84l96K1K51j5
2331A60mj94j72K75j54Q9J73m7n9k60j73L02J0k50J62K54k40p5J46q6L56L7k93
2354d3j75J29o8J30J96j97J63M3j67R1Kj69J06j30L98l14R1l12R7L44J03j12r
2377A97J41o24L94l74L12O9J28j97K1j52k74J09M47j08q8L89j48l63K80l81M48
2398B26J44k28j11j29N1M5K31R0j92R4j40m41J60K33k56L26j72j90K39j87n3L22
2420F2n5L8R1J84m06p6K30j6J3J96m4k72R6j03j05J95o1M4J82q0k48k02K64K97
2444B24m08K27n3l2q3%n9K14n1L22k84N5r1j56L64k25K78k84j51J88k02J59k22
$$ plain form
2467 -270 132 187 -235 171 -215 -66 -14 72 208 259 -57 -58 -426 -37 -158 226 63 110 -107 -246 -172 -256 -150
2490 -150 224 -1 29 -215 -223 -43 -185 167 81 333 60 253 -66 -232 81 -31 49 -223 -135 -333 -275 76
2512 76 -148 161 -239 -84 42 6 -235 -204 -43 133 106 170 -155 -326 -50 -57 -91 -14 62 -33 -210 -67 3 111
2536 111 -115 76 5 -162 -57 -172 94 26 312 126 -306 -47 -46 -122 47 -97 52 46 -47 -183 65 -18 -41
2559 -41 -55 -77 60 -154 12 -220 78 338 132 328 106 214 -372 73 31 12 154 288 -281 -148 -28 -213
2581 -213 119 -35 95 31 -185 -173 -344 81 -105 311 415 324 -14 65 -243 -14 132 266 149 -206 -166 -189
2603 -189 -69 -154 -184 7 181 -112 -278 -360 -103 -269 92 -114 -22 255 -132 -243 29 -28 243 291 -41 -146
2625 -146 177 41 157 382 131 -84 -143 -205 -270 121 235 114 -105 155 -44 -64 -288 86 -45 153 484
$$ packed form
2467b70M02N5m22M06l86J49N2Q6J36N1l16jl68L89j21L84j63M7k17j39P4q4J06
2490a50L74k25L0k44qJ80j42L52q6K52k73J93l19j66L13j12Q0k72Q8j98N8L51
2512G6k24L09m00J55J26l6k41L1J61J76k7O4l25j71K76pl4P7P6r5j77J43P0J08
2536A11k26J91p1j67J05j15K66o8K86j86m32K59Jp6J69j44J49or3j36K48q3k3
2559d1j4k2J37k14J66k32K98K60k06J96k22J08n86M45m2j9J42J34n69J33J20j85
2581b13L32j54J30o4k16J2j71M25j86M16J04r1l38P9l08K29J46J34j17l55M0k3
2603a89J20q5l0J91J74k93j66q2K57j66L61k06R2K77l87j11K72n7K71M8l32j05
2625a46L23j36J16K25k51k15n9o2o5L91J14j21k19K60j99k0k24L74j31J98L31
$$ plain form
2646 484 -90 -152 -167 -64 33 160 132 -7 9 -305 -65 6 -281 166 57 -28 -72 160 -174 -101 234 295 266 175
2670 175 -241 -421 88 -221 -103 59 -143 -84 140 -283 -192 133 -85 26 -117 -297 -234 -30 8 17 77 318
2692 318 102 54 179 231 188 211 117 41 140 -126 32 72 71 178 -148 -403 -518 -49 -297 -54 224 117 299
2715 299 -123 -42 -361 63 139 205 38 247 -64 -191 -32 -23 -7 587 -18 -260 -75 -367 -244 131 9 -6
2737 -6 499 -182 -430 -83 -68 -33 -144 148 104 -96 113 -211 -40 334 -130 257 -27 -597 -158 40 23 -89
2759 -89 347 -169 98 191 -263 -72 259 383 70 229 -137 -311 -67 36 -65 174 189 -198 -76 -137 -308
2780 -308 -20 -83 -425 -83 44 -186 -201 199 -84 22 254 110 29 130 -105 67 221 -90 39 56 -323
2801 -323 -43 -188 -220 -301 -123 -126 -562 126 -21 -305 215 268 158 245 262 -229 73 554 221 369 274 236 -73
$$ packed form
2646D84n74o2j5J03R7J27k8j39J6l14K40P1k87M47j09q5m4K32l34P3L35O1k9r1
2670A75m16j80N09l09J18J62k02N9K24m23R1L25k18J11j43j80O3K04L8RO0K41
2692C18k16m8J25N2m3K3r4p6R9k66J58M0jJ07l26k55j15M69k48K43K78j07J82
2715B99m22Q1l19M24P6O6j67K09l11j27J59RJ6N94o05k42J85k92J23L75j22j5
2737fN05o81k48L47J5L5j11K92m4k00K09l24J71L74m64L87k84n70M39J98j7j12
2759h9M36n16K67R3m54J91L31J24l13J59l66j74K44J03j01K39J5l87J22o1j71
2780c08K88o3l42L42J27k30j5M00k83J06K32j44q1J01k35J72J54l11J29J7l79
2801c23K80j45l2q1J78lm36O88j47k84N20N3j10Q7J7m91L02M81l33J48r5l8l09
$$ plain form
2824 -73 -151 -23 -92 34 183 -135 -66 -436 -546 144 -135 -78 107 22 -129 -214 322 -116 269 123 7 308
2846 308 27 -107 -119 495 -47 -62 -159 4 -429 -14 32 -315 -168 190 161 59 -207 11 246 137 442 54
2868 54 142 -97 186 87 87 146 344 -203 -411 -145 -221 -138 81 -148 56 224 84 -236 161 -67 9 582 58
2891 58 -27 -34 28 -167 -47 100 -49 64 -302 69 -191 -35 -171 -52 157 -192 -201 -61 -113 -101 197 339 60
2914 60 220 66 -304 250 298 42 517 103 -67 -51 -447 -310 -267 4 -144 227 -112 -277 -59 334 19
2935 19 1 96 -31 59 -65 -114 26 471 320 121 296 -279 -67 254 -75 161 161 -282 -543 -511 -488 -108 66
2958 66 -114 -165 24 -56 -297 89 97 96 98 149 -21 -13 156 -178 243 11 -6 -153 -46 -79 -295 -29 -69 -272 -160
2983 -160 -68 -208 -55 155 129 184 203 -95 -26 2 -30 234 172 185 -58 -105 -257 -241 -308 -236 -73 168 -161 -435
$$ packed form
2824g3p8J28o9J26J49l18O9l70j10O90k79N7J85q5j51q5N36m38L85j46j16L01
2846C08k81j34j2O14n42j5r7J63m33M15M6l47J47L58k9j02k66K18K35j09L05l88
2868E4Q8k39K83r9%N9J98n47k08K66p6Q3K19k29K04J68j40l20L97k28P6N73n24
2891E8q5pO2j95J20J47j49J13l66L71k60J56j36J19K09l49rJ40n2J2K98J42k79
2914F0J60j54l70N54M8k56M75m14j70J6l96J37M3K71j48L71l39j65K18L93l15
2935A9j8R5j27R0j24m9J40M45j51j99J75n75K12L21l29K36%m43k61L2K3L80J74
2958F6j80n1J89q0k41L86QjKN1j70QJ69l34M21k32j7j47J07l3k16K66m0k03J12
2983a60R2j40J53K10k6N5J9k98O9K8l2K64o2J3k43m7j52J6o7P2J63K41l29k74
$$ plain form
3007 -435 -371 -244 -212 106 301 132 319 -67 32 43 -152 184 292 123 -120 75 28 -121 27 -9 -140 203
3029 203 -128 -328 -159 -369 5 -12 42 105 -155 259 117 -80 237 455 205 77 -41 -138 46 200 -55
3050 -55 -30 -36 -256 -181 -4 -353 -107 -134 -17 -264 233 -180 36 218 86 210 255 186 -22 72 -165 -86 59
3073 59 158 -45 -250 -466 -228 -168 141 -121 23 -1 -8 -52 74 -11 268 48 298 29 252 220 -77 282 42
3096 42 121 234 13 -124 -42 -169 -237 61 -110 -11 -227 110 1 274 -12 223 146 130 -3 -29 371 200 346
3119 346 251 -18 -110 200 -186 5 329 136 -120 -114 -378 -413 -52 -121 194 125 102 -11 496 160 146 437 118
3142 118 -72 153 186 -192 -31 261 -32 113 370 -352 -278 183 -76 25 -211 -175 256 145 -25 -244 50
3163 50 -10 2 362 116 86 57 -98 -111 24 -202 -71 -74 -39 -342 -108 62 -315 86 146 -116 -49 -70 -215 277
$$ packed form
3007d35O4J27L2L18J95j69J87l86R9J1j95L36J08j69k43J95m7j49J48l6j31L43
3029B03l31k00J69k10L74j7N4O3k60M14j42j97L17K18k50j28j18r7J84J54k55
3050e5K5ok20P5J77l49K46k7J17k47M97m13K16J82j32J24M5o9k08R4k37P9J45
3073E9R9k03k05k16K38O0L09k62J44k4pm4J26q5K79k20K50k69K23l2k97L59k40
3096D2P9J13k21j37Q2j27o8K98j71R9k16L37j09K73k86K35p7j6j33k6M00j71J46
3119C46r5k69r2L10l86J91L24j93k56Ok64l5L61o9L15o9k3j13N07l36j4K91l19
3142A18j90K25L3l78J61K92k93J45K57p22P4M61k59J01k36L6M31j11j70k19K94
3163E0o0J2L60k46l0k9j55j3J35k26J31lL5l03K34J70l77M01O0k62O7k1j45M92
$$ plain form
3187 277 99 -16 -111 139 -87 224 273 90 270 325 -178 -573 -139 94 -209 -212 -178 -340 88 27 -268 9
3209 9 35 281 55 71 160 12 119 -8 -29 278 -60 -122 85 -313 -446 87 -203 -163 -53 67 -513 115 -372
3232 -372 -238 177 98 14 145 78 -30 -34 415 206 145 139 -194 -1 18 1 -37 -41 -136 -182 -69 -313 -462 144 -15
3257 -15 32 -95 81 -102 157 240 150 235 218 26 -186 150 -179 -50 7 30 -15 56 -172 -454 21 -409 106
3280 106 146 -326 -184 -176 25 -121 468 299 222 64 -19 -76 135 328 246 385 106 3 14 -321 -63 -44 80
3303 80 -65 -83 51 -131 -71 183 -132 280 246 -45 187 61 -77 -18 259 78 103 204 -164 -295 100 -192
3325 -192 -134 -13 -87 -372 6 -11 -142 106 231 -92 196 64 -167 -288 88 -216 145 152 -142 -223 -304 -103
3347 -103 33 20 214 -129 -147 -115 -140 57 -37 -169 244 6 80 151 145 -42 444 214 80 73 198 26 -230 99
$$ packed form
3187B77j78j15r5K50k26L11M9j83J80N5n03l95M34K33l03lL4j62M28o1k95K77
3209IK6K46k26J6Q9j48J07j27k1L07l38o2K07l98j33N33k90M0J10J20n80O28m87
3232c72J34M15p9q4J31o7j08mM49k09o1ol33J93J9j7l8mr5m6J13k44j49O06j59
3257a5M7j27J76j83K59Q3r0Q5j7j92k12L36l29J29N7K3m5P1k28k82M75m30N15
3280A06M0m72J42QK01j46N89j69p7j58q3n7K11J93q2J39k79j03J1l35K58J9J24
3303H0j45j8J34j82O0K54l15M12l4k91K32j26j38N9K77j81K5J01l68j31L95k92
3325a92N8J21p4k85L78j7j31K48J25l23K88j32k31j21L76l04L61Pk94q1q1K01
3347a03J36j3J94l43j8L2k5J97r4j32M13k38P4P1oj87M86k30j34pJ25j72k56L29
$$ plain form
3371 99 53 -126 -29 -276 -129 -75 -109 -266 -143 -125 60 274 -200 58 208 55 260 6 -7 -193 64 238
3393 238 83 131 40 -139 -295 -265 -427 -408 67 92 -217 -114 -462 -401 198 -211 -105 546 122 -242 129 43
3415 43 90 85 79 -212 79 36 -273 -261 30 -103 29 -169 -269 -241 213 93 25 494 25 110 40 -217 54 172
3439 172 158 129 157 170 -124 -52 57 -241 399 -91 -148 -42 -306 -241 -93 124 33 -56 -7 -77 -249 329 -73 19
3463 19 306 -94 -88 452 -421 -181 133 -8 35 29 -241 -278 -32 -47 -255 358 -145 26 -89 -223 92 -1 143
3486 143 -177 246 256 -69 130 102 10 304 230 -110 58 -145 -322 -215 29 220 9 141 -193 -399 -113
3507 -113 -136 96 229 97 -46 -81 328 15 168 80 13 71 -32 14 -413 -50 6 -266 -127 84 -73 -112 -178
3530 -178 12 382 148 -163 -53 88 45 219 46 208 262 -132 -62 5 43 -4 239 65 -142 -171 -110 -339 -72
$$ packed form
3371I9m6j79R7k47J47N4l4j57J23J8J85K14m74K58J50j53K05k54j3j86K57J74
3393B38j55M8r1j79j56L0j62J9M75K5l09J03l48O1N99m09J06O51m24l64L71q6
3415D3M7nok91K91m3l09J2K91j33J32j98j00K8M54j20o8M69m69Q5p0k57K71J18
3439A72j4k9K8J3k94P2J09k98O40m90n7J06k64O5J48K17r1q9M9p0j72N78m02R2
3463A9K87m00ON40q73K40L14j41M3ok70l7K46j5k08O13n03J71j15j34L15r3J44
3486A43l20M23J0l25J99k8r2K94p4l40J68k03j77J07K44J91k11J32l34k06K86
3507a13k3K32J33j32j43l5M09l13J53q8o7N8j03M6m27L63N6k72J39K11j57l9o6
3530a78J90L70k34l11J10J41m3J74j73J62N4l94P0O7L8m7K43j74k07k9O1k29K67
$$ plain form
3553 -72 -76 -218 -1 -72 35 -7 -52 108 83 72 379 -79 -9 89 -102 193 -119 76 -120 53 -129 -333 -65
3576 -65 -166 -57 202 -79 -213 76 238 150 291 -68 319 525 98 -248 133 -61 111 464 -131 -244 -221
3597 -221 -229 -99 110 286 -323 -185 -47 -223 313 -21 18 338 149 201 260 63 -145 -2 161 258 85 121
3619 121 -148 -27 4 -38 -288 93 -5 -213 -81 -386 -42 320 164 -2 303 170 247 24 40 248 99 65
3641 65 96 -139 19 -30 21 27 -139 -82 -35 -195 -390 57 -170 -23 -5 -139 88 58 143 -67 436 377 -185 272
3665 272 -249 -100 147 44 -170 51 164 -264 -229 -440 -345 -109 -2 -97 -31 -275 -65 -292 -43 -159 333
3686 333 171 107 151 144 -90 -4 174 161 -326 0 68 -181 108 -128 -171 -11 71 -254 -60 -171 203 -22 161
3709 161 119 -8 -7 -8 266 371 29 -48 273 -282 -258 -138 -123 -213 135 -40 -192 -219 -193 12 -27 76 -160 201
$$ packed form
3553g2mj42K17p1J07m2m5J60k5j1L07m58P0R8j91K95l12J95j96J73j82k04K68
3576f5j01J09K59k81j34K89J62q8J41l59L87K06m27l46L81j94J72L53n95j13K3
3597b21qJ30K09J76o09J38J38j76N36l34L9L20j89N2N9j97k08J43J63R7j73L6
3619A21k69J21L1m2k50L81r8k08J32l05L44L62j56j66L05j33P7k23J6K08j49l4
3641F5L1k35J58m9N1Oj66N7M7j60j95M47k27J47J8j34K27l0Q5k10N03n9n62M57
3665B72n21J49K47j03k14K21J13m28L5k11R5K36J07r5O6k44K10k27K49j16M92
3686C33j62o4M4pk34Q6J78j3m87L26O8k49K89k36m3J60Q2l25J94j11L74k25J83
3709A61m2j27JjK74J05l42p7L21n55K4J20J5r0L48j75j52k7K6K05l9J03k36L61
$$ plain form
3733 201 312 83 145 42 -4 43 244 197 226 185 -31 -78 21 25 -175 -82 -171 -187 69 54 -173 -21 4 -10 85 20
3759 20 23 124 56 184 -73 -150 313 -25 115 73 -43 -145 -174 -87 -241 -76 -46 157 -291 -172 159 -156 -342
3782 -342 409 317 59 225 303 232 13 4 -15 17 208 -25 -96 14 95 -75 -101 -184 -226 -141 -142 -45 180 -323 -102
3807 -102 240 260 -16 -60 -99 -50 35 322 7 173 223 -388 217 59 -204 33 -29 -40 -77 -306 152 -59 186
3830 186 161 77 171 -72 83 1 121 -24 287 119 -185 112 -97 -28 123 -120 126 158 43 -108 -218 78
3852 78 -278 49 16 272 -180 -97 206 67 85 -44 261 183 224 38 70 23 42 254 -64 -154 -381 -233 121
3875 121 -215 -232 -314 185 -3 -13 239 25 90 125 -145 33 66 -104 -88 279 16 76 -97 -17 -50 -242 -97
3898 -97 -268 -192 339 -11 -182 -19 220 -66 159 -9 126 -109 -41 -142 -156 90 50 71 149 22 -54 37 -159
$$ packed form
3733B01J11k29O2j03m6M7K01m7K9m1k16m7R9Mk00R3q9j6K56j5k27J52K5j4R5o5
3759B0LJ01o8J28k57p7M63l38J40m2j16j02k9Q7j54J65L0K03m48J19L31l15j86
3782c42P51r2k58J66P8p1k19rj9L2J91k33p1J10Q1j70k6q3m2Q5jR7K25n03K21
3807a02L42K0k76m4l9M9Q5K87l15J66N0o11O05j58k63K37o2j1l7k29M58k11K45
3830A86k5q4R4k43J55q2J20j45L11j68l04K97k09O9J51k43K46L2j15j51j10K96
3852G8l56L27l3K56m52Q3L03j39J8j29L05p8M1j86L2m7J9K12l18r0k27J48L54
3875A21l36j7q2M99j88j0K52k14O5L5k70J78L3j70J6L67k63O0j73Q0l3j92J45
3898i7j71P6N31l50j71J63K39k86K25j68J35k35O8j01j4K46m0K1P8j27p6R1j96
$$ plain form
3921 -159 -241 -112 44 -196 -333 -4 -325 -47 65 216 143 -44 -321 -52 104 -133 251 -41 195 280 194
3942 194 -358 -84 203 -65 -292 45 29 -58 -234 -124 -52 223 -230 -103 -54 -304 172 197 27 86 150 6
3964 6 -86 -136 -10 94 202 -15 -50 -212 -178 -233 88 -104 36 164 251 -336 97 -14 -114 -32 270 79 -62
3987 -62 186 50 -7 121 -50 107 11 -221 65 -17 -63 54 -151 -336 -236 51 -79 -262 45 -38 5 102 119
4010 119 275 -27 261 29 -4 -205 16 269 -104 -5 39 68 169 274 -23 -91 11 151 -98 -146 150 -66
4032 -66 -97 108 -280 -67 154 150 -102 -97 -140 97 -53 -137 27 -53 -82 -45 -67 -41 61 -172 -93 171 -232 110 -60
4057 -60 79 199 -5 -68 16 7 -50 -2 -19 -202 224 152 -58 -192 84 102 -7 -176 22 -144 41 290 -16
4080 -16 107 1 9 116 63 -255 29 -4 -25 25 182 198 52 -224 74 -3 -259 60 95 -57 -367 -111 -60 -276
$$ packed form
3921a59q2J29J56k40j37L29l21K78J12J51p3j87k77K69J56k37L84k92K36Q5q6
3942A94n52K74K87k68k27L37j6q7j76J10P2K75m53J27M9k50M76K5j70N9O4j44
3964Fr2n0J26J04J08k17l5j62L4n5L21j92J40J28Q7n87M33j11j00Q2L02j91j41
3987f2K48j36n7J28j71J57r6k32K86q2m6J17k05j85J00K87j30j83L07q3M3R7J7
4010A19J56l02K88k32l3k01K21K53l73R9M4K9J01J05k97o8J02J40k49m8K96k16
4032f6l1K05l88K13K21mk52Nm3K37j50q4J64q0k9L7k2K6J02k33P9K64m03L42j70
4057f0J39J20k04o3Q4rn7M8j7j83M26p2k10j34K76J8j09j69J98j66J85K49l06
4080a6J23j06QJ07n3l18K84l3k1N0J57J6j46k76K98p7k56L19L5j52l10K56N1k16
$$ plain form
4104 -276 77 35 -177 -71 56 -122 -125 57 192 237 54 -27 4 57 -162 -267 -280 -87 -74 266 -181 254 -99
4127 -99 -35 25 -10 73 136 111 -89 -147 22 39 -20 124 115 29 71 76 17 -377 170 -181 -85 -128 -181 -184 -322 -38 -103 -143
4155 -143 -40 -198 94 86 -157 207 45 -323 145 -128 19 206 128 -6 -120 -130 -117 -122 177 111 -147 67 97
4178 97 63 -182 -71 -60 191 200 332 -23 61 99 44 140 136 311 86 107 55 27 -202 -53 -7 -164 -28 -121 -192 139
4204 139 -78 134 -74 279 -51 -140 81 36 84 282 211 3 -121 75 -74 174 -19 -63 156 -328 -147 -69
4226 -69 -37 140 67 -250 39 -261 -175 137 73 120 151 -163 -139 98 -57 -57 -46 183 213 -11 180 -131 -116 -254
4250 -254 -133 -71 -146 8 -251 -5 205 95 -103 -111 49 -82 -35 4 12 67 -87 -59 -56 -152 94 264 4 15 -68
4275 -68 42 -181 -271 -18 -155 -216 -109 218 -232 520 -134 -13 200 90 -29 127 -187 205 172 -144 -195 -130
$$ packed form
4104b76L53m2k12J06J27j78lJ82J35M5j83q1L1N3k19j05j3J93J3L40m47M35l53
4127i9O4O0l5Q3O3k5k00n8J69J7n9J44rq6M2Nn9l94N47l51R6m3n3lj38K84o5m0
4155a43J03j58K92qk43L64j62l68M68k73J47J87p8j34j14j0J3nK99o6k58K14L0
4178I7l4k45J11J1K51RJ32l55Q4L8n5R6mJ75k25K1n2k8k29J49M6j57J36r3p1L31
4204A39k17K12k08L53l30q9K21m5M8J98p1k08j24J96j49K48j93m4K19m84J81P8
4226f9L2J77p3l17K89l00Q6L12o4M7L1l14K4K37j55%J1K29L0k24J91l11J5j38
4250b54J21O2p5J54k59K46K10j10j98qJ60j31M7L9QN5j54K8Lr6K46J70k60J1q3
4275f8J10k23r0K53j37o1J07L27m50P52o54J21K13j10j19J56l14L92l3l16n1O5
$$ plain form
4297 -130 -166 -140 -124 -89 -140 -12 179 21 41 243 -14 -345 -234 -38 -211 -38 5 -139 -159 355 162 4 -108
4320 -108 -203 -117 -100 17 101 78 29 -41 2 -249 -243 192 31 131 91 -49 -232 -21 -194 50 -326 44 50 126 24
4345 24 -307 -47 51 191 -175 -13 93 -246 -9 19 -90 160 -81 -93 -144 -131 -131 118 137 -241 -246 78 -30 81
4369 81 -65 117 -399 116 196 -287 167 85 -20 204 -205 144 83 202 110 85 119 97 79 -51 140 50 215
4392 215 9 -1 -335 -104 182 -268 -73 211 55 -206 113 -14 -88 209 251 61 417 180 274 -53 40 217
4414 217 124 -27 80 126 220 92 80 -106 -12 188 -19 67 44 -78 6 -81 -134 93 28 -109 62 181 140 215
4438 215 71 91 -108 -146 16 91 -176 -46 149 -107 -87 -133 -40 176 -34 -230 -146 -108 -196 233 21 101 -11
4461 -11 124 26 136 50 152 -100 94 35 26 -105 51 -44 -21 -66 -167 -332 -119 -231 5 -132 -106 201 -84
$$ packed form
4297a30l6K6J6L5n1J28J91j58K0K02k57l31J11J96j73J73M3j44k0N14j93j58j12
4320a08r5Q6J7J17Q4k3m9p0M3k51OM35j61J00m0j40j83K11j73K44l76L70OP6j02
4345B4l31K60R8J40l66J62J06l39K37K8j09K50k41j2n1J3%K49J9l78nL24j08J11
4369H1j46J82n16N15Q0m83M54q2j05K24m09L49o1J19r2k5L4k2j8j30J91r0J65
4392B15k06j0l34K31K86m50J95K84j56k61L19j27p4K97M2j90L56k37R4l27R3J77
4414B17r3j51J07M6R4j28j2j86R4K00k07Q6k3j22Q4q7n3K27o5j37J71J19m1P5
4438B15j44K0j99l8J62P5k67J30J95k56K0m6R3K16k10j96Q4L8q8M29k12Q0j12
4461a1J35r8J10q6J02k52J94n9rj31J56r5K3m5j01j65K13j12K36j37K6L07k85
$$ plain form
4484 -84 -23 270 17 -95 125 166 -289 -229 -45 1 47 14 138 -26 -253 216 -87 89 6 -106 -16 32 121 -25
4508 -25 -42 177 -26 -180 31 281 86 -166 -66 -51 -152 216 104 147 84 -172 70 -37 38 -21 43 182 -57
4531 -57 -229 -5 97 53 58 131 88 4 33 -215 57 -24 -43 116 -38 -9 95 -153 -282 -27 329 72 -147 -85
4555 -85 150 -369 126 72 -4 116 -228 26 192 -299 134 6 65 -41 181 128 -140 138 92 -45 23 189
4577 189 40 26 82 176 -101 49 -48 -8 -103 71 83 126 169 -64 -28 221 24 107 46 55 -93 -138 58 -93 185
4602 185 -68 9 -1 5 104 126 86 139 33 13 -84 196 174 -397 194 117 -190 106 -51 23 44 -371 -89 120 -46
4627 -46 109 -35 152 79 -110 -147 -20 42 187 -255 81 162 82 -56 112 115 -320 -77 -72 -96 -69 -145 148 -106
4651 -106 -92 -114 229 20 -189 60 259 19 104 174 18 -7 65 169 295 68 59 2 -16 -163 -268 -124 -72 -274
$$ packed form
4484h4O1K93k53j12K20M1m55O0J84M6M6l3J24j64k27M69l03J76q3j12R0M8Q9j46
4508b5j7K19k03j54K11K50j95k52J00J5j01L68j12M3o3k56K42j07P5n9O4J39k39
4531e7j72K24J02m4NP3m3q4K9k48K72q1j9J59j54K9J04k48j29K55L56k57k19O2
4555h5K35n19M95n4p6J20l44K54J66m91M33j28N9j06K22n3k68K78m6j37O8J66
4577A89j49j4N6R4k77J50r7M0r5J74J2M3M3k33L6K49j97Q3o1Rj48m5J96j51K78
4602A85k53P7j0OR9K2m0N3j06k0r7K80k2n71N91p7l07K96j57P4K1m15K82K09j66
4627d6J55j44J87p3j89l7J27O2J45m42L36Q1q0j38J68Lm35K43Nk4K7p6K93k54
4651a06J4k2L43k09k09K49J99k40Q5P0j56k5P2J04J26k27rn7j8j47j05J44N2k02
$$ plain form
4675 -274 -75 73 -43 225 -233 27 -49 34 -122 13 31 120 58 -8 -30 -112 -84 -240 -124 -158 -101 246 127 76
4699 76 -35 99 -210 -126 -110 -35 37 -217 -18 -6 -105 79 -58 -239 71 198 263 108 -162 2 -235 -136 -92
4722 -92 -246 -113 90 -191 42 -324 6 -186 -100 35 164 -56 -35 92 405 -125 -10 102 71 -32 81
4743 81 233 -129 217 -44 114 -23 10 -183 -142 68 -20 -334 130 -19 154 91 31 13 132 -135 -197 65 -272
4766 -272 -48 262 -35 -11 121 44 -165 56 -273 -210 2 78 -21 -171 151 -155 200 -196 22 -48 182 26
4788 26 26 132 -43 82 126 118 -69 41 81 -10 -224 -332 -93 2 -89 -8 -23 -128 -121 48 -84 -80 -13 27 -152 -229
4814 -229 78 152 -159 263 -9 -55 85 -191 17 -112 -3 136 -271 -165 -101 122 156 -100 64 -269 -52
4835 -52 77 -5 367 -174 235 -110 -26 57 -86 -35 -292 86 -116 -97 -214 -198 82 -78 -84 69 3 -72 19 165
$$ packed form
4675b74J99J48j16K68m58K60p6Q3j56J35J8Q9o2o6k2q2K8j56J16l4N7L47j19n1
4699G6j11J34l09Q4J6P5P2k54J99J2r9J84j37j81L10J27O5j55k70J64k37R9M4
4722i2j54J33K03k81K33l66L30j92Q6J35J29k20K1J27L13n30J15J12l1j03J13
4743H1J52l62L46k61J58j37L3j93M1K10q8l14M64j49J73o3o0j8J19k67o2K62l37
4766b72K24L10k97K4J32p7k09K21l29O3K12P6r9j50L22l06L55l96K18p0K30j56
4788B6%J06j75J25M4qj87J10M0r1k14j08K39R5r1Q1j5j05PJ69j32MO7M0j79p7
4814b29L07P4l11M22k72m6J40k76K08j29J09J39m07J06O4K23L4k56J64l33K17
4835e2J29q2L72n41M09l45Q4Q3j43N1k57L78k02J9j17J6K80j60oJ53o6p5R1J46
$$ plain form
4859 165 42 317 145 -64 168 19 -106 -90 22 -35 -100 -243 -79 -63 62 -13 53 220 -68 -82 -162 -20 171
4882 171 167 -96 100 271 237 -158 137 -30 8 95 346 -4 -149 -156 -192 -21 -104 -145 56 153 -63 -107 -206 98
4906 98 66 139 -75 32 63 -26 -87 96 172 136 -20 34 62 88 -69 145 -357 -6 83 -39 -251 -184 -128 126 52
4931 52 -34 -43 17 84 174 -29 -68 -98 103 -192 2 -61 -118 323 22 130 -234 -236 102 -107 -140 -169 255 20 24 221
4957 221 20 170 -112 94 -65 -140 -283 -88 248 114 3 -49 -102 -67 -195 155 23 -205 7 -80 105 63
4979 63 51 201 -63 71 91 99 380 59 234 109 -239 93 280 -147 -98 9 -57 82 75 -89 -135 -241 -379
5002 -379 -69 175 234 -50 111 145 44 -39 -181 -121 307 82 90 -276 25 -39 -50 4 -41 -78 -280 -179 -263 117
5026 117 -123 20 -21 -182 -52 164 -256 -69 -4 211 108 -22 266 189 125 3 99 -18 -99 -8 91 -1 -315
$$ packed form
4859A65j23K75j72k09K32j49j25J6J12n7o5j43J64J6J25p5O6J67k88j4q0J42J91
4882A71mk63J96J71l4l95K95j67L8Q7K51l50j45pl6J71q3m1K01R7k16m4r9L04
4906I8l2P3k14J07L1q9o1J83P6l6j56N4K8K6j57K14n02L51Q9j22k12O7N6K54p4
4931E2q6rO0O7R0k03l9l0K01k95J94o3n7M41l01J08l64kL38k09l3k9M24k35MJ97
4957B21k01J50k82K06j59p5j43J95L36j34j11n2n3L5j28L50j32k28K12q7J85m2
4979F3j2J50k64J34K0QK81l21J75j25l48L32J87m27M9J07o6J39pj64m6j06j38
5002c79L10K44N9k84J61L4j01q3j42O0M28k25Ql66L01o4j1N4m5l7k02J01q4L80
5026A17k40J43m1j61J30K16m20J87O5K15j03j30K88p7o4j22R6j17q1R1R9r2l14
$$ plain form
5049 -315 54 -247 -199 108 -173 -2 -313 -249 81 205 208 62 -332 257 -103 -93 224 -155 35 -8 -13 -37 -97
5072 -97 -73 -318 -159 -46 -202 257 54 30 -19 38 145 -96 33 -98 87 -7 27 -199 8 35 -99 -51 -60 11
5096 11 -16 -62 -232 4 9 -115 -62 205 -121 104 -25 -96 193 134 -73 11 123 51 -232 -16 86 -30 162
5119 162 -181 104 -4 392 -14 -126 -204 6 71 -61 -247 5 5 -10 118 -123 -99 -70 59 -22 39 21 -72 39
5143 39 -104 129 -266 40 -211 -65 65 -222 -161 80 -4 99 -39 -71 41 -40 -131 12 -35 11 -134 239 183
5166 183 79 48 -24 68 87 72 77 -54 -20 -100 -22 252 -219 -60 -82 126 -48 23 59 107 -135 -26 -136 -60 119
5191 119 -7 -213 -135 -50 153 -258 75 29 86 -152 -209 -77 -64 -71 160 -160 133 370 -311 137 30 202 -48
5214 -48 -12 -83 -194 23 116 35 -90 -202 -149 -15 -3 -315 -127 -333 -132 267 -125 -1 -126 3 91 242 261
$$ packed form
5049c15L69l01M8L07k81J71l11O4L30J24Lj46l94N89l60J0L17l79J90m3nk4o0
5072i7K4k45J59J13j56M59k03k4m9N7J07k41J29j31J85r4L4k26K07K7j34M8rP1
5096A1k7m6j70K36Nj24N3K67l26K25j29p1K89n9k07Q4J12p2k83K16J02j16J92
5119A62l43K85j08L96m06j12p8K10O5j32j86K52%j5J28k41K4K9J29q1O1j8r3J11
5143C9j43K33l95L06k51J46J30k87O1K41q4J03j38l2J12q1r1J43m7M6j45L73n6
5166A83j04l1p2R2J9j5Nj31L4q0P8K74m71J59k2K08j74P1L6M8k42J09j10P6J79
5191A19j26k06P8Q5K03m11L33m6N7k38n7J32J3pK31l20K93K37o81M48j07J72k50
5214d8L6p1j11K17R3q1j25j12N3J34J2l12J88k06K01L99l92J24j25J29Q8J51J9
$$ plain form
5237 261 -141 -35 214 230 -84 -159 30 109 206 -133 -172 -141 -205 249 -245 31 -53 143 13 99 282 194 18
5260 18 7 158 92 111 -20 65 32 18 -169 -96 -51 -112 -274 -53 -78 -34 -253 -104 -157 -210 -331 -180 56 230 -47
5285 -47 117 306 -61 247 114 -221 158 20 -120 -24 154 -25 -39 -58 -389 143 56 85 -86 177 -75 -360
5307 -360 165 -98 -50 153 -194 276 244 111 -4 261 207 -4 185 142 -281 96 48 -6 211 202 -149 50 59
5330 59 -207 -53 -210 -16 178 127 -56 -85 -119 60 -79 -29 106 -112 50 102 34 189 -30 78 -96 -331
5352 -331 -21 -199 71 12 -34 239 136 -13 120 -46 25 195 -10 -85 -30 44 102 197 148 -142 -64 -126 -168 -44
5376 -44 -171 69 144 -26 -124 257 85 -29 -74 -8 -117 -62 61 -154 140 -35 -69 -46 84 56 201 81 -107
5399 -107 -73 -45 -7 41 135 165 16 -12 141 96 480 83 113 -15 -35 127 -214 -48 92 95 -85 -163 -32 -173
$$ packed form
5237B61m02J06K49J6l14p5J89P9R7l39l9L1o4M54m94K76q4J96j30Q6J83q8j76
5260A8j1J51o6J9j31Q5l3j4j87P3M5o1j62K21k5M4k19J49n3n3j21J51K36J74k77
5285d7J64J89l67L08j33l35L79j38j40R6J78j79j4j9l31N32q7K9j71K63k52k85
5307c60N25k63M8K03l47M70l2j33j15K65n4k11J89m3m23L77m8n4K17rl51J99R
5330E9k66J54j57J94J94n1j83k9l4J79j39N0J35k18J62N2o8J55k19J08j74k35
5352c31L10j78K70n9m6K73j03j49J33j66P1J70k05p5N5P4N8R5m9k90P8o2m2J24
5376d4j27K40P5j70r8L81j72j14m5O6j09N5J23k15K94j75l4K3J30k8J45j20j88
5399a07L4K8L8M8R4L0j49k8J53m5L84l97L0j28k0J62l41J66J40Lj80p8J31j41
$$ plain form
5423 -173 -102 -96 -65 125 39 14 -63 161 115 215 -173 60 189 -197 121 -110 -126 375 -35 121 12 72 -210
5446 -210 -79 -23 -8 -30 17 91 113 -13 -74 13 148 -18 -185 -275 18 29 130 -197 183 -54 8 135 -41 97
5470 97 -187 -146 15 -322 103 -5 -95 189 85 -268 -39 20 295 -90 53 -133 -53 111 -3 6 -133 72
5492 72 -28 -6 -11 80 -56 13 160 -196 -20 120 44 95 -364 -11 -7 -45 14 212 327 -357 0 -206 10 173
5516 173 -19 14 -76 86 -241 -20 87 -376 -12 11 247 59 14 1 -61 159 137 -49 -34 143 31 179 -43
5539 -43 130 49 51 99 -117 -83 23 243 -18 -188 -33 191 -72 79 118 145 -105 77 130 100 -103 -359 224
5562 224 -35 29 -189 -41 -124 -141 -40 -239 -240 127 51 -66 -83 -6 -99 -146 -30 27 -23 -241 -67 -25 -92 17 90
5587 90 99 68 227 87 -21 -230 -331 103 -234 109 183 -459 -136 -75 -197 145 51 69 85 127 -63 106 4
$$ packed form
5423a73P1OL1J90q6k5p7K24m6J00l88K33J29l86L18k31j6N01m10J56j09O0k82
5446b10J31N6J5k2M7P4K2j26o1Q7J35j66j67r0K93J1J01l27L80k37O2J27j76J38
5470I7k84M1J61l37M25j08r0K84j04l53K29N9K75l85J43j86Q0J64j14Rj39K05
5492G2j00K2nR1j36O9J47l56J76J40p6N1m59L53Ml8N9J98J15o84L57k06K16J63
5516A73j92L3r0J62l27K21J07m63L64K3K36j88m5j3o2K20k2j86J5J77j12J48k22
5539d3J73q1KM8k16L4J06K20k61j70J55K24k63J51L9K7k50J82N3l0k03k56N83
5562B24k59O4k18J48q3j7J01j99jL67p6j17j7P7r3m7J16N7n0k18J74M2o7J09P3
5587I0Rl1J59j40j08k09j01M34l37L43P4o42L23O1j22L42r4J8J6M2j90J69j02
$$ plain form
5610 4 162 110 -107 45 -155 42 56 -2 263 -165 1 -15 33 -171 -162 -227 -181 14 109 25 60 -48 274 51 162
5635 162 92 -137 -264 -18 207 66 -68 118 -33 19 -67 -56 63 -24 39 115 -113 -336 77 192 142 6 -45
5658 -45 329 -9 7 423 54 53 17 72 -215 -24 -153 -35 23 56 -31 -76 -200 -385 205 -137 39 89 30 -167
5682 -167 108 26 141 53 -63 -90 -30 62 -186 -149 -23 -46 -201 171 -304 112 42 3 -17 -30 163 -63 203 53
5706 53 78 115 169 76 -185 -29 -46 -151 -59 -130 -11 60 -67 155 -157 -243 -81 62 -36 103 -9 87 -21 -187
5730 -187 55 26 -105 236 -141 250 -91 -16 25 120 -62 96 62 -225 191 27 62 98 110 154 -40 -13 -32 6
5754 6 30 -121 -226 89 113 -125 133 178 -84 78 2 -53 -50 79 -156 -105 18 -196 -5 -215 -214 -286 -1 129
5778 129 15 41 176 -81 258 -145 315 139 333 93 -16 35 -18 167 -173 -202 176 89 -53 85 -100 -236
$$ packed form
5610DJ58n2k17J52k00J97J4n8K65m28J66j6M8k04Ro5M6J95R5q4L5j08L22k23J11
5635A62p0k29j27K46K25j41j34J86j51N2q6J1J19q7O3P6k28k23M13J15n0j36n1
5658d5L74l38J6M16l69jl6N5k87J91j29J18N8L3q7m5j24j85N90l42J76N0n9j97
5682a67K75q2J15q8j16k7O0R2k48L7J26k3j55L72m75M16p0l9k0j3J93k26K66j50
5706E3K5L7N4r3k61J56j7j05R2p1J19P1j27K22l12q6J62J43r8J39j12R6j08j66
5730a87K42k9j31L41l77L91l41P5M1R5j82J58l4k87M16j64L5L6J2M4j94K7j9L8
5754FK4j51j05L15K4k38K58M5k62J62p6n5LJ29k35N1J23k14J91k10Jp2K85J30
5778A29j14K6J35k57L39m03M60j76J94k40j09N1n3J85l40k9L78q7j42J38j85j36
$$ plain form
5800 -236 -29 43 166 60 310 262 80 107 -21 32 -15 35 -32 32 12 -24 -4 -111 -3 -195 -129 -96 -45 116 206
5825 206 -24 -57 13 71 163 -8 41 135 25 278 -99 61 267 406 5 47 -17 -160 -62 29 -405 31 189
5848 189 -40 -253 39 -44 71 260 -122 111 -56 146 55 82 -161 139 226 -113 -4 4 -40 -344 -59 -8 -255
5871 -255 -96 -159 95 93 37 -89 87 188 -184 -232 210 -3 -26 29 59 376 -50 64 292 35 53 -36 -79 -111
5895 -111 3 -130 -173 -83 -106 -117 -49 148 232 -186 194 -97 -105 -63 235 -108 -93 126 97 -246 -104 79 -191 -24
5919 -24 -297 -232 -97 -7 293 156 146 123 174 17 159 96 20 7 210 213 -250 -94 14 -164 -166 198 -149 -147 -81
5944 -81 -228 -214 -159 -163 -153 252 -69 -25 -115 -150 -179 -34 70 150 -174 -23 39 64 0 -29 24 96 -39 -45 -83 -105 -110 -163
5972 -163 207 -186 -99 -62 -72 -101 216 -41 47 148 17 222 -125 -15 4 -57 10 133 -71 -187 265 158 -258
$$ packed form
5800b36K07P2J23j06K50m8j82K7j28N3m7N0o7O4k0l6K0j07J08j92O6L3N1J61R0
5825B06k30l3P0N8R2j71M9R4j10K53l77J60K06J39m01M2o4j43R8R1m34M36J58
5848A89k29k13K92q3J15J89l82K33j67K02r1K7k43L00Q7l39J09Qm4l04K85N1k47
5871b55J59o3K54kn6j26J76J01l72m8M42k13k3N5L0L17m26J14K28k57J8q9m3l2
5895a11J14j33m3R0k3j1O8J97Q4m18L80k91qM2K98l43J5K19k9l43J42J83k70J67
5919b4k73O5J35R0L00j37j0k3N1j57J42o3p6j3K03Lm63J56J08j78kL64l47KO6
5944h1j47J4N5mJ0M05l21M4r0l5k9J45J04Q0l24J51O2K5o4k9N3P2j35ol8k2nn3
5972a63L70l93Q7L7j0k9L17k57Q8J01j31K05l47J10J9o1O7J23k04j16M52j07m16
$$ plain form
5995 -258 -155 -41 -159 273 160 -238 170 7 265 -62 63 -175 21 158 -159 -182 72 185 -24 145
6015 145 246 -324 144 -105 41 -17 43 43 43 173 -135 180 106 166 159 250 -47 84 163 152 124 -46 -346 54 87
6040 87 -103 -72 -100 -113 7 -77 174 206 235 -160 -292 130 -140 152 39 202 49 283 105 -67 115 319
6062 319 31 -155 207 86 -77 -267 -65 -35 83 -7 -293 154 -18 -226 148 -15 -215 -152 -1 276 -81
6083 -81 162 -107 -206 53 46 2 85 -148 -235 -218 5 146 299 -140 -161 -70 -21 82 -77 156 -41 -9 16 -30 -15
6108 -15 -49 -99 113 -3 34 170 395 -303 -52 9 -98 -154 18 -129 -213 263 -276 7 -134 -238 239 284 -304
6131 -304 -107 -142 -213 -135 -24 -184 6 -10 -308 -6 142 -82 65 -15 -35 -11 -8 -283 105 -216 284 60 -65
6154 -65 161 -144 -78 93 -58 29 193 141 -63 -91 -90 -299 91 -69 -174 84 93 -55 -19 -147 52 -77 -101 64
$$ packed form
5995b58J03J14j18M32j13l98M08j63K58l27J25k38J96J37l17k3K54J13k09J69
6015A45J01n70M68k49J46n8O0%%J30l08L15p4O0pR1k97J31P9j1k8j70l00M00L3
6040H7j90L1k8j3J20q4K51L2K9l95j32M22k70K92j13J63j53K34j78j72J82K04
6062C19k88j86L62j21j63j90K02L0J18r0k86M47j72k08L74j63k00O3J51K77l57
6083h1K43k69r9K59pm4Q3k33q7J7K23J41J53m39k1R1M9J03j59K33j97L2K5m6J5
6108a5l4n0K12j16L7J36K25o98K51O1j07n6J72j47q4M76n39K83j41j04M77M5n88
6131c04J97l5p1P8J11j60J90j6k98L02J48k24J47q0k0K4Lk75L88l21N00k24j25
6154f5K26l05O6J71j51Q7J64n2k04k8Jk09L90j60j05K58Rj48L6j28J99j29k4J65
$$ plain form
6178 64 222 105 16 105 150 43 201 84 -101 -44 -280 -170 174 202 56 -276 -159 82 -120 24 -68 113
6200 113 145 137 -18 294 116 229 71 -256 -21 211 272 188 -60 -202 38 12 79 -59 71 -130 -49 85 43
6223 43 -4 -120 167 -80 -186 402 142 -220 80 38 -103 117 12 1 -54 122 -236 -124 -57 -251 50 -206
6245 -206 -60 -107 -139 21 -8 112 18 -121 114 400 63 -166 169 -203 225 9 -145 348 15 202 56
6266 56 287 113 -83 232 -64 -71 -41 -3 265 163 146 26 -9 267 293 110 -258 10 158 -231 -176 131 132 -22
6290 -22 -118 -9 -134 87 123 -8 8 -138 -25 233 -227 -34 34 106 12 -34 -229 83 158 37 34 -267 310 -82
6314 -82 -242 -242 -191 -362 -127 -132 63 54 129 16 -23 183 -202 159 -149 -4 86 -255 418 -23 14 104 262 329 123
6339 123 51 134 -6 25 154 7 -193 180 -69 -160 -34 -89 66 48 48 202 64 -13 109 -128 -116 183 -154
$$ packed form
6178F4J58j17q9Q9M5j07J58j17j85N7k36J10L44K8j46l32J17K41k02J44r2J81
6200A13L2qj55L12j78J13j58l27K35K32O1q4k48j42K40k6O7j38J30k01Q1J34m2
6223D3m7j16K87k47j06N88k60l62L00m2j41K20j05j1n5J76l58J12O7j94L01k56
6245b06J46m7l2J60k9J20r4j39K35K86l37k29L35l72M28k16j54M93l33J87j46
6266E6K31j74j96L15k96pL0L8K68j02j7j20l5K76K6j83l68K68J48l89N5L07Jj54
6290b2r6J09j25K21L6j31J6j46J13K58m60J93O8P2r4m6j95L12P5j21ll01N77l92
6314h2j60%N1j71K35nJ95rP5j13l9K06l85L61l08J45R0l41O73m41L7R0J58O7k06
6339A23p2Q3j40L1J29j47k00L73k49r1J26n5J55j8%J54j38p7J22k37J2K99l37
$$ plain form
6362 -154 37 -188 -224 163 99 145 -303 -333 -6 -157 -64 -9 114 -29 92 13 158 -2 221 -96 15 -102
6384 -102 -59 -398 -44 -207 -100 -98 -26 7 -112 -161 -279 260 70 231 -80 70 -34 -48 42 -27 -2 40 -103 -162
6408 -162 150 87 191 -21 193 -169 -147 -28 -116 461 48 -178 -70 258 -158 48 176 55 51 -98 186 71
6430 71 -15 -68 -25 -101 126 101 -66 109 -271 195 22 -67 -163 -20 92 -2 -126 -69 177 -227 126 -136 -103 -120
6454 -120 -162 -168 -141 -88 281 41 1 115 3 -63 -264 -90 -74 372 252 143 158 -45 -56 -126 -56 100 288 71
6478 71 6 212 110 -89 14 -113 -368 21 -9 -380 181 53 89 -97 139 206 -41 15 -100 -81 274 57
6500 57 -194 40 104 -159 -36 -49 -44 -114 138 89 -76 -82 -219 65 -199 -148 -283 60 57 -97 -63 81 -166 -42
6524 -42 8 -275 445 -110 -148 10 245 -95 74 -248 155 -79 -28 -139 -27 -63 -348 -91 -171 -37 -22 122
$$ packed form
6362a54J91k25l6L87o4M6m48l0L27j51R3N5J23j43J21p9J45j60K23l17J11j17
6384a02M3l39L54j63J07KP2L3j19m9j18N39j90J61l11J50j04j4R0o9K5M2j43n9
6408a62L12o3J04k12K14l62K2J19q8N77m13k26J08L28m16K06J28j21mj49K84j15
6430G1q6n3M3p6K27k5j67J75l80M66j73q9r6J43J12r4j24N7K46m04L53k62L3j7
6454a20m2oK7N3L69k40m0J14j12o6k01J74J6M46j20j09J5k03j1p0P0J56J88k17
6478G1o5K06j02j99J03j27k55L89l0l71N61j28L6j86K36O7k47N6j15J9L55k17
6500E7k51K34O4k63J23j3Np0K52m9j65oj37K84k64N1j35L43lj54L4J44k47J24
6524d2N0k83P20n55l8J58K35l40J69l22M03k34N1j11J12l6k85K57q0J34J5J44
$$ plain form
6546 122 -32 10 -179 14 381 54 -65 -5 260 -116 8 248 225 22 29 -112 -199 -65 -302 -118 30 16
6568 16 20 46 4 -170 -60 171 -18 0 -96 -64 -113 159 175 144 162 -26 155 23 -261 -47 110 2 127 -56
6592 -56 -121 -84 185 55 12 43 -137 26 5 138 4 -10 -17 19 67 66 -100 -110 -73 -152 -39 85 -133 -42 -139 -228
6618 -228 79 -101 -147 -46 256 26 -64 -170 212 18 56 20 -293 -33 -209 -87 157 111 184 7 -252 77
6640 77 -98 -89 -32 9 -160 4 93 403 -158 349 -37 47 107 32 -199 -62 4 -162 -251 -36 -13 -3 -9 22 -11 -196
6666 -196 103 176 131 157 131 -40 263 24 49 246 164 56 238 -60 112 209 -153 3 129 -239 35 251
6688 251 -2 30 109 -3 -192 32 -374 -180 -50 264 37 63 125 263 172 131 -160 -58 207 -186 200 147
6710 147 219 -124 25 -98 3 -111 -225 -59 -25 54 -97 125 -174 -58 225 26 -82 30 -129 45 -91
$$ packed form
6546A22j54M2j89J93L67l27j19O0K65l76J24K40k3k03Pj41q7J34k37J84J48j4
6568A6MK6m2j74J10K31j89J8r6L2m9K72J6l1J8j88J81j32k84K14J57j08J25j83
6592e6o5L7K69j30m3L1j80J63k1J33j34j4pL6M8jj66j0L7p9J13J24k18R1r7q9
6618b28L07j80m6J01L02k30r0j06L82j94L8l6l13K60j76J22K44m6P3j77k59L29
6640G7j75RN7M1j69J64Q9L10n61N07l86Q4O0p5k31J37O6j66q9K15K3J0oL1l3j85
6666a96K99P3m5K6k6j71L03k39K5J97q2j08J82k98J72R7l62J56J26l68K74K16
6688B51k53L2P9j12j89K24m06J94J30L14k27K6O2J38r1m1k91J02K65l93L86n3
6710A47P2l43J49j23J01j14j14J66L4P9j51K22k99J16K83j99j08J12j59J74j36
$$ plain form
6731 -91 223 -27 -18 120 -308 43 -104 -63 137 -157 49 44 27 26 102 181 -52 -113 -91 -136 142 53 -30 142 113 96
6757 96 33 46 17 -28 167 -9 -33 -304 91 -146 -248 94 -154 44 151 -59 0 26 29 -73 17 -4 207 274
6781 274 -150 -89 221 111 -96 -172 23 95 60 82 49 -105 90 -445 -315 -10 -110 -30 -21 68 240 107 166 -51
6805 -51 -18 298 -24 -156 -44 18 -136 -7 -70 241 74 84 208 108 237 -109 -15 149 -48 76 181 23
6827 23 -131 -104 55 -17 42 15 66 -77 -227 60 -167 -90 75 114 87 87 156 -170 -29 43 -18 30 148 108 89 149
6853 149 -308 -43 117 49 -3 -362 -232 -117 20 123 -133 -200 172 -149 -10 -53 -85 45 -28 -220 -19 56
6875 56 102 38 -97 -51 171 137 -134 -29 -59 -133 83 14 -85 51 -24 -70 114 57 -191 -184 -52 -40 -163 235 35
6900 35 -96 183 26 -112 81 2 144 -58 -349 -282 -390 20 30 -137 253 8 -50 -101 192 366 39 -123
$$ packed form
6731i1L14k50RJ38m28L51j47M1K00k94K06nj7jP6P9k33o1K2m5K78q9q3J72k9j7
6757I6o3J3k9m5J95j76k4k71L95k37j02L42k48J98J07k10N9K6Lj02R0k1K11O7
6781B74m24O1L10j10k07p6J95P2l5K2l3j54J95n35J30L05j00Q0RQ9J72j33N9k17
6805e1L3L16l22j32J12O2j54J29o3L11j67J0J24j00J29l46R4J64j97J24J05j58
6827B3j54K7J59p2N9k7N1j43j50K87k27P7J65L9k7%O9l26J41P2o1M8J18m0j9O0
6853A49m57K65J60o8n2l59J30J15J37J03k56o7L72l21J39m3l2J30p3j92K01P5
6875E6M6o4j35M6K22l4k71J05l0p4K16o9r9J36p5m6J84n7k48PJ32J2j23L98k00
6900C5j31K79j57j38J93p9J42k02k91O7j08M10J0j67L90k45n8n1K93J74l27j62
$$ plain form
6922 -123 -142 332 196 -48 211 25 95 -6 -297 -40 -48 -43 -166 27 -117 -91 37 -205 -42 6 -100 -147 234
6945 234 -272 -220 123 108 110 75 -75 80 -11 187 108 64 -260 -2 -231 130 113 125 14 -212 -215 -127 -36 64 84
6970 84 268 106 30 48 -48 -12 331 49 74 188 -58 100 -94 15 -59 44 -7 -166 320 -154 -158 151 124 -283
6994 -283 128 68 26 -9 199 -4 45 -24 -112 227 -48 224 89 -109 -306 -35 237 -216 -204 34 -75 -109 -213
7017 -213 170 -37 20 152 19 184 16 -41 57 92 142 113 87 143 2 92 -185 -167 151 -33 65 -30 -31 62 50
7042 50 -188 58 167 -210 285 -69 -58 -33 125 -70 -18 -66 -102 134 -28 65 -95 -48 -105 -100 -68 -43 113 26 -212
7067 -212 -6 -17 149 137 296 277 168 361 115 117 4 116 116 230 28 -198 41 -90 -54 -10 -140 16 -199
7090 -199 -165 -40 -8 134 114 -118 -37 -65 99 -166 127 177 17 65 -112 -61 -114 -48 -85 339 134 -174 222 -157
$$ packed form
6922a23j9M74j36k44K59j86P0j01k91K57qNj23J93j44K6J28k42J63M8j06m7L81
6945B34n06N2L43j5Kl5j50J55r1J98p9m4l24K58k29L61j7J2j11k26lQ8R1J00K0
6970H4J84j62p6J8r6L6L43k82K5J14k46J58j94J09p4J03n1j59M86m74mL09k7m07
6994b83M11o0m2l5K08k03M9o9q8L39k75K72j35j98j97K71K72m53J2K38j09l4j04
7017b13L83k07N7J32j33J65j68n7R8L5N0k9k6N6j41R0k77J8L18j84R8r5jR3j2
7042E0k38K46J09l77M95l54J1K5J58j95N2m8l6K36j62R3j60M7n7NL2K5J56q7k38
7067b12K06j1J66j2J59j9j09J93k46Kj13J12%J14k02k26K39j31L6M4j30J56k15
7090a99L4J25L2J42k0k32Q1k8J64k65K93N0j60M8j77N1n3O6l7M24k05l08L96l79
$$ plain form
7114 -157 -323 114 10 11 38 260 -132 76 162 53 90 69 132 -141 168 -144 18 -152 15 164 148 -139 20
7137 20 -36 -161 -2 105 -67 -123 288 25 68 -108 280 112 272 -157 -29 -165 -138 -279 69 -142 -229 88
7159 88 -179 -408 -189 24 -390 218 184 -75 -120 324 -245 -115 96 -36 287 265 -71 -152 46 -100 -283 -8
7181 -8 309 -41 144 -28 77 135 -68 -63 112 -325 -22 -43 -65 52 1 -75 45 -9 196 272 -435 31 128 -319
7205 -319 186 -206 -185 100 -111 -136 -370 -122 -57 178 158 83 -137 299 -26 -75 36 79 -133 211 316 -43
7227 -43 -81 2 -78 -143 -43 -222 -124 -126 -133 21 -82 65 108 -28 -58 -62 146 12 237 84 48 -172 -134 82 -22
7252 -22 99 -219 14 165 -139 -235 -236 -38 -92 56 -95 53 -284 -239 -80 261 -62 129 143 -192 -13 -41 206
7275 206 198 154 413 -265 -98 -44 -176 -345 -181 -324 144 -143 -50 -108 -73 46 -158 -128 -34 -17 28 82 16 117
$$ packed form
7114a57j66M37j04JK7K22l92K08Q6j09L7k1O3k73L09l12J62j70J67J49j6k87J59
7137B0n6j25J59J07j72n6M11k63M3j76L88j68J60m29J28j36K7j41L48k11q7L17
7159H8k67k29K19K13m14O08l4k59m5M44n69J30K11j32L23k2l36q1J98j46j83K75
7181hL17l50J85j72J05N8k03NJ75m37L03k1k2J17n1p6J20n4K05P6p07M66R7m47
7205c19N05l92K1K85k11k5k34K48O5K35k0p5k20M36l25m9J11M3k12L44J05l59
7227d3l8Q3q0o5J00j79R8kpJ54j03J47M3j36l0mK08j34K25j53l6k20L8K16j04
7252b2J21l18K33J51l04r6jJ98n4J48j51J48l37M5J59L41l23J91J4l35J79k8K47
7275B06qm4K59o78J67N4j32j69J64j43M68k87R3n8L5J19k04L0R4J7M5N4o6J01
$$ plain form
7299 117 -30 -67 -82 160 -162 -281 122 26 -18 18 -138 67 23 93 -314 126 36 -35 207 11 233 -179 43
7322 43 142 -5 -171 -111 -20 -9 -20 -133 -31 162 100 -47 -160 -27 -131 38 -198 136 -18 -219 -181 -17 -84
7345 -84 97 -152 57 10 102 224 190 -114 -274 -149 5 -60 13 -306 -109 11 -160 -300 -59 -140 300 295 45
7368 45 61 -15 -37 176 -83 -223 59 167 -138 34 -150 -181 176 -297 -31 -14 -136 -251 37 48 118 -19 36
7391 36 99 -27 -55 155 8 146 151 331 -142 166 -21 -27 121 73 -128 -224 207 -227 291 91 188 -32 -319
7414 -319 -122 239 103 130 209 -24 143 73 77 -350 -28 361 122 -2 38 59 0 141 -61 34 -165 19 -19
7437 -19 28 -29 25 292 40 66 -17 346 76 12 -150 -66 51 284 258 -204 -142 -4 -3 25 38 -175 1 15 46
7462 46 -149 116 -74 -7 38 116 -11 170 -118 -317 16 26 -227 123 -44 -31 -84 -104 -120 -219 -11 -331 -172
$$ packed form
7299A17j47l7j5K42l22j19M03r6m4L6j56K05m4P0m07M40r0p1K42j96K22m12K22
7322D3R9j47j66O0R1J1j1j13J02J93o2j47j13J33j04J69k36L34j54k01L8J64o7
7345h4J81k49K09m7R2J22l4l04j60J25J54o5P3l19J97J20j71j40K41q1M40nk50
7368D5J6p6k2K13k59j40K82J08l05J72j84l1L57m73K66J7j22j15K88J1P0j37N5
7391C6O3j26k8K10j47J38NJ80m73L08j87oJ48m8k01r6M31m34N18k00R7k20k87
7414c19J97L61j36K7P9k33J67p0Mm27L22L89k39j24M0K1n9J41k02R5j99J84l8
7437a9M7n7N4K67k52K6q3L63k70o4j62Q4J17K33k6m62O2J38JK8J3k13J76J4L1
7462D6j95K65j90O7M5P8j27J81k88j99L33J0k53L50j67J3n3k0j6r9K08l20J59
$$ plain form
7485 -172 -20 -61 -172 163 -7 306 -56 -127 294 46 61 234 326 25 36 -46 -211 149 -177 -144 144 93 -159
7508 -159 70 -83 38 58 88 152 -102 65 60 12 106 120 194 -42 -88 35 -169 -25 -60 -73 -84 87 -214 167
7532 167 -244 290 145 -144 -12 92 11 153 166 5 61 189 107 44 -71 -2 110 117 -114 -92 17 86 -167
7555 -167 49 -77 -18 219 -114 -187 -222 -112 -273 -172 55 9 -16 194 95 244 -26 -34 60 69 -154 142 -64 -165
7579 -165 26 -110 96 196 -156 3 -8 -78 -33 271 -43 125 -58 202 129 -93 255 -78 -38 2 10 52 -23
7602 -23 138 -249 -113 -78 21 151 -57 76 -273 55 8 -193 11 23 -156 246 45 -232 105 -2 79 126
7624 126 -49 -76 14 -183 67 37 -130 39 -69 -8 -169 -139 -61 -58 -95 129 255 -3 203 -27 102 100 260 -28
7648 -28 22 -32 -197 -69 -148 26 225 -32 -128 -15 -53 234 83 132 -6 148 92 -54 67 61 32 -244 157 26
$$ packed form
7485a72J52m1j11L35j70L13l62p1M21k48J5J73R2l01J1q2j65L60l26L3K88n1k52
7508a59K29j53J21K0L0O4k54J67nm8R4J4P4k36m6J23k04J44l5j3j1J71l01L81
7532A67m11N34j45k89J32J04q1J42J3j61N6J28q2o3j15O9J12Pk31K2J09O9k53
7555a67K16j26N9K37l33p3l5J10j61J01K27m6k5K10r9J49k70qR4Rk23K96k06j01
7579a65J91j36K06J00l52J59j1p0M5L04l14J68j83K60p3k22L48l33M0M0QM2p5
7602b3J61l87J36L5R9J30k08J33l49L28m7k01K04J2j79M02k01k77L37j07Q1M7
7624A26j75k7R0j97K50l0j67J69j08O1j61L0P8Ll7K24J26k58K06k30J29kJ60k88
7648b8N0n4j65J28p9J74J99k57r6J13l8K87j51M9j38J54n6j46J21ok9k76M01j31
$$ plain form
7672 26 79 -80 -178 -212 -96 58 -103 176 88 -342 -195 161 -102 42 -290 -302 -204 -15 -249 65 112 -56 287
7695 287 269 161 39 -128 -17 -63 249 -112 -193 187 1 43 26 396 -105 -148 234 70 -173 69 21 190
7717 190 251 -110 -118 5 -154 -107 52 6 -126 -1 0 -41 94 144 65 186 89 -3 -104 -141 -244 16 17 166 42
7742 42 304 227 219 -110 -93 -366 -43 220 5 -147 -539 -79 -184 -42 138 44 -260 -288 -22 -9 -25 -29 39 -59
7766 -59 214 57 120 -121 -143 27 63 60 140 -70 176 -44 125 -31 -216 -233 -10 -88 84 118 62 -165 67 -60
7790 -60 318 -281 129 -172 32 90 121 -33 34 -103 -199 63 37 39 54 146 -148 77 48 -92 33 -197 -224 80
7814 80 61 -64 -112 207 127 -97 -159 57 86 -97 -120 -1 -192 306 155 47 -105 2 94 -90 -2 -6 -100 -174
7838 -174 106 3 215 237 -163 -130 50 97 201 193 56 114 186 -5 -181 -112 -25 -159 41 35 -53 -133 81 -161
$$ packed form
7672B6N3j59r8l4J16J54j61K79q8m30J47L56k63J44l32j2R8J89k34L14M7j68L43
7695B87j8j08j22j67J11m6L12l61q1L80j86M2j7L70n01m3L82j64k43K42m8J69
7717A90O1l61qJ23j59M7J59m6j32J25Jm1J35N0p9J21r7r2j01l7j03K60JJ49j24
7742D2K62p7ql29J7k73L23K63k15j52l92M60j05J42J80r4l04k8K66J3j6mO8r8
7766e9K73j57O3k41k2J70L6lQ0k10K46k20J69j56j85j7K23p8J72L4n6k27K32j27
7790f0L78n99M10l01K04N8L1j54O7j37r6K62k6KJ5R2k94K25k9j40J25k30k7L04
7814H0j9j25m8L19q0k24o2K16K9j83k3J19j91M98j51j08j52J07R2j84Q8mr4p4
7838a74K80j03K12K2m00L3J80M7J04qj37N8P2j91j76O9Q7j34K00oq8q0K14k42
$$ plain form
7862 -161 226 -312 -244 -8 -133 -10 199 -4 -74 102 -95 -7 162 24 124 -200 -320 -87 122 -129 -66
7883 -66 24 -3 6 15 -40 -114 -50 45 -11 -113 -161 -25 -138 -36 260 113 102 2 -156 44 81 -59 -42 -113 165 -27
7909 -27 -258 158 -21 186 -339 329 162 141 -40 -147 146 -87 189 -175 -36 -54 -258 -189 -221 67 -108 -127
7931 -127 141 -124 -100 106 3 225 106 -50 -86 -23 72 123 -91 119 89 27 -71 -7 -105 132 -25 -140 22
7954 22 -88 134 -217 77 162 -5 -174 56 -12 -314 -77 130 -183 296 307 38 124 149 -42 -26 -140 28
7976 28 -151 108 231 41 72 -28 -186 57 -128 -49 -151 -61 -133 17 41 -1 19 112 -219 -159 -64 38 119 88
8000 88 -217 -114 -149 -113 96 -139 -150 -191 148 -80 58 126 -125 -6 137 -36 15 100 -176 -125 -51 76 -164
8023 -164 -134 38 6 72 -15 133 264 54 -128 49 242 -34 85 44 86 32 -16 -91 176 -106 94 16 -176
$$ packed form
7862a61L87n38O8K36j25J23K09k03p0J76j97Q8J69j38J00l24j20K33K09k51O3
7883f6R0k7RRn5p4O4R5n6j02m8J36j13J02K96j47j1j00j58K00L7j40J7p1K78j92
7909b7k31M16j79K07n25O68j67k1j81j07K93k33K76l64J39j8k04O9l2K88j75j9
7931a27K68k65K4K06j03K22j19j56l6O3R5N1k14K10l0o2r8O4r8K37j57j15J62
7954B2j10K22l51K94Q5j67j69K30o8l02K37K07l13M79J1k69Q6K5j91J6j14J68
7976B8j79K59J23j90L1j00j58K43j85P9j02R0p2J50K4m2K0R3l31O0R5J02Q1l1
8000H8l05J03l5L6K09k35j1m1L39k28J38O8k51J19J43j73N1Q5k76N1P4J27k40
8023a64L0J72l2O6q7J48J31k10j82J77J93k76J19m1M2n4m8p5K67k82K00p8j92
$$ plain form
8046 -176 -131 -133 335 -127 -49 7 -58 -70 -111 -168 -266 -63 -44 222 -59 79 -19 129 281 64 52 -3 140 49 -113
8071 -113 134 227 -21 58 10 -108 147 -218 -64 78 -24 -148 54 45 169 -12 394 3 388 -77 -130 151
8093 151 -76 91 81 -195 18 20 -72 27 -94 158 115 -60 -72 -269 -229 123 51 -24 132 82 51 80 67 -33 -165
8118 -165 297 -43 72 -109 39 23 -39 34 156 -32 76 -75 96 -69 122 -207 -275 32 46 -8 5 5 227
8141 227 238 176 39 36 177 401 -164 -69 -132 -150 -64 -72 0 358 0 -86 -89 68 -147 51 -175 18 -25 5 -166
8166 -166 273 -167 -261 134 -84 -42 -84 -220 43 100 -94 0 157 52 66 -181 58 92 -52 48 -228 -66
8188 -66 157 -57 -71
$$ packed form
8046a76M5kM68m62P8N6o5j2m1n7r8K03J9K66k81J38r8J48J52k17j2n5J43r1j62
8071a13K47R3k48P9m8j18K55l65J54J42j02j24K02rJ24j81M06l91L85m65n3K81
8093A51k27J67j0k76K13Kr2R9j21K52m3j75j2j97M0L52p2p5J56n0l1K9j3j00j32
8118a65M62l40J15j81J48j6o2P3J22j88J08j51J71j65J91l29o8L07J4n4J3%K22
8141B27J1o2j37lJ41K24n65R5o3j8Q6qP2L58l58q6lJ57k15J98k26J93m3L0j71
8166a66M39m40r4L95k18M2m2j36K63N7j94R4J57j05J4k47K39L4j44J00k76J62
8188f6K23k14j4
8191g1
$$ Imaginary data points
##PAGE= N=2
##DATA TABLE= (X++(I..I)), XYDATA
$$ plain form
0 0 0 0 0 0 0 0 0 0 0 0 0 0 0 0 0 -5 8 -8 8 -8 8 -16 16 -16 22 -24 24 -32 38 -40 48 -56 63 -71 80 -88 99
37 99 -111 125 -138 154 -171 190 -209 230 -254 283 -311 342 -378 416 -457 505 -557 616 -684 758
57 758 -845 947 -1070 1214 -1396 1626 -1930 2352 -2977 4010 -6002 11295 -57173 -138230 -39477
72 -39477 16168 22718 9136 16383 42452 76104 58091 48117 76372 86723 71227 81643 63086
85 63086 3514 -31946 -22267 12569 47142 11637 -54260 -39231 18229 12072 -17434 -14048 12748
98 12748 38262 19265 -41300 -53937 -22922 -25520 -27064 5873 2235 -41314 -54478 -25447 19502
111 19502 35337 -5523 -17063 39452 44038 -31931 -61361 -18297 18761 17418 -16051 -36757
123 -36757 -13332 -7372 -29957 1898 55273 40112 3798 10206 22855 14994 -9784 -26193 11775
$$ packed form
0@%%%%%%%%%%%%%%%nJ3j6J6j6J6k4L2l2L8m6M8n6P0p8Q8j04J19j34J51j68J87
37I9k10K36k63K92l25L61l99M39m84N37n94O53p20P94q73R62j062J173j300J442
57G58j603J792k017K284k610L022l556M282n329O987j0012J7297o8468q1057R8753
72c9477N5645O550j3582P247K6069L3652j8013r974K8255J0351j5496J0416j8557
85F3086n9572l5460R679L4836L4573l5505o5897J5029N7460o157k9506L386K6796
98A2748K5514j8997o0565j2637L1015k598j544L2937l638m3549j3164K9031M4949
111A9502J5835m0860j1540N6515M586p5969k9430M3064L7058j343l3469k0706
123c6757K3425N960k2585L1855N3375j5161l6314O408J2649p861k4778j6409L7968
$$ plain form
136 11775 48141 -1301 -57185 -32820 3869 4414 8168 22178 35532 39427 10097 -7914 26093
149 26093 39558 8780 8865 25333 1780 -30508 -40648 -28367 6354 15162 -17352 -20407 1464
162 1464 -16420 -36539 -16387 4844 11191 2026 -28611 -35785 -9842 -11460 -21954 7603 32473
175 32473 22646 9893 -2252 -2556 24103 30642 13397 21397 20163 -19448 -37717 -20494 -9501
188 -9501 -3281 -5954 -16502 -1832 9734 -19940 -26302 18275 41555 29901 16590 708 -2208
201 -2208 8190 425 2151 28037 19476 -13718 -8432 4916 -9264 -15082 -4292 12146 23541
214 23541 -5965 -51828 -37493 2413 -2567 -13707 -3179 -922 -3651 -6607 -13682 3628 28791
227 28791 20859 16873 32432 13830 -21193 -15478 8267 19634 16804 -10042 -26425 -7537 -3475
$$ packed form
136A1775L6366m9442n5884K4365L6689N45L754J4010J3354L895k9330j8011L4007
149B6093J3465l0778Q5J6468k3553l2288j0140J2281L4721Q808l2514l055K1871
162A464j7884k0119K0152K1231O347r165l0637p174K5943j618j0494K9557K4870
175C2473r827j2753j2145l04K6659O539j7245Q000j234l9611j8269J7223J0993
188i501O220k673j0548J4670J1566k9674o362M4577K3280j1654j3311j5882k916
201b208J0398p765J726K5886q561l3194N286J3348j4180n818J0790J6438J1395
214B3541k9506m5863J4335L9906m980j1140J0528K257k729k956p075J7310K5163
227B8791p932l986J5559j8602l5023N715K3745J1367k830k6846j6383J8888M062
$$ plain form
240 -3475 -21891 -9718 12217 10230 8650 1505 -17090 -15532 -1908 1748 16247 21294 -9040
253 -9040 -23935 -5110 2137 2612 8859 4791 7758 16848 -5513 -27316 -9376 7761 8910 12636
267 12636 856 -15833 -8961 -3043 -2397 18121 27488 10285 7321 11531 -1354 -5615 384 1051
281 1051 12688 12986 -21127 -37869 -19897 -11693 -9728 1082 -1311 -4513 -1111 -12641 -15067 6832
295 6832 12331 6251 17864 15936 -7222 -11657 -1562 9454 24859 19821 250 4403 8972 -10453
309 -10453 -10840 7613 7920 2033 -3919 -19218 -21819 -13695 -17401 -6819 17647 10497 -8771 -3916
323 -3916 970 2759 14474 15402 12597 18785 5479 -18424 -13297 -2362 -4872 2986 7011 -7427
337 -7427 -11383 -10989 -16016 -1794 14999 8184 5433 8855 -5804 -12755 -647 3095 8477 18563
$$ packed form
240c475j8416J2173K1935j987j580p145j8595J558J3624L656J4499N047l0334
253i040j4895J8825P247M75O247m068K967R090k2361k1803J7940J7137J149L726
267A2636j1780j6689O872N918O46K0518R367j7203k964M210j2885m261N999O67
281A051J1637K98l4113j6742J7972Q204J965J0810k393l202L402j1530k426K1899
295F832N499o080J1613j928k3158m435J0095J1016J5405n038j9571M153M569j9425
309a0453l87J8453L07n887n952j5299k601Q124l706J0582K4466p150j9268M855
323c916M886J789J1715R28k805O188j3306k3903N127J0935k510P858M025j4438
337g427l956L94n027J4222J6793o815k751L422j4659o951J2108L742N382J0086
$$ plain form
351 18563 7856 -4980 -81 -2808 -5074 11124 15387 5350 3342 -7473 -22046 -13199 -4910
364 -4910 -9034 -1172 3259 -9600 -12331 -8358 -7707 8000 22953 14095 9586 13266 -44 -7284
378 -7284 3375 6403 7154 9134 -6955 -18525 -10638 -12627 -14557 3273 10021 -278 -2272 -6791
392 -6791 -13760 -2234 6447 5073 13547 12817 -5714 -6887 3911 2686 9418 20340 14354 8551
406 8551 4964 -9672 -9174 5670 2819 -3507 692 -9112 -22395 -17721 -13839 -8162 6826 6240 -3478
421 -3478 1847 1220 -7286 3114 14967 11646 12318 7586 -8992 -9994 -2451 -3798 2967 11580 253
436 253 -5929 -2569 -9689 -8881 6501 8682 5430 6533 -5068 -13740 -4767 -1491 -169 11847 9900
451 9900 -3025 -2790 -2913 -7756 2544 10504 4265 3802 -390 -14946 -13767 -4904 -5553 2374 11121
$$ packed form
351A8563j0707j2836M899k727k266J6198M263j0037k008j0815j4573Q847Q289
364d910m124P862M431j2859k731L973O51J5707J4953q858m509L680j3310p240
378g284J0659L028P51J980j6089j1570P887j989j930J7830O748j0299j994m519
392f791o969J1526Q681j374Q474p30j8531j173J0798j225O732J0922n986n803
406H551l587j4636M98J4844k851o326M199r804j3283M674L882N677J4988n86r718
421c478N325o27q506J0400J1853l321O72m732j6578j002P543j347O765Q613j1327
436B53o182L360p120Q08J5382K181l252J103j1601q672Q973L276J322J2016j947
451I900j2925K35j23m843J0300P960o239m63m192j4556J179Q863o49P927Q747
$$ plain form
466 11121 352 -6015 381 203 4997 17532 16016 12861 15388 2775 -8969 -433 3728 415
480 415 4954 -792 -13983 -13715 -14145 -17066 -4582 3398 -4665 -4939 -4914 -15171 -11845 -235 1596 7076
496 7076 11805 1338 -2965 2843 1000 5937 19890 16386 6617 6200 -1051 -8059 -1503 -70 -1411
511 -1411 5156 -1179 -15869 -12643 -7099 -6748 4258 11372 5189 5163 5136 -3314 1479 11822 9707 10258
527 10258 11102 -1981 -8653 -3171 -5250 -3747 5856 1602 -6670 -6717 -13369 -16113 -3798 -270 -3991
542 -3991 200 -3290 -13648 -9162 -3167 -2222 8265 13646 4459 3196 3800 -2779 2541 12625 8723
557 8723 6717 7160 -4443 -10069 -3436 -2603 1175 9548 3554 -3396 1083 -1290 -5241 6023 11400
572 11400 7909 7952 206 -9237 -3907 -194 -3660 2292 5182 -6042 -8783 -6786 -10706 -5158 4383
$$ packed form
466A1121j0769o367O396j78M794J2535j516l155K527j2613j1744Q536M161l313
480D15M539n746j3191K68m30k921J2484P980q063k74K5j0257L326J1610J831N480
496G076M729j0467m303N808j843M937J3953l504r769m17p251p008O556J433j341
511a411O567o335j4690L226N544L51J1006P114o183k6k7q450M793J0343k115N51
527A0258Q44j3083o672N482k079J503R603m254q272m7o652k744J2315L528l721
542c991M191l490j0358M486N995R45J0487N381r187j263O04o579N320J0084l902
557H723k006M43j1603n626O633Q33L778Q373n994o950M479k373l951J1264N377
572A1400l491M3p746r443N330L713l466N952K890j1224k741J997l920N548R541
$$ plain form
587 4383 1467 565 1812 -8677 -10140 434 1858 3738 10647 5464 -2394 680 -102 -360 9402
602 9402 9394 2126 3105 -1825 -13150 -9641 -3226 -3605 859 187 -10488 -9235 -2699 -4318 1799 12567
618 12567 10180 8815 10243 2133 848 10388 10703 9091 12193 3869 -5347 -3132 -5273 -6314 1696
633 1696 846 -8050 -7553 -10164 -17191 -11042 -5102 -5850 -1041 -202 -9453 -7915 -715 -289 6537 14631
649 14631 9541 5685 7916 2398 1491 8837 7722 5988 8591 -805 -10668 -5588 -3129 -3995 2883
664 2883 3371 -3035 -1786 -4015 -8674 546 7381 2704 3562 3518 -5082 -5766 -1299 -2640 2459 7922
680 7922 -7 -5152 -2369 -6548 -5834 3196 2827 -94 2688 -3370 -8672 -2039 730 1034 8875 8516
696 8516 -59 1136 1737 -1401 4504 8950 3807 3135 837 -9531 -9033 -2105 -3684 -2151 1711 -4358
$$ packed form
587D383k916r02J247j0489j463J0574J424J880O909n183p858L074p82k58R762
602I402qp268R79m930j1325L509O415l79M464o72j0675J253O536j619O117J0768
618A2567k387j365J428q110j285R540L15j612L102q324r216K215k141j041Q010
633A696q50q896M97k611p027O149N940p48M809Q39r251J538P200M26O826Q094
649A4631n090l856K231n518r07P346j115j734K603r396r863N080K459q66O878
664B883M88o406J249k229m659R220O835m677Q58m4q600o84M467j341N099N463
680G922p929n145K783m179P14R030l69k921K782o058n302O633K769L04P841l59
696H516q575J195O01l138N905M446n143o72k298j0368M98O928j579J533L862o069
$$ plain form
712 -4358 -7207 -3395 -5883 -3139 8032 8354 4226 5533 404 -3156 3714 5221 2886 7614 5802
727 5802 -3973 -4419 -3348 -6140 -206 3219 -2628 -2881 -3703 -11492 -8882 -871 -981 1242 4567 -1563
743 -1563 -3311 2109 1671 3609 12304 10321 5568 6939 796 -4620 1653 4225 963 2264 -2415
758 -2415 -10633 -8001 -5571 -8259 -1760 3673 -1636 -2187 -1640 -6145 -1864 6029 4437 5168 7995 476
774 476 -3818 1074 1203 2011 8061 4012 -1600 -454 -4192 -7981 -1624 1172 -1480 1239 -1866 -9468
790 -9468 -5869 -849 -978 4458 7333 1777 2009 3294 -1789 781 7845 5419 3258 3559 -4704 -7722
806 -7722 -2536 -3142 -2636 2786 -553 -5488 -3422 -4501 -5222 3195 5860 2186 4833 2778 -3914 -707
822 -707 3205 1936 6366 7370 -1295 -2989 -1173 -4471 -2033 3295 -162 -1375 -501 -7614 -9207 -2751
$$ packed form
712d358k849L812k488K744J1171L22m128J307n129l560O870J507k335M728j812
727E802r775m46J071k792N934L425n847k53q22p789K610Q011j10K223L325o130
743a563j748N420m38J938Q695j983m753J371o143n416O273K572l262J301m679
758b415q218K632K430k688O499N433n309n51N47m505M281P893j592P31K827p519
774D76m294M892J29Q08O050m049n612J146l738l789O357K796k652K719l105p602
790i468L599N020j29N436K875n556K32J285n083K570P064k426k161L01q263l018
806g722N186o06N06N422l339m935K066j079p21Q417K665l674K647k055o692L207
822g07L912j269M430J004q665j694J816l298K438N328l457j213Q74p113j593O456
$$ plain form
838 -2751 -1329 -388 4745 1419 -2899 608 679 168 7589 9128 4489 4843 2115 -4588 -1435 2222
854 2222 -1190 650 1514 -5831 -7071 -5030 -7060 -2678 3865 400 -1613 990 -3089 -3517 3124 3769
870 3769 4137 8164 3540 -2184 691 990 -232 5200 5147 -571 -316 -2232 -7986 -4372 441 -1991
886 -1991 -89 411 -5960 -5136 -672 -2254 1317 7665 4390 1846 3300 -445 -808 5326 4364 1482
902 1482 3568 -746 -6399 -3478 -3343 -4447 1361 1285 -4142 -3274 -2518 -5677 -286 4231 1897 3660
918 3660 4637 -1646 -1458 3253 1860 4267 6981 2220 -975 548 -3677 -4358 1682 907 -1965 -710
934 -710 -4861 -8700 -3644 -2103 -2691 2448 3162 -1417 412 1332 -1166 4177 8657 4464 4344 3885 -2225
951 -2225 -1947 1169 -1403 -285 2925 -2736 -6087 -3722 -5099 -4613 1300 359 -1724 1353 -1482 -4810
$$ packed form
838b751J422R41N133l326m318L507P1n11P421J539m639L54k728o703L153L657
854B222l412J840Q64p345j240K041k030M382O543l465k013K603m079m28O641O45
870C769L68M027m624n724K875K99j222N432n3n718K55j916n754L614M813k432
886a991J902N00o371Q24M464j582L571O348l275k544J454l745l63O134r62k882
902A482K086m314n653K921J35j104N808p6n427Q68P56l159N391M517k334J763
918C660R77o283J88M711j393K407K714m761l195J523m225o81O040p75k872J255
934g10m151l839N056J541n88N139P14m579J829R20k498N343M480m193j20m59o110
951b225K78L116k572J118L210n661l351K365j377M86N913r41k083L077k835l328
$$ plain form
967 -4810 591 3101 2442 5897 4886 -779 782 1861 -821 2573 5283 981 -31 -289 -5754 -5053
983 -5053 -151 -1891 -1473 1193 -2899 -4652 -1042 -1688 -502 5723 4538 1760 3427 884 -1729 2613
999 2613 3345 914 3387 1507 -4447 -3721 -2057 -3885 88 2018 -2529 -2302 -914 -4458 -2794 2228
1015 2228 1471 2436 4202 -355 -2026 2207 1532 998 5707 3871 -469 466 -2280 -4595 34 920
1031 920 -2507 -839 -1658 -6455 -4183 -1404 -2361 1515 4677 373 632 2539 -502 2262 7017 4479
1047 4479 3050 4554 68 -2679 305 -1013 -1315 2162 -1081 -5301 -3099 -4171 -5853 -1219 765
1062 765 -1658 636 -321 -4600 -885 2980 1160 3802 5631 1369 1134 2264 -1048 853 5055 1522
1078 1522 -717 281 -3505 -5095 -1341 -2019 -2247 1234 -902 -4095 -1134 -860 -1661 3610 4885 1767
$$ packed form
967d810N401K510o59L455j011n665J561J079k682L394K710m302j012k58n465P01
983e053M902j740M18K666m092j753L610o46J186O225j185k778J667k543k613M342
999B613P32k431K473j880n954P26J664j828L973J930m547K27J388l544J664N022
1015B228p57R65J766m557j671M233o75n34M709j836m340R35k746k315M629Q86
1031I20l427J668q19m797K272K779r57L876L162m304K59J907l041K764M755k538
1047D479j429J504m486k747K984j318l02L477l243m220K202j072j682M634J984
1062G65k423K294r57m279L715L865j820K642J829m262k35J130l312J901M202l533
1078A522k239R98l786j590L754o78k28L481k136l193K961K74q01N271J275l118
$$ plain form
1094 1767 3064 2302 -1478 1317 3288 975 2595 3106 -2667 -3111 -887 -3179 -2061 1644 -1425 -2450
1110 -2450 -217 -4179 -4676 732 1248 403 3219 1163 -1591 1460 1284 -14 4424 4744 249 499
1126 499 -28 -3279 -827 1244 -1839 -403 228 -4328 -4449 -922 -2282 -134 3780 1091 52 2279
1142 2279 58 -285 4292 3484 2011 4082 1021 -3032 -514 -594 -1765 850 404 -3595 -2368 -2443 -5461
1159 -5461 -2362 897 -835 187 685 -2636 -862 2451 684 2203 5520 2774 392 1653 141
1174 141 -135 3571 1581 -694 1010 -1854 -5333 -2440 -1444 -2500 522 199 -3464 -1552 -164 -2237
1190 -2237 1175 4513 1643 2498 3032 -682 -307 2561 1218 1592 3240 -882 -2957 -580 -2448 -3377
1206 -3377 202 -351 -2167 -612 -2859 -4317 -159 888 -921 2323 3130 -382 542 1347 209 3297
$$ packed form
1094A767J297p62l780K795J971k313J620N11n773m44K224k292J118L705l069j025
1110b450K233l962m97N408N16q45K816k056k754L051j76j298M438L20m495K50
1126D99n27l251K452K071l083J436O31m556j21L527j360K148L914k689j039K227
1142B279k221l43M577q08j473K071l061m053K518q0j171K615m46l999J227p5l018
1159e461L099L259j732J022M98l321J774L313j767J519L317k746k382J261j512
1174A41k76L706j990k275J704k864l479K893R96j056L022l23l663J912J388k073
1190b237L412L338k870Q55N34l714L75K868j343L74J648m122k075K377j868r29
1206c377L579n53j816J555k247j458M158J047j809L244Q07l512R24Q05j138L088
$$ plain form
1222 3297 4630 916 767 1547 -2033 -2299 67 -1205 -797 489 -2739 -4221 -991 -2122 -1860 2407
1238 2407 1854 -226 1780 360 -1111 2401 2830 1599 3532 2343 -1782 -990 590 -1979 -304 1276
1254 1276 -1635 -1908 -1519 -4633 -2814 795 -918 -1095 1413 -425 -1465 1126 382 1053 5058 3156
1270 3156 107 1985 1178 -932 1094 1557 -370 1010 -440 -4381 -2731 -1219 -2610 -801 713
1285 713 -1878 -1490 -224 -1680 -167 3204 1803 1741 3226 559 -884 1636 1315 316 2383 844
1301 844 -1878 -344 -1835 -3585 -147 386 -1865 -1122 -1037 -3299 -1238 55 -773 1509 3232 69
1317 69 381 1776 379 1479 3406 1296 916 1927 -1180 -2747 139 -399 -1650 351 -1396 -3013
1333 -3013 -1370 -1434 -2241 1341 1909 -473 1050 1451 -1020 724 2755 1203 2453 2901 -284 -470 767
$$ packed form
1222C297J333l714j49P80l580k66K366j272M08J286l228j482L230j131K62M267
1238B407n53k080K006j420j471L512M29j231J933j189m125P92J580k569J675J580
1254A276k911k73L89l114J819L609j713j77K508j838j040K591p44O71M005j902
1270C156l049J878q07k110K026M63j927J380j450l941J650J512j391J809J514
1285G13k591L88J266j456J513L371j401o2J485k667j443K520l21r99K067j539
1301H44k722J534j491j750L438N33k251P43Q5k262K061J293q28K282J723l163
1317F9L12J395j397J100J927k110l80J011l107j567K886n38j251K001j747j617
1333c013J643o4q07L582N68k382J523M01k471J744K031j552J250M48l185j86J237
$$ plain form
1350 767 -1715 -946 1459 -521 -2037 -917 -2628 -3061 -132 -683 -1254 1766 510 -1758 217 747
1366 747 719 3144 2996 700 1802 1514 -1503 -23 1769 -218 -171 368 -2792 -2690 -837 -2245 -1788
1383 -1788 493 -900 -1497 66 -1236 -1058 1975 1587 754 2631 1546 -431 1330 1526 8 1795
1399 1795 1856 -1135 -750 -1024 -2530 -985 2 -2085 -948 58 -2104 -2073 91 -326 775 2672 651
1416 651 -131 1916 636 288 2401 1723 531 1632 -476 -2178 -464 -488 -1782 -196 -302 -2464 -1543
1433 -1543 -1235 -2237 18 1365 -440 673 1494 -406 256 2031 1022 1167 3038 519 -174 682
1449 682 -796 -957 962 -63 -1841 -575 -1342 -2806 -1032 -548 -1175 1039 732 -1408 -115 1319
1465 1319 38 1792 2543 1049 1356 1410 -577 -295 1583 39 -113 692 -1194 -2272 -806 -1920 -1731
$$ packed form
1350G67k482P69K405j980j516J120j711m33K929n51n71L020j256k268J975N30
1366G47k8K425j48k296J102k88l017J480J792j987M7N39l160J02J853j408M57
1383a788K281j393n97J563j302J78L033l88q33J877j085j977J761J96j518J787
1399A795O1k991L85k74j506J545R87k087J137J006k162L1K164m17J101J897k021
1416F51p82K047j280l48K113o78j192J101k108j702J714k4j294J586j06k162R21
1433a543L08j002K255J347j805J113Q21j900O62J775j009J45J871k519o93Q56
1449F82j478j61J919j025j778J266p67j464J774M84o27K214l07k140J293J434
1465A319j281J754P51j494L07N4j987K82J878j544j52Q05j886j078J466j114J89
$$ plain form
1482 -1731 542 -21 -1459 -177 -494 -1341 942 1559 317 1944 1894 -286 841 1366 -339 835 2027
1499 2027 -365 -899 4 -2028 -1619 -206 -898 -1207 381 -1647 -2217 -94 -103 -314 1904 1298 279 1853
1517 1853 801 -448 1692 2099 415 755 652 -1510 -450 -386 -1652 -298 304 -1754 -1368 -504 -1686
1534 -1686 -906 1010 60 47 1595 283 -205 1404 1088 622 2160 1146 -693 666 -6 -717 -198
1551 -198 31 -1303 -376 -613 -2484 -1347 -204 -1001 11 966 -852 94 1005 -67 782 2337 1598
1568 1598 1072 1401 100 -413 872 195 -536 370 -210 -2023 -964 -1151 -2020 -335 -94 -1060 -159 257
1586 257 -1204 35 1271 546 1248 2175 441 46 999 17 478 1301 291 -470 390 -1145 -1943 -525
1604 -525 -479 -1044 6 -438 -1493 20 56 -771 938 1320 139 995 1028 -203 1043 1574 153 519
$$ packed form
1482a731K273n63j438J282l17q47K283O17j242J627n0k180J127N25j705J174J192
1499B027k392n34R03k032M09J413o92l09J588k028n70K123rk11K218o06j019J574
1517A853j052j249K140M07j684L40j03k162J060O4j266J354O02k058L86Q64j182
1534a686P80J916r50j3J548j312m88J609l16m66J538j014j839J359o72p11N19
1551a98K29j334R27k37j871J137J143p97J012R55j818R46R11j072Q49J555p39
1568A598n26L29j301n13J285o77p31R06n80j813J059j87q69J685K41r66R01M16
1586B57j461J239J236p25P02R27j734l95R53r82M61Q23j010p61Q60j535p98J418
1604e25M6n65J050m44j055J513L6q27J709L82j181Q56L3j231J246N31j421L66
$$ plain form
1622 519 947 -593 -992 41 -1565 -800 357 -1024 -1255 -667 -1218 -1338 315 365 -131 1075 658 -528
1640 -528 737 843 142 1437 1211 -62 545 469 -1066 -537 87 -976 -293 -126 -1753 -1345 -50 -580
1658 -580 -612 781 -25 -146 306 45 109 1306 934 392 1101 810 -550 330 205 -840 421 300 -1428
1677 -1428 -921 -680 -1681 -906 151 -815 -350 341 -705 -192 803 858 784 1709 707 236 1491 120
1695 120 -49 1236 422 -462 94 -726 -1566 -516 -289 -1197 -433 -477 -1098 -492 -113 -390 643 1352 428
1714 428 484 1254 38 448 1300 600 419 940 84 -814 -1 -781 -875 -54 -182 -1363 -309 -839 -1392 -36
1734 -36 444 -72 726 933 -28 473 1111 284 773 1478 164 216 523 -601 -608 278 -513 -552 -65 -705 -1070
1755 -1070 -154 -660 -757 520 249 -644 393 118 126 731 943 409 1176 1123 -241 189 -112 -304 126 300
$$ packed form
1622E19M28j540l99J033j606P65J157j381k31N88n51j20J653N0m96J206m17j186
1640e28J265J06p01J295k26j273O07p6j535N29O24j063O83J67j627M08J295n30
1658e80l2J393q06j21M52k61O4J197l72n42P09k91j360Q80j25j045J261j21j728
1677a428N07K41j001P75J057r66M65O91j046N13R95N5p4R25j002m71J255j371
1695A20j69J285q14q84N56q20q40J050K27r08P64m4o21O06L79k77J033P09r24
1714D28N6P70j216M10Q52p00j81N21q56q98Q13p80r4Q21j28j181J054n30n53J356
1734c6M80n16P98K07r61N01O38q27M89P05j314N2L07j124pQ86p91l9M87o40l65
1755a070R16n06r7J277k71q93J037k75QO05K12n34P67n3j364M30l01j92M30J74
$$ plain form
1775 300 -861 -676 -369 -936 -773 -57 -463 -604 227 -488 -469 733 454 45 995 758 161 963 452 -200
1795 -200 677 263 -651 -223 -207 -1016 -563 -39 -1089 -576 52 -728 -600 253 -382 -205 794 308 351 951
1815 951 511 0 898 410 106 580 132 -744 10 -352 -642 -202 -179 -938 -301 -180 -852 -307 283 -175
1835 -175 -35 751 107 450 802 344 354 1053 410 306 509 79 -354 70 -293 -673 16 -350 -1069 -391
1855 -391 -650 -727 -93 168 -168 348 495 -104 264 826 257 482 902 193 -121 174 -184 -93 314 -435 -314
1876 -314 -116 -785 -1238 -247 -329 -801 -57 -115 -535 128 224 -91 534 951 363 241 567 -183 180 344 -373
1897 -373 -240 131 -634 -546 -77 -815 -380 44 -445 -770 63 100 -133 342 287 57 582 689 95 707 419
1918 419 -86 428 414 -311 -66 -15 -579 -198 93 -582 -371 -53 -620 -483 315 -14 59 492 256 144 706
$$ packed form
1775C00j161J85L07n67J63P16m06j41Q31p15J9J202k79m09R50k37n97Q02n11o52
1795b00Q77m14r14M28J6q09M53N24j050N13O28p80J28Q53o35J77R99m86M3O00
1815I51m40n11Q98m88l04M74m48q76P54l62k90M40K3p59O37J21o72N45N90m58
1835a75J40P86o44L43L52m58J0O99o43j04K03m30m33M24l63l80O89l66p19O78
1855c91k59p7O34K61l36N16J47n99L68N62n69K25M20p09l14K95l58R1M07p49J21
1876c14J98o69m53R91q2m72P44n8m20O63R6l15O25M17n88j22L26p50L63J64p17
1897c73J33L71p65Q8M69p38M35M24m89l25Q33L7k33M75n5k30N25J07n94O12k88
1918D19n05N14j4p25K45N1n64L81K91o75K11L18n67J37P98l29P3M33k36j12N62
$$ plain form
1939 706 216 -129 912 509 -89 187 245 -283 126 -284 -793 -74 -124 -853 -300 -33 -675 -213 216 -131
1959 -131 61 474 -51 20 535 377 280 547 202 -7 542 217 -351 29 -391 -545 17 -556 -780 -243 -15
1980 -15 -580 -198 58 -47 182 324 6 181 394 457 349 404 65 -70 281 -2 -303 237 -335 -475 -309
2001 -309 -413 -562 -249 -227 -438 175 -192 -224 443 354 -182 301 463 71 311 518 -316 -88 312 -2 -267
2022 -267 46 -467 -694 29 -375 -585 89 -492 -489 142 -90 -90 112 573 282 330 414 298 398 226 -31 336
2044 336 405 -248 -112 -31 -623 -483 322 -660 -255 -304 -164 -413 -179 -129 -158 363 126 142 280 76 -5 433
2066 433 484 -76 275 122 -393 177 -53 -537 -179 14 -349 -85 -8 -408 -68 59 -18 -65 232 229 6 613
2088 613 -1 230 429 468 144 248 115 -194 253 12 -383 20 -282 -345 -163 -199 -486 127 -156 -315 324
$$ packed form
1939G06m90l45J041m03n98K76N8n28M09m10n09P19n0p29N53K67o42M62M29l47
1959a31J92M13n25P1N15j58r7K67l45k09N49l25n68L80m20j54N62n73k24N37K28
1980a5n65L82K56j05K29J42l18J75K13O3j08N5l39j35L51k83l01N40n72j40J66
2001c09j04j49L13K2k11O13l67l2O67q9n36M83J62l92K40K07q34K28M00l14k65
2022b67L13n13k27P23m04k10O74n81LO31k32%K02M61k91M8Q4j16J00j72k57L67
2044C36O9o53J36Q1n92J40Q05r82M05m9J40k49K34N0k9N21k37J6J38k04q1M38
2066D33N1n60L51j53n15N70k30m84L58J93l63K64P7m00L40J27p7m7K97lk23O07
2088F13o14K31J99L9l24J04j33l09M47k41l95M03l02o3J82l6k87O13k83j59O39
$$ plain form
2109 324 272 -203 30 312 40 229 161 24 92 125 -17 -225 229 -7 -234 -39 -327 -333 -251 -196 -52 -214 227
2132 227 -170 122 96 -61 169 487 -69 4 227 17 -144 378 144 -112 195 -259 -438 -2 -303 -418 -182
2153 -182 9 -431 70 -78 118 34 1 119 550 279 -5 139 289 16 442 323 63 -106 -331 -560 -380
2174 -380 -82 39 -345 -489 -179 -402 -27 -90 183 285 230 -188 253 115 190 353 465 124 156 146 -280 -176
2196 -176 141 72 -254 -20 -282 -341 -153 -278 -119 341 -32 54 291 -80 -151 251 189 49 120 -26 -236 29
2218 29 195 -81 59 352 -170 19 -30 -152 -23 177 -23 79 526 -333 -13 234 125 24 224 143 20
2239 20 156 80 -404 187 -95 55 168 -106 -411 68 -11 -96 204 254 -109 -144 248 -45 93 -50 68 221
2261 221 84 102 -358 340 94 275 92 9 -282 -1 -243 -336 -153 -133 -166 69 -60 -269 107 209 221 273
$$ packed form
2109C24n2m75K33K82k72J89o8j37O8L3j42k08M54k36k27J95k88oQ2N5J44j62M41
2132B27l97K92k6j57K30L18n56P3K23k10j61N22k34k56L07m54j79M36l01j15K36
2153a82J91m40N01j48J96q4l3J18M31k71k84J44J50k73M26j19k60j69k25k29J80
2174c80K98J21l84j44L10k23L75o3K73J02n5m18M41j38P5J63J12l41L2j0m26J04
2196a76L17o9l26K34k62n9J88j25J59M60l73Q6K37l71p1M02o2j40P1j46k10K65
2218B9J66k76J40K93n22J89m9j22J29K00k00J02M47q59L20K47j09j01K00q1j23
2239B0J36p6m84N91k82J50J13k74l05M79p9q5L00N0l63l5L92k93J38j43J18J53
2261B21j37J8m60O98k46J81j83q3k91K81k42r3J83K0l3K35j29k09L76J02J2N2
$$ plain form
2283 273 157 152 -123 268 -82 21 295 10 -84 -96 -228 -357 56 -111 -31 -119 -287 -223 -33 -69 -134 -20 75
2306 75 -69 421 -128 -275 26 276 312 301 16 135 -59 43 -270 -139 110 112 -150 61 -98 -176 -120 -13
2328 -13 39 126 -109 -60 -189 -321 22 259 148 125 135 134 -272 244 399 -277 155 65 -69 47 -91 -79 177
2351 177 217 -28 -154 -66 -101 -197 124 200 -213 112 -108 -497 75 -5 -117 90 -103 -105 -248 3 -277 -379 -118
2374 -118 34 41 184 -214 -140 222 161 130 469 76 172 26 -53 -205 36 193 116 101 -19 -186 -130 54 -203
2397 -203 54 -62 -14 -20 48 -29 -8 114 363 -242 171 -106 -122 -38 -246 1 58 -103 -155 -100 -131 -132 100 -191 -5
2422 -5 -36 -422 -171 -13 61 227 271 136 -313 -197 43 129 117 124 -56 113 -155 -90 3 -5 321 235 23 -66 -235
2447 -235 -353 -156 -17 153 -212 134 -173 71 -140 -37 478 149 77 273 -146 -76 -109 60 16 -7 -19 -133
$$ packed form
2283B73j16nk75L91l50J03K74k85r4j2j32j29M13j67Q0q8j68O4J90l6o5J14R5
2306G5j44M90n49j47L01K50L6j1k85J19j94J02l13J31K49Kk62K11j59p8N6J07
2328a3N2Q7k35M9j29j32L43K37j11k3J0jm06N16J55o76M32r0j34J16j38J2K56
2351A77M0k45j26Q8l5r6L21P6m13L25k20l89N72q0j12K07j93kj43K51k80j02K61
2374a18J52PJ43l98P4L62o1l1L39l93R6j46p9j52K41J57p7j5j20j67N6J84k57
2397b03K57j16M8oO8p7K1J22K49o05M13k77j6Q4k08K47N7j61n2N5l1jK32k91J86
2422el1l86K51J58P4J66M4j35m49J16K40Q6j2Pj80J69k68O5R3qL26q6k12q9j69
2447b35j18J97J39J70l65L46l07K44k11J03N15l29p2J96m19P0l3J69m4k3j2j14
$$ plain form
2469 -133 -218 -333 -150 46 285 64 228 -14 -11 -193 90 -53 138 54 96 -14 -100 -183 -24 62 -9 -1 33 -349
2493 -349 -121 193 -137 -179 60 108 322 77 -168 -230 164 -165 81 238 184 -1 109 127 -230 -135 97 -15
2515 -15 -388 -193 -100 33 -117 -128 -64 -270 -272 -248 46 275 378 213 -39 -60 25 -97 67 305 48 23 -223
2538 -223 -208 -238 232 -117 238 -101 -85 -329 -107 -189 -350 82 -5 96 26 213 -196 74 65 -115 13 176 -195
2561 -195 -424 -23 -259 -94 224 272 -215 -151 -41 -309 24 202 -56 35 -110 -9 77 139 105 102 184 327 -350
2584 -350 -299 -143 -247 164 245 76 -113 -164 -345 -221 -158 -73 262 328 9 -266 93 34 -81 44 168 173 31
2607 31 -40 92 -15 -2 42 235 -230 -329 25 -88 -124 -2 28 -86 -256 -144 -91 -31 104 -120 96 243 -43
2630 -43 -47 200 -183 -52 315 -4 -214 -347 -309 -356 205 -62 102 -29 84 -159 -33 122 102 54 199 -174
$$ packed form
2469a33q5j15J83J96K39k21J64k42Lj82K83j43J91q4M2j10q6q3J59Q6p1QL4l82
2493c49K28L14l30m2K39M8K14k45k45o2L94l29K46J57n4j85J10J8l57R5K32j12
2515a5l73J95R3J33j50j1O4k06kK4K94K29J03j65k52k1Q5j22J64K38k57k5k46
2538b23J5l0M70l49L55l39J6k44K22q2j61M32q7J01p0J87m09K70rj80J28J63l71
2561a95k29M01k36J65L18M8m87O4J10k68L33J78k58R1j45J01Q6O2l4lQ2J43o77
2584c50N1J56j04M11Q1j69j89n1j81J24O3Q5L35O6l19k75L59n9j15J25J24Nj42
2607C1p1J32j07J3M4J93m65r9L54j13l6J22L0j14j70J12N3O0J35k24K16J47k86
2630d3mK47l83J31L67l19k10j33L8m7N61k67J64j31J13k43J26J55k0m8J45l73
$$ plain form
2652 -174 111 -101 -9 -49 190 171 150 -67 -284 -80 -41 -13 136 -31 124 40 52 -82 -66 317 233 352 353 256
2676 256 -2 -170 213 -121 199 258 -166 -94 -344 -387 -58 -201 -11 61 -166 -132 77 71 -101 93 442 150
2698 150 26 264 -111 -50 63 478 225 452 -15 -342 79 141 52 -221 -53 -8 -51 -121 -165 251 306 182 -147
2721 -147 -2 -127 -423 168 63 367 361 -100 -129 -75 -268 39 75 197 -114 -275 -172 -85 15 -141 -85 146
2743 146 -29 -4 -321 171 -54 75 150 92 41 -281 -205 -47 43 185 90 272 129 -83 -42 -144 -127 17 36
2766 36 43 96 -6 -94 40 -128 142 274 54 -15 53 41 -23 -84 24 -59 -331 -37 -341 -164 110 61 -131 -9
2790 -9 -278 -290 -52 228 97 451 296 -177 -87 207 -6 241 357 224 -127 -63 -218 -512 -159 -113 -169 236
2812 236 -165 -269 -138 -283 110 109 28 -72 206 -10 -302 182 98 148 429 182 -125 70 -172 -275 -151 -39
$$ packed form
2652a74K85k12R2m0K39j9k1k17k17K04L9K8J49j67J55q4J2j34J6L83q4J19Jr7
2676B56k58j68L83l34L20N9m24P2k50m3L29j43J90P2k27L4K09oj72J94L49k92
2698A50j24K38l75O1J13M15k53K27m67l27M21O2q9k73J68M5m3p0m4M16N5j24l29
2721a47J45j25k96N91j05L04om61k9N4j93L07L6J22l11j61J03Q7J00j56N6K31
2743A46j75K5l17M92k25J29P5n8n1l22P6J58R0J42r5J82j43k12M1j02J7J44J9
2766C6PN3j02q8J34j68K70J32k20o9O8j2o4o1J08q3k72K94l04J77K74m9j92J22
2790ik69j2K38K80j31L54j55m73R0K94k13K47J16j33l51O4j55k94L53M6n6M05
2812B36m01j04J31j45L93jq1j00K78k16k92M84q4N0K81k47l07J95k42j03J24J12
$$ plain form
2834 -39 63 -109 -144 -303 -356 5 -108 65 153 354 230 9 -56 287 285 316 83 127 74 -374 -4 13 95 381
2858 381 -211 -311 -246 -237 -346 155 280 161 -15 -179 -127 -111 125 82 107 214 204 -95 213 -13 -177 391 -88
2881 -88 -245 -176 -317 -313 129 189 327 48 -112 -9 -47 279 -153 256 482 100 -108 -47 -194 317 317 -179 58
2904 58 140 -165 -383 -189 -313 -119 179 49 -163 -189 -77 -330 67 71 144 344 -189 -154 -32 107 73 126 -29
2927 -29 -96 -139 -47 -225 -243 210 -105 -183 -43 -132 -370 109 -41 -177 205 243 208 121 -50 231 226 199 43 202
2951 202 -10 -222 -55 52 154 -24 -179 -423 -348 -122 -342 -279 -20 83 39 -13 -70 -162 94 89 482 410 134
2974 134 181 139 -174 -124 242 352 -193 -54 -31 -174 -65 -189 9 -52 -142 -138 -68 -296 -175 171 215 101 27 74
2998 74 117 68 145 142 20 -106 -78 -216 -143 -6 -166 5 -137 -351 -302 -113 -590 -7 137 211 -31 151 150 -7
$$ packed form
2834c9J02j72l5j59n3L61j13J73Q8K01j24k21o5L43kL1k33M4n3m48L70J7Q2K86
2858C81n92j00O5Rj09N01J25j19j76j64N2J6K36m3K5J07j0k99L08k26j64N68m79
2881h8j57O9j41MM42O0J38k79j60J03l8L26m32M09K26l82k08O1j47N11%m96K37
2904E8Q2l05k18J94j24J94K98j30k12k6J12k53L97MP3K00n33L5J22J39l4N3j55
2927b9o7m3R2j78j8M53l15p8J40q9k38M79j50j36L82L8l5q7j71K81nk7j56J59
2951B02k12k12J67J07J02j78j55k44P5K26k20O3K59J03m4n2n7r2K56nL93p2k76
2974A34M7m2l13N0L66J10n45J39K3j43J09j24J98o1r0MP0k28J21L46M4j14p4M7
2998G4M3m9P7lj22j26K8j38P3J37j60J71j42k14M9J89m77N83J44P4k42J82jj57
$$ plain form
3022 -7 72 184 556 298 71 -50 -107 -406 -315 309 -184 -227 -36 -132 -208 -190 -173 -135 239 49 -30 -92 39 -84
3046 -84 227 499 176 383 290 -32 -63 -8 -178 -76 -153 -213 -29 -273 -330 -165 -33 -61 -206 100 85 0 166
3069 166 -159 27 378 195 178 -135 433 -62 253 86 -34 -161 -372 -421 -70 37 -70 89 -66 -217 -21
3090 -21 -273 -247 216 583 346 173 186 179 159 -216 56 -222 161 -36 -416 -262 -115 -168 -158 -57 -418 -38 -54
3113 -54 -404 -147 36 151 1 206 -154 158 161 100 162 299 123 77 118 -88 -142 117 -142 -24 347 -119 -179
3136 -179 -83 -41 -251 283 -265 -33 122 32 -36 -56 251 51 16 185 -7 -15 -14 -64 339 307 -146 -273 -244 -327 -84
3161 -84 136 6 -342 37 227 -66 177 348 273 159 433 74 -187 111 -369 221 71 56 -80 -88 -318 -273
3183 -273 -39 -5 -153 159 -301 -465 -96 -33 -151 85 189 87 284 171 -167 97 -55 467 152 27 -26
$$ packed form
3022gP9J12L72k58k27j21n7k99R1O24m93m3J91r6p6J8J7L8L74j90p9o2J31j23
3046h4L11K72l23K07r3l22l1N5j70J02p7o0J84k44n7J65J32k8j45L06j5q5J66
3069A66l25J86L51j83j7l13N68m95L15j67j20j27k11m9L51J07j07J59j55j51J96
3090b1k52K6M63L67k37j73J3pk0l75K72k78L83j97l80J54J47n3J0J01l61L80j6
3113e4l50K57J83J15j50K05l60L12Lo1O2J37j76m6M1k06n4K59k59J18L71m66o0
3136a79R6M2k10N34n48K32J55r0o8k0L07k00l5J69j92qJn0M03l2m53j27K9q3K43
3161h4K20j30l48L79J90k93K43J71p5j14K74l59k61K98m80N90j50j5j36qk30M5
3183b73K34L4j48L12m60j64L69O3j18K36J04j02J97j13l38K64j52N22l15j25n3
$$ [...]
8191A18
##END NTUPLES=NMR FID
##END=
