##TITLE=1H_TG-2112-X6
 DMSO, 8 sc, 
 27.6.2019
##JCAMPDX= 6.0         $$ Bruker NMR JCAMP-DX V2.0
##DATA TYPE= NMR FID
##DATA CLASS= NTUPLES
##ORIGIN= UXNMR, Bruker Analytische Messtechnik GmbH
##OWNER= root
$$ XWIN-NMR		Version 3.5
$$ Thu Jun 27 14:50:23 2019 Russian Standard Time (UT+4h)  she@DPX200
##.OBSERVE FREQUENCY= 200.13155
##.OBSERVE NUCLEUS= ^1H
##.DELAY= (6, 6)
##.ACQUISITION MODE= SIMULTANEOUS
##.ACQUISITION SCHEME= undefined
##.AVERAGES= 8
##.DIGITISER RES= 18
##SPECTROMETER/DATA SYSTEM= spect
##.PULSE SEQUENCE= zg30
##.SOLVENT NAME= CDCl3
##.SHIFT REFERENCE= (INTERNAL, CDCl3, 0, 15.7039)
##AUDIT TRAIL= $$ (NUMBER, WHEN, WHO, WHERE, WHAT)
$$ ##TITLE= Audit trail, XWIN-NMR		Version 3.5
$$ ##JCAMPDX= 5.01
$$ ##ORIGIN= Bruker BioSpin GmbH
$$ ##OWNER= she
$$ F:/spectra/data/she/nmr/H-F/1/audita.txt
$$ ##AUDIT TRAIL=  $$ (NUMBER, WHEN, WHO, WHERE, WHAT)
(   1,<2019-06-27 14:49:12.43 +0400>,<she>,<DPX200>,
      <created by zg, POWCHK disabled, PULCHK disabled
       configuration hash MD5:
       00 E9 B6 7A A2 85 ED C7 34 08 36 98 17 FE 4E 26
       data hash MD5: 16K
       73 AD 9E 7E 79 65 6F C5 9B 74 2F 03 66 A3 0E B5>)
$$ ##END=
$$ 
$$ hash MD5
$$ FB F2 3D 1E 58 D6 00 17 F5 12 CC EB B5 77 04 01
##$RELAX= 
##$RELAX= 
##$RELAX= 
##$RELAX= 
##$RELAX= 
##$RELAX= 
$$ Bruker specific parameters
$$ --------------------------
##$DU= <F:/spectra>
##$EXPNO= 1
##$NAME= <H-F>
##$PROCNO= 1
##$TYPE= <nmr>
##$USER= <she>
##$AMP= (0..31)
100 100 100 100 100 100 100 100 100 100 100 100 100 100 100 100 100 100 
100 100 100 100 100 100 100 100 100 100 100 100 100 100 
##$AQSEQ= 0
##$AQ_mod= 1
##$AUNM= <au_zg>
##$AUTOPOS= <>
##$BF1= 200.13
##$BF2= 200.13
##$BF3= 200.13
##$BF4= 200.13
##$BF5= 200.13
##$BF6= 200.13
##$BF7= 200.13
##$BF8= 200.13
##$BYTORDA= 1
##$CFDGTYP= 0
##$CFRGTYP= 5
##$CHEMSTR= <none>
##$CNST= (0..31)
1 1 145 1 1 1 1 1 1 1 1 1 1 1 1 1 1 1 1 1 1 1 1 1 1 1 1 1 1 1 1 1 
##$CPDPRG= <>
##$CPDPRG1= <>
##$CPDPRG2= <>
##$CPDPRG3= <>
##$CPDPRG4= <mlev>
##$CPDPRG5= <mlev>
##$CPDPRG6= <mlev>
##$CPDPRG7= <mlev>
##$CPDPRG8= <mlev>
##$CPDPRGB= <>
##$CPDPRGT= <>
##$D= (0..31)
0 1.2 0 0 0 0 0 0 0 0 0 0.03 0 0 0 0 0 0 0 0 0 0 0 0 0 0 0 0 0 0 0 0 
##$DATE= 1561632551
##$DBL= (0..7)
120 120 120 120 120 120 120 120 
##$DBP= (0..7)
150 150 150 150 150 150 150 150 
##$DBP07= 0
##$DBPNAM0= <>
##$DBPNAM1= <>
##$DBPNAM2= <>
##$DBPNAM3= <>
##$DBPNAM4= <>
##$DBPNAM5= <>
##$DBPNAM6= <>
##$DBPNAM7= <>
##$DBPOAL= (0..7)
0.5 0.5 0.5 0.5 0.5 0.5 0.5 0.5 
##$DBPOFFS= (0..7)
0 0 0 0 0 0 0 0 
##$DE= 6
##$DECBNUC= <off>
##$DECIM= 24
##$DECNUC= <off>
##$DECSTAT= 4
##$DIGMOD= 1
##$DIGTYP= 9
##$DL= (0..7)
0 120 120 120 120 120 120 120 
##$DP= (0..7)
150 150 150 150 150 150 150 150 
##$DP07= 0
##$DPNAME0= <>
##$DPNAME1= <>
##$DPNAME2= <>
##$DPNAME3= <>
##$DPNAME4= <>
##$DPNAME5= <>
##$DPNAME6= <>
##$DPNAME7= <>
##$DPOAL= (0..7)
0.5 0.5 0.5 0.5 0.5 0.5 0.5 0.5 
##$DPOFFS= (0..7)
0 0 0 0 0 0 0 0 
##$DQDMODE= 0
##$DR= 18
##$DS= 0
##$DSLIST= <SSSSSSSSSSSSSSS>
##$DSPFIRM= 0
$$ [...]
##$SUBNAM2= <"">
##$SUBNAM3= <"">
##$SUBNAM4= <"">
##$SUBNAM5= <"">
##$SUBNAM6= <"">
##$SUBNAM7= <"">
##$SUBNAM8= <"">
##$SUBNAM9= <"">
##$SW= 24.9336996594482
##$SWIBOX= (0..15)
0 0 2 0 0 0 0 0 0 0 0 0 0 0 0 0 
##$SW_h= 4990.01996007984
##$TD= 16384
##$TD0= 1
##$TE= 0
##$TE2= 300
##$TE3= 300
##$TEG= 300
##$TL= (0..7)
0 120 120 120 120 120 120 120 
##$TP= (0..7)
150 150 150 150 150 150 150 150 
##$TP07= 0
##$TPNAME0= <>
##$TPNAME1= <>
##$TPNAME2= <>
##$TPNAME3= <>
##$TPNAME4= <>
##$TPNAME5= <>
##$TPNAME6= <>
##$TPNAME7= <>
##$TPOAL= (0..7)
0.5 0.5 0.5 0.5 0.5 0.5 0.5 0.5 
##$TPOFFS= (0..7)
0 0 0 0 0 0 0 0 
##$TUNHIN= 0
##$TUNHOUT= 0
##$TUNXOUT= 0
##$USERA1= <user>
##$USERA2= <user>
##$USERA3= <user>
##$USERA4= <user>
##$USERA5= <user>
##$V9= 5
##$VALIST= <valist>
##$VCLIST= <CCCCCCCCCCCCCCC>
##$VD= 0
##$VDLIST= <DDDDDDDDDDDDDDD>
##$VPLIST= <PPPPPPPPPPPPPPP>
##$VTLIST= <TTTTTTTTTTTTTTT>
##$WBST= 1024
##$WBSW= 4
##$XGAIN= (0..3)
0 0 0 0 
##$XL= 0
##$YL= 0
##$YMAX_a= 302522
##$YMIN_a= -470939
##$ZGOPTNS= <>
##$ZL1= 120
##$ZL2= 120
##$ZL3= 120
##$ZL4= 120
##$ABSF1= 10
##$ABSF2= 0
##$ABSG= 5
##$ABSL= 3
##$ALPHA= 0
##$AQORDER= 0
##$ASSFAC= 0
##$ASSFACI= 0
##$ASSFACX= 0
##$ASSWID= 0
##$AUNMP= <proc_1d>
##$AZFE= 0.1
##$AZFW= 0.1
##$BCFW= 1
##$BC_mod= 2
##$BYTORDP= 1
##$COROFFS= 0
##$CY= 11.3945322036743
##$DATMOD= 1
##$DC= 2
##$DFILT= <>
##$DTYPP= 0
##$F1P= 18.9103706918063
##$F2P= -1.10871071338519
##$FCOR= 0.5
##$FTSIZE= 0
##$FT_mod= 4
##$GAMMA= 1
##$GB= 0.15
##$INTBC= 1
##$INTSCL= 1
##$ISEN= 128
##$LB= 0.24
##$LEV0= 0
##$LPBIN= 0
##$MAXI= 10000
##$MC2= 0
##$MEAN= 0
##$ME_mod= 0
##$MI= 1.114404
##$NCOEF= 0
##$NC_proc= 0
##$NLEV= 6
##$NOISF1= 3.799351
##$NOISF2= 2.8
##$NSP= 1
##$NTH_PI= 0
##$NZP= 0
##$OFFSET= 15.70392
##$PC= 1
##$PHC0= -8500.322
##$PHC1= 11.40098
##$PH_mod= 1
##$PKNL= yes
##$PPARMOD= 0
##$PSCAL= 0
##$PSIGN= 0
##$REVERSE= no
##$SF= 200.130013532006
##$SI= 16384
##$SIGF1= 3
##$SIGF2= 2
##$SINO= 400
##$SIOLD= 16384
##$SREGLST= <1H.CDCl3>
##$SSB= 0
##$STSI= 0
##$STSR= 0
##$SW_p= 3612.71676300578
##$SYMM= 0
##$S_DEV= 0
##$TDeff= 0
##$TDoff= 0
##$TI= <>
##$TILT= no
##$TM1= 0
##$TM2= 0
##$TOPLEV= 0
##$USERP1= <user>
##$USERP2= <user>
##$USERP3= <user>
##$USERP4= <user>
##$USERP5= <user>
##$WDW= 1
##$XDIM= 8192
##$YMAX_p= 0
##$YMIN_p= 0
$$ End of Bruker specific parameters
$$ ---------------------------------
##NTUPLES= NMR FID
##VAR_NAME=  TIME,          FID/REAL,        FID/IMAG
##SYMBOL=    X,             R,               I
##VAR_TYPE=  INDEPENDENT,   DEPENDENT,       DEPENDENT
##VAR_FORM=  AFFN,          ASDF,            ASDF
##VAR_DIM=   8192,          8192,            8192
##UNITS=     SECONDS,       ARBITRARY UNITS, ARBITRARY UNITS
##FACTOR=    0.0002004,     1,               1
##FIRST=     0,             0,               0
##LAST=      1.6414764,     0,               0
##MIN=       0,             -470939,         0
##MAX=       1.6414764,     302522,          0
$$ Real data points
##PAGE= N=1
##DATA TABLE= (X++(R..R)), XYDATA
0@%%%%Qj6J6j6K4l2M0m8N6p2Q8j09J33j60J90k22K62l05L53m11M74n42O19p05
28c75Q02r07J022j153J297j451J620j810K015k239K487k759L057l384L749m152
44b181M598n096N656o291P013p849Q826r986J1392j3133J5361j8328K2501k8850
58a6367L9802o3872K07383j54284l88232L40850L17783j12137l15183N4996J74650
69H5389n0262j77258Q6190J70323o5281k09643M1178J95697k14j99390k3094J82280
81C5915P9842j28397n7550J05556M2794j21502l2946J59385Q7856j75161j86883
92a91091P7518K14590M4577j34469r7114K8965N6528K5050J4645o413n7595n6457
104h1266J6297O0707K4136k5501l2185j0325K0604M5283K4185l7498o0281P9P0820
$$ plain form
0 0 0 0 0 0 8 -8 8 -8 16 -16 24 -24 32 -40 48 -61 72 -88 102 -120 142 -163 190 -221 253 -289 330 -375
28 -375 427 -480 542 -611 686 -765 855 -955 1060 -1179 1308 -1451 1606 -1778 1971 -2181
44 -2181 2417 -2679 2977 -3314 3699 -4150 4676 -5310 6082 -7051 8310 -10018 12483 -16367
58 -16367 23435 -40437 166946 12662 -375570 -34720 283063 170926 -144257 -89261 85389
69 85389 35127 -142131 -55941 114382 49101 -160542 -119364 76333 76119 -123271 -146365 35915
81 35915 115757 -12640 -70190 35366 78160 -43342 -76288 83097 170953 -4208 -191091
92 -191091 -113573 101017 145594 11125 -85989 -57024 -496 24554 39199 32786 -24809 -81266
104 -81266 -64969 -4262 19874 -5627 -37812 -48137 -27533 17750 41935 4437 -55844 -55765 15055
117A5055N1976l3797q0717l5229N2557R4774L8450p4921j16005j6496J03278P9359
129G8284m8433q9833j0473M4379J2358L920N5701L8765p6392r6915O0419J57518
141A29298O059j70899q4036J25937J23653o2114j14638J5016P0130j5389l4514
152a1497N2632L1632j10956j02384J00524J66807l6768j84404m0240J48697Q9288
163A03331p7655o8543M6335K8269o8780k4186J04261O4746j05422j18458O7888
174d8214J60507J6410j34400p6064P0291Q1997j5592n4985j8887k683q217K1316
186h521M8481M427o0984n0004K7850O6257K1895m3265n9249j9400L7993O1228
198B6708K0306m5474n5203M959N5415L8780j1564m1410l7006o001L7141N0406
$$ plain form
117 15055 67031 33234 -47483 -82712 -30155 64619 103069 28148 -87857 -104353 -1075 78284
129 78284 29851 -59982 -70455 -26076 -13718 -9798 45903 84668 8276 -88639 -28220 129298
141 129298 135357 -35542 -119578 6359 130012 67898 -46740 -31724 38406 23017 -11497
152 -11497 41135 72767 -38189 -140573 -40049 126758 89990 -94414 -134654 14043 103331
163 103331 25676 -42867 3468 31737 -37043 -61229 43032 107778 2356 -116102 -48214
174 -48214 112293 128703 -5697 -81761 -11470 70527 54935 -50 -18937 -21620 -29837 -8521
186 -8521 39960 44387 -16597 -66601 -38751 27506 49401 6136 -53113 -72513 -34520 26708
198 26708 47014 1540 -53663 -48704 6711 45491 33927 -7483 -44489 -50490 -13349 37057
210C7057M107n7767n0946K8282P7980L1517m9073o2442r904M0100M3879Q975l7030
223D735n3278j1183N6825O6979m729p3717m8255L3776O1835J4258l4947m0118
235b7819j8113J5300M6402L7467k2165o2605j9794N0720N0448j4947m6699j8013
247b9818N584P469K5749L8134j1890p2773l1943P7026R1035l1639j15901l7507
259h6474Q5033P4584l1676o6764p066L1687J0158J717K2407N643m8960m7865L1801
272b5775P5153Q278p2425n2642L0361O2205K2656k3479l7643k3454Q209M0763
284A2207L6091j9517o5194l2653M6667P0337Q594n9147m8582J8348N6853K4911
296D8915l0057m3167j0154J8476K0348J2974L455j7491l3545p854M4779N3585
$$ plain form
210 37057 41164 -16603 -67549 -39267 38713 70230 21157 -41285 -51189 -11089 32790 41765 4735
223 4735 -48543 -59726 -2901 64078 59349 -14368 -62623 -28847 32988 47246 12299 -27819
235 -27819 -45932 -30632 15770 53237 31072 -31533 -51327 -607 49841 34894 -11805 -29818
247 -29818 -24234 -16765 8984 47118 35228 -37545 -69488 7538 98573 66934 -48967 -86474
259 -86474 -1441 73143 41467 -25297 -32363 -676 9482 11199 33606 39249 -9711 -57576 -25775
272 -25775 49378 57656 -14769 -67411 -37050 25155 47811 24332 -13311 -36765 -28556 12207
284 12207 48298 28781 -36413 -69066 -22399 47938 56532 -2615 -51197 -32849 24004 48915
296 48915 18858 -24309 -34463 -15987 4361 17335 20790 3299 -30246 -38100 6679 60264
308F0264j4831p8579m3783N1882P8196K562o8628m6175K4471N3970K4115j5996
320B7468l2332k5909J587L5097L1843j4461m7170j8143K9401L5709N816j5766
332A3140j9989j7802K558L5427L5255k4722o9772k2540O4945O7267j7807p0782
344b4822k9309L6934M6097R207k0258l0265k5309M515M2938L6918k1068n5327
356b9749j3777M3923L9517r222l3300j6391J476Q798K0356K0243j7521n0780j4955
369e1382N7481O0857k3457p8651l0711N2804N9706o624n1779k9384J3140K5972
381b028J7541Q285q969k8443k2168J7379M3963J5777l7670m7723L046M9433L4370
394D2793j7938m2387j7054K2815L7544J4808k3530m1409j7940L0062M9994R238
$$ plain form
308 60264 45433 -33146 -76929 -25047 53149 55711 -12917 -59092 -34621 19349 43464 27468
320 27468 -4864 -30773 -29186 5911 37754 23293 -23877 -42020 -12619 23090 28906 13140
332 13140 -6849 -24651 -22093 13334 48589 23867 -45905 -68445 -3500 63767 45960 -24822
344 -24822 -54131 -17197 28900 38107 17849 -12416 -37725 -33210 9728 46646 25578 -29749
356 -29749 -43526 397 39914 30692 -2608 -18999 -17523 -8725 11631 31874 14353 -36427 -51382
369 -51382 6099 66956 43499 -35152 -65863 -13059 46647 40023 -11756 -41140 -28000 -2028
381 -2028 15513 23798 14829 -13614 -35782 -18403 25560 41337 3667 -44056 -41010 8423 42793
394 42793 24855 -17532 -34586 -11771 25773 40581 17051 -24358 -42298 -12236 37758 46996
406D6996m6001m4961J2767N1010K6124k1302l5839j4475R021J8666J8268L873
418B4147k4573l4748Q31M4139L5526k1011n1458j9207L5332M3026J55l8293l2140
431c8274O781L6871L0307n308l5935k6554J3439L7806K0912j7707l4859j6975
443b9496J6219L0823J6336j1825l1911k0700J5630L8494J6788k9660m5402q776
455d3480L8280L9282q343m4256k6467K0647L8757J4821j8517k9683j3438J2468
467a9929K7961J9620j1480l4817j9808K4015M2638J0663l0546l4031k88K8081
479B079K5454j028k6656k8607o05L4411L4804j0541m8336k5052L1079M5041K954
492C4997l6128k9315M199K3797J9377N585j3258k6953j3720K2367L8024N769l5725
$$ plain form
406 46996 995 -43966 -31199 19811 45935 24633 -11206 -25681 -16660 2006 20274 24147
418 24147 -426 -35174 -34343 9796 45322 24311 -27147 -46354 -11022 32004 32159 -6134 -38274
431 -38274 -31493 5378 35685 30377 -5558 -32112 -18673 19133 40045 22338 -12521 -29496
443 -29496 -13277 17546 33882 22057 -9854 -30554 -14924 23570 40358 10698 -34704 -43480
455 -43480 -5200 34082 25739 -18517 -44984 -24337 14420 29241 10724 -18959 -32397 -19929
467 -19929 8032 27652 16172 -18645 -38453 -14438 28200 38863 8317 -25714 -26002 2079
479 2079 27533 26505 -151 -28758 -29363 5048 39852 29311 -19025 -44077 -12998 32043 34997
492 34997 -1131 -30446 -26247 -2450 16927 22512 9254 -17699 -31419 -9052 28972 34741 -984
505i84l4473O150L6238K3619j3079l2261j7024J5321L2972J6166k1026l5714q025
518c2120L0289L1041l302k8178k1128N283K5089K2606L23k3895k7515l87L1736
531I842K7675j0161l6314k1386J2975L1022J7712j5055l3207j7574J9471L4324
543A9324Q001l0397l3160M435L2236K1814r531k4718j4340Q566K4388J9327n195
556B0750k7519k1534J1292L5834J9302j9486l4932j0245K3227L1098O673k4736
568I724l2389n303K7903K8695n389l4060k2774J3620K9716J1055j3914k1392j0517
581b5025Q587K2325J5512j0944k8105j3457J9251L1628R246k2879k9018k377K6020
594G64K7173p90k9405k5967O664L2068K0871j3518l1285j4326J7731K8161P250
$$ plain form
505 -984 -35457 -29307 6931 30550 17471 -14790 -31814 -16493 16479 32645 11619 -24095 -32120
518 -32120 -1831 29210 25908 -2270 -23398 -18115 6974 29580 29903 6008 -21507 -21894 9842
531 9842 37517 27356 -8958 -30344 -17369 13653 31365 16310 -16897 -34471 -15000 19324
543 19324 27325 -3072 -36232 -31797 439 22253 12722 -11996 -26336 -17770 6618 25945 20750
556 20750 -6769 -28303 -17011 18823 38125 18639 -16293 -26538 -3311 27787 34460 9724
568 9724 -22665 -27968 -65 28630 23241 -10819 -33593 -19973 9743 20798 6884 -14508 -25025
581 -25025 -16438 5887 21399 10455 -17650 -31107 -11856 19772 29018 6139 -22879 -25256 764
594 764 27937 27147 -2258 -28225 -21561 10507 31378 17860 -13425 -27751 -10020 18141 25391
607B5391j8302k3242o039J5887K2347P649j7518k5016m587K2265K5373J23k5130
620g99k2965K698K6112K1842p365l1174k0696J5462L2781J0685k1664k6830m492
633b6405J9934K2720K554j8783k1185j712K1184K3510M6k2682k0563M256K5900
646H774K0199p488k7135j7474J1943K7783J3122j5308k8865j0993J9673K7572
658B1803K405k5114k3466K327K2565J7182l904k0034j7274L000K2186J9182o215
671A4643k5530j4697J2310K5221J2496j2020k4565j0585J6704K6889P461k1181
683G146k5704j411K4462K1674m488k5534j8443P816K3999J3633j0734k2409j1898
696b1891R450K1351J2309j1339k4633j0769J7283K4873M782j8733k1640j940J9078
$$ plain form
607 25391 7089 -16153 -22192 -6305 16042 23691 6173 -18843 -23430 -1165 24208 24331 -799
620 -799 -23764 -21066 5046 26888 19523 -11651 -32347 -16885 15896 26581 4917 -21913 -26405
633 -26405 -6471 16249 18803 20 -21165 -22877 -1693 21817 21863 -819 -21382 -17126 8774
646 8774 28973 21485 -5650 -23124 -11181 16602 29724 14416 -14449 -25442 -5769 21803
658 21803 24208 -906 -24372 -22045 520 17702 13798 -6236 -23510 -20510 1676 20858 14643
671 14643 -10887 -25584 -13274 11947 24443 12423 -12142 -22727 -6023 20866 28327 7146
683 7146 -18558 -19969 4493 26167 21679 -3855 -22298 -14482 9517 23150 12416 -9993 -21891
696 -21891 -12441 8910 21219 9880 -14753 -25522 -8239 16634 21416 2683 -18957 -20897 -1819
709a819K1415M0k1953k1240N331K5889J5908j0748k3922j1027J1382K1737J0009
722B1002j3158k3043p109J6398K1675M085j7022k0287l044J9988K0656r26k2148
735b933j9095N520K3073J5023q093k2153j3723J0431K3435J0643j5272k3001n482
748b1627J5725J9540L770j5319j9778k249J8726J9339r08k0427j6977N168K0578
761E561J4678o146k1303j3221J0149K3787J0225j4654k1645n330J4956J9599L516
774B0172j6269k0224j332J8723J8493k188j9711j6635M676J9788J4656o603k1178
787g632j3559J0208K2128Q858j2496j9256o176J3437J9145M585j6879j8910N76
800a5971J8054J5217l563j7348j3138L983J8078J4405o030k1902j2769J0494K1328
$$ plain form
709 -1819 19596 19636 -2317 -23557 -18226 7663 23571 12823 -11099 -22126 -10744 10993 21002
722 21002 7844 -15199 -22308 -5910 15765 19850 2828 -17459 -20503 -515 20141 19215 -2933
735 -2933 -22028 -16508 6565 21588 13495 -8658 -22381 -11950 11485 22128 6856 -16145 -21627
748 -21627 -5902 13638 17408 2089 -17689 -19938 -1212 18127 17219 -3208 -20185 -15017 5561
761 5561 20239 14093 -7210 -20431 -10282 13505 23730 9076 -12569 -17899 -2943 16656 20172
774 20172 3903 -16321 -17653 1070 19563 17375 -2336 -18971 -14295 5493 20149 13546 -7632
787 -7632 -21191 -10983 11145 20003 7507 -11749 -17925 -4488 14657 19242 2363 -16547 -15971
800 -15971 2083 17300 13737 -3611 -16749 -12766 5312 19717 13687 -8215 -20984 -10490 10838
813A0838Q456j2232k0099p298J3774K1404M708j6844j8824r84J7468J5470k351
826A3486j7400j3574M204J8311J1713p216j7689q462R182J6242O687q874j7959
839a1349p548J2735J9908L614j6535j7227k76J7330J6297j192j8581j6170L968
852a5026K0422J2774p742j8753r070R851J7077P558r947j7742n629J2525J6171
865A2469J716j3026j3487j469J3841J5461n01j6853j4312M782J7421J1488p491
878A0039j7792r660Q579J8337Q699j1238j9072m549J4207J6083R47j3576j5159
891a4155n92J4405J4515j414j5569j2433L923J6324J0996n892j6737r459P649
904h439J6825P462j0517j6610l486J2433J4674K262j2042j5062j234J4878J3576
$$ plain form
813 10838 19294 7062 -13037 -20335 -6561 14843 19551 2707 -16117 -17101 367 15837 13486
826 13486 -3914 -17488 -13284 5027 16740 9524 -8165 -16627 -7445 8797 15484 6610 -11349
839 -11349 -18897 -6162 13746 17360 825 -16402 -16678 652 16949 15757 -2824 -18994 -15026
852 -15026 5396 18170 10428 -8325 -17395 -7544 9533 17091 7144 -10598 -16227 -3702 12469
865 12469 14185 1159 -12328 -13797 44 15505 15004 -1849 -16161 -11379 6042 17530 10039
878 10039 -7753 -17413 -8834 9503 18202 6964 -12108 -16657 -2450 13633 14580 1004 -14155
891 -14155 -14747 -342 14173 12759 -2810 -15243 -11320 5004 16000 10108 -6629 -16088 -8439
904 -8439 8386 15848 5331 -11279 -14765 -2332 12342 14604 2562 -12500 -13734 1144 14720
917A4720l420j5714j0683M892J5254J0027n499j5449q988O676J6413P752j0145
930E836j6909n106J1646J5874M089j3091j5673j36J5257J2972k498j4964j1158
943a3861L957J4903R670n890j4880p139Q738J4535M661j0426j3421k691R214J2838
957A0208K698j1766j3693r8J3790J3098j831j4549j2569L101J5663J0310n771
970H591j5957q506Q237J5739O031r601j3779m179J0163J4252Q26j3107j1915J943
984a1262J2647R938k835j2079r065L903J3353Q104n846j4305p355P392J4500N424
998A2514q232j4050m468J0761J4193J790j2051j2768k10J1984J1641j201j3326
1011c423j0433M987J3972Q048o256j2981o217P484J2518L890q022j2484l195J0588
$$ plain form
917 14720 11300 -4414 -15097 -10205 5049 15076 9577 -5872 -14860 -8184 8229 15981 5836
930 5836 -11073 -16179 -4533 11341 15430 2339 -13334 -13470 1787 14759 12261 -2703 -13861
943 -13861 -9904 4999 14669 8779 -6101 -13240 -4502 10033 14694 4268 -9153 -11844 -2630 10208
957 10208 12906 1140 -12553 -12651 1139 14237 12406 -2143 -14712 -11611 4052 14362 8591
970 8591 -7366 -15872 -7635 8104 14135 4534 -9245 -13424 -3261 10991 11817 -1290 -13205 -11262
984 -11262 1385 11323 8488 -3591 -12656 -8753 4600 12704 6858 -7447 -14802 -7410 7090 12514
998 12514 4282 -9768 -14236 -3475 10718 12508 457 -12311 -12521 -537 11104 9903 -3423
1011 -3423 -13856 -8869 5103 13151 6895 -6086 -12303 -4819 7699 11589 3567 -8917 -12112 -1524
1025a524J2605J392j0999j1504O27J1568J0770k415j3092r258M260J3096Q155
1038A3681n157j3091o113P112J2462M622q617j2830l105R768J1701Q94r833j0305
1052h811L3J1280J0342k974j1605r408L398J1853P879n099j2851o003P319J2436
1066G789M754q594j2340k480R316J0268J261j0348j0792P91J1422R440k619j1259
1080c391q134L472J1416O919n551j2001n678O030J1618M846p296j1290k931Q906
1094c065J0717J323r766j0409j31J1304Q852k471j0202p619L815J1555O635n446
1108E092j1769m652O107J0754M041p460j0974j727Q207J0686J346r505r478L20
1122i012R997Q530k055j0048p367L110J1558P159m966j0560n095O395J1030L560
$$ plain form
1025 -1524 11081 12473 1474 -10030 -9403 2165 12935 10520 -2572 -11830 -7570 5526 13681
1038 13681 8524 -4567 -10680 -3568 8894 13516 4899 -7931 -11036 -1268 10433 11327 1494 -8811
1052 -8811 -8778 2502 12844 9870 -1735 -11143 -7745 4108 11987 6888 -5963 -11966 -4647 7789
1066 7789 12543 3949 -8391 -10871 -1555 8713 9974 -374 -11166 -10375 1047 10487 7868 -3391
1080 -3391 -11525 -8053 3363 10282 4731 -7270 -12948 -6918 4700 9546 2250 -9040 -11971 -3065
1094 -3065 7652 8975 -791 -11200 -11331 -27 8825 6354 -3848 -11467 -7652 3903 10538 5092
1108 5092 -6677 -11329 -5222 5532 9573 2113 -8861 -10588 -2381 8305 9651 146 -9332 -9012
1122 -9012 985 9515 7460 -2588 -9955 -6845 4713 11872 6906 -3654 -8749 -2354 8676 12236
1136A2236q215r981j820Q092R541Q43q853q770J076R080P851k407j0242p380L310
1151e639J0290N716m867r557n189N966J0450L922p445r822k386P751R814P56r550
1166B10q618J693R173P726k073r923o898L708Q935N073m625r705m884N735R529
1181E056L187o464r170k274P750Q839p9r181p894J153R065P436k149r597o118
1196a0440M060R553N045m783j0056m024O251Q840K492o718p913j905P406Q409
1210F217N46p816p902O74Q631P189j930r406n483M392R088M751m354q836l743
1225g982N982Q126K765o839q534j272P812P582np190p283Q96Q008O439k352q295
1241b142n573L034Q767N422m597q781l376O008Q717K148o512q070p37O623P192
$$ plain form
1136 12236 4021 -5960 -7780 312 9853 10696 1843 -6927 -5851 3229 11080 8673 -1569 -8949 -5639
1151 -5639 4651 10367 5500 -4057 -9246 -3280 7170 11092 3647 -6175 -8561 -810 9004 9760 210
1166 210 -8408 -6715 2458 10184 8111 -1812 -8710 -5002 3933 9006 4381 -5324 -10208 -4473 5056
1181 5056 8243 1779 -7391 -9665 -1915 6924 6845 -2336 -10230 -9077 -12 7424 5275 -4322 -10440
1196 -10440 -6380 3173 8218 3435 -6621 -10645 -4394 4446 6938 220 -7693 -9598 -2192 6217
1210 6217 6763 -1053 -8955 -8281 350 7539 5609 -3797 -9280 -4888 4200 8951 4597 -4239 -7982
1225 -7982 -2000 6126 8891 2052 -6482 -7754 58 7640 7635 445 -6838 -5942 2066 8505 6153 -2142
1241 -2142 -7715 -4681 4086 9508 4911 -3870 -7246 -1238 7479 9627 3115 -4955 -5692 931 8123
1256H123j02p098p051J299Q454N716k804p831n310K379Q123M391m547q529l234
1271h021N600P862J942n919p662j287O616P408k28p954o784K161Q311N261k743
1286D563p546m480K884P658M139m183q222k841M529P430K411n872p021q40O532
1301h59O588m28p509n750J728P162M957j688p625n143L845Q552L691n491p316
1316e286j715M522O629K085m951o944j676O235P322K43p150o170J687O911M892
1331F634k035p432m783M147P494L093m537o365k203M688O771J593n765o538n0
1346e288N932O327j085o215m913J242O062N710j920p887m676M127P359K356m267
1361B864o449k594M939P529N40n981o250K26O149M633j210n524m752J061O260
$$ plain form
1256 8123 8021 923 -6128 -4829 3625 9341 6537 -1294 -6604 -4225 3898 8289 3742 -4787 -8021
1271 -8021 -2421 5441 7383 1464 -6198 -7485 -869 6539 6311 -1643 -8427 -6266 2045 7306 4563
1286 4563 -2983 -7463 -4579 3079 7218 3035 -5187 -8028 -3499 3931 6342 470 -6551 -7391 -859
1301 -859 5729 5301 -2208 -7958 -6230 932 5889 4201 -3424 -8567 -4722 3830 7521 2030 -5286
1316 -5286 -7001 -2479 4150 6235 1284 -5660 -7336 -1101 6221 6464 -686 -6856 -5169 1742 6634
1331 6634 4599 -2833 -7616 -3469 4025 7118 2581 -3784 -5987 -1299 5472 7065 1300 -5238 -5288
1346 -5288 644 6971 5886 -329 -5242 -4000 2062 7772 5852 -2035 -6711 -2584 4775 7131 2864
1361 2864 -3585 -6179 -1240 6289 6829 848 -5402 -5176 973 5606 4396 -1128 -5880 -4819 1441
1376A441N083k344p395l727L764O292K611l369p104k637M849P525J202o049n959
1391e817M82N951N361j078o098m877J630O779L864l241o243k151K711N561L163
1406E997l090p129k631N315N753R58n456n114l83N394N304n19o155n198K345O847
1422B238L654l725n834k114K738O068K806l983o190j175M816N516L37m276n026
1437d150m54M916N719m69o345m474K113O306K927k623n610l441L124O270K040
1452E849m806n822l26M580M251K32l942n201l89N460M988j275n933l670K286N414
1468A696L490k021n647l288L355P022J236m640n074j2L813M901Q03m644n112M94
1484c628N479L602j651n246k941J596M654K880j478o056l391L503O191Q58m031
$$ plain form
1376 1441 6524 4180 -3215 -6942 -3178 3114 5725 2356 -4748 -7385 -2536 4989 6191 142 -5817
1391 -5817 -5335 616 5977 4899 -1199 -6076 -4446 2333 6197 2956 -3287 -5438 -2727 2834 5997
1406 5997 2907 -4222 -6853 -1538 4215 5173 -283 -5397 -5780 -386 4918 4399 -1756 -6954 -4609 2238
1422 2238 5892 2167 -3667 -5781 -3043 3025 5831 1848 -4342 -5517 -701 4815 5152 876 -4150
1437 -4150 -4604 312 6031 5562 -783 -5257 -3144 3162 6089 3466 -2144 -5585 -2461 3809 5849
1452 5849 1043 -4779 -5105 -525 3726 3958 16 -5185 -5574 -114 4874 3599 -2334 -6004 -3718 1696
1468 1696 5186 3165 -2482 -5770 -2415 4607 5843 1203 -3871 -3883 -70 4831 5634 990 -4122 -3628
1484 -3628 1851 5453 3802 -1444 -4385 -2789 1865 4745 3267 -2789 -6180 -2677 3514 4372 341
1499C41m692j170L609N136J231n568m807J311N566L686j626m880k895K440M734
1514B416L190k589n416j594L590M701J402l322m544j661L863N608k83n712m266
1529d617J287M670K942j294m774l325J197N489K445l099n457j288L939L679J345
1544C139k797m608r27M295N046k74m468l549J045M427L756j020m685l525K065
1559b080N505K294l460m700j228L170L792J222l873m437n64M469L935j162m191
1574a308l238M43M330L522j249m922l042K493N083J998k842m287j911L200M743
1589C013J281l945m682L97M738L326r50l585l161P37M323L615j714m658k490K571
1605a184M484J859k734m125j415L037M553N90m201m601M97L575L269q21l850l954
$$ plain form
1499 341 -4351 -5521 -1912 3224 4455 -1113 -5920 -4609 957 4643 3017 -1863 -4758 -2318 2416
1514 2416 5606 3017 -2399 -3993 -403 4298 5700 2378 -2166 -3827 36 5644 5361 -351 -4617
1529 -4617 -3330 1340 4282 2988 -1786 -5111 -3914 1575 4020 921 -4536 -5824 -1885 1794 3139
1544 3139 342 -4266 -5193 -898 4148 3874 -594 -4143 -3098 1329 5085 4065 -620 -4145 -2080
1559 -2080 3425 5719 2259 -2441 -3669 -499 3293 4515 642 -3795 -4359 110 4045 2883 -1308
1574 -1308 -4546 -4103 227 3749 2500 -2422 -5464 -2971 2112 4110 1268 -3019 -4930 -1730 3013
1589 3013 4294 349 -4333 -3936 802 4128 3178 -407 -3568 -2831 1492 5107 3393 -1265 -3755 -1184
1605 -1184 3300 5159 2425 -1700 -3115 -78 4475 5065 864 -3737 -3240 335 3604 2783 -1067 -5021
1621e021J047M418K859k654m164j783K191M386J807k286l969j606L702M490J053
1636D470l614l671N12L856L467r9l956l727J356M410K157j961m360k190J769L599
1652B018J327k921m341q28L053L431J14l566l106K99L521L494k55l954l285J927
1668c072M976K116j736l667k062K445M141J538k842m201q53L763L287k10l365
1683B58l176k07L403L380j079l837k600J631L516K066j199m137k228K492M300
1698B583J330k622m029j020L275M002m64l349l171K58L664K713j069l956k181
1713d036J296L450K213j387l900j669K751L682J387k725l181n86L348L404J27
1728D174l042l744P60L714K438j601l589k005J335L275J664k245m024j379K433
$$ plain form
1621 -5021 -3974 444 3303 649 -3515 -5298 -3107 1279 3086 800 -3169 -4775 -1073 3417 4470
1636 4470 856 -2815 -2303 1553 5020 4921 965 -2762 -1406 3004 5161 3200 -1160 -3350 -1581 2018
1652 2018 3345 424 -3917 -4745 -1692 1739 1853 -1713 -4819 -4520 -999 2495 2240 -1714 -4999 -3072
1668 -3072 1904 4020 2284 -1383 -3445 -1000 3141 4679 1837 -2364 -3217 546 3833 3623 258
1683 258 -2918 -3125 278 3658 2579 -1258 -3858 -2227 1289 3355 2156 -1981 -4209 -1717 2583
1698 2583 3913 1291 -2738 -3758 -483 3519 3055 -294 -3465 -3207 457 3170 2101 -1855 -4036
1713 -4036 -2740 710 2923 1536 -2364 -4033 -1282 2400 3787 1062 -2119 -2705 643 4047 4174
1728 4174 1132 -2612 -1852 1862 4300 2699 -890 -2895 -1560 1715 3379 1134 -2890 -4269 -1836
1743a836L328O12k810l398K0K710L771l83k566l127N30M434K674j297l195k313
1759b846J508M132J898k549l503j036K438K873P71l080l488j3K946K760j73l589
1775i51k860R68L392K176j195l222k253J516L892J970k251l380q37K309L406J025
1791C705k825l319j33K765K874m72l135k573R95L099K213j599l214k080J785L604
1807A690J375k264l347o01K171L678K31k851l081K28L041K542L8l508k449J157
1823a950L066K089j305l692j479J715L290J183k186k976r75K354K969O65k871
1838a03k691K51L091K499n94l572j813R85L009K068j185l276j776J888L258J075
1854C114k044l052j004K771K770K05k793k709N30L226K165p41l125j865J258K632
$$ plain form
1743 -1836 1492 2104 -706 -4104 -4084 -1374 2397 2014 -552 -3679 -3149 1285 3959 2662 -533 -2846
1759 -2846 -1338 2794 4692 2143 -1360 -2396 42 2915 3686 606 -2882 -2895 51 2811 2638 -951
1775 -951 -3811 -2843 549 2725 1530 -1692 -3945 -2429 1463 3433 1182 -2198 -3035 -726 2680 3705
1791 3705 880 -2439 -2572 193 3067 2595 -540 -3113 -2118 981 3194 1595 -1619 -3699 -1914 1690
1807 1690 3065 801 -2546 -3147 -976 2702 2933 82 -2999 -2771 270 2812 2850 -658 -3107 -1950
1823 -1950 1116 3205 1900 -1792 -3271 -1556 1734 2917 731 -2245 -3220 -866 2103 2768 -103
1838 -103 -2794 -2543 548 3047 2453 -1119 -2932 -1947 1062 3130 1945 -1331 -3107 -1219 2039 3114
1854 3114 1070 -1982 -2986 -215 2555 2760 -33 -2742 -2212 1014 3179 2438 -687 -2552 -1294 1338
1870A338J872j773l218r70J639L068J455k250l233m82K339K843k64k866k420J17
1886b805K897K696j190k539j996R85L437J459j585l274j003J900L192J085k493
1901G66l142l4K575K595l9k586k502L32L031K073j010l009j724R55L107J243j663
1918I68k790q50J422K940Q59k226l244j65K728K531k94k684k341O31L309J749
1934B543j132k971j262R49L380J336j623k718p79J788K725J036k441k731J14K408
1950F22K235n9k312k709O62K477J999q67l328j428J357K572J230j942k593j229
1966c313J977L004L08k292k503j6K274K212L74k803j971O28K947K247r28k762
1982f17j470J336L066J268j590l083r45K047K861K06k496k170k68K066K468o04
$$ plain form
1870 1338 3210 1437 -1781 -2751 -1112 1956 3411 1161 -2072 -2554 -215 2628 2364 -502 -2922 -2805
1886 -2805 92 2788 1598 -941 -2937 -1952 1485 2944 1359 -1915 -2918 -1018 2174 3259 766
1901 766 -2376 -2410 165 2760 2721 135 -2367 -2035 996 3069 2059 -950 -2674 -1719 1388 2631 968
1918 968 -1822 -2672 -1250 1690 2549 323 -2921 -3086 -358 2173 1879 -805 -3146 -2515 794 2543
1934 2543 1411 -1560 -2822 -1873 1507 2843 1220 -1498 -2277 -489 2236 3272 831 -1900 -1786 622
1950 622 2857 2798 486 -2223 -1561 916 2915 2048 -1280 -2708 -1351 1221 2451 509 -2084 -3313
1966 -3313 -1336 1668 1976 -316 -2819 -2835 -561 1651 2025 -778 -2749 -2121 826 3073 2145 -617
1982 -617 -2087 -751 2315 3583 1993 -1090 -2035 12 2873 3079 583 -1587 -1855 211 2679 2075
1998B075k563k154P77K325J474j140k306j824J271K642J569j875k970n27K220
2013a006K670K91j975k474j18K878K691o54k831j465J209K281J490r42k798j218
2029a971J703K238J416j912k865m93J806K383N0k174k670P6K349K349r90k476
2045a181k020J251K340J498j173k990j130J833K843N81j566k247k01J453K349
2060A640Q46k107k248N9K688K241q52k620j684Q35K990J565j432l078j129J917
2076c69K114O57j875k222l47J550J827L97k104k291K92K267J569m48j840k261
2092c084L76L165J880j715k695r51J989K699O02j977k296pK241K846l73k494j769
2109a563J147J790J412m06j740k490J237K524J216j530k553j076J060K312P16
$$ plain form
1998 2075 -488 -2642 -1865 460 1934 794 -1512 -3336 -2065 577 2146 271 -2699 -3226 -1006
2013 -1006 1664 1955 -20 -2494 -2612 266 2957 2303 -528 -1993 -784 1497 2987 2045 -753 -1971
2029 -1971 -268 1970 3386 1474 -1391 -1884 -78 2305 2355 181 -2489 -2413 -64 2285 1295 -1181
2045 -1181 -3201 -1950 390 1888 715 -2275 -3405 -1572 1271 1852 286 -1961 -2162 -709 1640
2060 1640 2486 379 -1869 -1810 878 3119 2267 -353 -2037 -1202 1788 3353 1921 -1157 -2286 -369
2076 -369 1745 2402 527 -1695 -2042 -492 1335 1732 -372 -2663 -2371 -104 1465 1017 -823 -3084
2092 -3084 -2708 457 2337 622 -2073 -3024 -1035 1664 2266 289 -2007 -2014 227 3073 2700 206 -1563
2109 -1563 -416 1374 2786 2380 640 -1850 -613 1911 3127 1597 -956 -2032 -972 1340 2056
2124B056j837k704p52K611K281r36k469j609J025K289J735n86k620j123J359L040
2140A760L90q63j712j112J446K250J120j419k594p28K429K124l05k502k234L38
2156a612K095K255j313k997j479J939J829N85j585j656o41R21K858R6j349k473
2172b527Q3K190J810r6j516k126J17K588K527j170l415j150J722K517K85j318
2188E21k341n42K132K272m05k151j282L77J845J122J72j420k090M69J893J751
2204B323q93k339j228R85J996J620j607l142q85K333K678k37k172k057P72K015
2220A62J491k26k129j347Q00K020J301p59q46j289K89K370J659j192k712j112
2236a520K250J958R2j761k985M51K308J158l41k882j665J627K408J37j298j198
$$ plain form
2124 2056 219 -2485 -3237 -626 1655 719 -1750 -3359 -2334 -45 1690 1104 -1516 -2639 -1280 1760
2140 1760 2150 1287 -425 -1537 -91 2159 3279 1860 -734 -1462 967 3091 2786 284 -1950 -1612
2156 -1612 483 2738 1425 -1572 -3051 -1112 717 1302 -283 -1939 -2580 -1659 1199 1295 -54 -2527
2172 -2527 -2444 -254 1556 1460 -56 -2182 -2065 523 3050 1880 -1535 -2685 -963 1554 1839 521
2188 521 -1820 -2362 -230 2042 1637 -514 -1796 -1419 426 1548 1720 300 -1790 -1321 572 2323
2204 2323 1430 -909 -2137 -1152 844 2464 857 -2285 -3170 -837 1841 1604 -568 -2625 -1853 162
2220 162 1653 1427 -702 -2049 -1249 771 2072 1313 467 -822 -533 1837 3496 2304 -408 -1520
2236 -1520 730 2688 2780 1019 -1966 -1515 793 1951 1610 -1272 -2937 -1310 1098 1235 -63 -1261
2252a261o76N21K220O72j399j616j22J097J868J042j324k535p12K672K631m61
2268B617l393j489J471K198P89j029k754o82J623K311l68j981j108L52R88R06
2284D51R62j217j931n0J498J892j73j893j825N88K453J562r72k916j172K286K022
2301A565J77k046j618L55J365J389r7j512j381O88J014J218J89j457j338K6K093
2318F30J800n01k679j534J403L058M53k102k138k68K227K085o38k722j146J219
2334h53J794R08r18j229j404Q78J348J040m14j952o29O33J742J297r41k411j398
2351b509K272K879n69k379j823P20K498J160j308k237m56J223J522N38j386j454
2367a309J7P96J214O34m77k322p50J633K081L85j854k316j45K435K305q87k866
$$ plain form
2252 -1261 -1937 -1416 804 1476 77 -1539 -1661 -564 1304 2346 1022 -1513 -2225 447 3078 2617
2268 2617 -776 -2265 -794 1404 2193 1164 -1590 -2272 -649 1662 1294 -687 -1795 -1443 -455 451
2284 451 1413 196 -1735 -1785 -287 1605 1432 -461 -2286 -1698 755 2317 1345 -1571 -2743 -457 1565
2301 1565 1742 -304 -1922 -1567 -202 1187 1090 -422 -1803 -1115 -101 1117 1306 -151 -1489 -1463 630
2318 630 2430 1929 -750 -2284 -881 2177 2630 528 -1610 -1878 349 2434 1796 -926 -2072 -853
2334 -853 941 1849 931 -298 -1702 -824 524 1564 1150 -802 -1431 -798 944 2241 1300 -1111 -2509
2351 -2509 -237 2642 2073 -306 -2129 -1409 1089 2249 941 -1296 -1752 -529 993 1531 145 -1309
2367 -1309 -1292 -496 718 1352 875 -1447 -2197 -564 1517 1902 48 -2268 -2413 22 2327 1440 -1426
2384a426j282J815K538M07k272j640L70J260R06J81j050j185OR12R59R55j397
2401E7j637p04K226J983q7k376k084J049L141J274j940k664k76J974K797r16j868
2418e1j698J136J298M22o2r66j103m3J180J419l15j314j885K77K294J598q28k634
2436a275j270J940K728K81k539k184R18K273J177p61k105n27R56J548k3r5j241
2453a99o50L12J079J223n03j409j598Q83K511J170k457k135l90K485K198r72k825
2470a277j604J990J964L65j633j635N6J536P13k29p5j065m34M88J435O03o91j466
2488i59j117J416K314M37k165k096P63K311J539j455k612k58J487J993Kk062q72
2505a334K7J285J102m93n12r31l09M17J533O19j483j879m1K064J925n60k739j394
$$ plain form
2384 -1426 -2708 -893 1645 2052 -220 -1860 -1490 -230 676 857 -193 -1378 -1372 -460 499 1454 57
2401 57 -1580 -2284 -58 1925 1838 -538 -2622 -1573 1568 2842 902 -1762 -2038 -64 2733 1817 -51
2418 -51 -1749 -613 685 1107 1045 79 -1024 -1067 113 1532 1217 -97 -1982 -1705 589 2187 1359 -1275
2436 -1275 -2545 -605 2123 2404 -135 -2319 -1401 872 2049 1288 -817 -1344 -388 1160 1137 1042 -199
2453 -199 -849 -537 542 1765 1262 -147 -1745 -862 1649 2819 362 -1773 -2163 322 2520 1548 -1277
2470 -1277 -2881 -891 1073 1438 -195 -1830 -1774 -238 475 246 171 -894 -1328 -840 595 1198 507 -959
2488 -959 -2076 -660 1654 2091 -74 -2170 -1407 904 2443 988 -1624 -1882 -395 1598 1600 -462 -1334
2505 -1334 -1307 -22 1080 587 75 -856 -1165 -748 785 1404 -79 -1958 -1999 65 1990 1430 -1309 -2703
2523b703J373K966P02k435k164P69K444J188r42j554p41Q51J137M91p70l08o53
2540c49n15Q50J785l63j687j324J44K293J459j229l233k67K530K012n65k587j216
2557b262J350K024K15j066j482K24N22P75M54p1r99o13k51J840J318p02j666j417
2575a807J272K358L88k082k126N89K640J219j344k426q61K009J981m04j669j059
2591a322K75J265M24j94l81p73n78L85J286J233j216k361o8J877K436m98k747
2608i57j650J648K812J81j555k161M18K127Q11l44j310q63N17O28O76k52n93p47
2626f14n03P64J651N18k049j846L36K189J592j133k723q09K191K393n87k197j725
2643b552J485J771P95j167j126Q3N56N30N07J39r19j003j06J213J362o6k018j660
$$ plain form
2523 -2703 -1330 1636 2338 -97 -2261 -1492 952 2140 1198 -356 -1097 -246 891 1382 612 304 -349
2540 -349 -864 -14 1771 1408 -279 -1603 -1459 834 2293 1064 -2169 -2436 94 2106 1541 -1046 -2262
2557 -2262 -912 1112 1327 261 -1221 -997 -475 300 754 683 -316 -929 -1180 660 1978 1276 -390 -1807
2575 -1807 -535 1823 2211 129 -1997 -1408 1232 2451 1107 -1319 -2180 -171 1810 1406 -263 -1322
2591 -1322 -1047 218 642 448 67 -706 -1284 -899 387 1620 404 -1957 -2025 -148 2288 1790 -957
2608 -957 -2607 -959 1853 2034 479 -1682 -1264 863 1674 1330 20 -843 -326 302 978 726 133 -614
2626 -614 -1117 -353 1298 1816 -233 -2079 -1743 446 2038 905 -1818 -2627 -436 1957 1370 -827 -2552
2643 -2552 -1067 704 1499 332 -794 -711 -155 375 882 1021 102 -901 -1007 206 1568 1502 -516 -2176
2661b176J271K706L93k114j995O9K612J377q51k492r04J552J691J13j373j043
2677a164J54J036K24O52N5j272j283Q83J274J224r67k202n98K010K180j47k533
2694d74j795J250K337P75j802j706K40J496J317n01j102q82O58J69N77L73n21
2711D09j086p52Q24J629P65j732j978K79K178J761j450k493n89J583K323J65k476
2728f40j221R58J495P46n53j121l28K62K75O06N04n51j471j11J064J697k30j789
2746d08j801J064K527O32j978k089rK236J715q01j908r29R82J275K45p29q09J38
2764f47Q5P05N54J79j089j238N57J853R43r73j801r27J296K285L25k360j927P45
2782a435K595R83j746j828J57J100Q73J28r12n58o5N76Q20Q2j09j170r13N32K156
$$ plain form
2661 -2176 -905 1801 2194 80 -1915 -1846 766 2143 1292 -1200 -2104 -552 1139 1252 -121 -1164
2677 -1164 -1010 26 250 902 957 -315 -1598 -715 559 1783 816 -1386 -1984 26 2206 2059 -474
2694 -474 -2269 -1019 1318 2093 291 -1415 -1175 321 1638 1137 35 -847 -189 -20 557 930 409
2711 409 -677 -1429 -605 1024 1789 57 -1921 -1642 536 2297 847 -1646 -2235 -652 1671 1836 -640
2728 -640 -1861 -903 592 1338 785 -336 -664 -402 -127 479 983 432 -1039 -1150 -86 1611 1381 -408
2746 -408 -2209 -1145 1382 2014 36 -2053 -2062 174 1889 1088 -820 -1749 -767 508 753 24 -785 -647
2764 -647 -562 143 697 876 -213 -1451 -894 959 1902 929 -872 -1799 -503 1782 2107 -253 -2180 -1435
2782 -1435 1160 2143 397 -1431 -1274 -174 699 827 -85 -643 -708 -132 688 770 661 -509 -1422 -890 1266
2801A266P32j816k168K98J802K017j471j615j141J450K011L11j729j691R02J149
2817C07N83n45l11o30m16P46J009O42j059j237p2Q57J366K03j498k022R01K158
2835I82J244k061j635k34J432J997r24j175j427J310J339L11o46r03k41N4N07
2852g0N32Q14j185j451J62J812J262r03j826r66J191K501L58k132j833K12K734
2869A212L26j111j375J3L15J055N75p90o01n24M61Q44N23j22r57j372Q92J419
2887G83J208j592k107L04J802J263m53j744j136Q59J823N93j447j307p8J434M29
2904F34r4m61n22m14M12Q93P30p30j375m63Q27J640O98j902j964M84K175J573
2922B141j522j902l38J272J839n04j455p25K76J454M87l44r12n61K25J57J065
$$ plain form
2801 1266 1998 182 -1986 -1688 114 2131 660 -955 -2096 -646 1365 1676 -53 -1744 -842 307
2817 307 890 345 34 -596 -1012 -266 743 1385 326 -911 -983 -126 1240 1443 -55 -2077 -1176 982
2835 982 2226 165 -1470 -1704 -272 1725 801 -374 -1801 -491 848 1159 513 -390 -631 -577 -70
2852 -70 462 1276 91 -1360 -1198 614 1876 973 -853 -1819 -628 1873 2231 99 -1734 -1522 1212
2869 1212 1538 427 -948 -935 -620 435 1010 220 -381 -905 -444 400 923 801 -156 -1528 -636 783
2887 783 1991 399 -1708 -1404 398 1661 1208 -536 -1672 -813 1010 1603 156 -1151 -1229 205 634
2904 634 540 79 -443 -857 -445 448 1178 448 -927 -1390 -563 1077 1775 -127 -2091 -1607 568 2141
2922 2141 619 -1283 -1621 -349 1490 986 -469 -1194 -918 536 1023 679 -233 -794 -569 -412 653
2939F53O75r93j475n4J662J234n40j807j091R14K232O14j964j606K55J797Q96
2956A402q80q54p13M40R81L43j99q76n59M86N87J042l43j294j084K20K113Q57
2974A669j280j614n04J785J446p4j511j603Q15J718M32p23j392j82R29R13j00
2991G24l41r67j11K07R72O50o41j334p69J277J594L24j491j476l93K446J217j300
3009E88j329r74J198J433M54j218j093K2R04R82k38n84o63n84P09R17Q39q00j815
3028a252j86J571J538m83j962o80M61K060Q79j793j652P6J901P23n5j278p25p
3046h64P78J049k07q28p93j80J031O22J80q15j206R3J654J306q23j895p77J299
3064c76J782J67j751j069K83J224J009m82j442k80O54P18N95l30j120o73J33J208
$$ plain form
2939 653 1328 335 -1140 -1194 468 1702 1162 -645 -1736 -822 1410 2024 60 -1546 -1291 506 1402
2956 1402 522 -332 -1045 -605 376 719 520 -356 -915 -429 158 1200 857 -437 -1521 -1301 812 1669
2974 1669 389 -1225 -1729 56 1502 1428 -83 -1686 -871 847 1279 556 -836 -1018 -89 824 724
2991 724 383 -584 -695 -488 484 1134 493 -841 -1610 -333 1261 1585 94 -1382 -1775 671 1888 588
3009 588 -741 -1715 -517 916 1370 152 -941 -919 -15 967 729 145 -518 -1102 -393 524 1363 563 -1252
3028 -1252 -1438 133 1671 1188 -774 -1454 -993 1067 1946 153 -1499 -1423 478 1201 1146 -132 -857 -864
3046 -864 -86 963 756 -72 -865 -1045 -14 608 788 -27 -1233 -1140 514 1820 997 -898 -1675 -376
3064 -376 1406 1573 -178 -1247 -964 260 1269 787 -655 -935 -281 437 1032 702 -418 -1091 -958 250
3082B50P78M1j789o89N68J845M19r70k052J80J530J374p33j126r48P76J121N57
3100A132n07j158l59P42R78N8m24r50l78r1J653O62r36j138n29J110J617j44j478
3119a40j251K18J800Q49o00k321K57J034R48K17q37q20l22P53J227k4q96o10m07
3138i25Q32R08L26j078j043n3J405J299q38j697q52J293J534L45j177j470K1J284
3156A14R26j18p46j258L3J117P22j04o63j045rJ022J282n45j329n50L60J322J100
3175A631j138j674m2J265J347k32j296j142M70J152M65j44o86p80K5J378N28n33
3193E94q15o42M21J058M28p03j233l67J052J599m74r01j530M22J582P08n30j181
3211e12m18M91J305J41o93j054k60N48R47O18p06j115l58P65J121K94j184j112
$$ plain form
3082 250 1028 1069 -720 -1409 -841 1004 1423 453 -1599 -1419 111 1485 752 -374 -1322 -546 575 1132
3100 1132 625 -533 -892 -150 828 886 462 -488 -866 -957 696 1358 422 -716 -1245 -135 1482 1338 -140
3119 -140 -1391 -1173 627 1476 876 -1445 -1188 -154 794 1011 174 -646 -968 -215 1012 988 92 -518 -925
3138 -925 -93 815 1141 63 -980 -1033 372 1671 833 -864 -1716 -423 1111 1456 279 -1191 -1170 114
3156 114 1040 922 176 -1082 -1049 68 790 686 23 -1022 -1031 -9 1273 728 -601 -1151 -791 531 1631
3175 1631 493 -1181 -1223 42 1389 1157 -139 -1281 -811 341 806 662 -24 -804 -779 599 1127 594
3193 594 -221 -863 -442 616 1044 341 -892 -1259 -207 1392 918 17 -1513 -1091 491 1199 669 -512
3211 -512 -930 -439 866 1007 314 -740 -1000 -452 495 1113 407 -708 -1066 -301 820 1114 -70 -1182
3229a182J2J488J224k47j701r40M84J909J70j035r29l56P68J351k8p53j376J66
3247i75Q17J064K21j261r02K56O83J573o47r47j386N40J645N65l94j869l61J214
3265a64J052K77r80j186j54J002J079q7r79o79p3R12J002k98q82j013L82J195
3283D06P90n80j132q62Q51J444K42r67j084j97J123R44J13j344r71N39J032O46
3301I93k08r61r46N58R48P18m49j530m86J267Q41P76j111j311r4R41J110k1j342
3320c07p56L15J065R44n56j093n42N91O85O34l90j383l39R85J199R2j025p71o74
3339a326J435R31Q0j478o36j4J292O83l81r78r93J018J159J47k49j651j54Q53
3357b62J170rj007p34j61Q03J377j08j014j181L37Q60J032m11j092r03N73J312
$$ plain form
3229 -1182 -1170 318 1542 1295 -406 -1346 -862 1047 1217 182 -747 -1103 -335 1016 988 235 -1141 -975
3247 -975 -158 906 1127 -134 -1036 -780 -97 1476 829 -118 -1504 -964 681 1246 852 -1017 -1378 -164
3265 -164 888 1165 185 -1001 -1155 -153 926 839 -140 -819 -892 20 1022 724 -158 -1171 -789 406
3283 406 1196 616 -516 -1378 -527 917 1159 192 -892 -1089 34 978 1091 -253 -1224 -685 347 993
3301 993 785 -176 -1122 -564 384 1102 653 -877 -1363 -96 745 1521 410 -901 -995 -54 1056 1035 -307
3320 -307 -1063 -748 317 1261 705 -388 -930 -339 346 980 590 -793 -1132 -147 1052 1144 119 -652 -1326
3339 -1326 109 1040 1120 -358 -994 -1008 284 967 586 -392 -1385 -367 792 939 690 -961 -1115 -262
3357 -262 908 899 -108 -842 -1003 -200 1177 1069 55 -1126 -789 71 1103 692 -400 -1303 -730 582
3375E82Q34j090r35l58O63J339J88j415p29j6J041P54pr97q92n7J151R91k41j550
3395g44o23O35J159P47o71j049n97J116R92K84j187j095R9J476O89k40j397p94
3413a200L01J564O14n92j151m46O31J037K92n82j119l84P40J356l9p89j042m31
3431a240J098J079J42j321q99L43J248P28o19r76o82O23J201N17r68j154k29R24
3449a85J126j24r78q67j35J042J462m82j253q82L86J310Q95n69j191q25N26J631
3467H87J14q06j174l82Q69J159K53j108n52n34J382J026l54r43o08j19J164J005
3485A279m52j219m13M55J092N35p87j187o42J109J293R3q43j397J66J299Q49m11
3503H19j155o65K11R49R28l63j425m46P22J190%m84j391p6Q25J271K48j299j090
$$ plain form
3375 582 1416 326 -609 -967 -304 1035 1223 -192 -921 -937 104 858 851 -146 -1038 -1095 56 1047 806 -744
3395 -744 -1367 -732 427 1174 503 -546 -1143 -27 965 1249 62 -1033 -934 542 1231 991 -406 -1200
3413 -1200 -899 665 1279 687 -464 -910 -279 758 1050 468 -651 -1035 -295 1061 1022 233 -809 -1240
3431 -1240 -142 937 1079 -242 -1141 -798 450 1178 559 -417 -1099 -476 725 1242 274 -880 -1109 -185
3449 -185 941 817 -161 -1028 -1163 -121 1341 859 -394 -1276 -890 420 1315 746 -445 -1270 -744 887
3467 887 1001 195 -979 -1361 -492 667 920 -188 -740 -1274 108 1134 780 -163 -771 -890 274 1279
3485 1279 827 -392 -805 -350 742 1277 490 -697 -1339 -230 1063 1156 313 -1084 -918 381 1230 819
3503 819 -336 -1001 -790 159 1087 724 -701 -1147 -425 765 765 281 -1110 -1186 -361 910 1158 -141 -1231
3522a231M78J161N99n54o85q42R3J720P27o68j569j60O22J233M77p69j490l88
3540a246J077J143j69q42q32L06Q51N77j09j197q32M25J178M66l62j097k93K03
3558g53J237N68r46j054r2P85J495J46j435q05J18J038P95P3j276p73K38J185
3576E44N04q28p82l89N06Q56O21r97j008k83J046J094q3p87r37j94J218Q95R3
3595A089j471n40K03J163K60l79q41n97M50J545K67j009o88k17Q82N67L05j049
3613f0p55NJ088Q93n00j104p73P46J071P14r50r64m71N82J264L54j068p11j34
3632g73N61J155k42o49j054QJ091R03l03j200l30N9R00J017m37j378n20R49J187
3651I44L00j144r04l32R91J094J08r87j183M79J118O27l91j131n47J99J029Q42
$$ plain form
3522 -1231 -753 408 1007 453 -232 -1074 -981 739 1466 798 -771 -931 -309 924 1401 632 -858 -1246
3540 -1246 -169 974 805 -37 -869 -563 288 865 756 -441 -1273 -848 330 796 434 -663 -956 -753
3558 -753 484 1052 106 -948 -1040 -255 1240 1386 -49 -854 -736 302 1097 1170 -106 -879 -641 544
3576 544 1048 220 -562 -951 -445 411 1032 35 -973 -1256 -210 884 801 14 -923 -1117 101 996 1089
3595 1089 -382 -922 -719 444 704 325 -516 -1113 -663 882 1149 140 -548 -765 117 684 989 -60
3613 -60 -815 -810 278 1171 671 -433 -1206 -460 611 1325 375 -589 -1060 -478 786 1140 72 -639 -773
3632 -773 -212 943 701 52 -1002 -994 97 1000 697 -503 -833 -774 126 1143 706 -672 -1192 -243 944
3651 944 1244 100 -804 -1136 -145 949 1057 70 -1113 -634 484 1111 720 -411 -958 -759 270 1112
3669A112o92j395k48P37R16M92p17j033l20J048J262l36j230m79J81R44P56k46
3687G52j093m80K44J399L91q16j204k15P52J006J13l98j316l6R17Q69J24j126
3705a17q26J72J182N11k10j136r22P33J314M16p45j294q2P40P01N59o98j390N7
3724a035J281P21k92q28q38P7J439M52M2j361n00M57J161M74r31r89m29Q23R62
3743F86O72j312r72J46Q53N48P1r27o83m29J621P95n68j278l60P72J030O8j55
3762E78j365m50Q35J299J39j409n49m3Q19J209j3j128p68r8J195J132n52j320
3780d89o88Q68J016K37m85j378k55J077J178k44p82j019K48N61R80P5j135r04
3798a139J59J459O06r76n72m93N59P22P27o84j015l81N50J226J21o00j332L75
$$ plain form
3669 1112 420 -975 -1223 -486 430 922 205 -828 -1148 -100 1162 826 -404 -883 -702 242 998 752
3687 752 -341 -821 -577 822 1213 397 -807 -1022 -270 736 849 451 -865 -901 16 885 1009 -117
3705 -117 -943 -771 411 922 712 -424 -1346 -613 701 1117 372 -922 -1004 -264 437 996 298 -1092 -1035
3724 -1035 246 967 675 -153 -991 -914 525 977 1019 -342 -842 -385 776 1250 319 -670 -1099 -276 686
3743 686 1358 46 -926 -780 73 621 692 -235 -918 -1347 274 1069 501 -777 -1137 -365 665 733 578
3762 578 -787 -1237 -402 897 1036 -373 -922 -965 -146 1063 1050 -78 -846 -944 251 1383 831 -489
3780 -489 -1177 -309 707 944 459 -919 -1174 -97 1081 837 55 -964 -716 -155 825 900 -235 -1139
3798 -1139 -980 479 1085 109 -463 -956 -397 325 1052 368 -647 -1028 -478 748 869 269 -1063 -688
3816f88O72R58J50j356n67K28J222N47j32j802k57N85R45P51r38j072l51J029
3834g6R52P4r14q59j33J054R39l74p80l88l91J281O37l72o88j072P09J023N69
3853A191o92j099l93J170N06K46q76j049PJ171O35k34o92q29M99R69L96m50r18
3872d42q48N46J349M93n33j344m48Q49J445N4j044q10j12J168N55R6j039p50K51
3891e64J061L66m70r01m19J01J507M0l49j069n35J052J069K22j114j056K93J107
3909C41N87j70q47j028M41J439K70n31j156o04O43J336K94p37j145k42P33J493
3927A117m46o41o80j95O57R62K19r87j218M88J072O00m27p83q32N79J299J48o28
3946C04r56j65O06J126k30m42j083K20Q42N64q7j024n68K23J189N27o85r36n23
$$ plain form
3816 -688 -16 942 1092 -264 -831 -603 619 1166 1034 -768 -1025 -440 505 1256 318 -754 -1105 -76
3834 -76 876 950 36 -823 -956 98 1037 663 -117 -505 -896 385 1022 650 -38 -1110 -401 622 1191
3853 1191 499 -600 -993 177 683 929 53 -996 -989 182 817 583 -109 -938 -439 530 926 476 -442
3872 -442 -1290 -744 605 1098 565 -779 -1227 -378 1067 1121 77 -733 -845 323 878 974 -65 -815 -564
3891 -564 497 863 393 -508 -927 -826 681 721 372 -697 -1232 -180 889 1111 -3 -1059 -766 341
3909 341 928 758 -89 -1117 -676 763 1033 502 -654 -1258 -615 721 1015 278 -867 -1109 -376 1117
3927 1117 671 30 -650 -845 -188 774 993 6 -1212 -724 348 948 521 -262 -1094 -515 784 932 304
3946 304 -652 -817 -211 915 685 243 -840 -620 222 786 699 -325 -893 -670 519 1046 361 -575 -1098
3965a098O18J302J88p05j038m4O60Q93O8r45o10m41Q98J464o06j126l60J26J141
3984C85L66m8j101o24P09Q01O70p11j120k14O07J109Kp21j062j7R74J157m83r35
4004b56q18M41Q60N68k81r86j28L05R30L47q92q15l37J023Q70l57l99p85k3J050
4024C17M94j34q54j194N04J443N85n27r87m27N21J072L67p82q56m99Q69Q27J82
4043I21r71j020L87P02P93rr97q30L92J029P59r43q69k45K08R81P81j068j007
4062a006l6R71P85N64j082j015O5P30Q42Q7r28n40j5J061N69m29q87l35L97R53
4082G51K51o89j032l11J029R52k21p39p78L7R43O65k39o67q74L56J133L27l72
4101E22j347j98N08R96M95m25j190j31N45Q24K6r04r00M14Q97Q02m32r18q20O33
$$ plain form
3965 -1098 -480 822 1010 305 -733 -777 -117 776 844 -101 -711 -1152 -254 1210 604 -522 -882 -756 385
3984 385 751 703 -398 -1022 -313 488 1158 447 -673 -887 -280 829 831 110 -952 -969 5 1162 679 -256
4004 -256 -1074 -633 227 795 514 -472 -600 -295 635 982 90 -725 -1062 -39 831 474 75 -710 -733 317
4024 317 811 677 -177 -1371 -867 576 1161 634 -353 -780 -259 813 1180 398 -458 -957 -88 739 921
4043 921 -50 -1070 -683 19 812 803 -194 -1024 -632 397 1156 213 -656 -901 -693 288 1069 1 -1006
4062 -1006 -1042 -71 714 1278 196 -819 -754 -24 818 905 -23 -563 -578 483 1052 623 -264 -599 -202 751
4082 751 1002 313 -719 -1030 -1 951 730 -9 -787 -750 193 858 619 -48 -922 -566 567 894 522
4101 522 -825 -1023 -515 481 976 551 -639 -770 -225 599 625 -279 -1179 -765 132 934 502 -416 -1236 -603
4121f03Q38N50k51j076j33N95N08M29o72p31j38R68L21K74j043n06k75J183P37
4140I75k57j115q08O88R40L59o47n77o94N49J196K13r34n50l61J134P28k33o58
4159e2o33j3Q61J016n40q52p15L59J119K55j02j422j53M87J284N5p71r95m88J134
4179a66O64J42p86r07J27J015R19l45q53o53L62P09R91q89j027k84O15J134K65
4198A033p36p25p04J170M93M38j004p39j51J162Q20n78r06o51M99Q98M14n74n29
4217c70n18Q21O01L10p56q05k18M54J428l46o35q16J71J201J81k42o27q59M63
4236e62J051M01n06q44k89M23Q41N57p26r48l21R75P14M9r34m41j33J057L02R
4256F75j048n20N91O06N89n57r54j88M68M31O68n80j068K06L63P86K42p31p99
$$ plain form
4121 -603 235 785 534 -542 -675 -80 428 857 185 -546 -684 284 605 879 -164 -670 -945 238 975
4140 975 718 -397 -1205 -517 423 782 135 -442 -1136 -587 609 822 -112 -662 -1023 111 839 606 -52
4159 -52 -685 -698 163 1179 639 -213 -928 -569 550 805 703 -719 -872 -385 899 954 183 -812 -1300 -166
4179 -166 498 640 -146 -1053 -926 89 1008 663 -190 -843 -481 228 1219 330 -697 -981 -366 768 1033
4198 1033 297 -428 -1132 38 531 969 -35 -774 -925 237 1057 479 -427 -1078 -579 319 733 159 -370
4217 -370 -888 -67 534 844 88 -717 -935 -481 947 601 -34 -850 -679 522 703 461 -166 -1025 -562
4236 -562 489 890 384 -460 -749 -326 515 1072 346 -602 -923 52 766 815 -119 -560 -693 364 666 675
4256 675 -373 -893 -302 304 893 336 -618 -806 -338 93 761 181 -887 -681 -318 468 710 -21 -820
4275h20N39M95N67k26q92k47L10Q99K74o58o20n82O14R15J19m35r00kQ28O25o46
4296A57j15r37L51J045M67n66q22n02N17O96N21n21p48k84L54Q81N14j067m61
4315e20j61P50P12j54o63p83O1R26O89n15o72m03K04Q83L69l58r59m07P98R42
4335G39J29j041n54J96N75P26n5j003l39j39N92J233o44p11m52N31M82O56o05
4354C16p59m86N43R19Q8m61p12r2Q65M26No52p27K46N86R10q71m53n75M57Q39
4375D12L53p46m23l01N08P42L51m93j255M08M75Q10m66q23k51K77P14M13O6j104
4395c33m26M10Q57K58r06j84m89P96L08M28m24j127J9O53R09k19o68l89K4N63
4415F0P54k79o29p44L09J030K08p67k12k26J70J124J7r30n00q8N32Q98j89n99
$$ plain form
4275 -820 -281 214 781 555 -337 -584 -274 625 899 241 -379 -961 -347 568 687 252 -648 -650 178 803 157
4296 157 42 -895 -544 501 968 402 -420 -922 -405 291 812 291 -457 -741 -387 494 1008 -59 -520
4315 -520 -681 69 781 627 -36 -819 -758 168 857 342 -330 -733 -529 354 723 365 -594 -1001 -203 739
4335 739 868 -173 -727 -531 44 770 715 -288 -627 -766 -174 1059 415 -296 -748 -217 265 921 316
4354 316 -443 -929 -386 533 621 160 -552 -644 221 647 652 0 -727 -481 105 1015 144 -309 -884 -427 412
4375 412 765 19 -404 -705 -197 545 896 403 -852 -444 31 841 375 -448 -699 -422 292 705 771 -333
4395 -333 -759 -349 508 766 -140 -324 -813 -17 291 719 295 -832 -813 -160 749 530 -138 -527 -503 60
4415 60 814 535 -94 -838 -529 501 709 -58 -270 -496 -326 798 815 -115 -615 -703 -171 727 538 -61
4435f1m83k23J048O58n47p29o64M78J037K23l53r75j30L81O78L32n81p84L53L71
4455B9P34l03n66m99N2O61R24o22m64m81L39N60N66l72j005m19O27J169j89p97
4475e6l79j98M06O45L62r16o71J64Q38M96j95q39m51N24O15N98p98l40q56P10
4495c41P21K21n89r45N56K19P06j55n07q33J19J303L20l49n54q92N84Q92J16k38
4515C54q37j68O28P16j91m65o58K59L86M63L7n32p17L08Q64J56m27p89j75M73
4535c15K62R79n12j134K68R4J110k46n06n46l39Q82M79j93p79k48M20M70O21k50
4555E17j101r1J36P28N63l66q95j85N62M49J93n76q54L72O58L93M9o94l71n0Q11
4576B48L66l32m29m86K35Q00R1k59n14j80M02L78N88r93m52k54Q19N51j00n20
$$ plain form
4435 -61 -544 -767 281 939 392 -337 -1001 -523 514 737 384 -591 -721 -340 338 670 89 -695 -342 29
4455 29 763 460 -106 -605 -553 108 1032 410 -54 -535 -196 364 930 558 -447 -866 -239 930 741 -56
4475 -56 -435 -633 -227 418 780 -136 -807 -643 195 691 496 -343 -794 -270 345 943 145 -195 -1051 -341
4495 -341 380 601 12 -933 -377 -158 548 393 -114 -947 -828 475 795 446 -108 -1000 -416 476 592 354
4515 354 -483 -651 -23 693 502 37 -621 -362 24 487 524 -8 -725 -417 447 603 176 -613 -788 -315
4535 -315 -53 926 414 -720 -452 -358 752 506 0 -546 -885 -3 476 283 -496 -744 -324 146 767 517
4555 517 -584 -675 -539 189 752 386 -509 -694 -132 317 510 -66 -920 -548 110 503 552 -142 -513 -563 248
4576 248 614 282 -147 -633 -398 402 493 234 -280 -460 -58 320 908 -85 -537 -791 28 579 479 -41
4596d1p95N02L29P87l95n37n55J51J034J9k57p99K01L18M73k40j63p32M35N55
4616B90K37K15p79q54N49R67m7m63l63m96M18Q69J53o76n67M1K68O82J43l89o38
4637d40k65Q83L75l4m45n96J63M79R36q93l84m01J20J155n2o12l65k66M43P45
4657E46N9n23m21l86P97L06K02q98n30L85O25M99l93n81l94M39Q46P7l00p45R0
4678c00J63N51L33p89m27j45N75N50j24p91k52O0R28K50k68p28j2K79M89K49k87
4699C04p49j33M93L14K72o60k35J06L54K19K63p47m40L20L71L57k22m57j79L33
4719a16L04K49j6j069r1Q30L22j13l33n17l98J098M42J9n40o04P9M92N82k83l98
4740f1l50J49Q47k69m99J32n10L18Q38k50l36n94K00N28M23k76m12p33N33N57
$$ plain form
4596 -41 -836 -334 -5 782 387 -150 -705 -554 480 499 242 -557 -356 -38 435 195 32 -700 -265 290
4616 290 527 742 -37 -891 -342 625 578 115 -248 -744 -326 543 696 20 -547 -506 -238 444 587 198 -440
4637 -440 -705 178 553 519 74 -522 -359 120 1056 163 -221 -622 -502 653 601 -11 -376 -642 -199 546
4657 546 605 82 -339 -725 72 378 580 -318 -848 -463 162 661 268 -313 -707 -268 578 655 355 -390 -300
4678 -300 -137 414 747 -42 -469 -614 -39 511 387 -404 -656 -596 332 582 314 -414 -426 -147 342 591 304
4699 304 -445 -578 -85 229 501 -159 -394 -288 66 285 548 -199 -639 -319 52 409 187 -270 -449 -116
4719 -116 188 437 421 -648 -739 91 413 300 -33 -550 -948 150 592 611 71 -533 -454 38 620 337 -61
4740 -61 -411 -262 585 316 -183 -51 -561 -243 595 345 9 -585 -385 143 566 290 -122 -855 -322 235
4760B35O27n88q65k89M15R63rk51p29r1P86K70K46o94p47K05Q35M35o11k61m04
4781e22j5J099L4l68m79n36P27O67O9o81m93K07N03K20J6m96n97K86K85O32j27
4802D31q01L3J64M43J66j93n19n59O25M18M21p16p00J12R40K70Q8r05m42K63O81
4823B20L75j16m17n94K39N34K04k93m56l42N94O50j78l82o00m3K96L73O48p82
4843g0m85J59P10J84k46m63m06M93L51M59l27o87l78M40N02N51o95p99p1J008
4863B30l4K63n61m59o9P17M54j68o66K0j52Q26J88m65k87k29M12L74N8j59q48
4884e55R2N20P0L20o83n5l00O02N16m74j94n15N24K46M97l00r29r0M57N51J47
4905D47m40k36k02L70O91k40k75k73k8L93L11k73k83J30j59R1M00r7m97l67M52
$$ plain form
4760 235 862 274 -591 -880 -465 498 489 238 -491 -582 204 474 720 26 -721 -516 319 754 143 -118 -522
4781 -522 -537 562 596 228 -251 -787 -60 607 676 -5 -498 -291 212 432 448 -48 -645 -359 -74 558 431
4802 431 -370 -337 -173 270 436 243 -276 -835 -210 208 629 -87 -787 -675 265 535 623 -282 -724 -461 220
4823 220 595 479 62 -532 -293 241 445 152 -304 -646 -52 598 420 38 -562 -605 -309 64 712 -70
4843 -70 -555 -396 314 498 252 -211 -617 -124 227 686 359 -328 -706 -266 236 787 92 -707 -778 230
4863 230 196 459 -102 -561 -630 87 541 373 -293 -273 -425 401 589 124 -163 -392 20 394 452 293 -555
4884 -555 -463 57 127 447 -236 -291 -591 11 527 53 -141 -656 -132 114 611 311 -618 -708 -251 300 447
4905 447 7 -229 -431 -61 630 390 115 -158 -186 207 518 245 -38 92 -67 24 424 327 -170 -537 -85
4926h5M47P2m04k67K3J60P16l9m72o67J41N77J22l23l82M0k7Q29J15l70o58j1
4948d63L31K30L61k72o08l4K99O30J70o09n14J55J17Q49m61n36n8J11P76l15o6
4969I3m08P4J88M84J53m40l43m5J54M32J36n38l55J2P38j30J44p49r8K77N43J51
4991D73n25k44j43L94N09o2l16o99K74L77M87j41m55k09j04R9J060m14o53l17
5011f09N03N61k17J65p49n0M08M86Mm68l96J74MN29J76m75l60k9N59M15k39o22
5033b30q4J98J57L10l99m47L15MP27j92Nj082M62J62N50k87k21j97j32K97M58
5054C74r0k26q13N67L23M10n45j11j45N3N64q5O6n00k14L34K57L03o64n10K52
5075d00O85m2L9m44m19P18R9L74m36m27OJ55K28J94l04o6k94M42M26n3n50n14
$$ plain form
4926 -85 362 434 30 -237 -214 -54 662 623 151 -516 -375 202 324 1 -381 -341 -368 461 576 206 -452 -463
4948 -463 -132 98 459 187 -421 -455 -156 474 644 35 -479 -324 -207 642 181 -355 -413 -302 474 159 93
4969 93 -315 -241 -53 431 584 144 -199 -244 -90 342 478 -60 -415 -403 335 205 349 -400 -498 -221 322 473
4991 473 -52 -296 -439 -45 464 402 86 -613 -339 38 525 384 -71 -280 -384 -285 775 361 -292 -609
5011 -609 -106 455 238 403 -346 -396 12 498 502 34 -362 -188 -184 345 521 46 -314 -343 216 631 392 -230
5033 -230 -314 -116 41 351 -48 -495 -180 -176 551 359 364 -718 -256 -94 456 169 -52 -249 -381 -84 374
5054 374 284 58 -755 -188 135 545 0 -111 -256 -203 361 276 342 -158 -372 -38 219 522 -142 -652 -400
5075 -400 285 243 282 -162 -581 137 236 610 174 -253 -247 -92 136 330 26 -40 -334 108 534 481 -69 -583
5097e83K23Q90k06j98j63m61M61J99N8k54J83l25M36KKJ08p12R8J73L17j01n58
5119d11M16j38J90L63k60l26l18N21J81m0j93k88k28L71N06J2l71k76k7N16p5
5140A25j3k00m85M66L7K64J3k94l18K36O00m15k4j82l5J84L20K17k84m80k33O70
5162A69J10J9m71m43L20M15M3mj61r0R2K14M5n7j17l60N2P08k11k21j71j40J72
5185h7Q74m35k99k90L2N08p7j31o26K10K36L02j6J72p56j35L48L77L42p08j68
5206c27o5M39N14k53m34m42M20L69o8J9m46k24N04K69K63o35j92K4K92m0K30l83
5228a66K07k73K07J99J72l54j47l69L18O51o27j17p6J08Q29l36m82M7J22N5L75
5249C43J11o19l00K37j91J024l72j90k44qM16J53j18j74m11J36O49m21j48j96
$$ plain form
5097 -583 -360 530 324 126 -37 -498 -37 162 220 -34 149 -176 260 262 264 372 -340 -242 -69 248 147 -411
5119 -411 5 -133 57 420 160 -166 -484 37 218 178 -15 -303 -531 -160 346 358 -13 -289 -316 200 125
5140 125 112 -88 -573 -107 -70 194 207 -87 -405 -169 431 16 -8 -190 -225 -41 279 496 212 -268 -501 169
5162 169 279 298 -173 -616 -296 119 162 158 -3 -93 -1 213 258 201 84 -276 -224 484 273 52 -119 -259 -87
5185 -87 787 352 53 -237 -205 303 226 95 -531 -321 -85 217 201 373 -383 -518 -170 207 549 -159 -327
5206 -327 -392 47 561 308 -126 -568 -148 221 153 172 -274 -498 6 275 538 -97 -289 -265 27 -13 217 -166
5228 -166 41 -232 -25 174 346 -8 -155 -524 -206 445 -182 -299 -375 -267 562 226 -256 -209 -87 -32 343
5249 343 454 -165 -465 -228 -419 605 233 43 -201 -209 207 360 242 68 -343 -207 442 21 -127 -323
5269c23p7N03m0J50l30k4q1J74L84k63k87J47j79J63P16o24L5m66J3N36J72j75
5291A24k54m16L56M11L08p48j34O2K03Q41n43l28m12L07M38K29j96l35n07N84
5311a0K15J3j39K2m68L39J86K70l37l34l4J08N94l8m26j16J27K21J88l29k73j53
5333c74L20J67l1j70k79K31K02k8L28k24l91o2Q3O37j91n43O6%N20Rk28l48j63
5356d69L43J61K43l33l55R5L48J88J20m53jJ53L5K61k73ql24R7K14n6mj48r3L20
5380F1J8j1r1n9m74J013j13j46l05K91l52Q8M75q9m22k81K94Q1K98Ll08n14P19
5403A76J26n08M08l74K5J51K79J54l96m35L64N5J63J73q96M73k0J86K09m17n58
5424f62O19KJ05L32k17m07K95n1N55k94k28m15r9N93R6q9m60L1L25L19M8j88o91
$$ plain form
5269 -323 -400 103 63 213 -117 -141 -222 -48 336 73 -214 -67 -246 -83 633 9 44 -422 -409 127 299 124
5291 124 -130 -546 -190 221 529 -219 -353 -291 -88 753 210 -118 -530 -223 215 444 248 -87 -594 -10
5311 -10 205 218 79 101 -367 -28 158 428 91 -243 -277 -169 425 387 -39 -155 -28 193 381 52 -221 -374
5333 -374 -54 113 82 -88 -367 -136 66 38 366 142 -249 -311 -228 409 218 -325 -259 -259 261 270 42 -306 -469
5356 -469 -126 35 278 -55 -410 -315 33 221 341 -112 -113 40 75 336 63 55 -269 -172 42 -14 -18 -166 -259 61
5380 61 79 68 -23 -82 -556 457 344 198 -107 184 -168 -80 395 306 -116 -397 -103 -22 276 279 -29 -543 176
5403 176 302 -206 202 -172 -147 4 283 437 41 -394 -30 25 188 361 -535 -62 -82 104 313 -104 -662
5424 -662 -43 -41 64 396 179 -228 67 16 571 277 49 -366 -465 128 224 135 -325 -294 31 350 398 210 -481
5447d81L63K95L31o26L95l44n7M41J92l28l52j81N6R2O98m75k16k15M26PM86n41
5469c4K29m93M56J25j77J32o21J18P45m55M1l40o3M14j98L84j16l39N7J32j6M20
5491D01m49k25l6K10L63j33k05l00RK69M20l61j90O5R4K32J53l60m1m0J23J23
5513A22j0J9j43j16O4L71q2l30q3Q7R6K56J55l07l86M46j87J10m27L7k7J49L68
5536A82J0l49r8PL60m0J09j04n15K62K15L19j18l77j52M5L05L62m18j69J3R4Q2
5559B5K22j19l50M6L16K20j70j67k34nK14K74m01K02l34K77L42N15r02J56n12
5580c85Q4L11N96r87J52K78k9J73m6j47j27M44j79l82M31k46J02J42J32n3n21
5601b57m2L41m27L70l5K29l70OM64j50L02m01n82L55M74k94k58j01J78L81K23
$$ plain form
5447 -481 -118 177 508 -118 277 -67 -124 317 509 181 -171 -352 -296 -204 494 19 -197 -412 14 21 507 -34
5469 -34 195 -298 158 283 106 238 -383 -265 480 25 66 -274 -337 77 -121 263 147 -192 -135 -3 -19 401
5491 401 -48 -273 -309 -99 264 131 -74 -374 -365 -96 324 -37 -227 -162 -68 164 317 -43 -84 -124 -1 122
5513 122 112 131 -12 -128 -64 307 225 -105 -188 -101 -5 251 406 99 -287 159 -28 82 -345 -308 -335 -186 182
5536 182 192 -157 -255 -248 112 72 181 77 -438 -176 39 358 240 -137 -289 -244 61 423 5 -164 -151 -57 25
5559 25 247 128 -222 -176 140 360 190 23 -211 -216 -2 272 -129 73 -261 16 358 873 -29 127 -385
5580 -385 -301 10 606 -381 -229 49 20 193 147 0 -127 317 138 -244 187 -59 43 185 317 264 -257
5601 -257 -299 42 -385 -15 -50 179 -191 -185 279 129 431 30 -552 -197 277 -17 -275 -376 -198 183 406
5622D06j6l80k44K01K03L3J44l55l46L07j29L63j44k25j31K08K75J78k31m75J98
5643a60j15O07k60M4l02J19J76Q8J16n5l97R5K96J52l54K4l10J92L93m9r9l23
5665a22J61R8LN8k89o8j6K23K11P8l92j32j99K95K93o6m04K1K80P5K34j47k70
5688g5k50N21O1J8K1o81k39N80K95p8l88K71k26M2M03k14j78O5j11K18J73j55
5710G3K54l73o2K49N7n0j27l45L26K35nl76j30p7K56J45j05k9j14l2M03J77q8
5733B62q04M80P5K06L38o84J03j96L14k07M02l06j01q0L19j79K6j38k39K19K56
5754F6M7J5j86k03R7M40k4k76o5J0j19L5N22l42j49J34j22M28l96q2l1K5N26j88
5778A62j0j06l04K50L02j46j96j59P5Q3L43j26%k74K89k37L57k39j73j36J79K56
$$ plain form
5622 406 390 10 -234 -33 170 203 347 -8 -354 -47 -176 187 43 -182 -313 -105 170 348 117 -358 -160
5643 -160 -275 332 72 116 -186 -67 109 197 313 258 -139 -44 252 404 50 74 -236 -44 349 300 201 -122
5665 -122 39 137 140 198 -91 -159 -175 48 259 337 -55 -187 -386 -91 202 136 -268 -247 33 108 342 195 -75
5688 -75 -325 196 257 275 296 -385 -624 -44 251 173 -215 56 -170 -128 275 61 -117 -52 -163 55 228 73
5710 73 327 -46 -108 141 198 148 21 -324 2 237 232 -144 -274 -351 -95 50 -55 -84 -198 -230 173 350 262
5733 262 -542 -62 13 219 557 -127 -24 -220 94 -113 289 -17 -118 -198 121 -58 -32 -170 -409 -190 66
5754 66 113 128 -58 -261 -164 276 252 -24 -89 -79 -198 -163 359 17 -132 2 -120 308 -88 -170 -201 -176 350 162
5778 162 152 46 -258 -8 294 148 -48 -207 -132 -49 294 168 168 -106 183 -54 303 64 -109 -245 -66 190
5800A90M8j25n11n3L86J64N6R0l03J02K18r1k57OJ05K66l80K18P9o56L72J0J20
5823E4J1l27j36K13RN07j15l45k6J1K31M4J39k09P6l21J12K84Om66N4j41O37J17
5847D19n08qq7K4K46k7K90o71K57L20P7m5m39L10m55K37M13j09k69j16J78r3J01
5870D5j75p6K0J38L54J39m90o4l72P05k95L72l46j89N8K71K07j66q4k87K30J13
5892A08N5l7o0%k6j7L40n85j74K15R6J43M8O0n04J50M25p6Qn00K57K18p0J03j69
5917Hj43q8K45K21k66j61q5L11J6O2J68l41P4J18M8K39l45k20J29l70P51k77k53
5940a59J34k86M12J05R5k56m10N72J51M4k97n67L08L06k32M00k40l76O1L3J43
5961e9J31N9j53J23k40L01N3j10N6k12qL09l27M4m38K67J69J23j27j66k29L86
$$ plain form
5800 190 238 113 -398 -451 -65 99 155 245 -58 44 262 171 -86 -80 25 291 -89 129 208 -448 -76 -66 54
5823 54 65 -262 -398 -185 -176 331 216 -129 -155 -144 87 131 270 61 137 -184 -72 212 218 -248 -194 -335 302 419
5847 419 -89 -97 -184 -160 86 59 349 -322 -65 255 332 287 -152 158 -297 -60 353 244 -25 -141 37 -56 45
5870 45 -130 -206 -186 -48 306 445 -45 -109 -481 224 -71 301 -45 -234 -176 95 302 136 52 -235 -5 108
5892 108 163 126 66 66 40 23 363 -222 -396 -181 -85 58 106 166 -338 -188 237 161 169 -331 -74 144 74 177 8
5917 8 -135 -223 22 243 -23 -184 -269 42 58 120 288 -53 21 139 187 426 81 -139 -10 -380 371 94 -159
5940 -159 -25 -311 101 206 301 45 -365 207 358 402 105 -462 -154 152 -80 320 80 -296 -235 -202 -59
5961 -59 72 131 -22 101 -139 162 215 105 161 -51 -59 250 -77 -33 -471 -204 -35 88 -39 -205 -434 -48
5983d8N76n3m66j08j84L67q4J68j59k35K45k94N83k42j58O6%L27l19K33n5n60
6005d00N00K03k21J45m47K3M00J65k50k58K16l61K00M01k44n25K64LM25j46l75
6026b82J81k20M07q3j03J8j72O8J51L96j05o69L96r7K14R8j57k75P0M0J99R2j49
6049A8n5k66N45l7j21n4j73k31O09j90L11k88l84M34k27O2j09L66m18K95N3r9
6071D1j06k47L28r4K58N2k94j20J09nJ7j25J75j13p7M82Mk86j72j27K43J83o1
6094F5P8Rk70O4N7K53j77k35K05Q9k6m8K01k53j88M16qj02k68k19J79L16K12n76
6118b26J26O7O0p9L15j30n91M24J01J64Kn40K98J10j83M2k8k89L47K38k38J16
6140A06R8j15n66L37M41k08k93j81n2Q48j49J15m81l13J88M95m3o2J13k34k99
$$ plain form
5983 -48 528 475 9 -99 -283 84 0 168 9 -226 19 -275 308 66 -92 -26 -26 301 -18 215 160 -400
6005 -400 100 303 82 227 -220 -197 203 368 118 -140 76 -285 -85 316 72 -453 -189 -186 239 93 -282
6026 -282 -101 -321 86 3 -100 -82 -254 -186 -35 361 256 -413 -17 -114 100 198 41 -234 -164 -124 75 167 18
6049 18 -37 -303 242 205 84 30 -143 -374 235 45 356 68 -316 118 -109 -47 -156 210 -208 87 140 41
6071 41 -65 -312 16 -78 180 232 -62 -182 -73 -78 -61 -186 -11 -124 -201 281 285 -1 -173 -300 -57 126 65
6094 65 143 152 -118 -54 3 256 79 -156 49 138 112 64 265 12 -176 240 232 130 -138 -357 -178 138 350 -226
6118 -226 -100 -33 27 -52 263 133 -458 -34 67 231 233 -307 -9 101 -82 -40 -68 -357 -10 228 -10 106
6140 106 204 89 -477 -140 301 93 -200 -381 -433 415 266 381 -100 -413 -225 270 227 165 278 44 -255
6161b55M41K1j68q9l15J51J50K97m08p6J88j91L64l2k32L9K60K24m30K99m14q4
6183b60K78L2M04m37k1k85K74J76k02K8N5j30L73k89L15o81K59M6n0K37n2l64
6205b94Q6J78L40k38J71l61J5R4K48K60o50J28r8J12O5N7l43R8K01k1O00n96m8
6228Dk35K79j80L93q7l01M9J91K07j28j60k39M81p8J20k71j17N1k03J86L57o0
6250B59j79m13L40K36j63k55N00l86J02J49K14n26k05N09l26K21j40n7j27K11
6270c6M85r6m50r5j45K86K43q8j9l16P8J46J45j24j45o4J47J22J06r6J43l04j54
6293b31j3O32m01j82j8Q1J24J51o5l54j97O31K9j04l8k22K28J22k0o8N0l43J26
6316h2J46J09J48m28l56O12j88L84k68k35j6o9J56L09k60J30k03L8K72J09n00
$$ plain form
6161 -255 186 207 39 -50 -365 -214 -64 233 -175 -251 -63 -254 110 78 -154 -115 145 369 -61 238 -176 -260
6183 -260 18 50 454 17 -4 -289 -15 161 -41 -13 42 -88 285 -4 311 -370 -111 -65 -115 122 70 -294
6205 -294 -208 -30 310 72 243 -118 -103 -9 239 499 -151 -23 -121 -9 56 113 -230 -132 69 48 648 52 4
6228 4 -231 48 -132 261 174 -127 -78 113 320 192 32 -207 274 196 316 45 -72 -21 -224 -38 319 259
6250 259 80 -333 7 243 80 -175 325 -61 41 190 404 -122 -327 182 -144 77 -63 -120 -247 -36
6270 -36 449 353 -97 -192 -337 -51 192 104 85 -231 -153 -7 138 14 -131 -195 -48 74 180 84 227 -77 -231
6293 -231 -244 388 -13 -195 -213 -132 -8 143 78 -276 -473 158 187 83 45 -177 51 173 153 85 135 -208 -82
6316 -82 64 173 321 -107 -463 149 -39 345 77 -158 -174 -243 -87 222 -38 92 -111 -73 199 308 -192
6337a92k2J66N15m38J19l57N1J47K7M61l95k22k6R1L00k89L6k43K47K28o1j20
6359B3j99rK53J17L08l59k54K1N4M88l89J7L6l59L36p2K42J4p14L34J61r7J85
6382A37k22N5j85O87j87k85k72j72Q32L8l52j10l70L32K25K48k80k2m53J49K21
6403A4l9j24j11JN9L42K54m73j75J80K22L7K6j88j11J67Pn3K38l26k35J7L56K7
6427A12J80m43k80L28J84K46l85r9MK55k78Q5L96n72O1L95O6k31k64l6l89P12
6449D7K45J28n85j52M76KK29k2o05j74L81L46k52l5L7l91L92l6J96m78pJ81L9
6472c8L04o0m58n8J88R0q9K48p6j80L3K88k26L07k45k5L6K58lj09m93K32K43k21
6496e4R8k54r7J47M69n17O7j40R3N41m60M70l22p9m9J82N3n0O3k42p7J27J97j90
$$ plain form
6337 -192 -214 -48 467 29 148 -209 -158 -11 16 477 82 -140 -166 -75 225 -64 -28 -271 -24 204 143 23
6359 23 -176 -185 68 185 493 134 -120 -99 -45 443 54 71 107 -252 84 12 254 268 -446 -112 49 -48 137
6382 137 -85 -30 -215 472 285 0 -272 -444 388 426 74 -36 -406 -74 151 399 119 97 -356 -207 14
6403 14 -25 -149 -260 -259 -200 142 396 -77 -252 -72 150 187 213 25 -86 81 88 35 273 -53 -288 -271 85 112
6427 112 292 -151 -431 -103 81 327 -58 -157 -153 102 -176 -91 305 -267 -206 189 255 24 -240 -276 -665 47
6449 47 292 420 -165 -317 159 161 390 368 -237 -411 -30 316 64 29 66 -325 67 31 227 -251 -258 -77 -38
6472 -38 266 206 -252 -310 -122 -32 -121 127 51 -129 -96 192 -34 273 28 3 39 297 294 185 -308 -76 167 -54
6496 -54 44 -210 -307 -160 309 -208 -141 -281 -188 353 -107 363 41 -38 -87 95 148 98 161 -81 -158 -31 166 -24
6520b4J7m2M6J23O6p7k74l19J59N32n5m43k8K33K64j38K24k87k18L67m7K18l00
6543cj40j08K34k6J53l41J15O5R5r1o5P0m12K43L37j27Q5K14k00k17J8L18p8m11
6567b72J85m04Q07j92j17j95l59K58M77Jm26J66j79L80j31l1K13o10M03R3n2l7
6589b2k04m6P9M33j08k98N9K62k66j08M06ql52j63N03K84m57k72M2oM51L7m51
6612b05Q8l77Q18o4j79j25o8N0m2K07K18o07J25m0K62j61L30k83O2K5Q3J02J12
6635C31m34O5j2oM14o63J65P8n8L09N0l06O5j02J94k28K07k41m9K92R8K92k43
6658B18m73K87j38M37j61k98N9l18L47J95K71m96k4k03M02O0K3o9k32j53K82K68
6680B84k78L27m30q3J71L22j75l85J36J56N81n18j87%qM71k18j80k49K73J31J53
$$ plain form
6520 -24 -7 -49 -3 120 186 109 -165 -484 -325 207 152 -291 -319 -86 178 40 264 -23 -241 126 79 297 -3
6543 -3 -143 -251 -17 -43 110 -231 -116 -51 44 -47 -112 -42 -454 -211 126 -1 84 298 98 -119 -101 217 139 -272
6567 -272 -87 -491 316 124 7 -188 -547 -289 188 189 -237 -71 -250 130 -1 -32 181 -429 -26 67 15 -22
6589 -22 -226 -272 -193 240 132 -166 -107 155 -111 -219 187 179 -173 -336 167 451 -6 -278 -236 -242 209 246 -205
6612 -205 -117 -494 324 260 81 -44 -112 -62 -104 103 321 -286 -161 -201 61 -100 230 -53 9 34 117 219 331
6635 331 -103 -38 -50 -56 358 -305 -140 -62 -120 189 239 -67 -2 -104 90 -138 69 -172 -221 71 169 461 218
6658 218 -255 32 -106 331 170 -128 -69 -387 -40 155 426 -70 -94 -297 105 165 188 119 -113 -266 16 284
6680 284 6 333 -97 -180 -9 313 138 -247 -111 45 626 108 -79 -79 -87 384 166 -14 -263 10 141 294
6702B94k19j34k3L09j70L59k82j15L4r5j60L73j50K53j21m66N44j50o5j69R7k10
6724b66K33J04j97L4n5K72M2O7k52%J7NQ5p3Qk10K35r9J99J93l33LJ26K05rk90
6750D4j45K03k67J78O4j14no7Q8l5J95j31k30j93M33K25k94K01j12l71P16j74
6772B09k63P5k83K08q1L22m55j24L03k7K70j48k91R5j74N70k38Rj18L8K8J90O2
6795A77l75R9l24M22K08J0l59J7R1k65L72j32O9l2k70M48j07p7M6j36L6M52l06
6818F4K26m63R6Q0L02k24J15j67q9Kq2J85m1l50J42J54J67j24k50L48j36j55J64
6841c6J02l85L48j90M79m03K07k37k0M07m6K81m78k26K5L27l3j32J00k20L7L05
6863B12N0l98K12k01L52J65k86P1m00nL60J37j67j37Q0k10J00J44K40m42P1J74
$$ plain form
6702 294 75 -59 -82 227 57 416 134 19 53 -42 -202 171 21 274 153 -313 231 81 16 -153 -56 -266
6724 -266 -33 71 -126 -92 -147 125 167 234 -18 -18 -1 4 89 16 24 -186 49 -50 149 342 9 12 138 343 334 44
6750 44 -101 102 -165 13 77 -37 -42 -109 -21 -56 139 8 -222 -415 18 243 -51 150 38 -333 383 209
6772 209 -54 21 -262 -54 -135 187 -268 -392 -89 -116 154 6 -285 -190 -364 206 -32 -23 -141 -103 -75 115 177
6795 177 -198 -99 -423 -1 207 217 -142 -125 -34 -299 73 -59 10 -22 -292 156 49 -28 18 -118 -82 370 64
6818 64 290 -173 -77 3 305 81 196 29 -60 -58 -140 45 4 -346 -204 -50 117 -7 -257 91 -45 -200 -36
6841 -36 66 -319 29 -161 318 -85 122 -115 -135 272 226 507 29 -197 -172 155 122 -10 90 -130 -93 212
6863 212 262 -136 76 -125 227 392 106 177 -223 -228 132 269 102 -35 45 -165 -65 79 319 -123 -52 122
6885A22j07L10l10l62j89L97MJ54Ll93K05j6M41k50j96k5J80p5N42n67k90L97
6907b5k83L75J56N5m68N0pK49j93L10j94k30J67%l2J36k26J2Q1M5kpk09m6P5N62
6933C51j05k22j93J96jj71L19j69j98L64k39L69m12k43P9O27k10J93m11N0pNQ8
6956F0J16l17J34l76O17r5j71O2K21Kk49L30k97m40M87j39L05J5n01L58j4n6k30
6979a78J57n9p7l7K11N3Q7q8l67M5L44J45l13j49J06J3J14n1J42k83L8K03p9k25
7003b48J94j52r9K14m5q4J26l80P82j08n05N03m37M97l91M9J6J9j65N18k23o9
7025A2p7n5J71j73P1L73l24L7j60K69J0J53l38mM3l4J14r4J61m61K05J61K98j26
7049B32k52j78M89r7o0j32q4J71N1k90P2J00j93p5J02L48K17o40R2P9J3L55l15
$$ plain form
6885 122 15 325 15 -347 -536 -139 -135 19 22 -371 -166 -182 259 9 -187 -212 -32 -107 435 -132 -422 -25
6907 -25 -308 67 223 278 -190 -140 -147 102 -91 219 25 -205 -38 -38 -70 66 -160 -148 -67 -22 -24 -31 -240 -286 -211 351
6933 351 246 24 -169 27 26 -145 174 5 -193 171 -68 301 -111 -354 -275 352 142 335 -76 -26 -33 -28 60
6956 60 176 -141 -7 -383 234 139 -32 30 251 253 4 334 37 -403 84 -55 250 265 -236 122 108 52 -178
6979 -178 -21 -80 -157 -194 17 70 157 69 -298 -253 91 236 -77 -226 -120 -107 7 -44 98 -185 -147 56 -23 -248
7003 -248 -54 -206 -305 -91 -136 -220 -94 -474 308 200 -305 198 -239 258 -133 -84 -68 -49 -214 304 81 12
7025 12 -65 -120 51 -122 -51 322 -2 35 -125 144 154 307 -31 -35 8 -26 88 -6 155 -306 -101 60 358 232
7049 232 -20 -198 291 194 134 2 -82 89 140 -150 -78 22 -171 -246 -144 204 421 -219 -127 -48 -35 320 5
7072Ej06o5L87l0R5p5m19N2j24M74o7l44k49M93q2M73l54l89Q1L46qJ19l8k39
7096f4k42L30J71r6j68Rj24K49J8O5k42k13K98M37j67r7m14J01j6M45q0l83K23
7119D0k14m6K26l7n6l5M8kj96J27R5j63J09K88P2l38L2K5Q1j52K64m31K53K05
7143A95l09L35K00p27K98j47k99N53J82o83J07R4M08N9m23j51rL23L4j39O6O9
7165C6j55n2M72j35m27J5M15j04k36K86j88k99L97Kl4K47j39m22O15L5k78R1j27
7188A5l20L01l0M85k67l64K40o2p8J20j22L4j09J06k5j78J18j00L53k08J13J31
7210A53k73q3J72J48k31O9j56KL07j60j5k9o3N7N5K64r4k56j37o9N68Jl24k53
7234c47J78J67M4P1j23n0J72K3p4Jl65K05J4R2KJ39k73J96m22K20R7K89l41j39
$$ plain form
7072 5 -101 -166 221 191 286 211 -208 -156 -280 194 127 -217 -466 27 -55 418 64 -325 -244 102 94 213 175 -64
7096 -64 -306 24 195 99 -69 -60 -184 65 83 148 -94 -307 -9 428 261 164 -250 -149 -165 280 200 -183 40
7119 40 -174 -220 6 -31 -87 -122 -74 -76 -272 -145 -50 -213 -104 184 256 -82 -50 -25 56 -96 168 -263 -10 195
7143 195 -114 221 421 -306 -8 -155 -454 99 281 -402 -295 -201 207 266 -157 -308 -317 6 40 -99 -33 36
7165 36 -119 -171 301 166 -261 -246 169 65 -171 115 -73 -372 25 27 -7 240 101 -321 294 329 51 142 15
7188 15 -305 -4 -34 451 184 -180 60 -2 -80 40 -82 -48 -157 -51 -76 -254 -136 -236 117 -91 22 153
7210 153 -120 -203 -31 117 -114 -45 -201 -199 108 -52 -67 -96 -159 -102 -47 217 123 -133 -270 -339 229 230 -94 -347
7234 -347 -169 -2 42 113 -10 -60 112 135 61 62 -303 -98 -84 8 10 149 -124 72 -350 -130 -33 256 -85 -224
7258b24K42J37m49M34j32j07N6L81k45l51K5j31N75j94j32J26q6l12M31J14K2
7279A80j84j10j04O21n21j79l3O24m14J71k20%L24r7J61r5j76j10K07Q2K03j30
7301B00l09J97j28j26K23j1j50j32L21j06J60l50L30q9j7N0m44K75j3m3L5J54
7323B7P2k46l3j32K41J81j0j98O9J03lL6j44j7k7j48M03j7j46J35m54O98k86K1
7347A25M1m02M50l39M36R2m12m1k50K02K57oj56j25k46N27J04l8m38j20M16J3
7369I0J46k06K83o58M99p0J26l32j43J73j9L77j89k31R3j51J19K23k25J33j16
7390g8K33R3k19%l92J82J73q4K52l61N2L35j4k3l25N0j38K62J84j57j25P0j39
7413a69L36oj75K2j03k9M20k05KJ99m22L89l63L32k49m6j09J03p2K23k48R4L57
$$ plain form
7258 -224 18 155 -294 140 8 -99 -43 338 93 -258 -233 -364 211 17 -115 11 -75 -387 44 158 180
7279 180 -4 -114 -218 403 -118 -297 -330 294 -120 51 -169 -169 155 58 219 124 -52 -162 45 127 330 200
7301 200 -109 88 -40 -166 57 46 -104 -236 85 -21 139 -211 119 30 13 63 -381 -106 -119 -162 -127 27
7323 27 99 -147 -180 -312 -71 110 100 -98 -29 74 71 107 -37 -54 -81 -229 174 157 11 146 -308 390 104 125
7347 125 166 -236 214 -125 311 403 -9 -50 -300 -98 159 153 -3 -128 -374 153 257 219 -219 -339 77 90
7369 90 236 30 313 -345 154 84 210 -122 -265 -92 -111 266 77 -154 -61 -212 -93 130 -95 38 -78
7390 -78 155 248 29 29 -363 -181 -8 -92 160 -201 -149 186 172 149 -176 -126 -264 -2 182 25 -100 -30 -169
7413 -169 167 161 -14 8 -95 -124 296 91 93 292 -130 259 -104 228 -21 -67 -176 -73 -145 78 -170 -76 281
7436B81l70L03k37M5J03j61K05k17K7J03r6j3J36j52J96m71K14P1R1n3J17j88
7458f6L7J54j02O4q5j1n2k37O51k30R5o05J28M5L05r0j24J00J8M7j0M3p0r6RK46
7484A64j46k97J79L28k92L49j99Q6j66m6j45K76l38mR3Q0J53ll7j17j10L38q1
7507F5m6J24J4k04lJ00q8k28J30J59j28j53Q4J92j74K30p3J80q2l91L44O0j91
7530g9r5J91j95J65r1K54l38J94O8J36%j69o9j12K07k43K96m51K60o5j04J15L11
7553A86j8J80m67K0K23J53m22j41K16O9l08N53m05K08o5L0j96J37r1J24k3o0L67
7576B70o04L13n8j39M90j20k45P4k08M6J69j00J76n2l72J90L19k36l9R2j20K9
7598a25K01R6l23j27L05L1J36M2j7m39k54L09J14j77K76J02p2K6k41J09j15j8
$$ plain form
7436 281 -89 214 -23 22 125 -36 169 -48 -21 82 -14 -27 109 -43 153 -318 -104 -33 58 5 122 -66
7458 -66 -29 125 23 87 2 -9 -61 -298 353 123 218 -387 -259 -214 91 1 -123 -23 -5 42 32 75 5 -91 -82 164
7484 164 18 -279 -100 228 -64 285 86 172 6 -40 -185 91 -247 -251 -158 -78 75 72 35 -82 -192 146 65
7507 65 19 143 157 -47 -50 50 -38 -266 -136 23 -105 -258 -174 18 -156 74 1 181 99 -292 52 112 -79
7530 -79 -174 17 -178 -13 -104 150 -188 6 74 210 210 41 -28 -140 67 -176 120 -331 -71 -136 -240 -125 186
7553 186 168 348 -119 -99 124 277 -145 -286 -70 -1 -309 244 -161 47 -18 12 -184 -47 -138 -14 -37 -97 270
7576 270 -334 -21 -79 -218 272 152 -93 -19 -227 -181 -12 -112 64 12 -360 -170 149 -87 -126 -34 -154 -125
7598 -125 76 172 -151 -278 27 58 194 236 219 -220 -474 -165 -51 -228 48 150 78 104 -137 -28 -143 -161
7620a61lL98l0k43p6K11m18O74k08k05K55k69m5J53l17K9K74p4l8k05p8M38qj73
7644a19K60OL9q7K44n21J71m1n0j3p1L32k02j8L9k44N29k42l62J16K23K14k29
7667b6L12m66jK15J63M0l40j9J0o6K36p5j32J73j0O6k29J65M1q1J62q0j48K34
7691A44j26l53P7K17O5N6n1k85K25k36J79M06l26O1J26n9K8k68J62O9l98K97o7
7714e7J20j83L26l93K18m3L72k33k08K56p8J61m02J96N1k8j10L5N6J20k9M2Q8
7737B77l53N1J80p8k8J53k41J30l46K83k2j65j04N2n0J6M58l75J27p6L06L1m01
7760a75P9K65l32J15N62l10j88k18r3N24l8R7k47k19r1M93l04J38j17p3k49L80
7782aK87l6n2k83K88l59L28k69Q4l4m3L48k18q1rl44J62J87N8j53LN4L7M8%j15
$$ plain form
7620 -161 -164 234 204 -39 -115 96 -322 352 144 -61 194 -75 -120 33 -284 -255 19 -55 -93 -298 -376 62 54 -119
7644 -119 141 147 186 99 343 -178 -7 -48 -98 -111 -182 150 -52 -70 -31 -275 254 12 -350 -234 -11 203 -26
7667 -26 286 -180 -181 34 197 237 -103 -122 -112 -178 58 -17 -149 24 14 80 -149 16 57 -24 138 58 -90 144
7691 144 18 -335 -258 -41 24 80 29 -256 -31 -267 -88 318 -8 53 179 120 148 -120 42 111 -287 10 -57
7714 -57 63 -120 206 -187 31 -12 360 127 -81 175 97 258 -144 52 103 75 -35 0 56 176 147 189 277
7737 277 -76 -25 155 77 49 202 -39 91 -255 28 6 -159 -263 -211 -261 -245 213 -162 -35 -111 195 226 -175
7760 -175 -96 169 -163 -48 514 204 16 -202 -295 229 191 288 41 -178 -269 224 -80 58 -59 -132 -381 -1
7782 -1 286 250 198 -85 203 -156 172 -97 -13 -47 -90 258 40 -41 -50 -394 -232 -45 13 -140 -137 -83 -46 2 2 -113
7808a13M86n60O9L50k41j11m6J08J48j66P8j97L72j3j31R4k15p7r9L44K44j02
7830B22k0j1m28M25j80NLL8k44K06M3k29j16J92k5N00j89k83J02o6K97j31l1k05
7854a25K71r4j22O4j1n1J99m2l30L40q3m8K72P9k38p5k34J64j51L86l68J08k04
7877b93M29j80K77m51J44k3J27Pl80L86P0k02K32L1m01L39p8J3j06l2Q4J09l26
7900b24j02O70j61J6j12k35P7J5J36j1m6K7J12j89o2J26M5j07M6j04j94L47o9
7923Ak65K57P2m7M1k00K78q7j57J38P8j49L6R7j9J10l05P7p9K20l6j64R0%N0o2
7949b5K0m7K53k90m2j27M46k33mL2M12j25l5l19l05J12J63J60m1j9J66k78O6p2
7973a32J16Q9j11L40k73J01k33Q8J38k0j52j65M61k36o3K7J75j29k20j72J91L06
$$ plain form
7808 -113 373 -187 -118 232 -9 -120 -166 -58 90 -76 2 -195 177 164 33 127 -88 -165 -264 80 324 222
7830 222 202 191 -237 188 8 13 16 54 -190 16 59 -170 -286 -94 -119 381 192 -91 11 -55 242 111 80 -125
7854 -125 146 52 -70 -6 -17 -68 131 89 -241 99 16 -32 240 319 81 6 -228 -64 -215 171 -197 -89 -293
7877 -293 136 -44 233 -218 -74 -97 30 37 -343 43 113 -89 143 174 -227 112 34 47 -59 -91 -7 102 -224
7900 -224 -326 344 183 199 87 -148 -71 -56 80 69 23 50 162 -27 -89 37 82 -25 21 -83 -277 70 1
7923 1 -264 -7 65 18 59 -141 137 50 -107 31 109 -40 -4 93 74 184 -121 -44 -123 97 61 -103 -13 -13 37 -25
7949 -25 -5 -52 201 -89 -131 -258 188 -45 -49 -17 395 270 235 -84 -389 -277 -114 46 5 -14 152 -126 -60 -132
7973 -132 -16 73 -38 302 29 130 -103 -15 123 103 -49 -214 247 11 -52 -25 150 21 -199 -371 -180 126
7995A26j15L1Pl36J96k6J54p5j96L14k12L70M6l02o7K82j85N6N5k83j5R1K27q7
8019E6j61K9j46K69K53j97p7j1M4qJ7k49J17r2L92k87O1j19L48j93k53K11R9K79
8043C82k75k09J56j24M15q0l9l71J34Qj88N9K05J64j48P7j18m9J11j94l7K27m15
8066c09K35R8k0K40j12j21j8k28K72L0K80n06k10J76L53N6l38L19j94j16J10L48
8088C45j45j32j61J14M5lj31J59j78m3K34j64k60P9J60J84j12j09k5J66n7K63
8110B29jj28m81K01K38N9n7mj16R7j30N2L25m24J25P6j41R1k2L2k97J09L73J03
8134C09j65k26O2J5P4o6M8J66k24J10J28j99k09k22K46M16j56O9r5K9l88J87K12
8157A21j90k10K61k12L00K87k23mj64L06k89M8j45j25J42K56j98L14l68J03R6
$$ plain form
7995 126 11 42 49 -287 -91 -117 37 -38 -234 80 -132 238 284 -18 -85 197 12 68 123 -160 -175 -84 143 56
8019 56 -105 -76 -222 47 300 103 26 15 59 51 68 -181 -64 -156 236 -51 10 -109 239 46 -207 4 103 382
8043 382 107 -102 54 -70 345 265 226 -145 -11 -3 -191 -132 73 237 89 166 48 -1 110 -84 -121 106 -309
8066 -309 -74 24 4 244 132 11 -7 -235 37 67 347 -159 -369 -193 160 216 -122 197 3 -113 -3 345
8088 345 200 68 -93 21 66 63 -68 91 -87 -130 104 -60 -320 -241 -81 103 -9 -118 -143 23 -34 229
8110 229 228 100 -381 -180 58 117 60 56 -60 37 -93 -41 284 -140 -15 61 -80 11 -11 21 -276 -167 206 309
8134 309 144 -82 -20 -5 69 3 51 217 -7 103 231 32 -177 -399 -153 263 107 176 81 110 -278 -91 121
8157 121 -69 -279 -18 -230 70 357 134 130 -34 272 -17 31 -114 -239 -97 159 -39 275 -93 10 106
8178A06k14K70o5q5Q7j3j13J46J60l38k11j5J99
$$ plain form
8178 106 -108 162 97 12 99 86 -27 119 279 -59 -270 -285 -86
8191h6
$$ Imaginary data points
##PAGE= N=2
##DATA TABLE= (X++(I..I)), XYDATA
0@%%%%%%qJ6j6J6k4L2l8M6n6P2q3R4j14J35j56J81k11K45k80L20l66M17m71N30
30B81n99O75p55Q45r44J050j167J298j443J598j767J956k167K402k661K952l280
47a726L652m083M580n167N877o745P839r270J1227j4082J8652k7136M8058j91168
61a59492l11447M34664L38797j87241l36613Q7908K33327l5294j75171P4906J60476
72A24820q1071k02044N2997J97411j8895j99511m159J96841O1284j53408o7945
83i3680J13961N4250j07653l1100J38122N2167j80140j39830J35803K13572j5526
94A39946j85537q5616P8925Q4937P207k0399k2934m3753k4391M5358O9197Q850
106E1790m4797l2525O035K7024K7064l069m8475m6283K1909P1457K9051n3231
$$ plain form
0 0 0 0 0 0 0 0 -8 8 -8 8 -16 16 -22 24 -32 40 -43 51 -63 72 -84 97 -114 131 -149 171 -195 222 -249 281
30 281 -318 357 -398 447 -497 553 -614 684 -759 839 -928 1028 -1139 1263 -1398 1554 -1726
47 -1726 1926 -2157 2423 -2744 3133 -3612 4227 -5043 6184 -7898 10754 -16382 31676 -159492
61 -159492 -470939 -36275 302522 115281 -221332 -133424 99903 64609 -110562 -35656 124820
72 124820 43749 -158295 -105298 92113 73218 -126293 -130452 66389 127673 -25735 -93680
83 -93680 20281 74531 -33122 -64222 73900 126067 -54073 -193903 -58100 155472 139946
94 139946 -45591 -131207 -52282 32655 39862 19463 -3471 -47224 -71615 -26257 42940 51790
106 51790 6993 -25532 -19497 7527 34591 31522 -16953 -63236 -41327 30130 59181 5950
118E950o6838P180Q0561P6257q168r4407q5068L1824J18848N1627q1148r5193
130e8575J1620O9419J9062j5551J8312P914p4017o7801P4543J31174k9894j69452
142h3246m5217J55909J12384r3628j25087L2118R1847j2498n3407K5809K1601
153B6585q7623o2946J14698J39299p1809j80872m47J75046P3874j11087q4568
164f9850N4835M7259n1924j9462Q8525M0467j09874r1368R2261J44001k8836j57323
176f1289n3639J02174Q3046m1827p3455q042K5519J1281J8178K9431j3588o1346
188d3557k9448M8146O2088k918o0537m4358J5266N8680M9118p260n6905m0079
200e1764K8930O1638J9896l7439m7357j6621K0855M3918L1639j9717n9870k8899
$$ plain form
118 5950 -60888 -53708 26853 103110 94942 535 -84533 -52709 66139 117766 36618 -58575
130 -58575 -46955 22464 41526 25975 44287 52201 -21816 -89617 -15074 116100 86206 -83246
142 -83246 -128463 27446 139830 46202 -78885 -46767 45080 32582 -20825 4984 26585
153 26585 -61038 -123984 -9286 130013 58204 -122668 -123115 51931 125805 14718 -69850
164 -69850 -15015 32244 -19680 -39142 49383 89850 -20024 -111392 -19131 124870 96034 -61289
176 -61289 -114928 -12754 70292 28465 -44990 -53032 -27513 -16232 1946 31377 17789 -43557
188 -43557 -73005 -24859 37229 34311 -26226 -70584 -55318 3362 52480 45220 -11685 -51764
200 -51764 -22834 38804 58700 21261 -26096 -42717 -21862 22056 53695 33978 -25892 -54791
212e4791M7189O9398J51p0910n3842J9224N7427L2150j6081m5098l3293J7975
224c0501O3381M2368l5509p8348k5051N6125O0198r039n3743l2000Q875L4311
236A067L8954J1746l9547n5114J031O0586L7483l4583n3571m836K8622J9777J5124
249B6739J4190k3900n8286p144P9779O1742o0685j11014m380J05535O1468n8058
261B5986p5988Q741N1211J3601j2632K813n068m0311k5839M5222O4646j3240p8086
274c8944l1896N6114O4147j574m7465l6224k233K6800L6857J4319l5467n4438
286e0004m566O3077N7176k0511p0525l2160M0319N7127M341m7387l9304Q534L4526
299F43K1085m61j1268j9091j8927Q139M3068L0381l5609p2073j4494P1652O6643
$$ plain form
212 -54791 -7602 61796 61947 -8963 -62805 -43581 13846 45996 29915 -15183 -48476 -30501
224 -30501 32880 75248 39739 -38609 -63660 -7535 52663 43624 -10119 -42119 -33244 1067
236 1067 40021 51767 12220 -42894 -41863 18723 56206 21623 -31948 -36784 -8162 11615 26739
249 26739 40929 17029 -41257 -48401 31378 93120 32435 -78579 -82959 22576 84044 25986
261 25986 -50002 -41261 9950 23551 10919 13732 8664 -31647 -57486 -12264 52382 39142 -38944
274 -38944 -70840 -14726 49421 47847 382 -35842 -38075 -11275 25582 39901 4434 -50004
286 -50004 -54570 8507 65683 45172 -25353 -57513 -17194 39933 44274 -3113 -42417 -33883 643
299 643 21728 21267 9999 -9092 -28019 -19880 23188 53569 17960 -54113 -68607 3045 69688
312F9688k5558p8353k7117M9555N6116K641l8995l4586q210J9338L4826J6919
324C6264k7326m3201j197M2470L1113j1601l0017j7448j403J4522K9459J4882
336C6517l5175n4863M161P3927M8575m4100p4898q207N7497M2459j3066l8556
348e729k5599k536K2207L9724J7668l5569m9976L719N3251K9229k8514m0867p225
361c0217J7759J6568J2903L910k2361l6574M194N9069L8417m5284p5499m526P0514
374H873M9689l0123o0540j4598L5020L3285O594r832j7796k2282o142K7207L5646
387C5001k099m4794l3670K3141N3886J8228l6464m2579m49L5445L0469m949l5775
400d609l1918M092M0803L7052j2320n2437k9932L1715N2300Q163m0027l6903J253
$$ plain form
312 69688 44130 -34223 -61340 -11785 44331 46972 7977 -26609 -34819 -15481 19345 36264
324 36264 8938 -34263 -35460 7010 38123 26522 -3495 -20943 -22346 -7824 21635 36517
336 36517 1342 -53521 -49360 24567 73142 29042 -45856 -54063 3434 45893 32827 -5729
348 -5729 -31328 -33864 -11657 28067 45735 10166 -39810 -36091 17160 46389 17875 -22992 -30217
361 -30217 -12458 4110 17013 20923 -1438 -38012 -33818 25251 63668 18384 -57115 -61641 8873
374 8873 58562 28439 -32101 -46699 -11679 21606 28200 18368 572 -21710 -27852 -645 35001
387 35001 32902 -11892 -45562 -22421 31465 49693 13229 -29350 -29799 5646 36115 31166 -4609
400 -4609 -36527 -32435 8368 45420 33100 -19337 -49269 -17554 34746 42909 2882 -34021 -32768
413c2768K4858K1175O370r986k4766j9472J5948M3755J8387l6515m7237P25M7749
426H223L4215j7849m4515j7579K5504L9225J4322k3946l7719j2723K6824L6072
438C0054L581l1895l2278n53K8735K7670N54k5402k8715m366K6451L2624r23l8729
452a3192l3954J2048M6727K6683k4532m4474r503L5540L6931j566l1863k5839
464b6994K230K5170K5029M028k2978k9849l601L3615L3809p518m1160k5620J5617
477a8222L3854J5031j6613k9943j5715J6025L5277J9113k5965m5566p681M2990
489B585L8117j4695m4374j9394K2134L0452J1094j0101k0272j8631Q30K8687K7889
502C4321j0554m0963k2032K3425L9553J0569k6727l1247k062K6994K8090n1l0013
$$ plain form
413 -32768 -7910 13265 19635 9649 -15117 -34589 -18641 25114 43501 6986 -40251 -39526 8223
426 8223 42438 24589 -19926 -37505 -12001 27224 41546 17600 -20119 -32842 -6018 30054
438 30054 33635 1740 -30538 -31091 -2356 25314 25868 466 -28249 -32615 -6164 26460 25537 -13192
452 -13192 -47146 -35098 11629 38312 13780 -30694 -40197 -4657 32274 30708 -1155 -26994
464 -26994 -24764 406 25435 29463 6485 -23364 -26965 6650 40459 32941 -8219 -33839 -18222
477 -18222 15632 30663 14050 -15893 -31608 -15583 19694 38807 12842 -32724 -40405 2585
489 2585 40702 26007 -18367 -37761 -15627 14825 25919 15818 -4454 -23085 -22255 6432 34321
502 34321 23767 -17196 -39228 -15803 23750 34319 7592 -23655 -25717 1277 29367 29316 -697
515f97k8942P842L6566K1015j7579l2758j1041J8758K6801R624j5022k7720j6578
528b9731J3265L2934J4366k4391l5699p497K7240K9759K807k5640k9165j279K9710
541c321K9005n736l5216k1688J9498L7178J1058k1807k5628k723J9457K2775O291
554B9143j7960k6715q922K2452L1311L740l1142l1072L925L1908K3105r815l2533
567a2575k2797J0523L3477J8625j7986l4645r645K6022L0062J61k3923j8700J947
580a9454J8179J9347M018j8518k4049n66K6890K5420n327l1153k1314J1438L0382
593A5293J6305j5795l2043j4159J9868L2147Q038k5455k9241n03K7204K4197n634
606B0222k6521j7522P003K1785J6736m460k3016j8342P655K6535J6404j2933k8379
$$ plain form
515 -697 -29639 -21797 14769 35784 18205 -14553 -25594 -6836 19965 29589 14567 -13153 -29731
528 -29731 -16466 16468 30834 6443 -29256 -36753 -9513 20246 23053 -2587 -31752 -33031 -3321
541 -3321 25684 19948 -15268 -36956 -17458 19720 30778 8971 -16657 -19380 77 22852 29143
554 29143 11183 -15532 -24454 -2002 29309 33049 1907 -29165 -25240 6668 29773 19958 -12575
567 -12575 -35372 -24849 8628 27253 9267 -25378 -35023 -9001 21061 21222 -2701 -21401 -19454
580 -19454 -1275 18072 22090 3572 -20477 -21043 5847 31267 25940 -5213 -26527 -15089 15293
593 15293 31598 15803 -16240 -30399 -10531 21616 29654 4199 -25042 -25545 1659 25856 20222
606 20222 -6299 -23821 -16818 4967 21703 17243 -5773 -24115 -16460 10075 26479 13546 -14833
619a4833j3564J5734K7549R962j8612k9227p177K6003K9500k049k9604k1434R857
632a7895K6920J5423q837k3045j3567J0374K4454J4229j1960k6222j1650J5425
644f351K5690P990j8837k6898o381K1908K4339O15k4894k3559K100K6250K1724
657B3696r719k8925j5089J5244K6626Q986j4155k1063o946J3939K3117R002j6058
670H655k4400m708K1801K2347J83k1381k0400Q39K2275K0723n834k7473j8463
683b5836J0432K7592J2373j6275k6371q196J7760K3493M004j9205k0658r27J8748
696c066J9087J759j8715k0930J305K4003J9693o902k4265j4711R237K3086J3405
709B2986j1412k4284j1374J5473K5627O199k0018k2838l58J9831J8294j51k0167
$$ plain form
619 -14833 -28397 -12663 14886 24848 6236 -22991 -30168 -4165 25335 23286 -6318 -27752 -17895
632 -17895 9025 24448 15611 -7434 -21001 -10627 13827 28056 16096 -10126 -21776 -6351
644 -6351 19339 27329 8492 -18406 -24787 -2879 21460 22075 -2819 -26378 -24278 1972 23696
657 23696 13977 -14948 -30037 -14793 11833 20819 6664 -14399 -21345 -7406 15711 24713 8655
670 8655 -15745 -20453 1348 23695 23878 2497 -17903 -17064 5211 25934 20100 -7373 -25836
683 -25836 -15404 12188 24561 8286 -18085 -26281 -8521 14972 18976 -229 -20887 -21814 -3066
696 -3066 16021 17780 -935 -21865 -20560 3443 23136 16234 -8031 -22742 -13505 9581 22986
709 22986 11574 -12710 -24084 -8611 17016 23215 3197 -19641 -19999 -168 18126 17975 -2192
722b192j8329L617K2226J6391o476k1855j4564Q452K2991J2956j2208k4584r434
735b3009J5763K3237N326j7495k1014l004J7914K0844N31k1788j8584M844K1951
748E516J3975n817k0018j2779P622K1883J2376j0944k2810q665J4485K0629N786
761B1239j5394k0022l683J7424K0697j5k2233j7615M711K0425J3758o615j9982
774g305j3897Q793K1895J0873j1434k1793q295J3679K0604N925j4951k0215l785
787a9906J7815K0074r90j8855j5897L370J8262J4242n215k0460j2862R640K0563
800I781Q266j1881j8258n756J2378J7935N278j3997j9981m150J7921J9322r85
813A5873j8608j6002K660J9278J6287n118k1364j3474R114K0142R047j0477j8441
$$ plain form
722 -2192 -20521 -16904 5322 21713 15237 -6618 -21182 -12730 10261 23217 11009 -13575 -23009
735 -23009 -7246 15991 21317 3822 -17192 -20196 -2282 18562 19093 -2695 -21279 -16435 5516
748 5516 19491 13674 -6344 -19123 -11501 10382 22758 11814 -10996 -19661 -5176 15453 21239
761 21239 5845 -14177 -17860 -436 20261 20246 -1987 -19602 -14891 5534 19292 12677 -7305
774 -7305 -21202 -12409 9486 20359 8925 -12868 -21163 -7484 13120 19045 4094 -16121 -19906
787 -19906 -2091 17983 16993 -1862 -17759 -14389 3873 18115 12900 -7560 -20422 -10782 9781
800 9781 18047 6166 -12092 -17848 -5470 12465 17743 3746 -16235 -20385 -2464 16858 15873
813 15873 -2735 -18737 -16077 3201 19488 14370 -6994 -20468 -11354 8788 17835 7358 -11083
826a1083o540J2376J7892M409j4312j6491r01J5029J3594j066j4503j4318J451
839a4463J7761J5828n379k0491j1792R023J9641R392j0842j9702q449J2812K0299
852A3638N418j5555j7963r00J6293J4794j181j5382j4325K352J6703J2388n725
865A0555j6370r110O920J5858Q975q628j7509q247J1814J8147L677j4433j6581
878a4932n93J5032J5411O12j6998j5626L539J8770J1600p319j6666r463P397J6840
892G604Q663q576j6908o263J0894J6310L522j2492j5165k102J3636J4683K70j5255
906a179j3738M074J6219R830n454j5406r938O464J6504Q161j0044j6588m184J1961
920c318J4512L113j1905j4352k137J2520J4631R6j4938j3456L130J6052J1723
$$ plain form
826 -11083 -17623 -5247 12645 17054 2742 -13749 -14650 379 13973 12907 -1596 -15914 -14463
839 -14463 3298 19126 13747 -6744 -18536 -9513 10128 19520 8678 -11024 -19473 -6661 13638
852 13638 19056 3501 -14462 -15362 931 15725 14544 -838 -15163 -12811 3892 16280 10555
865 10555 -5815 -14925 -8005 7853 16828 8200 -9309 -17556 -5742 12405 16082 1649 -14932
878 -14932 -15525 -493 14918 15530 -1468 -17094 -13555 5215 16815 9496 -7170 -16633 -9236 7604
892 7604 16267 7691 -9217 -15480 -4586 11724 15246 2754 -12411 -14513 -877 13806 14076 -1179
906 -1179 -14917 -10843 5376 15206 9752 -5654 -15592 -9128 7376 15537 5493 -11095 -15279 -3318
920 -3318 11194 14307 2402 -11950 -14087 -1567 13064 13160 -1778 -15234 -12104 3948 15671
933A5671l712j6526j1112P051J7031P281j0091j5375m987J0639J4944L457j2339
946A932j3472o60J3443J1813k971j4160r831M223J2395R177l565j4095r332O534
960h569J5376P595q453j6064o048R971J5723M132j1945j4638j126J3437J3861
973A3252j328j4084j1446L096J3669R997n394j5003p067Q683J3763M753q954j2233
987h296l576R253J2048K021j0417j2732q19J2475J2432p36j2884j0792K217J4031
1001D225J0350m893j5058q340O632J4431O695p729j3959m504J0263J3236J959
1014A3308j1313j1858m26J1939J0143j991j1395q982K997J2911Q787m892j3460
1027d232o965N535J2785O096q040j3681l527R420J3224J955j0368j2221o53J1282
$$ plain form
933 15671 11959 -4567 -15679 -8628 8403 15684 5593 -9782 -14769 -4130 10814 14271 1932
946 1932 -11540 -12200 1243 13056 10085 -4075 -13906 -9683 2712 11889 8324 -5771 -15103 -8569
960 -8569 6807 14402 5949 -10115 -16163 -6192 9531 13663 1718 -12920 -14046 -609 13252
973 13252 11924 -2160 -13606 -10510 3159 13156 7762 -7241 -14308 -5625 8138 12891 3937 -8296
987 -8296 -11872 -2619 9429 11450 1033 -11699 -12518 -43 12389 11653 -1231 -12023 -9806 4225
1001 4225 14575 9682 -5376 -13716 -7084 7347 14042 6313 -7646 -12150 -1887 11349 13308
1014 13308 1995 -9863 -10289 1650 11793 9802 -1593 -10575 -7578 5333 14120 9228 -4232
1027 -4232 -11197 -5662 7123 13219 5179 -8502 -12029 -2609 10615 12570 2202 -10019 -10672 610
1041F10J0768j963j1894r760K811J2638Q292m442j2364o877O036J2156N341p872
1055C480j2497l756Q364J1671K904r793j1258n32J1268J0240j421j1984r456K690
1069a0080J2595P547n073j2078n806O279J2291N294p835j1978l117Q339J0817
1082G195K044r430j0482k89J0434R948k00j0663r358K573J1733P382m150j1474
1096d737o706O121J2218M487o821j1340k563Q040J0767J653j0119r950N2R995
1110A097R175j332j0269p953L187J0993P417m408j1004o422N764J1279L926o276
1124E174j0699k812P683J0870J888q991r878n74R452Q834k061j0929p769L662
1138f150J0370N773l743j0370n964N346J0241L875o992r791l097P482J0156J389
$$ plain form
1041 610 11378 9415 -2479 -12239 -9428 3210 11502 7060 -5304 -12181 -6145 6011 11352 3480
1055 3480 -9017 -12773 -4409 7262 10166 373 -10885 -11417 -149 10091 8670 -3314 -12770 -10080
1069 -10080 2515 10062 4989 -7089 -12895 -6616 5675 10969 3134 -8844 -11961 -3622 7195
1082 7195 9239 -191 -10673 -10962 -528 9420 9220 -1443 -10801 -8228 3505 10887 6737 -4737
1096 -4737 -11443 -5322 6896 11383 4562 -6778 -9341 -1301 9466 11119 1000 -8950 -8898 1097
1110 1097 10272 8940 -1329 -9282 -6095 4898 12315 7907 -3097 -9519 -3755 7524 11450 5174
1124 5174 -5525 -8337 -654 10216 12104 3113 -6765 -7339 2113 10947 8886 -2043 -9812 -6150
1138 -6150 4220 9993 6250 -4120 -10084 -4738 5503 9378 2386 -7405 -10502 -3020 7136 8525
1152H525q530q374k46Q724Q863j459j0291p844K903J0171P000m784j0542m543
1166a0427N355J0274L414o645r734k981P061R322N27p539q356p2Q791Q176j000
1181F166r310p109K918R195O234m163r712m491N447R649M262o148r776k094P960
1196i72Q765M41q445q134O47Q969P504k086q354n560K471Q660O002l690r247n013
1212h042N123R169L993o246r222j603P623Q119M53p479q166M13P972O961k227
1227F841q506o289L346R198M520m147q661l605M752P901L263o117q185j832O635
1242h86Q332J159p251p999L93Q575O392k542q325n748K759Q689M177l724q070
1257d069m371M821Q215K581o205p987j384N902P067J099p022p148P83P871O407
$$ plain form
1152 8525 -5 -8379 -8625 99 8962 7503 -2788 -10632 -7729 2442 9442 4658 -5884 -10427
1166 -10427 -5072 5202 8616 1971 -7763 -10744 -3683 5639 6166 -1373 -9729 -9801 -1010 7166 6166
1181 6166 -3144 -10253 -7335 1860 8094 3931 -5781 -10272 -4825 4824 9086 2938 -6838 -8932 -972
1196 -972 7793 8234 -211 -8345 -7698 1271 8775 6689 -1665 -7225 -4754 3906 9908 6218 -3029 -8042
1212 -8042 -2919 6250 10243 3997 -5225 -6828 795 8914 9367 1888 -6278 -5865 2107 9068 6841
1227 6841 -1665 -7954 -4608 4590 9110 4963 -3698 -7303 -2551 5350 8613 2496 -5689 -7521 -886
1242 -886 7446 8605 1354 -6645 -6252 2323 8715 6173 -2152 -7900 -5141 3548 7725 4001 -4069
1257 -4069 -8440 -3619 4596 7177 972 -7015 -8399 -2497 4570 5669 -1353 -8501 -7718 153 6560
1272F560k067p526n636K689Q432M353l844q331l448N273Q426K345o183p080q91
1287f928N256O970O80p134o124O14O931O003j134p209n456K718P755M090l481
1302C551p596l609N212P307K453n261p299j227O406P831l12p925o242J676P002
1317A967M875j550o397n178K510P215M480l207p885l802M954P482J674m891p114
1332d867j170O370O854o67o645n376J376O020N125j816p183m728K972P789K991
1347G045l678p003k364L869O721K294m874p442j641O713O294o30o391n185J207
1362e065N940N279j984p098m446L336O761K568l869n928k018L823O315K271m935
1377I50o845l93O035N475n46n444n260O44O565N848k452p194l772L511O279K649
$$ plain form
1272 6560 4493 -3033 -8669 -5980 2452 6805 2961 -5370 -8818 -3545 4881 7226 1043 -6037 -6928
1287 -6928 -1672 5298 5978 -1156 -7280 -6666 265 6268 5134 -2075 -7531 -4813 2942 7032 3551
1302 3551 -4045 -7654 -2442 4865 7318 2057 -5242 -6469 -63 7768 7456 -469 -6711 -5035 1967
1317 1967 6842 5292 -1105 -6283 -3773 3442 7922 4715 -3170 -6972 -2018 5464 7138 2247 -4867
1332 -4867 -6037 333 7187 6520 -125 -5501 -4125 1895 7020 5204 -1979 -6707 -3735 4054 7045
1347 7045 3367 -3636 -6000 -2131 4590 6884 2010 -5432 -7073 -360 5934 5304 -1087 -6272 -5065
1362 -5065 875 6154 4170 -2928 -7374 -4038 2723 5291 1422 -4506 -6524 -2701 3614 5885 950
1377 950 -5895 -6288 -253 5222 4676 -768 -6028 -5384 1181 7029 4577 -2617 -6389 -2878 3401 6050
1393F050l806o388k331M932O480P38n521n520M06M894M460K68n025n482K27O451
1409H33N366k785o112l388K987O220L000l329o681j996M504O671Q32n601n068
1424d547M93N156M394J90n995m876J568O465L154k543n127l360K116O124L205
1439F417l248o352k944M679N843L97m700n212k90M723N203l50o183m317K722N425
1455A813K789k230m928l029K250O143L153l808o131j381M708N611M74m020n454
1470d040n80M894N794p16o267m240K482N005L036j916n936l046K953N652J804
1485D879m421m564q21L321M695P69l960m731j015N696M804j288n376l503J998
1500c517N179L324j199o010l071L625O214J411m000n137m81M035M387O02m283
$$ plain form
1393 6050 2244 -4144 -6475 -1543 4937 5675 154 -5366 -4960 -66 4394 4662 -363 -5845 -5618 833
1409 833 6199 3414 -2698 -6086 -3099 3121 6121 2792 -3889 -5885 -1381 5290 6122 521 -4547
1424 -4547 -4054 1102 5496 5686 -309 -5185 -3617 2848 6002 3459 -1668 -5028 -2912 3212 6417
1439 6417 3169 -3183 -6127 -1448 4395 4792 92 -5120 -5410 -687 4516 4166 -2017 -6334 -3612 1813
1455 1813 4602 2372 -2556 -5585 -3335 2808 5961 2153 -3978 -5359 -651 4960 5434 1414 -4040
1470 -4040 -4620 274 6068 5352 -915 -5155 -2673 2332 5368 3452 -2484 -5530 -2577 3075 4879
1485 4879 458 -4106 -4927 -1606 3089 3858 -102 -4833 -5848 -152 4652 3364 -2012 -5515 -3517
1500 -3517 1662 4986 3787 -2223 -5294 -1669 4545 5956 1956 -3181 -3662 373 4760 5362 1079
1515A079m813L02M865L498j094n030l196P47M581L379k181n947k600L508N210
1530B308Q89l270m668q74L610N024O06m576m220J086N304L105j270l887k815J121
1546b527N401L044k444n447j626L123M242J577l335m967j236L669M848J29n178
1561g27m160O90M906K661q37m384l628K142N072K306k825m533j385K847M324J662
1577D131l039m586r29M396M341k94m102l635Q57M169L474q98m710l503K347N313
1593C332J937l065m240r86K228M014K040l967m368l19L758L793l98l934l480n
1609c660M504K893j354m742l001J982M364J764k151m000k010K796N162J029m118
1624e42l583O18M024L410k57l211l251O24M088L803r81n309k646K380M259J304
$$ plain form
1515 1079 -3734 -3432 1433 4931 3837 -1193 -4389 -3642 939 4318 2137 -3810 -6410 -2902 2308
1530 2308 3197 -73 -4741 -5615 -2005 3019 3625 -951 -5171 -4085 1219 4324 3054 -833 -3648 -2527
1546 -2527 2874 5918 3474 -1973 -3599 -476 3766 5343 2008 -2959 -4195 -526 4322 4451 -727
1561 -727 -4887 -4197 709 3370 2533 -1851 -5479 -3337 1735 4041 1216 -3317 -4702 -1855 2469 4131
1577 4131 1092 -3494 -4423 -27 4314 4020 -82 -3717 -2860 1309 4783 3885 -825 -4328 -1981 3332
1593 3332 5269 2204 -2036 -3022 -794 3220 5260 1293 -3075 -3394 364 4157 3759 -175 -3655 -3660
1609 -3660 844 3737 2383 -2359 -5360 -3378 986 2750 599 -3401 -5411 -2615 2547 3576 -542
1624 -542 -4125 -3507 517 3927 3670 459 -2792 -2168 1920 5723 4742 -567 -3213 -833 3426 4730
1640D730k411m479k229K958M239L96l986l755l68L420L498m38l848k799J066M220
1656B14K713j167l959k071K546L863K262k019l899j628L222M136O31l562l392
1671b110m00L550L197k04m327l616J102M029K137j646l880j666J654L666J749
1686C235k229m258r52L446L597N17k963l593p5L518L414n55m128k789J149M004
1702A338K387k046l953j427J732M005J501k862l869j68K897L466O07l120l253
1717b765K83L782K747m57l607k599J081L606K046j950l617k055J984L335J525
1732C339l109l703l53K403L304M1l056l109L08L961K673r61l121k159J706L853
$$ plain form
1640 4730 2319 -2160 -4389 -1431 2808 3204 -782 -4537 -4905 -1485 2013 1575 -2273 -5072 -4006 214
1656 214 2927 1760 -2199 -4270 -1724 2139 4401 2382 -1517 -3145 77 4213 4844 1282 -2110
1671 -2110 -2510 1040 4237 4033 -294 -3910 -2808 1221 3358 1712 -2168 -3834 -2180 1486 3235
1686 3235 1006 -3252 -4204 -758 2839 3356 393 -3200 -3275 243 3657 3102 -1026 -3815 -2666 1338
1702 1338 3725 1679 -2274 -3701 -1969 2036 3537 675 -3194 -3362 -465 3001 3608 488 -2765
1717 -2765 -2482 1300 4047 3590 -17 -2616 -1535 2071 4117 2167 -1450 -3505 -1521 1814 3339
1732 3339 230 -3473 -3826 -1423 1881 1922 -1134 -4243 -3935 26 2699 1738 -1383 -3542 -1836 2017
$$ [...]
8191c01
##END NTUPLES=NMR FID
##END=
