##TITLE=1H_TG-2112-5
 CDCl3, 8 sc, 
 5.7.2019
##JCAMPDX= 6.0         $$ Bruker NMR JCAMP-DX V2.0
##DATA TYPE= NMR FID
##DATA CLASS= NTUPLES
##ORIGIN= UXNMR, Bruker Analytische Messtechnik GmbH
##OWNER= root
$$ XWIN-NMR		Version 3.5
$$ Fri Jul  5 14:00:06 2019 Russian Standard Time (UT+4h)  she@DPX200
##.OBSERVE FREQUENCY= 200.13155
##.OBSERVE NUCLEUS= ^1H
##.DELAY= (6, 6)
##.ACQUISITION MODE= SIMULTANEOUS
##.ACQUISITION SCHEME= undefined
##.AVERAGES= 8
##.DIGITISER RES= 18
##SPECTROMETER/DATA SYSTEM= spect
##.PULSE SEQUENCE= zg30
##.SOLVENT NAME= CDCl3
##.SHIFT REFERENCE= (INTERNAL, CDCl3, 0, 15.7039)
##AUDIT TRAIL= $$ (NUMBER, WHEN, WHO, WHERE, WHAT)
$$ ##TITLE= Audit trail, XWIN-NMR		Version 3.5
$$ ##JCAMPDX= 5.01
$$ ##ORIGIN= Bruker BioSpin GmbH
$$ ##OWNER= she
$$ F:/spectra/data/she/nmr/H-F/1/audita.txt
$$ ##AUDIT TRAIL=  $$ (NUMBER, WHEN, WHO, WHERE, WHAT)
(   1,<2019-07-05 13:59:01.90 +0400>,<she>,<DPX200>,
      <created by zg, POWCHK disabled, PULCHK disabled
       configuration hash MD5:
       00 E9 B6 7A A2 85 ED C7 34 08 36 98 17 FE 4E 26
       data hash MD5: 16K
       20 F3 60 C0 16 85 06 F2 77 9F 23 BD F7 3E 35 84>)
$$ ##END=
$$ 
$$ hash MD5
$$ 56 8F 43 EE 0E D6 ED 64 F1 8F 2E E1 9C B7 1A AC
##$RELAX= 
##$RELAX= 
##$RELAX= 
##$RELAX= 
##$RELAX= 
##$RELAX= 
$$ Bruker specific parameters
$$ --------------------------
##$DU= <F:/spectra>
##$EXPNO= 1
##$NAME= <H-F>
##$PROCNO= 1
##$TYPE= <nmr>
##$USER= <she>
##$AMP= (0..31)
100 100 100 100 100 100 100 100 100 100 100 100 100 100 100 100 100 100 
100 100 100 100 100 100 100 100 100 100 100 100 100 100 
##$AQSEQ= 0
##$AQ_mod= 1
##$AUNM= <au_zg>
##$AUTOPOS= <>
##$BF1= 200.13
##$BF2= 200.13
##$BF3= 200.13
##$BF4= 200.13
##$BF5= 200.13
##$BF6= 200.13
##$BF7= 200.13
##$BF8= 200.13
##$BYTORDA= 1
##$CFDGTYP= 0
##$CFRGTYP= 5
##$CHEMSTR= <none>
##$CNST= (0..31)
1 1 145 1 1 1 1 1 1 1 1 1 1 1 1 1 1 1 1 1 1 1 1 1 1 1 1 1 1 1 1 1 
##$CPDPRG= <>
##$CPDPRG1= <>
##$CPDPRG2= <>
##$CPDPRG3= <>
##$CPDPRG4= <mlev>
##$CPDPRG5= <mlev>
##$CPDPRG6= <mlev>
##$CPDPRG7= <mlev>
##$CPDPRG8= <mlev>
##$CPDPRGB= <>
##$CPDPRGT= <>
##$D= (0..31)
0 1.2 0 0 0 0 0 0 0 0 0 0.03 0 0 0 0 0 0 0 0 0 0 0 0 0 0 0 0 0 0 0 0 
##$DATE= 1562320741
##$DBL= (0..7)
120 120 120 120 120 120 120 120 
##$DBP= (0..7)
150 150 150 150 150 150 150 150 
##$DBP07= 0
##$DBPNAM0= <>
##$DBPNAM1= <>
##$DBPNAM2= <>
##$DBPNAM3= <>
##$DBPNAM4= <>
##$DBPNAM5= <>
##$DBPNAM6= <>
##$DBPNAM7= <>
##$DBPOAL= (0..7)
0.5 0.5 0.5 0.5 0.5 0.5 0.5 0.5 
##$DBPOFFS= (0..7)
0 0 0 0 0 0 0 0 
##$DE= 6
##$DECBNUC= <off>
##$DECIM= 24
##$DECNUC= <off>
##$DECSTAT= 4
##$DIGMOD= 1
##$DIGTYP= 9
##$DL= (0..7)
0 120 120 120 120 120 120 120 
##$DP= (0..7)
150 150 150 150 150 150 150 150 
##$DP07= 0
##$DPNAME0= <>
##$DPNAME1= <>
##$DPNAME2= <>
##$DPNAME3= <>
##$DPNAME4= <>
##$DPNAME5= <>
##$DPNAME6= <>
##$DPNAME7= <>
##$DPOAL= (0..7)
0.5 0.5 0.5 0.5 0.5 0.5 0.5 0.5 
##$DPOFFS= (0..7)
0 0 0 0 0 0 0 0 
##$DQDMODE= 0
##$DR= 18
##$DS= 0
##$DSLIST= <SSSSSSSSSSSSSSS>
##$DSPFIRM= 0
$$ [...]
##$SUBNAM2= <"">
##$SUBNAM3= <"">
##$SUBNAM4= <"">
##$SUBNAM5= <"">
##$SUBNAM6= <"">
##$SUBNAM7= <"">
##$SUBNAM8= <"">
##$SUBNAM9= <"">
##$SW= 24.9336996594482
##$SWIBOX= (0..15)
0 0 2 0 0 0 0 0 0 0 0 0 0 0 0 0 
##$SW_h= 4990.01996007984
##$TD= 16384
##$TD0= 1
##$TE= 0
##$TE2= 300
##$TE3= 300
##$TEG= 300
##$TL= (0..7)
0 120 120 120 120 120 120 120 
##$TP= (0..7)
150 150 150 150 150 150 150 150 
##$TP07= 0
##$TPNAME0= <>
##$TPNAME1= <>
##$TPNAME2= <>
##$TPNAME3= <>
##$TPNAME4= <>
##$TPNAME5= <>
##$TPNAME6= <>
##$TPNAME7= <>
##$TPOAL= (0..7)
0.5 0.5 0.5 0.5 0.5 0.5 0.5 0.5 
##$TPOFFS= (0..7)
0 0 0 0 0 0 0 0 
##$TUNHIN= 0
##$TUNHOUT= 0
##$TUNXOUT= 0
##$USERA1= <user>
##$USERA2= <user>
##$USERA3= <user>
##$USERA4= <user>
##$USERA5= <user>
##$V9= 5
##$VALIST= <valist>
##$VCLIST= <CCCCCCCCCCCCCCC>
##$VD= 0
##$VDLIST= <DDDDDDDDDDDDDDD>
##$VPLIST= <PPPPPPPPPPPPPPP>
##$VTLIST= <TTTTTTTTTTTTTTT>
##$WBST= 1024
##$WBSW= 4
##$XGAIN= (0..3)
0 0 0 0 
##$XL= 0
##$YL= 0
##$YMAX_a= 211229
##$YMIN_a= -306037
##$ZGOPTNS= <>
##$ZL1= 120
##$ZL2= 120
##$ZL3= 120
##$ZL4= 120
##$ABSF1= 10
##$ABSF2= 0
##$ABSG= 5
##$ABSL= 3
##$ALPHA= 0
##$AQORDER= 0
##$ASSFAC= 0
##$ASSFACI= 0
##$ASSFACX= 0
##$ASSWID= 0
##$AUNMP= <proc_1d>
##$AZFE= 0.1
##$AZFW= 0.1
##$BCFW= 1
##$BC_mod= 2
##$BYTORDP= 1
##$COROFFS= 0
##$CY= 11.3945322036743
##$DATMOD= 1
##$DC= 2
##$DFILT= <>
##$DTYPP= 0
##$F1P= 18.9103706918063
##$F2P= -1.10871071338519
##$FCOR= 0.5
##$FTSIZE= 0
##$FT_mod= 4
##$GAMMA= 1
##$GB= 0.15
##$INTBC= 1
##$INTSCL= 1
##$ISEN= 128
##$LB= 0.24
##$LEV0= 0
##$LPBIN= 0
##$MAXI= 10000
##$MC2= 0
##$MEAN= 0
##$ME_mod= 0
##$MI= 1.114404
##$NCOEF= 0
##$NC_proc= 0
##$NLEV= 6
##$NOISF1= 3.799351
##$NOISF2= 2.8
##$NSP= 1
##$NTH_PI= 0
##$NZP= 0
##$OFFSET= 15.70392
##$PC= 1
##$PHC0= -8856.574
##$PHC1= 9.800961
##$PH_mod= 1
##$PKNL= yes
##$PPARMOD= 0
##$PSCAL= 0
##$PSIGN= 0
##$REVERSE= no
##$SF= 200.130013532006
##$SI= 16384
##$SIGF1= 3
##$SIGF2= 2
##$SINO= 400
##$SIOLD= 16384
##$SREGLST= <1H.CDCl3>
##$SSB= 0
##$STSI= 0
##$STSR= 0
##$SW_p= 3612.71676300578
##$SYMM= 0
##$S_DEV= 0
##$TDeff= 0
##$TDoff= 0
##$TI= <>
##$TILT= no
##$TM1= 0
##$TM2= 0
##$TOPLEV= 0
##$USERP1= <user>
##$USERP2= <user>
##$USERP3= <user>
##$USERP4= <user>
##$USERP5= <user>
##$WDW= 1
##$XDIM= 8192
##$YMAX_p= 0
##$YMIN_p= 0
$$ End of Bruker specific parameters
$$ ---------------------------------
##NTUPLES= NMR FID
##VAR_NAME=  TIME,          FID/REAL,        FID/IMAG
##SYMBOL=    X,             R,               I
##VAR_TYPE=  INDEPENDENT,   DEPENDENT,       DEPENDENT
##VAR_FORM=  AFFN,          ASDF,            ASDF
##VAR_DIM=   8192,          8192,            8192
##UNITS=     SECONDS,       ARBITRARY UNITS, ARBITRARY UNITS
##FACTOR=    0.0002004,     1,               1
##FIRST=     0,             0,               0
##LAST=      1.6414764,     0,               0
##MIN=       0,             -306037,         0
##MAX=       1.6414764,     211229,          0
$$ Real data points
##PAGE= N=1
##DATA TABLE= (X++(R..R)), XYDATA
0@%%%%%jJqJ6j6K4l2M0n1N9p2Q8j05J29j53J77k08K41k81L27l74M26m86N52o24
30c31P05p95Q91r97J115j245J386j538J708j895K101k328K575k850L160l504L887
47B045m321M818n392O065o862P826r022J0551j2585J5441j9781K7243m3532J40148
61A12642j24276k52999K81661J92156j57424k05025J34242J45343j09167j66835
71a49682R4551J41618o1272j24658O6388P8162r2795q1872J31917J17090j08878
82A0569j51930O2293J48399j323j06902o133P3119K084n3612J1524L7697j4097
94A1688m906L9570k6100q8200K0707J33396K0876j41991p1085J14851R2302q5743
106A5365q9609P8089Q5685q2367r1904P7694R3612o4847q1801O0507O6248p5718
$$ y = [0, 0, 0, 0, 0, 0, -1, 0, -8, 8, -8, 16, -16, 24, -27, 32, -40, 48, -57, 72, -81, 96, -112, 129, -152, 175, -199, 227, -259, 293, -331, 374, -421, 470, -527, 588, -657, 729, -809, 899, -996, 1105, -1223, 1352, -1498, 1662, -1842, 2045, -2276, 2542, -2850, 3215, -3647, 4179, -4843, 5708, -6877, 8564, -11217, 16026, -27506, 112642, -11634, -264633, 17028, 209184, 51760, -153265, -19023, 126320, 17153, -149682, -55131, 86487, 25215, -99443, -33055, 45107, -47688, -129560, 2357, 119447, 10569, -141361, -79068, 69331, 68008, -38894, -45027, 28092, 30176, -23436, -11912, 25785, 11688, 6782, 46352, 20252, -67948, -47241, 86155, 107031, -34960, -106045, 8806, 101108, 15365, -74244, 3845, 89530, 7163, -84741, -7047, 86565, 21718, -60083, 424, 66672, -9046]
118i046p7124Q3387J06302p2662j38192L5075J38270o804j21598q111R8095J1196
130C8788q0054j6896O0508K4871l1523j2798J6236o628j6014L0860M0529l0184
142A7695n3557K3386N4896j3970m3829J2905L3845j1067k8120J798J2895l967
154B910j244J5333m808m1354j1853N3365L1538n2083m3390M0963M3585l0637l8351
167c6026K3031L9787n235l2251r276J6863J4461O629L192j6740k8457J1178M3508
180C0664l268m7202o65M4324k693n1111o313N0796K0176m2188l1206K6345K4311
193A1970k1836r004L6242M828n1851j1971N7473K4668m6248k3965M0347K3949
205C4602m0997l1622M2670M9604l0284n8582R940M5642L9k3943N026Q591j6474
$$ y = [-9046, -86170, -2783, 103519, 30857, -107335, -72260, 66010, 59206, -62392, -70503, 27592, 38788, -41266, -58162, 2346, 27217, -4306, -17104, -868, -7496, -23510, 7350, 47879, 17695, -35862, -12476, 42420, 28450, -15379, -2474, 31371, 20304, -7816, -6018, 6877, 2910, 1666, 16999, 12191, -29163, -41016, 12349, 43887, -8196, -51586, -10623, 32962, 2325, -36026, -12995, 26792, 21557, -10694, -19970, -3107, 11354, 17983, 21175, 4435, -24022, -12844, 30664, 27396, -19806, -20471, 23853, 21160, -29951, -36264, 14532, 34708, -7480, -38686, -12341, 11970, -9866, -18870, 17372, 22200, -29651, -41622, 15851, 40519, -5729, -29694, 10653, 34602, -6395, -38017, 4653, 54257, 23973, -34609, -24669, 20973, 21012, -2931, 2095, 10686, -5788]
218e788r071J4811R059p482j938P694q574k2834O189L9277P094m1673j5665L3401
232D500R030k9999M508L8751p116m8489m111M8177J5243m0429j6002M0380J3078
245B7521n1772j8318O2482L3417n7109m2577M0030L9920k5982l0114K3688K8772
257B9958k3812l5436J6655L8035o979k8330N309J2855j6396p409K5643J0855k4815
270c867j4567J4155R288j0235k609J6556L015k4774r690K6376J2206k3283l340
283a0769K8040n557l8480M684M8286Q351m5299j9657L7156K4237l3057k5770L6014
296H179L0903l7284l7937K9068L6462j8838k6540J3795J5478j8431j5792K1033
308I6K2805j8026k8044J1797K4950j2179j9731J7526J8586j9096j8831J3773J3783
$$ y = [-5788, -14859, -48, 9011, 1529, -409, 7285, -1289, -24123, -17934, 21343, 28437, -13236, -28901, 4500, 13530, -16469, -11961, 26790, 19674, -28815, -32926, 15251, 30494, -9935, -25937, 14443, 27521, -24251, -42569, 19913, 53330, -3779, -46356, -6326, 33594, 7612, -22502, 1186, 29958, 6146, -29290, -12635, 25400, 18421, -9909, -4600, 8255, -8141, -15550, 10093, 20948, -3867, -18434, -4279, 5009, -5226, -7835, 8721, 11736, -13038, -22728, 3648, 15854, -7429, -10769, 17271, 11714, -26766, -22082, 26204, 34555, -10744, -30401, 6755, 30992, -2065, -27835, 8179, 39082, 1798, -36139, -7071, 29391, 10553, -15987, -2192, 13286, -5145, -20937, 96, 22901, 4875, -23169, -11372, 13578, 1399, -18332, -806, 17780, -1316, -20147, -6374, 7409]
321G409n987l116Q277l932j7301J643K6873P561k9051j2693K9538J1830l2532
334a1481j0235L7312J3999l5570j9687K5898K0200j7201j4730J6594J1121k4240
346h020j4530K9626K0366k9170k1334K5208J6557k4700j3476K5832J5856k2578
358c63k0269J3854J9293q543j2289J2084N495k1615n449K9139P662k9853p415
371a8269K8205L985k8999n084L2549J2131l1914k0092K7169K2826k4373j7636
383a9502K7052J3849l3155j4278L5980J8018l1495j9486K6687J9398k5271k1402
395b3605K7413K7436k6445l2663K2188L0593j7583k3036J7872J6037k1836j5116
407a8745K2435J7502k0170k0086J7666J9627k1165k2158K5394K6286k7371l0456
$$ y = [7409, 1422, -1694, 6583, 2651, -14650, -13007, 13866, 21427, -7624, -20317, 9221, 21051, -11481, -21716, 15596, 29595, -5975, -25662, 236, 20436, 3235, -11495, 5099, 16220, -8020, -22550, 7076, 27442, -1728, -23062, 2146, 18703, -5997, -19473, 6359, 22215, -363, -20632, -6778, 12515, 3972, -8317, 3767, 9262, -12353, -17802, 11337, 18999, -10854, -18269, 9936, 13921, -15078, -20162, 12387, 24518, -7396, -27488, -319, 22507, -1866, -19502, 7550, 21399, -11756, -26034, 9946, 27964, -3531, -23017, 3670, 23068, -2203, -23605, 3808, 31244, 4799, -27864, -5676, 24917, 7334, -15702, 2170, 18207, -3629, -18745, 3690, 21192, 1022, -19064, -1398, 18229, -2936, -25094, 300, 26586, -785, -31241]
419c1241K2521K8467j7395k2349J5834J8575j7102j9449J8413K5129j6398k6884
431b1879J6859K8373j8650k8324K2988L2389k0412l5191J2898L4447m103k9945
443a0550j034K5396L43k6577l65K6408n75k5531L6J9558m230j6679P402J7259
457A0861o644k0519J583K1859M607j8592m811J7925K895j7349N41J8736P53j5403
471c558q06J0289j48p281K019Q973k248j3878k063J5393L864j4888l318J2198
485D548r43j2837J804J2669P34j0362m852O258O471m303n228O113N464q628o828
500i920P817P288k880l583j929r05K833L529j429j624J435n12q59O90J44K613
516B708M495k424o581J572M897J236J409M4o003l221N999L764m750l903J380K255
$$ y = [-31241, -8720, 19747, 2352, -19997, -4163, 14412, -2690, -22139, -3726, 21403, 5005, -21879, -5020, 23353, 4703, -23621, -633, 31756, 11344, -23847, -10949, 23498, 19395, -10550, -11584, 13812, 14155, -12422, -12787, 13621, 13046, -12485, -12449, 7109, 2879, -13800, -6398, 10861, 4217, -16302, -14719, 7140, 11747, -6845, -11656, 6269, 9164, -8185, -7644, 11092, 11845, -3558, -4364, 5925, 5777, -1504, 515, 9488, 7240, -6638, -8701, 6692, 10556, -4332, -7650, 4548, 3605, -9232, -7428, 5241, 5975, -4387, -9239, -2981, 3490, -813, -6041, 72, 5536, -3092, -9920, -2103, 5185, 2305, -1278, -3207, -4112, -1279, 2250, 821, -803, 632, 120, -739, -49, 95, 2708, 7203, 4779, -1802, -230, 4667, 5903, 7312, 7356, 1353, -1868, 4131, 7895, 3145, -758, 622, 2877]
532B877k368p255j500R280M000j1976q011O799N545k397j085Q30j886j49K663
547d633J973R77O11J282L835j349o802M112J4029j50j3958k165J0664L169o192
562E403k924L552J922n449o233L564O581m241n905K850m77o942K574R650j489
577B436j0283j102P076L570m093l231N849N460p343p950P968R794m770o474K232
592h61J309k634J463L545J41l533k963J048L215j034k061M930K206q417l630Q958
608A682N212m604k983J895N91j742j53K980L414k915p108O73N912j806l149L957
624A856R85p345k693N514L529j098k814o78J423o19k337M767P427m283q805K961
640b210P638j374k748K649J691l515l793o7M682L198m242m822P13p95k285M560
$$ y = [2877, 509, -6746, -8246, 1034, 5034, -6942, -14953, -8154, -2609, -5006, -6091, -5261, -7147, -7296, -4633, -2660, -1683, -1072, 210, 4045, 2696, -4106, 6, 14035, 13885, -73, -2238, 8426, 11595, 5403, 2479, 6031, 7953, 2504, -3729, -165, 6416, 2175, -3730, -880, -1357, -8299, -5725, 3925, 2436, -7847, -8949, -1873, 1697, -2396, -5627, 222, 5682, -1661, -9611, -1643, 8151, 3381, -3093, -861, 448, -2186, -723, 2822, 2963, -570, -3533, -2485, 730, -304, -2365, 2565, 4771, -3646, -7276, 1682, 6894, 2290, -693, 1202, 1793, 51, -102, 2878, 6292, 3377, -3731, -3058, 2854, 1048, -2101, 1856, 2841, -4504, -7197, -1683, 1846, 748, -2066, -2744, -1321, -1940, -4277, 490, 7917, 3634, -5171, -2210, 5428, 4054, 1306, 3955, 5646, 2131, -1662, -1729, 2953, 6151, 1909, -2913, -2200, -2995, -5280, -720]
656g20L784o156n429L131K615j621N86K899Q61j939l834Q05O819M022l270j428
672A125K96k480J706P418O11o382j028K452q15j799J184K793J021m827p052J640
688d137P829L17m925m98p06l225J289N262N69k450j919j432J076J844l16J700
704B78L657l896p407K010P632J245k467k589k171M29K446L08J131K168k444m294
720c964J208K648O14K976J821n325m184L839L836P38J40j600k747K93L8P24L341
737D396N10m559k081J456j675R82N757o56p808k333M293K902p14j709J59J853
753G73k406m685K883P869j96p283q19K342j85J831K670j401k944o44j3J800J578
770A170r19m6J436l165m406M248O234q52m171j921k86K485L467r52k199J603O4
$$ y = [-720, 3064, -3092, -8521, -5390, -2775, -4396, -3810, -911, -50, -1989, -5823, -5018, 1801, 5823, 2553, 1125, 1421, -1059, 647, 8065, 8676, 2294, 1266, 3718, 2903, 1104, 2288, 5081, 6102, 1275, -5777, -4137, 3692, 4009, -916, -1414, -2120, -5345, -4056, 1206, 1775, -675, -2594, -4026, -2950, -1106, -1422, 278, 3935, 39, -7368, -5358, 2274, 3519, 1052, -1537, -3708, -3279, -833, -525, 606, 2774, 330, -3964, -2756, -108, 506, 3482, 5303, -22, -4206, -367, 3469, 4207, 4347, 2747, 0, 293, 331, 1055, 4396, 4906, 347, -1734, -278, -1953, -971, 4786, 4130, -3678, -6011, -1718, 1184, 470, -1239, -1080, 773, -1633, -6318, -3435, 4434, 4238, -3045, -3864, -1522, -1707, 124, 2794, 1393, -1551, -2195, -2208, -408, 1170, 251, 205, 1641, -1524, -5930, -1682, 4552, 3700, -471, -2392, -2678, -193, 3274, 2322, 123, 1726, 1790]
787A790k463l0K304J600J419j480n842n75N597K331k348j617j475j212J882O89
803E70j086J079J146l817k019K223J135N5K073j250m508o23L613K520M36k245
819f98l141J787K850k307n52M709J38m893o87K524J091P19R85j428j645q03L00
836a051K998L189l475l935J845K079j486Q06J741j768r21L22j668m66L823J756
852C789k863k817j255J619M281K54m308r70K123n64n34J930l73j212J708p20l604
869c516P16M422J390k089l573k220L565N007j786m638O73K281l23o37l15j66L014
886A805J080m765k584L965L462k14j825l029j255M283K981k486k254J047Q89M1
902A141l31k220J813M576j983n784J64L943J636J04j661l939l5L779R81k024j065
$$ y = [1790, -673, -703, 1601, 3201, 4620, 3140, -2702, -3277, 2320, 4651, 2303, 686, -789, -2001, -119, 570, -516, 563, 1709, -2108, -4127, -1904, -769, -714, 1359, 109, -4399, -5022, -1409, 1111, 1547, -698, -3839, -2052, 798, -1509, -2061, 2648, 2786, -2107, -2794, -270, 821, 1540, 2525, 1097, -548, -1351, -1051, 1947, 5136, 1661, -2274, -429, 1650, 164, 970, 2711, 943, 22, 344, -1324, -1790, 2033, 3789, 926, -1891, -3146, -1527, 2754, 3008, -1300, -2270, -147, -711, -1245, 685, 312, -900, 808, 88, -3516, -2800, 1622, 3012, 923, -2650, -4870, -1305, 3702, 1916, -2722, -2049, 232, -91, -728, -1043, -1209, 1805, 2885, -1880, -4464, -499, 2963, 2749, 924, -2105, -3360, 923, 3904, 1418, -836, 211, 1100, 1141, 810, -1410, 403, 4979, 2996, -2788, -2624, 1319, 2955, 3059, 1398, -2541, -2576, 1203, 2184, 160, -905]
919i05K94N95P62k860j514M528L038m588l938J598J996J450J638k552l596J362
935b692K772R5m44m26k88J478k17l358J060M900O25l769j489k8J280L495J449
952D443m211k427K489J544j88l54o19N84J859k764l215L184M281j385k964j548
968a291j014K537L773k102l609M29R31o68P21l2q33J271K91l398j445L158K560
985A279l97j977l588J71M822K249m021r66K140k72o35R09j6R12K042j351l576
1002b275J064L225J305M14k592l049J798M028j200j644J047n21j622R42O00j302
1018B18P96J613k121k453J02J275K707M44m773k448L243J865j955p5J223j693
1034b032p50J586p30j84K160K77j782p57k43Q81L923N11m058j112K624O09Q48
$$ y = [-905, -611, -16, 746, -2114, -3628, 900, 3938, -650, -4588, -2990, -994, 456, 2094, -458, -4054, -2692, 80, 175, -269, -695, -983, 495, 278, -3080, -2020, 2880, 3505, -264, -1753, -1781, -501, 2994, 4443, 232, -2195, 294, 1838, 1650, 1296, 677, 1261, 3120, 356, -2859, 325, 4606, 3221, 257, -1291, -2305, 232, 4005, 1903, -1706, -1277, -346, -1014, -293, -325, -1158, 113, 404, -2994, -4439, -1281, 1279, 882, -1095, -4683, -4512, 310, 2559, -1462, -2428, -288, -560, -1195, -286, -302, 610, 2652, 1301, -2275, -1211, 2014, 3319, 3733, 1141, -1908, -110, 3918, 2718, 1074, 2121, 1600, -22, 920, 1520, 218, 1014, 2627, 506, -1947, -1845, -570, 2137, 2581, -2192, -4640, -1397, 468, -1487, -1562, -339, -2032, -2782, -1196, -1926, -2110, 50, 327, -1455, -2212, -2455, -1574, 2349, 2860, -1198, -2310, 314, 923, 1771]
1051A771P81j612r32J881Q3k284J347K492m61j621j787j287K651L306j857l507
1067a036j30P08L42J282o81k285J062R92k655j359L041J010k84p11k537j185L610
1084h16K866j610k003q56P14K060J029j902N4K951j223l210J149L066O01K67j511
1101A626l244O47L263P36j304o34j628k97J656l9j283J587Q56l216j540J256P94
1118g64J529J198l022l190J794K805J1j37r39j218P96M71j290J189L087j117l416
1135b213j48R89J215K604N8l469j277K075Q09R63J062j535j043Q23o82p87K827
1152B271J928k046j915r16n09K689L030k280l487K75N85o97J086O75j135j90j508
1169b144k346J232L693Nk414r19j272J71L583J616k055n66K22q85Q33K188M49
$$ y = [1771, 2552, 940, 8, 1889, 1972, -312, 1035, 3527, 3066, 1445, -342, -1629, 1022, 4328, 2471, -1036, -1166, -458, -116, 1166, 485, -1800, -738, 254, -2401, -3760, -719, 291, 7, -704, -3241, -4426, -816, 2050, 440, -1563, -2419, -1705, 355, 1384, -518, -464, 2487, 1264, -1946, -797, 2269, 2870, 3137, 1626, -1618, -971, 2292, 3028, 1724, 1090, -538, -835, 821, 782, -501, 1086, 1942, -1274, -2814, -1558, -764, 765, 1963, -1059, -4249, -2455, 350, 361, 224, -715, -1933, -1137, -666, -1956, -767, 2320, 1203, -2213, -2361, -1372, -157, 2447, 2505, -964, -2241, -166, 643, 1606, 2668, 1133, 90, 913, 231, -556, 2271, 4199, 2153, 238, -678, -1187, 1502, 4532, 2252, -1235, -960, -375, -1072, 14, 689, -446, -636, -2144, -4490, -3258, 435, 440, -1974, -2893, -4165, -3994, -411, 1205, -850, -1416, -1194, -2079, -1246, 942, 1391]
1186A391M47L84k598j713L176L185l04j113j783j737J614K442n47m86R06k277
1202I87k634J660K110O2K28j432k867l25K177M68P57j84l111k019J582J570p5
1219a046R73r32k967m99J838N14P84R61j694j744O26J051R59K625K29k949q05
1236b076J669J075K294J637k782k114K458J404q64M92J438o00r40k011j406L161
1252B835L035l067m100L6J101M97N72p98k288J67M95j584j33J211L28K99n41l116
1270e051n48M747K855l282k612Q90J686J412k09j700J204K873j606k964J373K950
1286B018O56M39k279k724K116L706m90k176K69J62J68M14j021o28K911K38l684
1303I5j257J576O43J059qk658k069J538J079p15K48m23j186L92n70j725J609L609
$$ y = [1391, 1838, 2222, -376, -2089, 1087, 4272, 3968, 2855, 1072, -665, 949, 3391, 2844, 2358, 3264, 987, -1647, 13, 2123, 2185, 2413, 981, -1886, -2211, -34, 434, 1191, 1007, -2104, -4123, -2541, -971, -1046, -73, -1005, -3972, -4471, -2633, -2119, -1335, -374, -2068, -3812, -3186, -2135, -1176, 1449, 1678, -1271, -2076, -407, 668, 2962, 4599, 1817, -297, 2161, 3565, 2701, 3193, 4631, 4031, 3091, 1080, -326, 2835, 5870, 2803, -1297, -1261, -160, 337, 909, 111, -2177, -2010, -1515, -3099, -3232, -2021, -1693, -1394, -1935, -5051, -5599, -852, 2003, -1279, -3891, -3001, -1315, 97, -112, -1812, -608, 2265, 659, -2305, -932, 2018, 2674, 3113, 834, -1890, 226, 3932, 3442, 1266, 1535, 1697, 1865, 2279, 1258, 630, 3541, 3779, 95, -1162, 414, 1057, 2116, 2108, -550, -2619, -1081, -2, -717, -469, -892, -2078, -1686, -2256, -3981, -2372, 1237]
1321A237j205l618N5J174R60J512J85j293j53m00n71K451K722j614k196J012J07
1338C65r30J922J925r50o80j388j373J549K981m38j337q32k197Q5L654R23k276
1355A003j172J76r05J08J302J32N93j74l224k020K880K836n2j099k539k029K160
1372b024L441j034j505P76n08j120L78O62J234K276j258m434k04L726K071k1j067
1389A389k846l24K587N52p40R86M23k204m28o0k5K325K070k952l703R44K485J115
1407A594K20j330k077P73R82r41R57J732j242j692J98p15L85L290O51k847j693
1424a755O22P65J826P91j869j184N62m18l31J788O03j333j14p39j523J264K815
1441A770r92j473k40j010NK167P66j242n59k68r09J269J272n83L23P89j726j472
$$ y = [1237, 32, -3586, -3531, -2357, -1397, 115, 300, -993, -1146, -1546, -2117, 334, 3056, 1442, -754, 258, 365, -565, 1357, 3282, 2332, 1652, 264, -1109, 440, 3421, 2983, 1646, 814, -1383, -1298, 2356, 3279, 1003, -169, 7, -898, -790, 512, 644, 1237, 1063, -2161, -4181, -1301, 1535, 1483, 384, -2155, -4184, -2024, 1417, 383, -1122, -346, -854, -1974, -1596, -934, 300, 2576, 1318, -3116, -3320, 406, 2477, 2456, 1389, -1457, -1781, 806, 1358, 618, 1604, 2027, -177, -605, -665, -690, 1635, 3705, 753, -2950, -2006, 479, 1594, 1814, 484, -1593, -820, 162, -779, 178, 1910, 668, -1024, -826, -1541, -1156, 2134, 2785, -62, -1755, -1133, -368, 1458, 2249, 380, -804, -242, -660, -991, 797, 1400, 67, -47, -786, -2309, -1045, 1770, 778, -695, -935, -1945, -1940, 227, 993, -249, -808, -1076, -1985, -716, 556, -27, 296, 1085, -641, -2113]
1459b113K224J678j71N5r36j854J215J987m0o40L0p61r94J257k68j23J676p48
1477A474k796q5J597k06L79O90k147j667J595N51l78L88j05j046K62M7n44J506
1495d85J564j626j275Q18J48L26K272k82k174K81J503n30J07J392m83q57K65q79
1513H5q4K088k77j675M31n84q17Q87J505j284j288R00n74q45J408M18q99J36K01
1532b68j381O72J549p9l11K8j187j23K306q6j549R21O40j756j38J506k21J7N6
1551E96j463m38J228J92o36P42m22j355O21R72p49L72J211j390r28J668J06p12
1569c85J162N67j549n20J109K56L89J0j357J48J405j012j093J955O72j907P7L22
1587B49l94O16J332j189j369P96L11j2M83j16q80K29k35r28O27Q08j025l08O15
$$ y = [-2113, 111, 1789, 1618, 1673, 737, -1117, 98, 2085, 2045, 1405, 1435, 674, -320, 937, 669, 546, 2222, 1474, -1322, -1407, 190, -16, 363, 1053, -1094, -2761, -1166, -615, -993, -605, -710, -1756, -1494, -1447, -1991, -485, 1079, -547, -1822, -1004, -856, -530, 1742, 1460, -714, -433, 1070, 540, 647, 2039, 1556, 699, 964, 85, 1, 2089, 1812, 137, 568, -16, -833, 54, 1559, 275, -1013, -113, -687, -1532, -124, 294, -605, -469, -268, -1649, -977, 572, 493, 182, 210, -977, -1100, 1206, 1120, -429, 492, 1132, -624, -762, 744, 523, 540, 596, -867, -1305, -77, 115, -521, 221, -201, -1556, -935, 37, -712, -340, 871, -519, -1447, 221, 327, -385, 777, 1344, -205, -725, 384, 640, 1029, 1039, -318, -170, 1235, 223, -870, 1085, 1757, -150, -73, 249, -145, 471, 1803, 614, -755, 41, 352, 340, 823, 707, -173, 56, -179, -1107, -480, 328, -697, -1005, -390]
1606c90j494r94K182R13j895o74N34L01R94M81j077N60J499p32o92J204Q90K13
1624A823P45o52j988J616J859j013j191L02m51l54O01m81j168L07J40j322k43
1641a470j13l28J006P51k345j149K520J303j170k57K70J58J446M03j059M7J583
1658A596k6r20Jj10O59J353j129k293P01J538j162m24L25q22l66J106n06j284
1676a763J128O46o54j50J07p56J405J266j592m98J248k00m68J135l01j291J195
1693D57M74j410n44J511k36m65J63n21J41R63m52n81J200L15j367P61J436q97
1711I48q88J292J46m50J00n78m51Q15J81j858l94O80k09j38l66j594L01J577o01
1730a487j497P93J268p83N29M58q36P32J921j06q11K68P97R26Q42j280j228K085
$$ y = [-390, -1884, -2878, -696, 217, -1678, -2352, -1818, -1517, -523, -42, -1119, -559, 940, 208, -484, 720, 1610, 1823, 2568, 1916, -72, 1544, 3403, 2390, 1199, 1501, 1050, 696, 1297, 816, -352, -45, 95, -1227, -1470, -1583, -1911, -905, -154, -2499, -3648, -1128, 175, -995, -1252, -982, -824, 622, 1025, -34, 13, 1596, 1570, 650, 651, 541, 1200, 2553, 1424, -869, -168, 1370, 208, -216, 109, -713, -1079, 27, -479, -1763, -635, 11, -643, -793, -686, -1442, -37, 1229, -363, -861, 387, 187, -281, 854, 553, -738, 457, 931, -479, -1023, 488, 252, -213, -50, -571, -430, 533, 81, -500, 700, 1015, -352, 409, 1845, 948, 60, 1352, 1498, 1048, 1148, 570, 119, 934, 1115, -743, -1137, -457, -666, -804, -1170, -2764, -2463, -886, -1487, -2984, -2191, -923, -1706, -1177, -719, -1555, -823, 1098, 992, 181, 449, 1246, 2172, 3014, 1734, 506, 2591]
1748B591R96j753j213R90j98N6j43j739q78J668O24k111j018R26N47J81p88j115
1766b377R34J815r36j252J105N50l00R02j94j166N69J626m35j229J95M92L77r8
1784E78q80j089J972N46j787m05J085k71K44M91j080kJ683l95j383P52J104l93
1802G70k71J77k73J23N98p40l40R82p74q91J036Q4j240M08O32j194k81Q84J71
1821a39q13N31j32q4R01k29q58J230O77j187l41Q91k85J46O78j138j017J497O07
1840I35j874R9J081l53q40J21l54R50P35j049q14J076J25o25R48O38j168L24J067
1859A022p02k20Q28L12o39L43p02m34J392M29j393k02L24m21M23K14j099J15R82
1878E72o96j448J124J266q13o98J88k90N27N09n77j57Q06p46n67J045L89j080
$$ y = [2591, 3587, 1834, 621, 1611, 1413, 1469, 1326, -413, -1291, 377, 1001, -1110, -2128, -1202, -655, -474, -1262, -2377, -1443, 372, -564, -1816, -711, -161, -461, 441, 247, -919, -350, 1276, 841, -388, -193, 299, 676, 578, -302, -1391, 581, 1127, -660, -1065, 20, -251, -7, 484, -596, -598, 1085, 690, -693, 59, 1163, 770, 499, 676, 403, 526, 1124, 384, 44, 1026, 252, -639, 397, 481, -759, -351, 281, -913, -1194, -310, -139, -952, -421, -553, -637, 264, 35, -823, 407, 1084, -103, -444, 447, 162, 308, 986, -152, -1169, 328, 935, -939, -840, 241, -112, -952, -831, -1185, -235, 500, -549, -1363, -287, -162, -787, 161, 799, -369, -45, 1022, 320, 100, 928, 1240, 601, 944, 242, -192, 1200, 1629, 236, 34, 358, -63, 360, 574, -525, -410, 572, -124, -1572, -448, 818, 5, -693, -505, -795, -268, 241, -336, -493, 313, -433, -1000, 45, 434, -646]
1896f46N65L31j227p7J187%o68O82o51p41J120P04q93J54M36o07L9P28l26L38
1916D48J067j286r06J397M97r58K82N09m01m30M88l06J29O97q98n87Q49p2q32
1935c13Q47J54j530J43Q29p57j55Q58o60r82P54L7m90O28K43p34j38M81l16M35
1955f66Q31o40m17J191l19m91J022O39r83L04O70n63K57O47m2l60M89o12n31Q47
1975A273J6j008M2M57r64j4N72o11k54P58q30p25O95K59n02O1M53r88M93N89m83
1996g11j9Q33m57p20R33K80p54Q81O64j275j80J155l12j33Q17n78l65L58p5l93
2016e1O46L78j079j63N39n85J25Q10m20j008P29k15m57R12J83q14J4L47p18N61
2036b66J149o42m47N69k70m28R70M97r25K93K49p47J01R34l19o31L34l23o52Q83
$$ y = [-646, -81, 250, -977, -1054, 133, 133, -535, 147, -504, -1245, -125, 579, -314, -160, 276, -331, -292, 436, 110, 448, 1515, 229, -677, 720, 1217, 259, 541, 1050, 649, 219, 707, 401, 530, 1227, 329, -258, 591, 519, -313, 534, 688, -842, -699, 130, -627, -782, 76, -584, -1566, -812, -775, -1265, -637, -394, -1128, -1266, -785, -1101, -666, 165, -475, -892, 299, -20, -511, 511, 1150, 167, 471, 1141, 578, 835, 1482, 1440, 1080, 1569, 957, 426, 1273, 1289, 281, 323, 780, -184, -198, 374, -237, -491, 267, -563, -1288, -593, -334, -836, -775, -322, -1310, -817, -228, -711, -730, 103, -354, -1074, -141, 139, -615, 266, 930, -345, -525, 630, 318, 185, 1002, 424, 59, 417, 342, -51, 595, 973, -106, -269, 270, -315, -190, 620, 200, -808, -79, -294, -751, 161, 344, -470, -456, -109, -827, -266, 883, 241, -206, 363, 93, -335, 635, 1132, 207, 500, 749, 2, 103, 1037, 718, 87, 421, 98, -554, 329]
2056C29M83j089J17K1q84J31R77p37j90O19n65j090J167M47o04L36op59L21R69
2076gl82j84P90l01j95P60M6j20P07K49j175J85J088k90o0N95n30n35N41K12p11
2097F83L34N5j109R0L87q39q5Q24r33p39J78Q9n55O08M0r05L21O24o46K47R71
2118c60l31m15O08M94m94Q92K71k41K36M21k99J83P15o98m47N69j76o13K62K49
2138H26r32M10K18j074J81P11l42p35P83k85k98P24k4n51K29Q76p00l5O19n03
2158I8j52Q06o07p19J025j52q71K93M18r26K22N19q42j07Q66o37k25N38L0j96
2178f19L39K98n76K78R40r97m1J039k46k46L26K25n48M14J04r51O27K75q31p1
2198b61R88n79k76P41k23n06L02Q23o09O6M61n27J96O67q22k23P23l22q06N39
$$ y = [329, 812, -277, -160, -139, -1023, -892, 85, -652, -842, -223, -788, -1878, -711, -264, -868, -532, -538, -1297, -976, -7, -389, -573, 217, -84, -279, 481, 527, 407, 1114, 1363, 188, 373, 1461, 1171, 1111, 1706, 1176, 641, 1182, 1394, 683, 1017, 1072, -37, 53, 440, -399, -484, 340, -593, -1332, -1154, -1065, -1620, -1012, -972, -1877, -1556, -932, -1578, -1331, -360, -691, -1106, -498, -4, -498, 394, 665, 424, 660, 1081, 782, 965, 1680, 982, 535, 1104, 928, 315, 577, 826, -106, 304, 522, -552, -371, 340, -2, -737, 46, -239, -537, 187, 163, -388, -159, 717, 17, -18, 601, 98, -54, 752, 145, -574, 451, 299, -572, -279, 139, -787, -565, -46, -888, -995, -129, -766, -991, -453, -423, -619, -280, 18, -558, -280, 660, -337, -378, 661, 415, 169, 495, 720, 172, 586, 690, -261, 366, 641, -190, -261, 727, 148, -128, 613, 390, -116, 186, 1009, 400, 466, 927, 400, 596, 1263, 441, 218, 941, 619, -187, 352]
2218C52k5q99K44R3j224M5O61n57o26L42n2k82K79J57k68Q25N64p88M70R56j48
2239A19J08J050k50j58R09M55q88L13N61m80j00K32p19k81M27p67n47J17L9o77
2259e37K37n25p55N49Q43j232k57J005j59o96P41L68m77M67K13n51M31M81l03
2278a57m3P02q63j79J083R5j129L67M59m53Q0N09o26M38M67l68l76N98K17l69
2298D52N75k89n84P33M80j170J31Q54p53q72P13l31l76R0l2p68J64L93m55J05
2318i40L70n93NQ65m10j76J040rp10O94O89n68L16N25m16l09O99j33l25J42k56
2339E00k49M01m98n59N82M63j191l12R83k73p10N13q2l90L34L17l07K1M30m05
2359d32J41P01o57m0Q61k14n87M14J31m42K96L45o43j09O35n53k26M39R1m88O45
$$ y = [352, 327, -572, -328, -235, -1459, -1414, -753, -1310, -1936, -1594, -1646, -1928, -1649, -1492, -1760, -935, -371, -1159, -689, 267, 119, 227, 1277, 1027, 869, 1778, 2233, 1345, 1658, 2219, 1739, 1639, 1871, 1152, 871, 1298, 531, -16, 101, 140, -537, -300, -825, -1580, -1031, -188, -1420, -1677, -672, -831, -1527, -786, -418, -895, -428, -215, -766, -335, 146, -157, -200, 502, -361, -540, 543, 638, -491, -124, 335, -118, -38, 471, -155, 283, 750, 382, 6, 604, 821, 452, 1027, 738, 154, 887, 1367, 197, 328, 1182, 429, -443, 270, -61, -437, -347, -379, -1147, -983, -590, -1045, -940, -570, -1163, -1158, -293, -703, -879, 161, 152, -558, 136, 825, 257, 573, 1098, 682, 373, 1072, 939, 614, 756, 500, 251, 652, 154, -405, 177, 640, -551, -863, 120, -153, -863, -350, -432, -822, -488, -171, -478, -457, -27, -432, -291, 410, -247, -287, 574, 360, -227, 187, 318, -124, 172, 517, -126, -235, 400, -153, -379, 60, 151, -337, 308]
2380C08N3n50K57N53n85Q8Q06o33l01Q06q0r27O40J40l16n61M64k87n3J69n77
2401e86l4O74o60m11P41j59r04M74O91p80L18O39l72m77Q86j70l57O51J29j16
2421A77M7M7j28M56L25o04j3O31l44l98R76k00p65K21N73n64N5J26l73P1K06p12
2443a90p3O73k37p38L22lp22O66K50q40j45Q90p54l17O24K46m88L05j23l15N29
2464d40L04J9J33K18o63L50R87n20o83Q58L48p59N1N75j56L19j13r18J24R32j44
2485H22o38L34k75k22M69R5q91K42P69r29m97O77n3k9P4n8q15L53M35j55J2N6
2507b24o80O05M83q33k64J258k49q22K25N11k30M70N2m21k57P40k51k03N44k47
2527B07k81N72k43o16O89L71p43J26M08n36j14N52J36p33L05L48m53K03K98l43
$$ y = [308, 361, -189, 68, 621, 36, 124, 930, 297, -4, 802, 722, -205, 435, 575, 259, -302, 162, -125, -178, -9, -586, -620, 54, -606, -1017, -276, -435, -1339, -865, -174, -954, -636, 3, -369, -846, 40, -130, -487, 164, 293, 177, 224, 271, 143, 599, 924, 320, 307, 938, 594, 196, 1172, 972, 207, 428, 1001, 437, 492, 618, 245, 316, 522, -190, -263, 410, 173, -565, -243, -246, -968, -302, -52, -892, -1037, -147, -901, -1218, -594, -348, -836, -531, -654, -969, -440, -136, -117, 16, 234, -429, -79, 908, 388, -295, 563, 911, 152, 203, 778, 622, 941, 828, -90, 34, 966, 822, 184, 518, 243, 21, 490, 585, -306, -64, 705, -224, -721, -44, -97, -126, -52, -110, -925, -572, -137, -292, -280, -224, -904, -299, 184, -649, -913, 345, 96, -726, -501, 10, -220, 250, 302, -119, -376, 364, 113, -90, 454, 207, -74, 498, 255, -361, 328, 699, -44, 82, 490, -46, -160, 392, 528, -205, 100, 448, -5, 198, 496, 153]
2547A53K08P7o82J78P21n62l25O00N4j007K74O64m80k85L85m16j46N39l8n21K54
2568c55j73m84L97M4l17N61O19r70k50J134q4l57K91L09o70L92M31k58R9K73r8
2589E34J15R9p16k0J218l59j115O06M59n73j13L26n67l5N44l73n24L24Q0l74K64
2610b00l80j23L29M70p76l6O62n28r1R17l38n93N33L17m48J7M97j81J46J26p86
2631d66K73R18m28n11P25oq28M21M34p06L53L78m62m55N34k60j23M78l6n53K51
2652f9L57k42K55l9n50N36M63n52n20P76J65q52L52J80l59m3L29m56j33N14m10
2673b98R7M22m40l34L82J47p56K74O81m42l2K42l98m41R74p5m51r5N37n86O14
2694B2j47l35K45L32m34j96J066j07n20N02K17o52L15M22q0r0J83m63M3M12j78
$$ y = [153, 361, 438, -244, -66, 655, 93, -232, 368, 422, -585, -311, 353, -127, -412, -27, -443, -589, -50, -88, -609, -355, -528, -1012, -615, -571, -888, -327, 292, -678, -928, 206, 122, -235, 56, 365, -305, 87, 518, 260, 359, 632, 534, 649, 748, 32, 12, 1230, 871, -244, 362, 821, 248, 135, 461, -106, -141, 403, 30, -494, -170, -90, -464, -200, -580, -703, -374, 96, -680, -716, -54, -582, -673, 244, -94, -687, -154, 163, -285, -268, 229, 48, 194, 320, -466, -193, 725, 297, -214, 511, 505, -323, 98, 532, -174, 179, 557, 95, -360, 174, -86, -209, 269, 233, -320, -69, 288, 46, 301, 262, -288, 248, 711, 159, -361, 415, 580, -272, 80, 260, -99, -142, 187, -269, -402, 112, -298, -201, 221, -219, -553, -171, -24, -780, -506, 175, -267, -299, -57, -455, -896, 78, 3, -448, -543, -6, -592, 22, -125, -460, -215, 117, -317, -513, 553, 446, -74, 428, 645, -7, 308, 730, 650, 560, 743, 280, 323, 735, 557]
2715E57l54L58J56p32m1K70m53J09J62n37n85Q16k20n85O57k2n10p6N54k95M55
2736c16K84p11J00N82l17J2P84m2o57L27M88n11M65K16l58k20L84j51l03Q32l23
2757E65p26M34j17j39K80M21q64J65N30p82j18O69J79o39p8J97j54M61o2n41K85
2778c4J98o70k0N99k95j92M60j53q27L41P15n71L8M95l69l26O52j43o6N41r0n93
2800c10K87M11n86K16N96o37j61M28J06m37M50j64l68J2N43m03M4L67m94j58N82
2821C24k66k07N20m1m58K31J85n04L67M01l52m00L88l04j19P63j26n61K8K4m95
2842f02L20M89m53j49L99o87q1J062k06o51K45J33l24K13O39m98O3L88l53l86
2862d39N04K24k83N14j80q97M81O26l56n7K17l98j82Q02l67n7L68l34m10J89M55
$$ y = [557, 203, 561, 717, -15, -56, 214, -239, -130, 32, -505, -1090, -274, -494, -1079, -422, -444, -954, -1030, -476, -771, -316, -32, -743, -643, -61, -378, -366, 418, 376, -281, 46, 534, 23, 488, 704, 346, 126, 510, 359, 56, 888, 565, -161, 273, 156, 17, 297, 718, -146, 19, 549, -233, -351, 318, 497, -142, -220, -23, -177, 284, 222, -319, -34, 164, -506, -526, 73, -222, -414, 46, -107, -934, -593, 122, -449, -411, 84, -285, -611, 41, -102, -168, 373, 283, -310, -23, 388, -198, 18, 614, -23, -184, 244, 350, -87, 363, 199, -169, -157, 386, -17, 27, 394, -100, -258, 324, 58, -149, 371, 330, -128, 103, 288, -216, 151, 552, 200, -200, 188, -116, -235, 528, 402, -159, -131, -107, -602, -282, 207, -246, -395, 4, -683, -764, 298, 92, -559, -314, -181, -505, -292, 347, -151, -88, 300, -53, -439, 65, 289, 6, 520, 340, -557, -76, 550, 194, 137, 354, -44, -226, 576, 209, 152, 520, 186, -224, -35, 420]
2883D20o29M56K79q78k42O96%j0J49j70m02L97K0m01K42L16n88j93N33k26j34
2904c65O01k84m84J87K69k05J50M40m78k80M82l68j6O67j28m91L79L81m80M0O33
2925F50m73j73M59m82j02P93l14m47K53r2j05N67l0o44J29N36n03m49Q25k10k17
2946b9K21l55l11K23L94m31J44K17n09K53L02m40j94M68K03o52N1L06r2K55L52
2967C76q16k99J001p7l60K80J46l79L09k8n53N23O39n24m02J27N7R6O10m33p11
2988d18N55L14m07L0J37k57J34M03p16j77Q37j23n69K71j26m86P62N37q22l41
3008d62O27k40m46N54O5m72K69q6n13N73O08o17l4J39l64O3P38k17l82L64l54
3029a87j73K91N24m10j82L64l06PL49M6m6L11m16m55L13M36m88L73M5n75j1N74
$$ y = [420, -209, 247, 526, -352, -594, 102, 102, 92, 241, 71, -331, 66, 86, -315, -73, 243, -345, -538, -5, -231, -365, 236, -48, -532, -345, -76, -281, -131, 309, -169, -449, 33, -335, -351, 316, 188, -303, 76, 457, -23, 17, 650, 177, 4, 463, -19, -121, 672, 358, -89, 164, 72, -33, 534, 504, -140, -11, 525, 22, -427, 398, 188, -29, 192, -163, -474, -251, 143, -288, -144, 73, -436, -183, 119, -321, -515, -47, 156, -496, -445, -139, -231, 24, 376, -440, -739, 262, 185, -175, 105, 251, -128, 181, 153, -400, 123, 762, 238, -164, -37, 20, 116, 726, 293, -418, 137, 451, 44, 74, 211, -46, 88, 491, -225, -402, 435, 312, -257, 14, -112, -598, 164, 701, -121, -462, 165, -75, -521, 33, 98, -374, -105, -191, -704, -131, 477, -140, -174, -35, -399, -336, 402, 185, -197, 167, -187, -360, -69, 455, 45, -137, 227, -79, -72, 277, 323, 277, 588, 172, -283, 30, 466, -22, 351, 396, -179, -190, 384]
3051C84J52n23K38o0l30J15J70o02O99K11p81j58M58j16K16J78m85n51O15L19
3071A49o76K15L90k72q3K20l08j03O83j34p69N65kj02M52M5r14L10P35l67l68
3092c34N45J81l06P3K4m26N26K53m26j8L03m69O1N19l60k51N69k26n42K11M22
3113C29k75R7o0j96n4K51q1j11L67o26k94N08J13m18L36L06o64m0O39l06k61K44
3135a96K23o89L09K05M0J12J67m98J39L44j65r7N60k24m83N18J16n89L07P55o41
3156B13l08M71o4j39L16j50k83R8J73m49M22J41o56m9L74l59k34Q48k29o06J47
3177c23N3k42M07K1l66J40J77k69j61P15p5o58Q66l47n26N91K30m04Q4L50l82
3198a19k32P20m5k96J60J22m34L37R1m07L6L96o18N3Q46n43m22N30K09n96K10
$$ y = [384, 536, 13, 251, 191, -139, -24, 146, -456, 243, 454, -327, -485, -27, -143, 73, 251, -234, -785, -170, 149, -527, -312, 78, -194, -277, -57, -365, -468, 215, 81, -688, -123, -125, -227, 225, 270, -644, -334, 401, 34, -334, 211, 392, 86, 159, 183, -243, 283, 536, 110, 92, 395, -74, -13, 506, 146, -105, 464, 238, -304, -93, 329, 54, 151, 91, -105, -159, 92, 11, -100, 267, -359, -653, -145, -32, -450, -114, 192, -472, -512, 127, -179, -440, -196, 27, -662, -353, -148, -108, 4, 171, -327, -188, 156, -9, -106, 454, 230, -253, 265, 381, -208, 99, 854, 213, -95, 376, 312, 173, 489, 339, 56, 154, 327, -122, 300, 441, -215, -264, 110, -249, -483, 365, 136, -470, -323, -270, -512, -105, -84, -450, -310, -133, -402, -563, 152, 77, -581, 285, -62, -588, 3, 233, -171, -87, 263, -119, -351, 369, 324, 28, 188, 310, -124, 213, 304, -103, -67, 329, -289, -236, 610, 67, -355, 175, 384, -212, -2]
3219bJ69m6%J49j51l29M77k81j49N93l22l25M58q3m47K44L25n15j27M32k08j94
3241c32K46J40l39Q2R1j58M52m2n10K94K29l44o1N23j34m38J90M11o31M23J79
3262B71m24J32K71j68l9K52j66k87M13J06n42N99Rn61J58M80m57j72M96J55m88
3283C8q9L30m43L19J38m30PK96n38J66M30m65l97N88j42o24L98L88m72J30K53
3304a19m06O8M23J6m01M48j79j56N27J76o29M35M01o18R8M16l27r7K54r8j42J06
3326A96K19m48J74K44n53K08M79m95Q4N05l52m75N49O1o63N44K30o50m3K29J6
3347E9l69M31m41JK34j86j47L75r5k43k3J66l27j00R24o06j68M60m6k54L52Nk16
3370b14L90J82m17L08K39k12k27P16l51l22M77P2n35Q1L77m34k52M65j41k27K11
$$ y = [-2, 167, 121, 121, 270, 119, -210, 267, -14, -163, 430, 108, -217, 241, 158, -289, -45, 280, -235, -362, 70, -138, -332, -86, 54, -285, -203, -112, -270, 182, 140, -370, -76, 153, -191, -252, 271, 137, -301, -111, 300, -331, 92, 271, -153, -21, 250, 82, 43, 295, 129, -158, 255, 361, -181, 418, 427, -134, 24, 504, 47, -125, 371, 526, 38, -51, 279, -164, 155, 293, -137, -130, 166, -372, -206, 224, -241, -638, -50, -192, -816, -418, -30, -502, -372, -119, -525, -457, -34, -18, -419, 29, -150, -306, 221, 397, -232, 203, 604, -14, 84, 500, 173, 76, 330, 232, 90, 196, 415, -33, 141, 385, -168, 40, 519, 24, 108, 613, 261, -214, 335, 396, -267, 277, 507, -143, -186, 43, 59, -310, 121, -320, -319, -85, -271, -418, -43, -138, -381, -404, -238, -565, -665, 259, -347, -515, -55, -101, -355, -3, 2, -214, 176, 358, -59, 249, 488, 276, 49, 765, 414, 92, 569, 641, 106, 187, 564, 130, -122, 343, 202, -25, 186]
3391A86m39J71M53k51m32L95K15m64N3M32m32k90M26l4l63J34kk57R8j0J1j55
3413e55L82p4j59K43k23j46L88j6k87N47L83n54j73N47J25n14M82r0j60L16R6
3434E58l81K56J49n42J40M05n35J38L15m16l12L14K13n04J89j14jj09J19k60L4
3455c44M26m15j15M35l42k78N64N3l79J86N26o11k7L92k86P7L8J06k31L16k9l41
3477b79K92K72k40j01N69o35R2K09K31n93O33n3j67R3J13n35L89Q7k25L6m8j29
3499A1j00K99j49l96M46P7m65jM38j55k74K01k69j18M49j11l43L65Kl97L06J90
3521Fj42JK29k74l64O58K7k27K54j54j15K5L90j56j16L70m32kL28j36k22L86j70
3544A64l73R5M63l77J01J89k11k85K97l01oL67k6l16j3L18j95K17l1j29j91M54
$$ y = [186, -253, -82, 371, 120, -312, 83, 298, -166, -113, 319, -113, -403, 23, -11, -374, -240, -242, -499, -401, -411, -400, -555, -173, -247, -406, -163, -386, -532, -144, -160, -447, 100, 483, -71, -244, 303, 428, -86, 396, 306, 146, 462, 558, 177, 433, 582, 40, 180, 585, 50, 188, 503, 87, -225, 89, 302, -202, -13, -127, -128, -237, -118, -378, -344, 82, -333, -448, -13, -355, -633, -69, -16, -395, -209, 317, -294, -321, 71, -215, -138, -100, 6, -225, 91, 62, -279, 13, 285, 45, -56, 513, -122, -30, 179, 410, -183, 450, 397, 230, 323, 436, -99, 290, 377, 152, 188, 140, 11, -89, 210, 61, -335, 111, 188, -277, -278, 160, 5, -269, -68, -337, -455, -6, -117, -460, -95, -93, -490, -184, 6, -136, -135, 94, -180, -544, 114, 141, -86, 168, 14, -101, -76, 314, 158, 42, 412, -20, -22, 306, 170, -52, 334, 164, -209, -114, 349, -28, 73, 262, 51, -234, 63, -238, -244, 123, 97, -219, -232, 86, -109, 108, 77, -52, -243, 211]
3566B11l25j60J93L48l45L3K29l46J0N30m30n0K25n1j51L22J1o60L57M4m46L71
3588h0J35k69n0K58P1l18M81j08l33J23J74r0J9J99j74p4J95l64O3M43J5n77M66
3611B05n8j50Q5L65l63O3L00l06j35N14q8l33K22p1m88L31J84l46n1K66l22k62
3633d38M84k29k13K47j60l53K27K99j96J16J91k29k03N03j99q7J72L40l62M22
3653C32k30j20K19K30k61j20K30j5k37L39k5l61K02p5k46J23K98k93j63M98l73
3674d8l00M05n4l26P2K78l02K32K11l82k77M70j32l21N70j33l50J71J90j39o8
3695b33M73k43l06K36l5M3L15j24l31K10L1l21L24N7l9k69M55m12M5J16K89j16
3717A65J40k66j50L17K92m94j2L80m49N7K92j75k00K64mj39J31K1k20J11K17k50
$$ y = [211, -114, -274, -81, 267, -78, -45, 184, -162, -152, 378, -52, -102, 123, 72, -79, 243, 254, -406, -49, -5, -451, -80, 55, -214, -264, -6, 65, -253, 228, 120, -213, -90, 84, -6, 13, 212, 38, -36, 159, -205, -142, 301, 316, -261, 205, 147, -3, 82, 447, 84, 147, 447, 141, 6, 520, 432, 99, 321, 250, -238, 93, 277, -69, -120, 146, -176, -438, 46, -183, -396, -149, -309, -662, -435, -136, -332, -216, -25, -254, -457, 46, -153, -240, -68, 272, -90, 332, 102, -18, 201, 431, 170, 50, 280, 265, 28, 367, 342, -19, 183, 108, -138, -15, 283, -10, -173, 325, -48, -348, 57, 3, -323, -251, 27, -275, -43, 168, -214, -491, -21, -153, -474, 96, -37, -387, -216, -26, -165, -233, 240, -3, -309, -73, -108, -65, 250, 126, -205, 5, 36, -285, 39, 96, 57, -212, 243, -169, -124, -8, 281, 165, 305, 39, -111, 206, 498, 4, -8, 372, -77, -20, 272, 97, -103, 161, 157, 18, 149, 170, -50, 61, 278, 28]
3739B8j84K07p0k64L91k26k07L59j11j96J96L42n23r0L41j12l57O12j73k91M93
3760A65q2m82N08M3l48r1L79m1j71L17mk19K56q1r9J66L50n34L6L56k03k05M51
3783D67k87j14L33j13n66M22K5l24j48K68k01j28M08k67k73M23j69k95K32L29
3803B2k35J1J96k59j31M28j38M6J72j74j44J02M09k41P5K41n41J26K63j99m7K47
3825B29J07o30M82k4l48P2L59j53l33L10P1M1RQ3k02K35k13j08J16K22l74n6L00
3848A95l19j42L95j17l50K07j46L3k41M95l52n5L55l38N0L34p9l95M91k1l32M82
3870A50j22j63N3K39k77R3K25j21j93K24%k71J64L61o45L09K46l32J76K11n4m09
3892a36L08R2n04N06L49o63P2J72j28k7J52J1l39K08kl70L44N7n15N9K59j79k2
$$ y = [28, -156, 51, -19, -283, 108, -118, -325, 34, -77, -273, -77, 265, -258, -348, -7, -119, -476, 136, -37, -328, 165, 83, -399, 109, 152, -196, -287, 92, 51, -120, 197, 193, -26, 230, 149, 50, 216, 566, 32, 68, 424, 221, 16, 467, 180, 66, 399, 286, -280, 142, 167, -157, -305, -37, -238, -366, 42, -225, -498, -75, -244, -539, -307, 22, -213, -202, -6, -265, -396, 32, -106, -60, 112, -62, -206, -104, 305, 64, 139, 380, -161, -35, 228, 29, -18, 229, 336, -294, 188, 164, -184, -112, 247, 94, -239, 71, 142, 183, 192, 275, 73, 308, 95, -13, 103, 325, -49, -105, 195, -124, -266, 129, 12, -338, -131, -277, -244, -485, 10, -342, -397, -42, -380, -330, 4, -75, -470, 21, 0, -332, 150, 28, -135, -82, 157, -120, -27, 198, 77, -116, 108, 108, -163, 1, 362, -283, 26, 272, -60, 116, 327, 273, -136, 172, 264, -240, 266, 615, -48, 24, 196, 68, 41, 193, 204, -135, 73, 71, -299, 45, 102, -413, -354, -95, -274, -296]
3915b96J97L3l95J93j30m4L30m0j85m8M65k19J04J57j37k0L39r1l35L80J55l58
3937E5J18J35l72L4J35n8r7M63l92j7K76p0l42M96j30m02O1M53l91j45M11k01
3959B0j83J75K24l22K26J25m26R1j48kn0K76j99k44K99N3l56M32J11n22N4L73
3981Gk07j60N27k58k9K73j62j42L77N0l69J04K80l12j51N73m02j24L61K12m44
4002DqL09l96j25L15Nq9J33k54M6K43k15j03K52n0m90K78K36j29k07K39j91n6
4025b53J86j61j30L37k38k39M82j3k79J95L11l81K0L71q8k32J55P8j3k35L88k76
4047a5r7K54l29L27K02k34q3L11j57j64L1K53m21Q7L16k77N6K0j40j65L82j7k52
4070a12J18K23m43J28K67k39j57M07j09l73K99J0k47K37j06o2J33Q9j52j84K72
$$ y = [-296, -99, -66, -461, -268, -398, -442, -112, -152, -337, -385, 80, -139, -35, 122, -15, -35, 304, 213, -122, 258, 413, 55, 173, 308, -64, -30, 105, 47, -50, 413, 21, 4, 280, 210, -132, 364, 234, -168, -107, 346, -45, -190, 221, 20, -163, 12, 236, -86, 140, 265, -161, -70, -218, -220, -270, 6, -193, -437, -138, -85, -441, -9, 102, -420, -366, 7, -200, -360, 167, -91, -120, 153, -9, -151, 226, 276, -93, 11, 291, -21, -172, 401, -1, -125, 236, 448, 4, -4, 305, -91, -216, 99, 104, 15, 148, -106, -60, 183, -32, -135, 117, 67, -423, -145, 91, -38, -245, -6, -197, -253, -67, -228, -358, -21, -259, -498, -16, -29, -308, -113, 198, -183, -163, 208, 120, -112, 43, 121, 108, -127, 261, -15, -112, 142, -187, 140, 342, 108, 25, 336, 179, 15, 46, 299, -122, -35, 281, 4, 60, 80, -60, -225, 157, 140, -112, 6, 229, -214, -86, 181, -58, -215, 192, 83, -290, 9, 19, -228, 9, -97, -159, -26, 63, -89, -273, -1]
4091ao9k06K94jk33J20J31l68J54K77k45qK18J32l20J2J35j04J78K23l69J97q6
4114F1r8J18L49l96j30O34k72m94L58J68j40j34K08k46k9L10k39p3K4M7l10J19
4136a65L5k79M55mk86j47M02j8l69K42K37k27j12J31N2J75j93M2J34n2j91K94
4158A56L68l91m66M38L77n08M13j20k97q5L18r1k9J12p1%J8m0k48L88k34k4k2
4181c8M33o33J22K16m9r0q9J8j36P6J77j30L1j92p5L98j12N4Jk0k21O6R9L05l54
4206a43N0J93k34J82J56J5j72j00j1j01L97r6m47M57l4j58m1K53l28J27L42j67
4228A40k55K61N7j85M7K17l46R3pJ91o9j25k44K55J38m0q8m5J87m50J33J42q9
4251h2j28J76M9l78J41N7k87K52J41l50K51R5k24k5L77j73k34M80rl46M72O7m65
$$ y = [-1, -70, -276, 18, 17, -216, -96, 35, -333, -179, 98, -147, -155, 63, 195, -125, -113, 22, -82, 96, 319, -50, 147, 61, -37, 81, 430, 34, -96, 538, 266, -228, 130, 298, 158, 24, 232, -14, -43, 267, 28, -45, -21, 26, -284, -165, -130, -409, 46, 42, -244, -391, 11, -7, -376, -134, 103, -124, -236, -105, -53, 122, -71, -29, 105, 53, -138, 156, 524, 133, -333, 105, 482, -26, 387, 267, -30, -115, 203, 112, 83, 195, 124, 124, 142, 102, -146, 242, 8, -16, -38, 395, -238, -116, 100, 51, -39, -128, -110, -246, -170, 7, -123, -92, -284, -359, 39, -73, -19, -18, -38, -259, -193, -94, 211, -143, -93, 100, -134, 48, 204, 219, 47, -53, -64, -165, 232, 136, -311, 146, 112, -46, -87, 166, -162, -35, 307, 140, -115, 146, 203, 18, 65, 282, -64, 29, 22, 213, 144, 19, -225, 30, 168, 128, 40, -5, 182, -268, -135, 7, -82, -210, -34, 15, -363, -222, -165, -452, -200, -59, -409, -158, -63, -287, -312, 65, -108, -342, 138, 129, -217, 255, 322, -143]
4274a43J82L38j81J13O8m42J95J39k10j46K39J5k12K63O8l13J4K81k14j19O3j54
4296a56p4J43K1K4O0O8k91r3N06m09M9J17r8l04M76j8k27J60K72l93KJ50k4j00
4320a39J68j92J9J67j20r6L55J27k73r5L44j58l41L28O7k18L99k22p2O3p1l26
4342b86L09K01j90N4J91k48O0L2p4k33K61K07n79J80J8n3J6K54l08n5K45n7k55
4365c10K22R4k47L67l12j13K72n0m6ML07j50k27J09K72l21Q7J95l70kM23k24n3
4388g3K33k00r0K02QM8R2k1r3j64L26k45o4L54j08l42M55l17J45J56k45j19l2
4411i4K94m18J37P1Nl54J25L31k47J75K7k47j33L49k18l4K84k44J24l3K6r5K67
4434I8K8l18L06K6j21J78j4k90P3K22l81p4L81R3l01K70mk90K24J09k82RL44k52
$$ y = [-143, 39, 377, 196, 309, 377, -65, 130, 269, 59, -87, 152, 167, -45, 218, 286, -27, -13, 268, 54, -65, -2, -156, -230, -87, -66, -42, 18, 86, -205, -298, 208, -201, -152, -35, -133, -437, 39, 21, -206, -46, 226, -167, -165, -15, -39, -139, 29, -163, -144, 23, -97, -193, 162, 289, 16, -79, 265, 107, -234, 94, 161, -57, 342, 120, 48, 111, 40, -286, 23, 224, 34, 88, 279, 31, 91, 123, 49, -184, 77, 284, -295, -115, -97, -150, -134, 120, -188, -243, 2, -55, -310, -88, 6, -241, 126, -186, -299, -27, -77, -123, -119, 188, 38, -189, -80, 192, -129, -42, 153, -217, -219, 204, -20, -73, 160, -40, -130, 72, 80, 128, 220, 199, 106, -58, 268, 23, -41, 313, 205, -137, 318, 1, 146, 302, 57, -62, -94, 200, -218, -81, -10, -5, -359, -234, 97, -150, 25, 52, -195, -328, 21, -197, -231, 53, -191, -67, -100, -74, -169, 98, 126, -192, 114, 140, 19, 197, 183, -107, -34, 188, -193, -267, 114, 207, -94, 176, 172, -118, 106, 215, -67, -58, 286, 34]
4458C4j98M70J3m04J80O5k16J17K08j67j64K14k73N1M2lr0K23p5k71n3K96L1k20
4482a90K22j95N7J69p5l3R9j66k19L80L0j82K0J82P8oj4j35j9K21j73p4P8J27
4506A82j40nJ06j60K03R5j74k66M41K5l37m3K25o3p4K04j96j26K87j84r0K33Q1
4529B24n24K47K10l76j4K20k09q9L98k57r5J68K36l79J74J60N1k46K76k82J14
4550GK07k67J34J50k37P3J59j67JO3L33n07J05O0rj15O8J03k32O4J77n1k11L25
4574B33j60j71L25r7k40J51j8j33J44j16j92L54j00l39K22L36k28L6o5j4p5P8
4596f9J01l05K88n1j95J6L39k53NK04j00j1J39J1j35k7J26r4p8K50j63k9K35J67
4620C71j55L2j62k60L69K57n27K20K19l33j52K68k9m00L63N1k97J74j04j78J88
$$ y = [34, -164, 306, 319, -85, 95, 160, -56, 61, 269, 102, -62, 152, -121, -70, -28, -31, -121, 102, 27, -244, -297, -1, 30, -190, 32, -163, -106, 63, -12, -45, 54, -112, -331, 49, 79, -103, -83, 99, 177, 171, 157, 22, 3, 224, 51, -23, 55, 182, 42, 37, 143, -17, 186, 281, 107, -159, 282, 307, -30, -73, 152, 89, 15, 219, 23, -103, 184, 0, -90, 143, 224, -300, -53, 157, -219, -233, -13, -222, -311, 87, -170, -265, -97, 139, -240, -66, 94, 145, -101, 175, -107, 7, 214, -53, 81, 231, -6, 67, 226, 59, 60, 123, 456, -51, 54, 114, 105, -10, 58, 161, -71, -7, 170, 119, -92, 233, 73, -98, 227, 130, -110, 41, 23, -110, 34, -82, -274, 80, -20, -359, -137, 199, -29, 7, -58, -72, -147, -69, 32, -273, 15, -36, -231, -215, 124, -129, -124, 80, -20, -31, 108, 119, -16, -43, 83, -11, -89, 161, -2, -31, 204, 371, 216, 248, 86, -174, 195, 452, -75, 145, 364, 31, -121, 147, 118, -282, 81, 132, -165, 9, -95, -273, -85]
4641h5J11k22J3K45j00k45L38q5j06J09n8p6k7M14k63k76L42j52L5K15j03j54
4663a30K03J7K1j28M9J46l34L00j72j09M11l61m3K33J67l70K98L8k87k4M3N7j02
4686g7K42j37k96L42j42j58K45N4j46j45J06%j27K09k2j53K85k64jL8K45l10R9
4709a13J9o0n8L30k58j52M08o0k15J28J59l51J61L0l1J26Q8j90n9J23J39k94J20
4732a0J07j96K75K65m74j3L08n2k57J71O7j97J18J20j83J1Q7k30q2J30j47Q9J73
4755H0Ml07kJ03q1r0J05k9j04L72l26M1J90L5m7M7j05R1N7J27k98L6J51r1k0K74
4781B13j31k48L37L8k38J45J71l20J3K66l93J91L84n19L0L56k45k91J79K69j38
4802F9Mj47J25Rr8J21l07L99k99J06k1R5k65O4L64l72rL79k64n1J30J12k85L8
$$ y = [-85, 26, -196, -183, 62, -38, -283, 55, -30, -136, -27, -85, -161, -188, 226, -37, -313, 29, -123, -88, 127, 24, -130, 73, 90, 111, -17, 32, 178, -156, 144, -28, -137, 274, -87, -130, 103, 270, -100, 198, 236, -51, -75, -32, 25, -77, 165, 28, -268, 74, -68, -226, 19, 73, -73, -218, -112, -112, -239, -30, -52, -205, 80, -184, -185, -147, 98, -212, -113, -94, -154, -212, 118, -140, -292, 116, 56, -159, -31, 128, -223, -62, -32, -63, 63, 151, -39, -98, 25, 164, -130, -10, 97, -99, 176, 441, -33, -46, 262, 210, -47, 124, 191, -6, 112, 232, 49, 60, 147, -83, -165, -35, -182, -93, 80, 84, -223, -225, -122, -203, -293, -188, -217, -321, 51, -275, -234, -44, -9, -56, -9, -114, -23, 34, 161, -137, -101, 50, -41, -61, 213, 82, -166, 171, 209, -29, 116, 287, -33, -20, 246, -147, 44, 428, -91, -61, 295, 50, -241, -62, 207, 69, 73, -74, 51, 60, -38, 83, -224, 175, -124, -18, -39, 56, -209, -145, 219, -153, -162, 217, -47, -98, 32, 144, -141, -103]
4826a03J36k74Q4K46l47L08K0l26P0K69j48%J48P3l45M63n4j83j81N57k64O8j03
4849A14K0j27J9KK4K52L3n36K52J15j43j91K21N0m03L77l0l46K44J45l45K94P
4872D8j50Q5L2o0N8j14L5j65J80P2Jk21K58L9m66M18J10j39J0j0oj17O9M5p7K74
4898B09j54K0J15j24J45l0k68Q6J87j63jm1P8j67o3K21r0L3K61k21p0J12l3j38
4922i6J59l51J6J03K65L9j52p8J53j79JJ22q2K27j95p0Q8K68k45oM28k68k30J56
4946G3J3k76K3K26m0j37J46J13j50q0K15k12J44j3k57K26K01j40K5J45j80K9R4
4969A88j56m4Q5P5k65JP6o2m8r3o7K38P8k71L26j9j11r7J16J9j74M7J67n0j22
4994a63J80m2n4J6k6q2K51j4k57L20K8k50J19M8l06L34j36L62l93K20l9j71P3
$$ y = [-103, 33, -241, -157, 89, -258, 50, 70, -256, -186, 83, -65, -65, 83, 156, -189, 274, 220, 37, -144, 413, 149, 217, 114, 134, 7, 26, 28, 52, 304, 337, -199, 53, 168, 25, -166, 55, 105, -298, 79, 49, -297, -53, 92, -253, 41, 48, -102, -17, 15, -45, 13, -101, -66, -231, -51, 21, 22, -199, 59, 98, -368, 50, 160, 21, 31, 21, 15, -102, -33, 12, -65, 209, 55, 75, 190, 66, 211, 181, -87, -1, 186, 23, 22, -19, 59, -108, -171, 50, -40, -7, 254, 33, -37, 75, 42, -96, 63, -288, -272, -169, 96, 135, -17, -95, 58, -121, -120, 2, -80, 147, -48, -118, -30, 238, -7, -13, 415, 147, -83, 73, 86, -190, -167, 59, 19, -118, 28, 141, -9, -89, 126, -86, 58, 45, -212, 14, 215, 75, 100, 245, 65, 94, 188, 32, -12, 73, 148, -117, -116, -40, -102, -150, -243, -310, -72, 6, -265, 61, 42, -69, -166, -50, -31, -205, -158, 9, -41, -163, 17, -25, -79, -63, -89, -171, 80, 66, -191, 129, 157, -93, 26, 74, -232, 102, -34, 328, -65, 155, 116, -55, 18]
5017A8J7n8J34R6m19K39K02k22m2K46k32M0O5j20m4o3J45n3J19J08k15j27K52
5040H6j73q7R4J62n13M47p0j45N2K14r7k23K50K11k69R1m1Nm8M6J14j47K09k1
5064A47k11L38k41J0J69m01K18J95L5k48O0p6L30k46j2J76k58P9o4J16j16L3k56
5087b23Q5K57k31o4J17J0k88L08k1j66J95qk04J77L2j5Q2Pnk00J53K3k07K60L9
5112A13l86K03J79n1Rj29R9k6p1jl6K72M1l02J4K28o4j12J45k05J76j1j3j61J30
5137D1J12j90O0J5M2l9l24L16p2Q5lk15J40N1k12jL25l07q1L22j05q9J78j71J29
5162Gl1J12k08J41J62k38J03p2L9n8K52k33l28O60l17j24J01l0jJ55J4j38J58
5185A26J02k97K35j91J20j21J34J12k97R5J70l92M9K44j72k47L25K19l80J21M3
$$ y = [18, 35, -23, 111, 207, -212, 27, 229, 7, -35, 211, -21, 19, 84, -36, -80, -143, 2, -51, 68, 176, -39, -166, 86, -87, -174, -80, 82, -431, 16, -54, -199, -147, 67, -30, -253, -3, 208, -61, 30, -11, -6, -54, -8, 106, -41, 168, 147, -64, 274, 33, 43, 212, -189, 29, 224, 259, 11, 71, -5, 325, 79, 67, 243, -15, 64, 0, 116, 0, 33, -223, -138, 119, -112, -176, -59, -49, -337, -29, -50, -216, -21, -29, -233, -56, -24, -39, 43, 50, 45, -155, -2, 21, -186, 74, 113, -273, -70, 109, 58, 67, -62, 37, 11, -60, -61, -97, 175, 216, -86, -72, 156, 92, -20, 125, -80, 96, 85, 72, -89, 41, 153, -37, 23, 38, 80, 41, -283, 33, -39, 46, 43, -172, -32, 19, -193, -194, 131, -176, -257, 65, -40, -129, 49, -122, 7, -24, 88, -120, 21, 183, -55, 48, -24, 15, -43, 209, -24, -352, 308, -9, -133, -32, -62, -63, 92, 106, -32, 126, 228, -69, 166, -25, 95, -26, 108, 220, -77, 18, 188, -204, -155, 89, -83, -330, -5, 214, -166, -45, -2]
5206bj06P0j21J33m0K77m33R6J55j68M8j7J53n02K88J81l64K49J54k06J09l0K5
5229e1l0J61j34K4R3l7N6p6L81n29R1oL1J67J47k0k36J63k17LO1n5r5L8J38m2
5255B6o7K23k86p8N9J85j81j05K25q8p7J33J04k50J56N3j54J10j34J31l8p6M0
5278h9Q1pJ00j53JK77j48J14O5m73K87m1o8KJ2J72j64k3J76k06J21jO4j90J19
5303B8R0j96K57k60o4J86j48J77J42q6l91J93K49j34NJ89j40k47J03P7k00K39
5325F9p0j37J77j53p3K07K0K3p5l2O8j08J65j09K09K1j23j73K43J65m38K0K3J4
5349f7J30r4K7L3o7J62k04Q9J53l21MK73j65j05L04k37J8J92m6O2p8r9r7l62N29
5374C4n5n7J26K7l09J85j66K9J45jj52J06J88r1j74J21q4k9JJ89j51J16j30K0
$$ y = [-2, -108, -38, -159, -26, -66, 211, -222, -126, 29, -139, -91, -108, 45, -457, -169, 12, -352, -103, 51, -155, -46, -76, -51, -81, 80, -54, -30, 63, 26, 82, 6, 387, -142, -51, -57, -26, 141, 288, 268, 32, 195, -22, -19, 42, -13, -108, -70, 68, 26, -41, 182, -104, -182, -123, 62, -119, -224, 1, -87, -164, -31, 73, -177, -21, 32, -122, -12, -146, -15, -53, -129, -89, -8, -15, 85, -68, -67, 210, 62, 176, 241, -232, 55, 14, -54, -52, -40, 132, -32, -55, 121, -85, 36, 35, 99, -91, 28, 118, -78, 179, -81, -145, 41, -107, 70, 212, 126, -265, -72, 177, 43, 48, 237, 97, -150, -47, 30, -170, 69, -1, -138, 39, -114, -187, 20, 40, 63, -12, -44, 24, -84, 81, -28, 181, 202, 79, -94, 149, 314, -124, -104, -81, -67, 63, -31, -4, 29, -38, 124, -80, 9, 162, -159, -155, 118, -47, -152, 152, -85, -67, 125, 79, 141, 63, -36, -133, -495, 34, -21, -78, 48, 75, -234, -49, -215, -186, -41, -42, -194, -88, 100, 9, -165, -44, -128, -157, -156, 33, -118, -2, -132, -112]
5398a12N2K23l63K20n2J97j11J9K7j38j38J80N4p6J82j4j33P0K10l19o6P7j3m4
5422f8J93k5j4r0j81J26m0j67J5L48Kl43K17O3k60l5M54l62K64j46j61K56k52
5445b06K01l9J3Km9MJ8J12L5j63K2N1M5K02m02K00J23k53J01J31J3j07N2p0oK42
5471B72k03j21J41M1k17nJ97j30J0K76j85k25K23o2r0J30Rj33r5J14n0m1J97j98
5495a45R6K74k37j92K30M4k44K04J5j2j20K23j97q6J84j7n2N4L2j44K21r0j14
5518g3j7K59k33J85k2K7j53m5J43o8%M4o1Q6J23q3n6j9Mk33K79J2k16J58k71R0
5544a40Q8Q6K5k26L26m18J25J03K4P5m5L9k92J68L05j54r9K30q1j59K19k43q0
5567a24J90P0k00R8L50n42K36L5j09q9J41M4J2Q0n7k30J02L15k54N7j43R5k88
$$ y = [-112, -60, 163, -200, 20, -32, 165, 54, 73, 100, -38, -176, 4, 58, -18, 164, 150, 17, 87, 297, -22, -88, -11, -24, -68, 125, 100, 86, -4, -185, -59, -99, -266, -251, 97, 99, -244, -27, 36, -224, -259, 195, -167, 97, -49, -210, 46, -206, -5, -44, -31, -29, -78, -74, -56, 56, 91, -72, -50, 1, 46, 248, -154, 46, 169, -84, 17, 148, 161, 54, 106, 36, 30, 272, 69, -52, 89, 130, -87, -92, 105, -25, -15, 261, 76, -149, 74, 12, -78, 52, 61, -72, -167, -53, -103, -144, 53, -145, -49, 225, -12, -204, 26, 70, -174, 30, 45, 33, -87, 136, -61, -147, 37, 20, -32, 22, 54, -90, 131, 41, -73, -90, 169, -64, 121, 99, 126, -27, -72, 71, 3, 3, 47, -14, 72, 195, 112, 56, 37, 41, -192, 87, 99, -117, 41, -230, -140, -52, 34, 59, -167, 159, -259, -134, -31, -7, 68, 23, 62, -230, -62, 243, 89, -10, 220, 139, -20, 199, -44, -124, 66, 136, -64, 34, 384, -158, 78, 113, 4, -85, 56, 100, 112, 192, 135, -95, 7, 322, 68, 125, -18, 77, -211]
5590b11K20L1j90L35M4l64k5K54j49J30n1j27J04J72j40r8M4j16%J62K14l57Q8
5613c0L47l22n0K18k99K28P5k69l0K29j34p7J84J35k12l5O3j32J49K58k01m0j12
5636e7Q3n1K27j8k21J43l4l11m8K06K18k11J24K2l53K17j04p4L2K77j60R9j26
5659a20Q8q2K17r9l34L00j76NK41j61R9m1L03r3k92L51p5l11K7L66k74M6L0j18
5683a03J07K12j21k14L38p4k57N11k47k27J43J42K6l98J75j40K38K18l01q1J12
5704E9M5p4l5O3l7N8k33j3j9J79K4j60O0J4M2R0j17p6J95p9J39q4N2k44J9J67
5730C5O7k97J52K17k41j37K85J9n4l1K1j94L26Q6k86J41P6j72J46p8p8p7K54j04
5754G6j65J09Q0p1o1N6j6j51K02k63J19J07mq5J27k73R4J01r0m1L01j45j58j61
$$ y = [-211, 9, 40, -150, 185, 229, -135, -160, 94, -55, 75, 24, -103, 1, 173, 33, -65, -21, -137, -137, 25, 239, -118, -30, 317, -5, -55, 163, -136, 92, 167, -102, -132, 97, -37, -114, 70, 205, -7, -42, 21, -111, 38, 296, 95, 55, -57, 26, -25, 202, 184, -37, 106, 72, -239, -287, -81, 137, -74, 50, 72, -281, -64, -168, -242, -210, 67, -93, 6, -120, -32, -114, 103, 4, -330, -30, -206, -201, 40, -121, -22, -63, 240, 147, -145, 206, 131, -180, -153, 213, -61, -15, 15, -103, 4, 216, 95, -119, 219, 145, -112, 399, 152, -75, 68, 210, 236, -162, 13, -127, 111, 329, 28, -53, 59, 104, 30, -5, 58, 21, 79, -154, -167, -186, -7, 17, -143, -83, -69, -27, 63, -54, -130, 65, -14, 125, 41, 93, -151, -132, 35, 102, -195, -43, 174, -67, -204, 81, 100, 46, 15, 36, -158, 168, 254, -32, 109, 185, 13, 159, 81, 3, -74, 180, 76, -89, 20, 100, 29, -32, 24, 8, -143, 59, -204, -85, 22, 18, -67, 60, -213, -119, -18, -108, -149, 152, 7, -151, -312]
5778c12M94j67j97K76k60J59J07o2q7j56K70k27K1J51oj18K18n6k76M19K0k45
5800c4m8N1o5Q1P8q0R9j6J3m3j00P3k4J06jp0j84K00J00k42l0QP1j90J45L9j14
5827a77J37j05K43j88o3P5K2J28j80j03L17j50K58j53k92K88n0j05K23j13Qj82
5849a62L22j49j47K08N6l13L61j05k2j73J13J69j42J40j16p3K02k06pN6k09K43
5871D6J8M8j46J04j70J69k15K27N5j70m3o5r0P6J66k51R1K26k59k1J77J58J9P2
5895B22k43j36N4m0O9j10M04k95rR6M4l5o8J81j99M3L5j09K03Q4k69r2L98l6l67
5920a75K93j1p3J01n0j29j9nj05K25J19n4n0mJ34l91J26kN1P5j6j37l3J76j50
5945a04M6L2m6j48J38N0k32L72q1j87j2J62J84k52L9J74j24L5J8Q3k7j42j41J85
$$ y = [-312, 182, 15, -182, 94, -166, -7, 100, 38, -49, -205, 65, -162, -141, 10, 4, -114, 104, 48, -228, 191, 211, -34, -82, -31, -96, -15, 63, -17, 82, 66, 79, 36, -64, 9, -15, 91, 90, 20, -164, 36, 136, -106, -136, -128, -57, -247, -102, -63, -177, -40, -145, 98, -90, -153, -78, -56, 72, -108, -211, 106, -44, 214, 61, -231, 57, 7, -98, 125, 12, 20, -162, 160, 11, -136, 72, 128, -185, 176, 71, 49, -124, -11, 158, 16, 156, 40, -33, 169, -37, -44, 12, -197, 46, 64, 112, -34, 70, -100, 69, -146, 81, 136, -34, -77, -142, -232, -156, 10, -241, -150, 76, -183, -204, -27, 131, 150, 222, -21, -157, -103, -143, -74, -184, 220, -75, -84, 12, 56, 21, -47, 134, -65, -22, 13, -96, 107, 191, -78, -170, 228, 192, -175, 118, 107, 34, 135, 85, -44, -63, -68, -173, 52, 171, 117, 67, 63, 197, -194, -68, -70, -19, 56, 40, -97, -130, 46, -104, -58, -26, -72, -220, -82, -32, -264, 108, 27, -160, -172, -10, 174, -78, -39, 135, 11, 46, 64, 147, 120, -22, -163, 22]
5969B2Q8k79J23K05k19J57L6m8o6J85j84j17j66M08j21k71L20l7P8m2n0Q4r5j9
5993hR9l56N12k37j47n7O1K15l85K33N5r8J22j49QK83k50Q5n6P2j09K51k99J10
6017d5J56K2n6j01J00p0K25j79m4P0J09k33J06j11J7J94j25R1m7Qk0k2j47K00
6041I8m4n1l9j4L4l5N5K8j87K26j08j18K35j98j0J22J35j21j07M6J43j10Q1j64
6065a03J3J13p0N4J58m57P9J88J62k22k4J43j35J06j26J51O1m4Q9J8k68K34j01
6088A9rJ31j32J4K92l27j89L15j76j53R0L6q4J98J2R5n3j68M1KQ5l0Qp0J12j75
6114a16MR1N5j12J45m8m4j8K19k27o3J28k1M6pl1K8R8k01J57k51J16o0M5K50k58
6140g5o6K63p1m4J85k10j36K64j44M9L3J44q8j89J96k29N7J64k51J25J53m66J48
$$ y = [22, 110, -169, -46, 159, -60, 97, 133, 85, 19, 204, 20, -97, -263, 145, 24, -247, 73, 36, 114, 72, 22, 106, 11, -8, 91, -265, 247, 10, -137, -194, -133, 82, -303, -70, -15, -113, 9, -140, -132, 151, -99, -14, -70, 2, -107, 144, -155, -45, 111, 133, 77, -24, 76, 6, 231, 52, 8, 78, 187, -46, 60, -51, -34, 160, 35, 126, 79, 87, 67, 45, -102, 98, 54, 3, -36, -50, -16, -51, 4, 32, -155, 71, -37, -155, 80, -118, -128, -6, 129, 8, -99, -53, 90, -20, 61, -103, -90, 23, -47, 7, 165, -292, -213, -25, 137, -85, -109, 34, -101, 5, -121, 30, 91, 47, 136, 154, -114, 120, 19, 10, 141, 9, 23, 315, -12, -201, 114, -62, -215, -125, -89, -173, 25, 37, 132, 79, -89, -48, -46, 39, 9, 17, -53, 59, -116, -112, -21, 34, -78, 67, 19, -25, -43, 176, -51, -114, 14, -7, 39, 32, 1, 29, 127, -74, 83, -168, -52, -112, -67, 183, -75, -141, 122, 51, 7, 192, -18, -154, 110, -34, 15, 48, 192, 104, -85, 111, -118, -61, 103, -148, -23, 130, -336, -188]
6163a88P9N7l6k8J10J13p8J57j07j78J03j69M0K96l09R2j36L45j29k04K73o7p6
6186d0Lr2Q1J51k04J65R0kj34l4K90k51m3kJ07q7L6O1k05R3J35Jr0K27l12N5o8
6213f9J26j3m0j34N5R3m7j52J57J42l09Q7J70j92LJ57l0k24K48k3l4j33K14j88
6237a36m7L54j67k05K17P4l17L78j76K1J56L4j01JN4j08j00Q0j9o0J82k21K23
6260A17j23%Q2j05r3k9R6J15Rj62K53j45j64p2M04k19j4L0k53L53Mj06%k1K03
6285A60k60l6J60k13K7K36j45J64J31k56J91l5R2l49L45j12p3j20L8O4m3K8R2
6308H6r0n6Q5J20N8j01k9j03K30k99K77l4k53P2K95j83L3k87J18J16l09K95j12
6331g1j72J06J61k6P1k78K39K4k43Q5R7J21r6J13Q5k46L7J75k24O9J37j54nj29
$$ y = [-188, -109, -52, -88, -116, -6, 107, 29, 186, 79, -99, 4, -165, -125, 171, -138, -46, -182, 163, 34, -170, 103, 36, -40, -37, -129, -48, 103, -101, 64, 154, 152, 18, -16, 274, 23, -20, -22, 85, -2, 34, 95, -110, -17, 118, 119, 29, 256, -56, -1, -69, 57, 44, 4, -130, -75, 18, -29, -181, -24, 118, -191, -104, 66, -126, -123, 34, 4, -220, 28, 5, -29, -162, 52, -136, -183, 171, 4, -201, 16, 90, -227, 151, -25, -4, 152, 186, 85, 86, 140, 32, -68, 12, -7, -67, 115, -106, 117, -6, -6, 76, -29, -122, -151, -55, 60, 69, -93, 160, 15, -149, -221, 183, -36, -50, -20, -273, 80, 84, -22, -22, -43, 160, -100, -136, 24, -189, -162, 74, -71, 93, 224, -32, 159, 124, 216, -133, 212, 100, 27, -93, -55, 9, -34, -6, 86, -4, -60, 25, 145, 203, 102, 73, -30, 200, -99, 178, 144, -109, -37, 258, 75, 108, -179, -61, 55, -254, 41, -71, -243, -137, 24, -2, 69, -209, 30, 54, -189, -104, -7, 114, 18, 131, 216, -30, 7, 182, -42, 27, 164, 10, 5, -124]
6355a24L07l01J18K81k73P9o1Qo6J60l5j34Q2M4k07J18O1j18M6K9l9K5%kk08L33
6381A23k07j01K61m4k29K24P0j40M4n4Rm4N1j07J26P7Nl32K81K65l12J22m3j13
6405f8K5J73m1l21K16J64j27n9J44j14MK48j24l12J60J63q5k8L6k25J20QP0j1
6429A6K28j72j80K97j12o7p1K86l96K13j02L1J2P8L2k52J04K19j21Lj9o1q1R6
6453a9Q4k23P2J61RQ4l30J15J73k96K60k6l9j95J83J52j80j01K99k47j55L1M22
6476B34k57k9Q2J08l8j02R1lJ17j75M1Ko3j12J67K7l73K52jl9n4J32N5j81J05
6501a4p7J35O7j97Nk8J50q7k5M7J04k40L06K8l41M7J89j00P8n9J2rj46K26j75
6526a04K61k16L17k64n2j41K03Rn5J69p4L6j14KN8j54J99J20l54K29j10J3j63
$$ y = [-124, 183, -118, 0, 281, 8, 87, 26, 34, -32, 128, 93, -41, 41, 85, -122, -4, 57, -61, -15, 14, -25, 0, 0, -2, -210, 123, -84, -185, 76, 32, -197, 27, 97, -43, 1, -53, -44, -88, -37, -144, -18, 59, 64, -268, 13, 278, -34, 88, 45, -68, -43, 130, 89, -232, -16, 148, 21, -38, 106, -8, -4, 244, 120, -192, -32, 131, 46, 18, 54, -171, -51, -43, 27, 16, 244, 72, -108, 189, 77, 10, -61, 225, -171, 42, -60, -29, -17, 61, 93, -159, -55, 164, 43, 46, 27, -34, -115, -19, 65, -158, -86, 75, 84, 168, -162, -47, 126, -170, 90, 64, 25, -170, 13, 165, -15, -116, 183, -64, -219, -188, 234, -23, -52, 30, 138, 100, -2, 89, 86, 203, 28, 69, 71, 8, -104, 63, 90, -283, -31, -32, -71, -125, 7, 62, -119, -14, -91, 44, 111, -86, -81, -109, 41, -46, -71, -24, 80, -160, 146, 174, -167, -120, 69, -31, 47, -12, 0, -9, -155, 71, -104, 157, -59, 258, -6, -58, -199, 4, 13, -42, 127, 53, 89, -25, -23, 35, -119, 80, 200, -154, 75, -35, -22, -185]
6549a85K74j8p9o2M2p7K9J9Lj16R0P1m1k2J34l16L70j55l5O0j20j93J84J76p3
6574d0J08p1N9j16M2p9j26M20j53k6j50J34O7N9j04M2M9N1l25J16Q5J8j31k9K86
6599A86l10K6J50j98P7P2J43l1j31K84l30K58j47k52J88ql2N7K27k26N3lQ9k40
6623i8K3pP7J9Q9o4q0J23p7m4q6K29m6k70L33j58N4J44o3j08K4jqJ49J9k64KK56
6651A67l10J76%M1k30K18L4j38K89L1m16L70j86N1j29P1R4P2r8j38Jk6k2N6p5
6676i7l1L7K80n8k55J89P5Mk23RJ22j34Q8o7o9K9K15j49o8J81j34j87M9L85q8
6701A03q7J28n7jl5p5J57pj87K27M3j10j10j83P9J9J19j59j4P7J05j14R4M1Qj56
6727i5J07k7j68J82j36P1J07pj15J97r2n4q9N8NJ27J02l10O2L5J03k59K61m3K5
$$ y = [-185, 89, 71, -8, -70, -28, -105, -76, -57, -54, -170, -80, -9, -50, -72, 62, -254, 116, -39, -74, -14, -134, -327, -143, 33, -40, 68, -3, 56, -60, -18, -97, -223, 197, 44, 18, -132, 2, 69, 128, 24, 66, 115, 166, -159, -43, 42, 60, -71, -100, 186, -124, -98, 52, -146, -69, 3, 146, 115, -16, 268, -62, 196, 49, -203, -15, -23, -55, 2, 229, 3, 56, 53, 142, -98, -75, -82, -5, 14, 103, 39, -41, 82, 5, -39, -125, 104, 58, -212, 121, -37, 17, 161, 98, -10, 14, 13, 5, 154, 173, -91, -89, 167, -143, 33, 33, 74, -156, 62, 96, -42, 247, 278, -138, 232, 46, 97, -32, 39, 133, 205, 107, -31, -30, -56, -78, -22, -97, -128, -91, 189, 131, -124, 65, 140, 144, -79, -70, 52, -82, 6, -61, -130, -101, 114, -35, -103, 78, -56, -243, -194, 191, 103, 16, 144, 87, 86, 51, -24, 133, 126, -61, 166, 209, 99, -11, -194, -115, -96, 23, -136, -150, -73, 32, -82, 12, 53, 61, -95, 12, -15, -183, -1, -137, -66, 41, 34, -81, 116, 24, -30, -119, -61, -56, 71, 173, -137, -75, -40, 63, -196, 65, 22, 47]
6752D7j4l7l3Q1j26N6j15Q9P1j01M8L23r5l60K58J2k03J2J35P0j64Q7K0J26r8
6777H9l13L21q6l9P4j66Q0J64k0j26j6k6k2L19j77Q3j50K3L4k00J9K25k65J03
6801g2Q4k04K18J08Kj66J07q9j01J11r8J48N6k53K25k6j1N4J11j77l9M3j44J10
6825cJ68j30J03r8K3j18J32N7j35Lj20m6Q6J29j3j15O7K29j99J03nJ03k21n5k04
6850b59J60J19n9J37q4m9k32L47M6j58r3J55j15K26l9j59J24J07k96Q9J00j38
6872g1P4L4j13L2N3J23j18k9R2R5j8j35p2N1P4M8l00J25O2m5K05l35O8J39j41
6897a02R0p7M4P3M9j00PpJ51j00k80J22K13p4r7M7p0k5J89J44k47J49k67M3J10
6922a5J24j88M4K0j67J59k6J45r4Q7n3m8j05K88k73j16J28K19j89J5J1O0P4N1
$$ y = [47, 33, -4, -37, 44, -82, -26, -141, -52, 19, -82, -34, 289, 194, -166, 92, 104, -99, -87, 48, 118, -46, 41, 61, 187, 89, -224, 97, 11, -28, 46, -120, -40, 124, 104, -22, -38, -64, -86, 233, 56, 139, -11, 12, 46, -154, -135, 90, -175, -72, 12, -192, 26, 134, 136, -30, 77, -12, -113, -2, -100, 48, 104, -149, 76, 50, 39, 93, 204, 27, -12, 31, -113, -3, 165, 35, 138, 40, 63, -55, 77, 134, -1, 2, -118, -164, -78, 51, 38, -77, -10, 219, 20, 123, 118, 221, 0, -55, -259, -99, 20, -39, 98, 14, -35, -267, 80, 126, -32, -125, 30, -85, 141, 102, -57, 67, 174, -122, -33, 67, -71, 3, 37, -76, -44, 9, 132, 14, -15, 77, 172, 154, 19, -53, -2, 72, 120, -180, -55, 7, -38, 167, -168, -100, 39, -102, -12, -89, -45, 28, 77, -23, -16, -23, 128, 28, -252, -130, 83, 9, -88, -41, -111, -136, 53, 197, -50, 99, -168, -125, -15, 109, -79, -35, -15, -182, -23, -49, 96, 2, 89, 36, -12, -117, 171, -102, -218, -90, 129, -60, -45, -34, 26, 100, 151]
6946A51M2k50R2k05K14j02qP4q8m4O5N3o4m0J00k6QK18k89l1lK14k87p5K71R9
6972H9j88jJ26j79J05J3LJ7j60K30m4n5R3q2R4m5r5O9k49K23J23j2j03R1N7j38
6998a8l4J84K4k22J20K4j63J40j09J86N4j21p6m8nj09K6J72Q1j51r8K2J43J11
7022A33R5k50P4Mp8k26J19L96k37k00J61rr5R6J7N0l3N0j63j06J27n8J63j0o1
7047d1j5N3j03Q9j24L7J45r8K46k96R6j94J47l3R8k27J61J92j71j09K68K6o8j99
7071a20k9L1q3K08O4j82Q8q2J44o0j56J87P2P9j6j53M9j40k6J48M1K0o7j05K1
7096f7J36r7J79%j28n2K04J54l47j45J77N3j11k06M39j77M7l9M3j67Q4K8j76L18
7120A50k40p0K75k56J6J42o5R2j72K14k86J39j9L6J0o6J79j37j4pN3J0J59j60
$$ y = [151, 193, -57, 35, -170, 44, -58, -66, 8, -80, -124, -59, -6, -70, -110, -10, -36, -28, 190, -99, -130, -133, 81, -206, -281, -10, 89, -99, -100, 26, -153, -48, -35, -32, -15, -175, 55, 11, -44, 49, -33, 61, 16, -79, -10, -259, -36, 87, 75, -28, 63, 120, -18, -52, 132, 156, -66, 54, 78, -85, 55, -54, 132, 186, 65, -11, -59, -64, -173, -147, 25, 106, -45, -143, -121, 22, 133, 228, -22, 52, 56, -22, -248, -129, 267, 30, -170, -9, -18, -113, -17, 0, 50, 17, 67, -96, -202, -75, -133, 30, 20, -41, -56, -3, -106, -17, -141, -104, 41, -57, 189, -107, -11, -205, -58, -91, 7, -220, -59, 133, -38, -147, 121, 147, 79, -120, -149, -118, -201, 7, 71, -111, -23, -105, 39, -21, -177, 10, 82, 161, 145, -8, 41, -99, -125, 23, 64, 84, 17, -88, -67, 69, -28, 151, 151, 23, -29, 175, 329, -18, -163, 14, 67, -44, -250, 189, 12, 59, 20, 63, -104, -20, 8, -168, 150, -90, -160, 115, -141, -125, 17, -48, 44, -128, 86, -200, -61, -80, -44, -34, -100, 79, -58, -72, -79, -26, -16, 143, -17]
7144a7O0O6o2j1Q7k11k1J45k7j86K59P7j46p3J75l62K65J11k04j9J08P1o4j3J9
7169B7q4K9j70J33L7N1K7r9O6J8M2j41J14j83J66r9K3k6P7p9R3j64K17j35j49
7194b09K98j1j13j8J24K0j65J41m0J22j48K3R2j31J36l35K90J55k21n1pj02J09
7217d1PQ7j68K38j81l4J5k2LK55k58J23o3J6l5K81M7l93J57q6n4K39j64L3Q6k03
7243a15Pl5nJ69j11J27n5K8J62o7j5n4pL0J52k23M7K80k61o4Q3l1K96m70K0J23
7269A1PKQ1m6j54P8j6P6p1J55k45K37k25J33m0k1mj02p0J85k22J96J42r5q7n8
7295a53R2K3J50q7j03M9n5qJ30n9p6mK38j31R7Jq3O5j07n9J42j50Q9j03R6j22
7321a28N0J53R6j40PP8k06L09k48pM2j1K17k60N0L0K6k75J02K33j06Q7j39q0M9
$$ y = [-17, 43, 109, 47, 36, 123, -88, -109, 36, 9, -177, 82, 159, 13, -60, 115, -247, 18, 129, -75, -94, 14, 85, 21, 8, 27, -57, -28, -198, -65, -28, 23, 50, -49, 17, 35, 77, -64, 50, -133, 33, -66, -43, -69, 8, -71, 22, -142, 75, -60, -209, 89, 78, -35, -53, 71, 91, -74, 67, 27, 149, 1, 24, 116, -15, 121, -214, 76, 231, 10, -41, -48, -150, -41, -34, 53, -115, 123, -58, -92, -77, -99, -96, 159, -99, 24, -39, -23, -58, 223, 270, -123, 34, -52, -106, 133, -31, 2, 88, -115, -108, -143, -148, 21, -90, 37, -18, 10, 172, 105, 90, 36, 29, 59, 211, -12, 35, 315, 54, -10, 73, 42, 338, -132, -112, 11, 18, 20, 101, 55, -99, -21, -37, 39, -32, 123, -122, 115, -110, 23, -17, -38, -42, -144, -214, -29, -251, -55, 87, -8, -95, -153, -61, -38, 112, 25, -78, -29, -84, -92, 38, -21, -97, -101, 137, 6, 103, 104, 21, 86, -21, -80, 62, -88, 1, -102, -6, -128, -78, 75, 171, 31, 38, 116, -90, 219, -29, -36, 6, -5, 212, -48, 2, 32, 58, -217, -115, 118, 12, 99, -40, -120, -71]
7346g1K2jl6J95q6k48K20N6k2m5k7r0p0L85j49j39J93p1P3o3j18R9o3k7N8N3q4
7373e6o2J23J84k57Q3p5P1j06J61K7k46K22o1n7l7N7J20j93J43r0L1j13J45k10
7397a96J78K82k31p3j10L12j06r2P5M1J05j66l3J1l0N7K1J3n0J71%j33j23K24
7421A47j41l10M76n1k12K7Q0N0j17K6l4K5J80l06RM12j72j01J47k27N2J20j93
7444a13L5K0m1J33j94J69Q3l9q8J16j47M8j07J30K22j76O2j85O3J1m8J5n7J5J87
7469A14k53Q1k20K08J43l6K19k77k5R0J22r6J71l01O4R5r8p7R5R0n4j48J41j75
7493a27J69R7j87j50K76J24p5j65N7J82k52J12n1k3n3L0j00J52n3L6m9nO0j54
7517a49J76p9l2j17K97q6J09r6j37K1N2j1P5k2o3K77m05J29j09J14M4K9o6K40
$$ y = [-71, -49, -50, -86, 109, 23, -225, -5, 51, 29, -16, -43, -133, -203, 182, 33, -106, 87, 16, 89, 26, -92, 7, -56, -83, -25, 28, -56, -118, 5, 189, -68, 15, -60, 11, -95, 66, 93, -153, 69, 8, -49, -86, -29, 91, -102, 41, -49, -18, -131, 14, -196, -18, 264, 33, -40, -150, 162, 56, -36, 39, 80, 185, 19, -14, -3, -33, 24, 45, 58, 8, 179, 179, 46, -77, 147, 6, -304, 172, 121, -91, -64, 16, 66, -51, -25, -59, -34, 146, -160, -151, 261, 89, -12, 135, -92, -40, 80, -113, -78, -58, -99, 34, -160, 9, 92, 53, -35, 81, -66, -18, -125, 5, 227, 51, 113, -72, -9, 2, -46, -31, -88, -73, 114, -139, -58, -278, -70, 73, 37, 256, -21, -46, 44, 166, 70, 241, -60, 4, 99, 1, -76, 19, 109, 55, -93, 48, -127, 42, 139, -48, -198, 78, 202, 127, -38, 19, 201, -51, 61, 10, -13, -66, -36, -136, 16, -37, -1, -50, -55, 5, -149, 27, -52, -84, -201, 96, 10, 119, 23, -114, -93, -41, -52, 23, 1, -62, 215, -190, -61, -170, -56, -12, 17, -49, 191]
7541A91q8k17q9J87l9j73K49m7J26p0j17J09j38m6Q0J93k59n4L02M8k96K35P7
7564A64n4k28rKR7l1L07k38k2J34q2j62JP0k66K63r1J01jP8j9R0p9r1k5K66k72
7591i7L4pK48k05L2q4Q3K47j16k25R1L44l15j20J37jj63J30M5K3j03J19p2Q7j26
7616a4l7l0n0J15q8J93k63J79K07k64J35o4n5K2q4N7R6N3nq4j84J27J08j3p9N2
7642C0j15J22J5k7O4j45j29J04NJ17j44J13o1J37j14L5j05K80o8k42K26k23L48
7665B23j12m6J26l27J16J05nP2j49j08K0J30j70J30J1K0J6O6k37J8L70j66j04
7688aq1M9K19k35Q7r2M9p7J60j83O7M4k06J35K55j99J48o6L8k00J15r4L1J25n4
7713C4R5j08M9N8r1j07P5k51OK19ok3J12o3p9L6j39J89j32O4R4j27K09Nj57J32
$$ y = [191, 103, -114, -203, -16, -55, -228, 21, -26, 100, 30, -87, 22, -116, -162, -82, 111, -148, -202, 100, 148, -148, 87, 164, 110, -118, -127, -125, -28, -59, 248, 10, -12, 122, 40, -122, -121, -51, -317, -54, -145, -44, -45, 33, 14, 104, 25, -66, -91, 175, -97, -63, -70, 178, -27, 5, -79, 4, 251, 135, -90, 1, 345, 30, -90, 47, 46, -117, 13, 58, 81, -22, 97, 25, 112, -14, -51, -81, -131, -16, -104, 89, -174, 5, 212, -52, 83, 19, -36, -14, -98, -41, 55, 108, 103, 19, -165, -38, 70, 57, -22, 30, -85, 37, 52, 25, 89, -56, -185, -81, -76, 41, -103, 10, -51, 86, -28, 7, -98, 182, 114, -128, 98, -125, 223, 111, 65, 191, -136, -20, 85, 80, 152, 3, -105, -85, 45, -125, 5, 16, 36, 52, 118, -119, -101, 269, 103, -1, -82, -33, 186, -49, 38, -54, -5, -82, 78, -105, -38, 6, -200, -65, 190, -9, 139, 73, 111, -89, 26, -68, -37, 88, 34, 129, 21, 70, 128, 37, -70, 5, -246, -240, -21, -27, -50, 62, -1, -80, -44, -183, 6, -126, -62, 32, -95, 114, 119, -38, 94]
7739I4j79J56o0j15r1L16k02k7L66l94P9mJ63l33J85K55k38P6L1o6l8J4j35P9
7763f8K90j08l21K84J05j32j36J74j71J99j07j14k6J32%k52L09l3j97O2J62o4
7785a2J38j48R1j11J49q0j25K22j06L0l1p4M7q9N9L42l72N6J63j20p3J43j81n4
7809a36J3R7k5K7j42J37P6j24Q8N5n4J36l28K70j5j98M5j5J89j50J06r7L4j56
7833a67N6M8J72j77J65j29K67k10K34j42k1j28J64J69l88K48l01J40K05l98L96
7854B03Qk46j51j3J44J34j07p2P8Q0J8m9j06J71j59R8j25J47k26J69N6n1L9j34
7878i4n9PJ72l8L2j55Q9m2j43K95Lk7J2m9q6j48L22j33m1J92J2l5j3k15K98j33
7904B3P6j41r4Q5j06L45k56j05K05n2j1m3K04k70Q2K6o7J82j21M7P7l9Q4l06J46
$$ y = [94, -85, 71, 11, -104, -195, 121, -81, -108, 258, -136, -57, -61, 102, -231, -46, 209, -29, 47, 78, 12, -26, -12, -147, -68, 222, 114, -207, 77, 182, 50, -86, 88, -83, 116, 9, -105, -131, 1, 1, -251, 58, 25, -172, -110, 52, -12, 126, -22, 69, -42, 107, 27, -98, 124, 18, 48, 17, -57, -10, -99, -40, 302, -70, -14, 149, 29, -44, 99, -82, -136, -123, -26, -51, -24, -166, -29, 47, -77, 11, 66, 12, 148, -180, 90, 75, -123, -78, -93, 96, -54, 52, -45, -11, -167, -111, -63, 109, -68, 97, -32, 235, 25, 259, 117, 96, -32, 132, 301, -87, 161, -140, 0, 205, -193, 203, 211, -35, -186, -199, -55, 79, -28, -100, -22, 58, 76, 27, -79, 92, -67, 31, -94, 53, -173, -4, 52, 1, 40, -94, -153, -146, 26, -12, 20, -135, -46, -88, -231, 64, 67, 40, 52, 3, -83, -231, 91, -42, -83, 109, 121, 86, 73, -142, 156, 23, 99, -42, -136, -51, -157, 188, -68, -173, 32, -20, -31, -74, 130, -140, -58, -32, -99, 83, -38, 9, 86, 47, 131, -175, -29]
7929b9p7J32j9P9mm1O1j91J80nJ0M9r6K0k11J41J95p8j20o7K8L3K3J15k63J52
7955A7J01j35om9K35k79J10j14J30m9L9J39k95K1K17j66q8K31pj62N4K0l4K08
7979A38p8J02j37k07J38Jr6K23p6O4j1k8j08N2Q6n2j73Q4k3J06n0m2Q3qj17J95
8005F6j09lj12R6j46L12Q7l39K03l25L35j37N1L4q9L9M8O1q2j24J49m4M7k00K46
8030F4p6R6j37N0l2J35r8q7j53K67J2q3K28p3k8p8mp0O8Qj5J54k92J97R5j17r
8057B2J66j47l3J45j44k7j9k24J97K57ml46k8L82N1m46M66l06J20l4q0K00j42
8080B6M9L0j31k8K3R5r3RM4K0K5p7J33Jl2q4J64k10L9k54J24K34k27j09K05p5
8106i9RL4L3K75l97L9L52l00n0K35k94J14J55p0J28k71J82Q1j62k6J3O9j23K01
$$ y = [-29, -106, 26, 7, 86, 82, 41, 102, -89, 91, 86, 96, 145, 49, 69, -142, -1, 194, 116, -4, -71, -43, -10, 13, 128, -135, 17, 118, -17, -23, -72, 163, -116, -6, -120, 10, -39, 0, 139, -156, -135, 82, -84, -172, 59, 52, -110, -56, -36, -70, 138, 60, 162, 25, -182, -44, -43, -139, 84, 8, 72, 61, 33, -75, -23, 63, 11, -162, -78, -101, 5, -45, -87, -4, -12, -129, 66, -43, -46, -158, -62, -208, 104, 191, -148, 55, -270, 65, -72, -21, 13, -76, -37, 11, 72, -10, -134, 15, -29, 18, -182, 64, -12, 84, -53, -3, -35, 100, 2, -85, -238, 29, 41, -42, 186, 113, 85, 7, 3, -67, 1, 9, -6, 148, -144, 53, 148, 31, 22, 188, 41, 8, 153, 9, -18, -37, -261, -64, 193, 189, -157, -185, 197, 248, -198, 268, -38, 82, 48, -32, 168, 26, 75, 105, -26, -54, -31, 64, -29, -20, 24, 44, 69, -8, 125, 126, 94, 10, 174, -36, 3, -251, -127, 107, -120, -229, -24, -99, -90, -56, -23, 252, -145, -106, 246, -54, -104, 131, -163, -49, 106, 36, 164, -107, 75, 156, -6, -32, -19, 50, -73, 128]
8130A28k65K15Q3n4k31o2J74j88K10N4N2m16J15K87k16J43n4o7J65l8L3o7J07
8153A08Lj13m9O7J7p6j5m1R8L7l6J32l1j42P2o6J45o1l0o9n8J05N5j03J98k39
8179i2K20k99J83r7N2o3K07m6j98J35M4j07
$$ y = [128, -137, 78, 161, 107, -124, -186, -12, -200, 10, 64, 116, -300, -185, 102, -114, 29, -25, -92, 73, 35, 68, 1, 108, 111, -2, -51, 16, 33, -43, -58, -99, -1, 36, 0, 132, 101, -41, 31, -35, 110, 49, 19, -50, -108, -3, 52, -51, 147, -92, 128, -171, 12, -85, -33, -96, 111, 65, -133, 2, 46, -61]
8191f1
$$ Imaginary data points
##PAGE= N=2
##DATA TABLE= (X++(I..I)), XYDATA
0@%%%%%%%Qj6J6j6J6k4L2l2M0m8N6p0P9q9J04j21J44j67J89k16K46k78L13l53
31a87L97m44M96n54O17o86P61q45R37j037J148j270J407j560J729j922K143k396
49a266K691l040L459l976M630n489O672q405J1204j6448K9513j17984k07598L12582
63F545K04684k03088k12699J47302J65995j15003j57334J09650J55616p1169j35572
74a05073O4263J00283p1493p2606J20368R7769j23480j37495R1509J56118k6942
85I3221j30279o290Q6679M986o3155N601M5670j3131k4439K2031j4287o2599K7617
98b8375J13112l964j43667m8527J30687Q5332r8741r2918P8633Q6018q0462q8792
110i1664Q1184R3724p1938q9985N9703P1724o7141o8514Q1413Q9938q1332j24240
$$ y = [0, 0, 0, 0, 0, 0, 0, 0, 8, -8, 8, -8, 8, -16, 16, -16, 24, -24, 32, -38, 41, -48, 56, -65, 79, -88, 101, -115, 131, -147, 166, -187, 210, -234, 262, -292, 325, -361, 400, -445, 492, -545, 603, -667, 740, -820, 909, -1013, 1130, -1266, 1425, -1615, 1844, -2132, 2498, -2991, 3681, -4724, 6480, -9968, 19545, -98439, -306037, 6545, 211229, 8141, -204558, -57256, 108739, -6264, -163598, -53948, 101668, 30499, -105073, -40810, 59473, -12020, -84626, 35742, 133511, 10031, -127464, -35955, 120163, 93221, -37058, -43348, 43331, 48317, -14838, -9237, 36433, 23302, -1137, 20894, 6607, -55992, -28375, 84737, 80773, -62894, -111421, 19266, 104598, 5857, -87061, -8428, 77590, -2872, -91664, -10480, 83244, 11306, -78679, -18976, 52748, -14393, -82907, -1494, 88444, 7112, -117128]
122a17128N5590J42471j7954j30149j432J10559J1367q7203j1792P2838K3407
133E0574m5111k0159K2566M548j3281K0505K7276l3595m9863K6372N5218j9406
145B5644n1155J1313L6975j4038l2632N660K0383j923o729P673m028k7748j173
158c1778N0154K2761n3178l8320M7775M5570l4636l9675K7735L9230j4399l7540
170a6301l052K5679J4228n673q882j4457j7027J4522L7206p432m6868m39M4655
183A6159j037m7523R4N2367J3657m7674k6490L4856L0656k1023j5614K8378N276
196B2082m4148p088N7349J9338n2573k5596M1796K2950m0206k6642M2199L9784
208D9245l8932n6790J9349N3917l372l5241O66J3746j1190p830J7368R922j0830
$$ y = [-117128, -61538, 80933, 62979, -67170, -68602, 41957, 53324, -33879, -45671, 27167, 50574, 5463, -14696, 7870, 12418, -863, 19642, 46918, 13323, -36540, -10168, 45050, 25644, -25511, -14198, 22777, 8739, -23893, -18233, 2150, 227, -6502, 1171, -2857, -30605, -31778, 18376, 41137, -12041, -50361, -2586, 42984, 8348, -31327, -3592, 35638, 21239, -16301, -19353, 6326, 20554, 14881, 5999, -8458, -25485, -10963, 26243, 18811, -28057, -28496, 16159, 15122, -32401, -32307, 20060, 33717, -13957, -40447, -5591, 25065, 4042, -11572, 16806, 22082, -22066, -29154, 28195, 47533, -5040, -30636, 11160, 34110, -6096, -32738, 9461, 49245, 10313, -46477, -27128, 26789, 23417, -11824, -11158, 2588, -8602, -16432, 936, 10858, 28]
221B8o242N695l954j3613R699L2372J65m2519j2871L8242J4434l0325j654L3463
235B2920q043m4332K848M9830J1034m4487j6946L8979J4287m5041j3978N8500
247B5571K5151o1975l9372M9101M2923l1990l4907K3441K7635k4176l2306K1050
259i854L7853j1695l4877M476J9954j0299q503K2008Q230k6733j3144J9587J3097
272A0100j0336m981J2759J821k1065n656K6896J2423k4597q056K4064j629l2973
285b1230O823M4591R96m8539j5282M1223K2729l4446k5221L3727K6937l7348l5160
298d0200L3914L8490k3933l2472J5216K0058j5595j4012K0621J9058k0137k5946
310b4938J4545K7468j0856k1363J4827J8816j9130j8869J7340J7717r084q597
$$ y = [28, -6214, -519, -4473, -18086, -8387, 23985, 24150, -18369, -31240, 7002, 21436, -8889, -10543, 22920, 14877, -29455, -26607, 23223, 34257, -10230, -27176, 11803, 26090, -18951, -32929, 25571, 50722, -11253, -50625, -1524, 41399, 9409, -25498, -2057, 25578, 1402, -30904, -9854, 27999, 16304, -18573, -14097, 5857, -4442, -12945, 9063, 17293, -9440, -22584, -2997, 10100, -236, -5217, 7542, 9363, -11702, -17358, 9538, 21961, -2636, -10692, 13372, 11743, -21230, -14407, 30184, 31180, -17359, -32641, 8582, 31311, -3135, -28356, 5371, 32308, -5040, -40200, -6286, 32204, 8271, -24201, -8985, 11073, -4522, -18534, 2087, 21145, 1008, -24938, -10393, 17075, 6219, -15144, -317, 18499, -631, -19500, -2160, 15557, 6473, -2124]
322b124N777j520j2313M289K2664L050k8901j1138K8980J2667l0801j0775L5178
335A5033J1248l7474j7415L1053K0722k0718j7925J5674J1897k0062j2049K7825
347G809J7336l0154k1823K7351J9193k4890j4046K5427J3868k4854j8161J8441
359d503K0877j0260j6174Q836Q595j6655m737K6255O801l0166p895K8853N848
372A5675k8069l503L0971P908l2774j6535L0225K2548k5311k0385K4755J5445
384B0950l0137j3437L5293J6047l4095j9343K8826J9067k5220j9951K6239K4003
396B8242k7941l0752K4255L2734j9698k7584J7293J8506j9809j5213K2386J6246
408A8665k1604j9057J8098J9842j8329k0601K3428K3939k6638k8400K5530L0685
$$ y = [-2124, 3653, 2133, -10180, -5891, 16773, 19823, -9078, -20216, 8764, 21431, -9370, -20145, 15033, 26281, -11193, -28608, 2445, 23167, 2449, -15476, 198, 12095, -7967, -20016, 7809, 25145, -5009, -26832, 519, 19712, -5178, -19224, 6203, 20071, -4783, -22944, -4503, 16374, 6114, -10060, -1224, 7371, -9284, -14021, 12234, 19035, -11131, -19026, 9827, 15675, -12394, -15897, 15074, 22982, -9792, -26327, 3898, 26446, 1135, -19250, 5505, 20950, -9187, -22624, 12669, 28716, -5379, -24722, 4104, 23171, -2049, -22000, 4239, 28242, 301, -30451, -6196, 26538, 6840, -20744, -3451, 15055, -4754, -19967, 2419, 18665, -2939, -21996, -3898, 15944, -2385, -22986, 442, 24381, -2257, -30657, -5127, 25558]
420B5558j9506k4965J6361J9913j5777j8107J8586K2465j7320k6249J6378K7867
432B5204j7904k7995K0938K9644k2967l4698J6887L4849q573l2824M66K6753P84
445A0564k6097k72K6471j70k6232J88K2789j321j7420O554J6894p170j8243M830
459h635K1767K317k0101n259J8191M152j7336j300J8366m06j8038r38J2264N1
473E095q539R83O995k935j1575QJ4687L452j5152m585J3330J565j2155K360J3050
488F584q11j1694k618Q534O360m681n860N052N482p674n946Q659P577n557n695
503b288L58J168L152K901k157k576J118O30j290J087J045O71J812k958n974J695
519a606O020k29k891r48m751k531O039K924n896m192K290K574j881m468Q57Q381
$$ y = [25558, 6052, -18913, -2552, 17361, 1584, -16523, 2063, 24528, 7208, -19041, -2663, 25204, 7300, -20695, 243, 29887, 6920, -27778, -10891, 23958, 15385, -17439, -16973, 9780, 10564, -15533, -15805, 10666, 10496, -15736, -15548, 7241, 5920, -11500, -4946, 11948, 4778, -13465, -8635, 13132, 15449, -4652, -9911, 8280, 12432, -4904, -6204, 12162, 11756, -6282, -7220, 5044, 5095, -3444, -2461, 4534, 1599, -9976, -9968, 4719, 8171, -6981, -11566, 1764, 3329, -8826, -6466, 6584, 5773, -5921, -8539, -5, 6355, 1674, -4186, 866, 6348, -1326, -7272, 1387, 8964, 3407, -2288, -1930, -762, 2390, 5291, 3134, 558, 1676, 2306, 1016, 2103, 3148, 3819, 5631, 2673, -3301, -1606, 4414, 4185, 1294, 346, -4405, -6936, -897, 2027, -3869, -8061, -5771, -3197, -5078, -9546, -8689, -308]
535c08K971j0633n624J0469Q151l610k453J978L75N35L314J833m7n53J71J174
551G743j237n137K455J0042l047j5248j960J1751K081r029l772L628J375n088
565e443m464M795O526l840o626L261L027m182K543R182k313r888N59R595K977
580E709n086l057M887L996o642o463Q051R147o744r032L218L935k546O44L110
595C127j132l787j450K145L668n57k562K762J986o911k817R273N052p216m771
610c190K834J449j584r5K084J444l414n999J424P172j012m583K551J825o022j243
626f359P274L609l141k933Q4J922R11j159K958M880m792q877L620Q567k288n339
642a063J342J341l953k797J619M293J509n285m637K282K336p24L164L193n506
$$ y = [-308, 2663, -7970, -13594, -3125, 5026, 1416, -1037, 941, 1316, 1851, 5165, 6998, 6951, 6398, 6569, 7743, 6506, 1369, 3824, 13866, 10819, -4429, -6389, 5362, 7443, -1586, -5358, -1730, -355, -5443, -9907, -5112, 1414, -2426, -9052, -5791, -2764, -6946, -4403, 4779, 2466, -7422, -6863, 2732, 5709, 623, -2434, 2453, 6449, -193, -6656, 1395, 10542, 3798, -5234, -2016, 1919, -627, 17, 3127, 1995, -1792, -3242, -1097, 2571, 2014, -548, 2214, 4200, -2711, -5528, 3745, 8797, 1581, -3190, -356, 1093, -491, -586, 1498, 2942, -472, -6471, -5047, 2125, 1113, -3470, -919, 906, -5116, -6359, 915, 4524, 1383, -1550, -1466, 456, 1367, 208, 3166, 8046, 3254, -5623, -2003, 6564, 4276, -1063, 279, 1620, -2333, -5130, -3511, 782, 2291, -2994, -7631, -5349, -3013, -3737, -573, 2620, -2886]
657b886m603N305M705j178j88K803q9k285j825J795N904K354n824l568J559o60
673A319Q22N049j164q188j485L741N2k441Q96J957q33m376m436L685Q225l99p039
690d615n07K086j104J751M941j81m057j380N28J940K195j53j98J680l243n819
706f136L517Q427j80n395k614m1J522L140N00o92R34j979l694J828M276K96K40
723C949k46m825l044N120M290j495k428j936j870N86J584M26J761o95m780j827
739e430L177O69J25L635r50p473q88O850L096k114k260J25J477q35k847K777P108
756F242j931q077m38M741Q68J26J538j854l500K03J951J486J071r87j525P90j392
773f88k533M133N580k668n719m38J762K551K617j806l697J113J134k060n2K763
$$ y = [-2886, -7489, -2184, 2521, 1343, 1155, 3958, 3869, 1584, -241, 1554, 7458, 9812, 3988, 420, 1979, 1319, 2141, 7190, 6026, -2162, -3647, 94, 146, -2295, -1399, 558, -275, -4651, -9087, -5402, 2823, 2424, -4615, -5122, -3036, -4140, -2389, 2552, 2371, -1686, -3066, -2538, -598, 1597, 1444, 1246, 2926, -317, -6136, -2619, 5808, 5628, 233, -2381, -2422, -900, 2240, 2740, 2048, 2982, 1003, -2691, -863, 3413, 3709, 3949, 3703, -1122, -4166, 954, 5244, 3749, 1321, -615, -2485, -1899, -315, 111, 1872, 1177, -3603, -5430, -2253, -1584, -1459, 2176, 1226, -6247, -7135, -285, 2811, 697, -1563, -1438, 39, -796, -3643, -866, 6242, 4311, -3766, -4204, 537, 1405, 1531, 3069, 1215, -2285, -2082, -131, 1355, 2426, 1439, -86, 704, -688, -3221, 912, 6492, 3824, -1895, -2333, -571, 1980, 4597, 2791, -906, 207, 1341, -719, -771, 1992]
789A992M87o72k490l812M94N862J796m437k398j43M48J739J292j490J55P69k454
806b862j551L489K047q60N84q90l815J242M568J675j491k623j807K116L466k101
822A187j337L251M69n094o40L956J215p85k94j651j750O84J110K160J180l438
838B23m012K636L055j808l83J808k005j746J160j78k66K835J082l652k507R94
854b764K427K941o02m640r45L407N62j273J678j53j868J031L03k677J274M348
870C049M6l472k863m6L891M292k882n295J287L474l96j080J96J6J633O54m146
887a642j901N210L099k342k726j992M89M100K244l555k924J614J373n33l57j221
903a064J183L147k162n874J291N244Q38k055k005k345N33M450P18l084j175R98
$$ y = [1992, 2479, 1807, -683, -4495, -4001, 1861, 3657, -780, -3178, -3321, -2873, -1134, 158, -1332, -1177, -408, -2862, -4413, -924, 1123, 263, 847, -43, -3858, -2616, 1952, 3627, 2136, -487, -2294, -178, 3288, 1187, -150, 3101, 3570, -1524, -2164, 1792, 3007, 2222, 1928, 277, -1473, -789, 321, 2481, 3661, 223, -3789, -1153, 1902, 94, -289, 1519, -486, -2232, -1072, -1250, -1516, 1319, 2401, -1251, -3758, -2764, -337, 2604, 2002, -2638, -3583, -176, 386, -887, 791, 638, -1230, -199, 104, -2573, -1299, 3049, 3095, -377, -3240, -3286, 605, 4897, 2015, -3280, -1993, 1481, 1085, 5, 201, 217, 1850, 2504, -1642, -3543, 1667, 4766, 2424, -302, -2294, -1805, 2295, 4539, 984, -1940, -326, 1047, 514, 157, -1064, 119, 3266, 1104, -4770, -3479, 1765, 2603, 548, -1457, -3802, -3269, 1181, 1899, -1185, -2360, -1362]
919a362O02K29j244j066L879K407n021l446L480L185M74p5k509k654K010L791
935B680n72j686j37O7P96O4k237O28M569j50n191p59J859J648J785K18m546k105
953c069L485J864j034r47p28J69J294j900k565L170L929k686m057k74J038J974
969c37K657k389m061J212K364n29l1O97q68O61N54k316r14M397K145k268k155
986a181j889J509M827J452m861j310K844L67r64J044J47k09R45j434k755J538
1002G0L307L6j750k298j884J947M042j579l377Q09L94j732P28J269j304L57J009
1019D4k025j979J522K083J341p29l623j672M198K940k832q51J778j235l45J943
1035E58pl67J645L27k513n8Q58J305K223m69m324p85L687R63j072P2j606j088
$$ y = [-1362, -760, -531, -1775, -2841, 1038, 3445, -1576, -5022, -1542, 1643, 2117, 2042, -467, -3121, -1111, 2680, 2108, 422, 285, 352, 1148, 1212, -1025, -397, 4172, 4022, -1169, -1928, -69, 1579, 3364, 3582, -964, -3069, 416, 2280, 1246, 299, -429, -260, 1034, -866, -3431, -261, 3668, 982, -3075, -3349, -2311, -337, 2320, -69, -4130, -2918, -554, -1083, -1114, -417, -1285, -624, -70, -2386, -3300, 1097, 3242, 974, -1181, -3070, -1561, 3266, 4718, -143, -1453, 1391, 1758, 794, 1838, 1985, 1776, 2721, 1287, -1468, 70, 3377, 3413, 1663, -635, -2519, -572, 3470, 1891, -1486, -677, -283, -2015, -1287, -18, -1322, -965, 44, -1981, -3960, -2438, -355, 986, 257, -3366, -5038, -840, 2100, -732, -1583, 195, -1040, -1385, 558, 551, 184, 1829, 2156, -357, -415, 443, 1748, 3971, 3502, -822, -1607, 2080, 3043, 1971, 2043, 437, -651]
1053f51J731M03k222N81K725j651k465p10r6K299K453k395l960N78K285L46M84
1070b65n28k085J002J735j851n30L014J294j792q28r37r2L759K452k948k733O70
1087f63J414J675P57k264n46K208o90l567J562L223l25j885j571k057J240L583
1103B094L3k666j250k72O6J752L00j616R39R24k580j288K765J667j71K38k617
1120a682k196K742L437o42j499n32j129J332J282p79N14K219j654l480Q12K542
1136A287Q43Q24q02l489o19L122J155m45K16j426j408O42L06o74K063J098l068
1153c75k361K18J150J943J726l083l836J449K107n00M90Q89j423p26p1q42J919
1170a326L597n12l245k97O76J070L137R44k998j095J190j89Q65K194m30j188l12
$$ y = [-651, 1080, 1483, -739, -158, 2567, 916, -1549, -2259, -2355, -56, 2397, 2, -3958, -3380, -1095, -749, -265, -793, -2878, -1876, -141, -1992, -2522, 492, 1786, -6, -834, -1771, -1863, 1896, 4348, 1400, -1333, -663, 751, 2426, 3183, 919, 373, 2581, 1891, -1676, -114, 3109, 2784, 899, -672, -2729, -1489, 2094, 2127, -539, -1789, -2061, -1995, -243, 57, -1559, -620, 304, -2276, -3564, -799, 868, 697, 935, -1682, -3878, -1136, 2301, 1659, 160, -372, -1501, -169, 1113, 334, 848, 3067, 1413, -2067, -1255, 1287, 2130, 2954, 2152, -1337, -1956, 1166, 2321, 1876, 2092, 666, -742, -100, 206, -468, 1595, 2693, -375, -2736, -2518, -1368, 575, 2301, -782, -4618, -3169, -1062, -1562, -1072, -183, -1606, -2332, -2403, -3245, -1326, 2271, 1759, -1486, -1783, -1107, -37, 3100, 4044, 1046, -49, 1141, 952, 1817, 4011, 3581, 2393, 2081]
1187B081j787j135K913K656j951k616j457m14J819K309j572j835M61j318j920
1202c766K037K688r38j500q77j852O85K792O66q44m82j997j044K711K301j040
1218d60J25m43k025L92L251P81k27M12j275j436J680K161L45Q44l50k979m97K606
1236B905J145L61q9l050k200K361J752j961m96O33j343j696j044j55K295K377
1252A795l831m258J256K877K09J83p04j639N46J500m30p9K196L48o22k45j304
1269b202J32M808K168m299k787K231K559P34o69j919O47K419j607k862J595K952
1285C900k88j483k089j570K156L299j125l471J2P57kJ04q51o02J890j41l618j053
1303d175K810J311m77m84k032j326K189K056j107l16J02p61M89P71q33J365K929
$$ y = [2081, 294, -841, 2072, 4728, 2777, 161, -1296, -1710, 109, 2418, 846, -989, -528, -1846, -3766, -1729, 959, 21, -1479, -2356, -4208, -3523, -731, -65, -909, -1391, -3388, -4432, -1721, 580, -460, -335, -778, -2803, -2411, 840, 1621, 1394, 1806, 531, -905, 775, 2936, 3281, 4125, 3775, 796, 299, 2905, 4050, 4411, 4322, 1272, -928, 1433, 3185, 1224, 728, 1361, 18, -1678, -2722, -2877, -582, 1795, -2036, -6294, -5038, -2161, -1952, -1769, -2473, -4112, -3566, -2066, -2496, -2575, -379, -31, -653, -898, -2202, -2070, 2738, 4906, 607, -2180, 51, 2610, 3344, 2675, 756, 1403, 3822, 2215, -647, 948, 3900, 3612, 2129, 40, -1530, 626, 3925, 2800, -671, -659, 98, 96, 200, -651, -1253, 637, 496, -3122, -4175, -1365, -54, -531, -1015, -3047, -4373, -2184, -128, -1235, -1551, -1449, -2210, -1721, -950, -1783, -418, 2511]
1320B511j453l450P07K891O80P23m00j433n84N68J75J526J915k373l016J694R03
1337A584p33Q80J207j751j536n19k50J617K317j252k753o82l11O34L092K91l309
1354a474j291J362j67J21J502O9n75l33k148p95L644K719j653k202j330l56K769
1371a38L187j403k507M05N39o22P23J271O10N58j617l576M26M811J268k073j954
1388i2j730L46K877Q58j941k2K51j660m68J400N34R78P04k954l170K053L708L01
1406A973j012j603j784J465J618m65J32J299j500k087J076N54L00J860L10l282
1422a146j453J714J436J019j36k172j301J335L40m44J555L67j656q34L66l53R90
1439c73K250q42k533J06M96M54J640O54j979n81O44k15J082J259q93n70N80j216
$$ y = [2511, 1058, -2392, -1685, 1206, 1886, 2609, 2209, 776, 192, 760, 935, 2461, 4376, 2003, -1013, 681, 1584, 851, 1731, 2938, 1187, -349, -868, -1118, 499, 2816, 1564, -1189, -1871, -2182, -1548, 1544, 1835, -1474, -2765, -1403, -1570, -1449, 53, 122, -453, -786, -2934, -3729, -85, 2634, 981, -1221, -2551, -2907, -138, 3049, 1646, -861, -456, 83, -539, 184, 1455, 2065, 2623, 1006, -2570, -2144, 2667, 3935, 1862, -92, -1822, -1476, 1401, 2259, 318, 296, 547, -1113, -1581, -181, 353, 1331, 2035, -919, -4089, -2036, 1672, 1973, 961, -642, -2426, -961, 657, 192, 324, 1623, 123, -1964, -888, -334, -34, 1826, 2136, -1146, -2599, -885, 551, 1570, 1434, -738, -2039, -704, -364, -808, 747, 1114, -542, -1376, -1010, -1363, -373, 1877, 1035, -1498, -1392, -896, -442, 1198, 1852, -127, -708, -64, -279, 803, 2062, 1169, 599, 1179, -37]
1457c7r94K333J444j173j183n19r69J122K185j065j520K22l52j136J115O16o45
1474e56L88m49k212L63K378k30m84P22j647j331K219J475r04j03L87r27K74J201
1492E64l48O93J206j520j479J417J002O8O41j96k293l9J964p22q8P72p55j354
1510d67J83j14J2J375k29k063k31P39n05O67J602j534j507J091M05p77J428Q68
1528I43j190k24M60o06L73J822p65q09O5l97O4J725k6k149L57P45q77q45J687
1547C53L23j081K1o37m35J488O86j167L28L7r70O74J246m66j69R08q68j046J560
1566G85P97j113L36N77j605l16J518K17m75k51j139J48J408n53j337J515O47j895
1584g36l18J196k01JR40j268j206Q69Q92p59L44K02j395K74N97o67m6J250o52
$$ y = [-37, -1031, 1302, 2746, 1573, 390, -129, -1098, 24, 2209, 1144, -376, -154, -506, -1642, -527, 89, -556, -168, -617, -2829, -2466, -88, -318, -802, -80, -1727, -3058, -839, 636, -268, -371, 16, -911, -637, 564, 216, 909, 2115, 595, -884, 533, 1535, 1603, 2244, 2048, -245, -284, 1680, 958, 870, 1642, 887, -467, -284, -398, -386, 989, 760, -1303, -1534, -795, -1300, -633, 969, -565, -2072, -981, -576, -1353, 75, 943, -247, -471, -11, -617, -244, 1578, 813, 4, 69, -328, -264, 1461, 1435, -714, -357, 388, -489, -1334, 353, 676, -405, -384, -1021, -1456, 32, 718, -449, -121, -84, -1054, -380, 866, 400, 231, 1139, 271, -775, 785, 1582, 469, 805, 1382, -223, -539, 979, 1196, 721, 470, -669, -521, 887, 334, -1003, 512, 1159, -736, -1054, 142, -59, -58, 882, -386, -1592, -723, 169, -590, -246, -44, -1439, -1165, -568, -1235, -1281, -31, -683]
1603f83q33P41l12n75K177J169k237l48J573M14M10J89p51p9J788n80j484J117
1621A696P80p57l80n21j448P10J898j596k220M12M15o80N05l01j022N18P89p86
1639a988j58O56m1J229Q12j787o31K969J389j692p13R96K54L70O50j510l58J615
1657B062l13j719q2J43J77O91j065k312J067K011j097j121P14P8l75J069k19r60
1675a251P77J269o86n46O71k61R71Q69j597r81J502K46j000P56k59j118N70J164
1693A096j324q49J621J09r70L39Nj96J139j86r94R05J72j221N25J478j370j176
1711h97J019J92j020j27j2n97R05o6j533m85J339L27l97J61o10M47K018k28j465
1730a029J168J576o11J5O71k49K90J364n28j484L11N57J88j32j375j270J222R59
$$ y = [-683, -1516, -775, -1087, -1662, 515, 1684, -553, -901, 672, 1086, 1496, 1685, 934, 855, 2643, 2063, 579, 1696, 2476, 1719, 1339, 818, -630, 80, 1978, 382, -1838, -1426, -1011, -1691, -1186, -1487, -2509, -1991, -1202, -1988, -2146, -1490, -1531, -302, 510, -1277, -1908, 1061, 2450, 758, 45, 1041, 1295, 1665, 2315, 805, 447, 2062, 1749, 30, -52, 91, 268, 959, -106, -2418, -1351, 660, -437, -1558, -844, -766, -1141, -72, -291, -1251, -474, 795, 109, -437, 234, -27, 944, 1813, 216, -765, 737, 983, -17, 739, 480, -638, -68, 1096, -228, -1077, 544, 653, -317, 22, 27, -169, 970, 784, -210, 695, 867, -354, 171, 1649, 279, -897, 122, 314, -706, -833, -845, -1442, -537, -603, -2136, -2621, -1282, -955, -1352, -1191, -1801, -1354, 664, 436, -1029, 139, 1715, 1104, 1119, 1790, 1541, 1831, 3195, 2667, 1183, 1494, 2051, 2239, 2107, 732, -538, 684, 1643]
1748A643k295j665J298M97p77P6j142m25J817P23j726p13J603P87M3k93p05R08
1766c46J909p43j543J170R16n88j9L13j318K43J713o39j635M97N76l32L11j094
1784f09o00J737O48j584p56J614l9r4M28n35n46J491k0j600O54J203r93p35N26
1803A90j42j47L51n69n24Q99o92q81R99O24j456M02J180p97p21J533J48o35K76
1822C8J44j38M99J14p99N34R10j196q91J216L2m84L79p03q46J207M86j483L2J194
1842B45r6r76K55M18M10Q03j024o18J141N25q70N66O57j209p4R60m09o93Q70J9
1862I00p61k51l4m13Q55M51j459n93R96j5m46M92o39j39J202m57j304J195J472
1881A052j249p48N16j37N44M90n74o35J134n21o03P66P37r06j47O07p97R4J429
$$ y = [1643, -652, -2317, -1019, -522, -1299, -1223, -2365, -2790, -973, -250, -1976, -2689, -1086, -299, -256, -549, -1254, -346, 1563, 820, -723, 447, 1363, 775, 756, 1069, -249, -6, 1707, 1068, -567, -70, 506, 174, 485, -609, -1209, 528, 1176, -408, -1164, 450, 411, 317, 745, 210, -336, 1155, 1135, -465, 189, 1392, 399, -336, 190, 48, -99, 252, -317, -841, 58, -634, -1515, -516, 108, -1348, -946, 234, -563, -1284, 249, 397, -238, 38, 182, 44, 543, 657, -142, 392, 1302, 106, -785, 431, 463, -21, 358, -345, -1191, 16, 502, -981, -949, 245, 149, -827, -572, -154, 256, 1059, 35, -583, 558, 1083, 213, 779, 1436, 227, 153, 1113, 704, 11, 881, 900, 139, -112, -146, -559, 296, 747, -712, -1305, -309, -324, -770, -278, -917, -1056, 146, -311, -1615, -420, 1052, -197, -945, -429, -566, -22, 468, -106, -741, 393, -128, -731, 35, 772, -134, -281, 326, -471, -377, 1052]
1900A052n43o28L73L2q21R55P51q95k03M73l64j3N48j89K5P25j079j068J234R39
1920A304j178n99Q06o03l70N41J27n24N46o94p99R30K63p28L63L71j250l9J306
1939b27k81l37N14j33q52Q84O03p11O12L31m73r5O06J2P2R39n80p48J158K05r05
1960E94L46P95q90j92M60m41l22P70n70q22J29O6o09L39K80q70JK40p64J97R85
1981b78n81m01P70k50p79Q91R54q69q5N45l87l0J075o6o24J071o42n08Q42L13
2001I61n74M07M16j073n12J249j32n67L19j83n99J23M53n84K73M62j175j10P87
2020e9l19q8R62m40j173Q20M15o29P27N06r06l07P33j97K3J173o06r37N00K29
2040D27n05O79L39j015j83N20o54N2R49n97q32Q8J73m18O00N98j162m8M32m70
$$ y = [1052, 509, -119, 254, 286, -535, 420, 1171, 276, 73, 546, 182, 169, 717, 528, 553, 1278, 199, -869, 365, 1304, 126, -473, 333, -270, -640, -99, 28, -496, 50, -644, -1443, -513, -250, -978, -615, -244, -1494, -1533, -227, -508, -845, -331, -464, -1316, -432, 171, -540, 72, 403, -70, -165, 441, 453, 525, 1464, 884, 136, 1294, 1499, 594, 940, 1735, 845, 653, 1113, 672, 350, 1120, 550, -272, -143, -77, -686, -347, -67, -937, -936, -696, -1460, -1263, -278, -859, -1260, -490, -740, -1519, -628, 326, -543, -628, -83, -470, -500, 575, 509, -115, 956, 314, -194, 648, 961, 387, 794, 1210, 137, -375, 874, 742, 175, 494, 311, -288, -165, 288, -296, -23, 439, -736, -846, -59, -378, -466, 496, 56, -1117, -297, 118, -511, 216, 722, -184, -491, 242, 45, 68, 1241, 635, -302, 198, 427, -78, 601, 940, -75, -258, 262, -392, -340, 609, 12, -820, -732, -559, -977, -377, 221, -941, -989, -557, -1027]
2060a027JJ202n03m24M40j20j71Q18P08n96p0K40m19K09R24j99o84O63K1o51O70
2081A032M86o15k0M66r98k61J016m18o43N20o68o98M48L89j064N5P4r67J83O37
2101a046l51j22N38k50p27O33O57k90O25N7l99K22J139k38r6R16l7o79O40M58
2121A650p35O03K55q46n7K41n01N0M33p10j056O77Q6p37P2N46q73J93L14n09J04
2142h00Q97k45o54O80J94m30N89M06r36K27N96q33p0R89n61n83M89M1q37M52L68
2163b1o47n9M08m89R4O12k18n24J042n8o40P59K54m58M17L41o69L06P77p33o69
2184a75J059m5p92L36J84m69J00Nn03K17O57p22j59R01l37n31N62J22n89L80N52
2205G53p11j30N04n66j79M86m91n58M81J3r97K46K09n56K37J43m98O7J194k75
$$ y = [-1027, -1026, 176, -327, -751, -311, -431, -602, 216, 924, 328, 258, 498, 79, 288, 1212, 1013, 329, 992, 1013, 362, 1032, 1518, 903, 883, 1349, 351, 90, 1106, 688, 45, 565, -103, -801, -353, 36, -1028, -973, -899, -1866, -1683, -1046, -1397, -1519, -981, -1231, -1958, -1325, -668, -958, -333, -276, -675, -453, 686, 448, 352, 1268, 1231, 552, 1192, 1650, 915, 1518, 1773, 927, 870, 1111, 610, 660, 1093, 383, -673, 4, 90, -647, -575, -29, -902, -709, -395, -904, -800, 97, -148, -802, -122, 72, -358, 231, 637, -299, -72, 524, -309, -379, 610, 49, -534, -45, -4, -841, -389, -21, -668, -727, -319, -808, -714, -102, -320, -844, 198, 140, -500, 259, 513, 55, 472, 813, 144, 450, 1227, 494, -175, 884, 839, 47, 383, 567, 98, 198, 203, -300, -83, 574, -148, -307, 594, 257, -274, 288, 410, -179, 201, 753, 42, -88, 416, -150, -329, 157, -334, -892, -411, -398, -1395, -1149, -940, -1496, -1259, -1116, -1614, -1547, -353, -628]
2225f28p85J037L65j78M99N24n1L67O75o59K85R55k94m80L50k29n93N64r2j242
2245C90j27K75p05m00R8n32n15M48j94o23M20K81n14L23K21o30O96R69n06m88
2265a113J140K49o55N79M61m28J49L46n28K59M33j11l60L23m01m06R19j15q81
2284a40L80P16q89MO34j41k46L42l15m03P82P6p22N5l3n11K6P19j141j76Q16m24
2306e91q27O82J03n68L33L63n54L15O90m15R2M99j02M6Q08j47n88J102L2r22M22
2327G73N94m53n05O34n16o17O63k69o32J03o0o17M20J03n57O6Q02p04l89J095
2347f6j04p13O04N38r34M10P94n09J16K56j09N4L11n60j57Q72k62q30L64M33n81
2368g3K6N42o25l79R69m94k30M41L01n79M11J91n77K11J17m88l5Q35p33m21Q41
$$ y = [-628, -1413, -376, -11, -189, 310, 834, 783, 1150, 1825, 1166, 1451, 2406, 2112, 1632, 1982, 1753, 1160, 1724, 1632, 390, 263, 538, -167, -567, -469, -1001, -1516, -1068, -1262, -1885, -1465, -1184, -1698, -1375, -1154, -1784, -1088, -119, -625, -1113, 27, 276, -379, 200, 661, 233, 382, 728, 200, 459, 892, 781, 421, 744, 343, -63, 856, 741, -140, 240, 956, 67, 71, 705, 564, 318, 660, 345, -58, 724, 800, 78, 133, 100, -411, -385, 334, -807, -983, -167, -591, -1418, -736, -633, -1201, -868, -505, -1059, -744, -54, -469, -377, 122, 20, 66, 874, 727, 139, 1241, 1273, 351, 773, 1367, 914, 409, 1043, 527, -90, 573, 304, -328, -225, -285, -902, -482, -379, -936, -870, -68, -772, -1161, -66, -170, -883, -279, 259, -675, -265, 529, 20, 136, 392, 283, 337, 648, 88, -69, 803, 541, -289, 75, 508, -73, -47, 495, -130, -509, 460, -34, -264, 177, 478, -101, 310, 501, -76, 135, 252, -236, -271, 564, -169, -590, 251]
2389B51j09q36J40N76n40l08L80o1j62J79k23k52P80j46l27P41J6p69N78N80n19
2410c1J05P31l62k83M52J50l45K87K37o23J12L16l38L95k1p74j51P94k61r53O91
2431A28L34j052J78M50l82k70M93m07k13N04m63l10P31L5q09J36N15m91M78P21
2451C06q65k97J004k02o59Q95O28o28n1K73l80N45L85n22j9L69l39M6P06l87r80
2472a72O93N76r94k37O93r5m45P3m21j21N88K17o98J31k35k36N66K19j143M43
2492e98Q72o02p10O97J01k0j01O7m33K81O89k42k11K02o06N69O93o14l80R31L13
2513H98j218M66M49k79J85K03m57m93N96K34p16M80j47l45M25jn22M77L36n90
2533a9l95Q04l04n59Q14K73q91K56M15m56j54J22M1j44J99m44J2O61k18p29L72
$$ y = [251, 142, -694, -554, 22, -518, -826, -446, -507, -669, -490, -713, -965, -185, -331, -658, 83, 99, -670, -92, 488, -31, 74, 805, 443, 160, 612, 762, 417, 704, 941, 318, 430, 746, 408, 803, 782, 8, -143, 651, 390, -563, 128, 462, -590, -412, 38, -344, -614, -121, -528, -741, -237, -700, -1010, -279, -244, -1053, -917, -402, -893, -415, 306, -559, -856, 148, -54, -713, 182, 810, 182, 131, 404, 24, 569, 954, 432, 413, 782, 443, 489, 1195, 808, -172, 521, 1097, 103, -134, 559, 464, 19, 92, -329, -450, 138, 355, -343, -212, -447, -683, -117, 102, -1041, -598, 274, -328, -1038, -341, -240, -260, -361, -294, -727, -446, 243, 1, -210, -8, -614, -45, 648, 34, -346, 585, 898, -320, 146, 595, 316, 501, 704, 247, -246, 350, 584, -132, 348, 201, -144, 281, 280, -242, 235, 571, -19, -414, 390, 86, -473, 341, 614, -277, -21, 394, -62, -216, -94, -53, -197, 2, -442, -430, 231, 13, -716, -344]
2554c44L00r81M11Q36m86l17K95k95l1Q70k88n53M92J92j76R8L44m27M10N18o28
2575B40l35Q28J26o81N34O8n31J85L74k75n78O21j80j36l2l36k4P30m38j074M26
2596d88N04l61k79M10m73j1N13j28n57N16N09n35r5K74m69N43L87n62j97Q86k47
2617A40m41P91j13p71N83N34o52k65Q36q6k34O6m86L24O15k77r22L70M89o81M44
2638B64J71o29j3M60k29m69O45m4k82P6K83m30J81L56k34J43o4o47J24P23k23
2659A62p56P80K01r11j15Q91m47j29M37n47n3L45J47k87N15k88n20N17K67o17
2679d08L36N14m75k35M49r1k20M00L15o33k36O88k84J20L54l68r1P54p60p8P50
2700H01k2q22L50M37o44P7N89m08n33K85k37m79N46j23m80M77k49p18K30O24l34
$$ y = [-344, -44, -1025, -614, 222, -264, -581, -286, -581, -612, 258, -30, -583, -91, 101, -75, 23, 367, -60, 350, 868, 240, -95, 733, 859, 178, 712, 780, 249, 434, 808, 533, -45, 576, 396, 260, 228, -108, -132, 598, 160, -914, -488, 16, -345, -624, -214, -687, -698, -185, -313, -870, -354, 155, -380, -475, -201, -670, -127, 260, -302, -499, 387, 140, -301, 490, 377, -394, 189, 723, 71, -194, 642, 556, 322, 388, -98, 226, 841, 564, -358, 12, 501, -180, 264, 435, -194, -207, 253, 24, -445, 200, 156, -126, -50, 233, -197, -16, 340, 106, 249, 185, -462, -338, 385, 162, -594, 186, 387, -524, -639, 252, -195, -324, 113, -434, -487, -142, 5, -282, 233, -55, -575, -58, 209, -408, -72, 442, -33, -268, 181, 90, -130, 270, 585, -48, -284, 404, 120, 240, 594, 226, 135, 889, 129, 51, 801, 779, -43, 307, 744, 100, 177, 766, 358, -175, 110, -127, -606, -60, -183, -663, -186, -435, -1153, -923, -299, -633]
2721f33j65L03m59j89Q76J87p36P53o4l76L09M87%m5M17n21j16N73N7k97N43j41
2743G63p01L66L19m17m9M06l80n29N27k1m01L59k86l34L23q9k71K63M26n35k88
2764e49M43j08k37N68K3n12j10L97n79K68K82Q6l08L11k86k20P98n9o64N12K11
2785B67o96K69Q17o50l1M04j80l07O54j14l01J99K51p98K07O79n96K6M25m93m96
2806d64O39J82o65M53K46q74L9O26l36R9L50m38l50P63k11l56O22J12r06L84L27
2827B42m28K54M81p21l50L92j66j02M19J66o93J27K42m22M24L11k82k61M22l92
2847c37o9Q47J29q15J96K82l22L83M24m14m18M70j64l91N79K66p20K21K19p68
2867d02M59O46m82m55K16k54k19P25R8o16Q5J66m09L10M09l37M0J62n70m74J187
$$ y = [-633, -798, -495, -954, -1143, -267, -80, -816, -63, -127, -503, -194, 293, 293, 248, 665, 144, 28, 601, 658, 361, 904, 763, 62, 428, 747, 330, 281, 687, 307, -222, 305, 284, -117, 242, -44, -378, -55, -144, -415, -152, 274, -261, -549, -106, -214, -451, 117, 140, -372, -482, -85, -664, -396, -114, -28, -336, -25, -311, -531, 267, 208, -456, 56, 267, -429, -160, 657, 7, -24, 380, 200, -107, 547, 433, 132, 331, 582, -216, -9, 670, 74, 100, 525, 32, -464, 175, 357, -308, 145, 391, -483, -444, 182, -154, -55, 295, -143, -493, 270, 59, -297, 325, 437, -469, -85, 242, -186, 68, 549, -172, -522, -130, -296, -398, 21, 187, -506, -379, -137, -559, -135, 176, -106, -367, 55, -337, -406, 441, 570, -245, -49, 233, -89, 294, 718, 304, -114, 356, 192, -199, 380, 646, -74, 147, 366, -402, 57, 703, 221, -234, -18, -272, -491, 234, 332, -284, -199, -33, -442, -132, 277, -60, -20, 142, -428, -902, 285]
2888B85J49p40L80k67k65J32M24k96O7O02p12k35M20k4j43M23m6p70O42M97l24
2909A99o7M61o55j67O34j77j72K53Q7m48K49L16k13RJ60l10k47L19r9m07N31m
2931B52p11L82K27m96M72L06q26j7P26n30l80M02K38k03J20n6o45K57P34m39k28
2952d15L54m5j17L87j34m01N24J93n35Q3J29K02r3M77q85Q3N32K63o84L84J91
$$ y = [285, 434, -306, 74, -193, -458, -326, 98, -198, -131, 471, -241, -476, -56, -80, -223, 200, 154, -616, 26, 523, 199, 132, 593, -62, -229, 405, 228, 56, 309, 396, -52, 197, 513, 300, 309, 469, 159, -88, 231, 132, -275, 256, 252, -459, -77, 150, -346, 126, 432, -394, -411, 315, -215, -595, -193, 45, -158, -38, -94, -739, -482, 252, -187, -415, -61, -106, -223, 164, 30, -371, 153, 346, -189, -106, 23, 225, 132, 609, -276, -193, 339, 602, -82, 302, 493]
$$ [...]
8191i
##END NTUPLES=NMR FID
##END=
