##TITLE=1H_TG-2110-C2
 CDCl3, 8 sc, 
 3.7.2019
##JCAMPDX= 6.0         $$ Bruker NMR JCAMP-DX V2.0
##DATA TYPE= NMR FID
##DATA CLASS= NTUPLES
##ORIGIN= UXNMR, Bruker Analytische Messtechnik GmbH
##OWNER= root
$$ XWIN-NMR		Version 3.5
$$ Wed Jul  3 14:25:32 2019 Russian Standard Time (UT+4h)  she@DPX200
##.OBSERVE FREQUENCY= 200.13155
##.OBSERVE NUCLEUS= ^1H
##.DELAY= (6, 6)
##.ACQUISITION MODE= SIMULTANEOUS
##.ACQUISITION SCHEME= undefined
##.AVERAGES= 8
##.DIGITISER RES= 18
##SPECTROMETER/DATA SYSTEM= spect
##.PULSE SEQUENCE= zg30
##.SOLVENT NAME= THF
##.SHIFT REFERENCE= (INTERNAL, THF, 0, 15.7039)
##AUDIT TRAIL= $$ (NUMBER, WHEN, WHO, WHERE, WHAT)
$$ ##TITLE= Audit trail, XWIN-NMR		Version 3.5
$$ ##JCAMPDX= 5.01
$$ ##ORIGIN= Bruker BioSpin GmbH
$$ ##OWNER= she
$$ F:/spectra/data/she/nmr/H-F/1/audita.txt
$$ ##AUDIT TRAIL=  $$ (NUMBER, WHEN, WHO, WHERE, WHAT)
(   1,<2019-07-03 14:24:13.79 +0400>,<she>,<DPX200>,
      <created by zg, POWCHK disabled, PULCHK disabled
       configuration hash MD5:
       00 E9 B6 7A A2 85 ED C7 34 08 36 98 17 FE 4E 26
       data hash MD5: 16K
       45 AF E4 C5 60 9C 58 6D 0A 26 BA 22 34 FB 82 DC>)
$$ ##END=
$$ 
$$ hash MD5
$$ A1 9D 27 C4 BE 3F 78 B2 BE 97 6B 23 A9 2A 80 2A
##$RELAX= 
##$RELAX= 
##$RELAX= 
##$RELAX= 
##$RELAX= 
##$RELAX= 
$$ Bruker specific parameters
$$ --------------------------
##$DU= <F:/spectra>
##$EXPNO= 1
##$NAME= <H-F>
##$PROCNO= 1
##$TYPE= <nmr>
##$USER= <she>
##$AMP= (0..31)
100 100 100 100 100 100 100 100 100 100 100 100 100 100 100 100 100 100 
100 100 100 100 100 100 100 100 100 100 100 100 100 100 
##$AQSEQ= 0
##$AQ_mod= 1
##$AUNM= <au_zg>
##$AUTOPOS= <>
##$BF1= 200.13
##$BF2= 200.13
##$BF3= 200.13
##$BF4= 200.13
##$BF5= 200.13
##$BF6= 200.13
##$BF7= 200.13
##$BF8= 200.13
##$BYTORDA= 1
##$CFDGTYP= 0
##$CFRGTYP= 5
##$CHEMSTR= <none>
##$CNST= (0..31)
1 1 145 1 1 1 1 1 1 1 1 1 1 1 1 1 1 1 1 1 1 1 1 1 1 1 1 1 1 1 1 1 
##$CPDPRG= <>
##$CPDPRG1= <>
##$CPDPRG2= <>
##$CPDPRG3= <>
##$CPDPRG4= <mlev>
##$CPDPRG5= <mlev>
##$CPDPRG6= <mlev>
##$CPDPRG7= <mlev>
##$CPDPRG8= <mlev>
##$CPDPRGB= <>
##$CPDPRGT= <>
##$D= (0..31)
0 1.2 0 0 0 0 0 0 0 0 0 0.03 0 0 0 0 0 0 0 0 0 0 0 0 0 0 0 0 0 0 0 0 
##$DATE= 1562149453
##$DBL= (0..7)
120 120 120 120 120 120 120 120 
##$DBP= (0..7)
150 150 150 150 150 150 150 150 
##$DBP07= 0
##$DBPNAM0= <>
##$DBPNAM1= <>
##$DBPNAM2= <>
##$DBPNAM3= <>
##$DBPNAM4= <>
##$DBPNAM5= <>
##$DBPNAM6= <>
##$DBPNAM7= <>
##$DBPOAL= (0..7)
0.5 0.5 0.5 0.5 0.5 0.5 0.5 0.5 
##$DBPOFFS= (0..7)
0 0 0 0 0 0 0 0 
##$DE= 6
##$DECBNUC= <off>
##$DECIM= 24
##$DECNUC= <off>
##$DECSTAT= 4
##$DIGMOD= 1
##$DIGTYP= 9
##$DL= (0..7)
0 120 120 120 120 120 120 120 
##$DP= (0..7)
150 150 150 150 150 150 150 150 
##$DP07= 0
##$DPNAME0= <>
##$DPNAME1= <>
##$DPNAME2= <>
##$DPNAME3= <>
##$DPNAME4= <>
##$DPNAME5= <>
##$DPNAME6= <>
##$DPNAME7= <>
##$DPOAL= (0..7)
0.5 0.5 0.5 0.5 0.5 0.5 0.5 0.5 
##$DPOFFS= (0..7)
0 0 0 0 0 0 0 0 
##$DQDMODE= 0
##$DR= 18
##$DS= 0
##$DSLIST= <SSSSSSSSSSSSSSS>
##$DSPFIRM= 0
$$ [...]
##$SUBNAM2= <"">
##$SUBNAM3= <"">
##$SUBNAM4= <"">
##$SUBNAM5= <"">
##$SUBNAM6= <"">
##$SUBNAM7= <"">
##$SUBNAM8= <"">
##$SUBNAM9= <"">
##$SW= 24.9336996594482
##$SWIBOX= (0..15)
0 0 2 0 0 0 0 0 0 0 0 0 0 0 0 0 
##$SW_h= 4990.01996007984
##$TD= 16384
##$TD0= 1
##$TE= 0
##$TE2= 300
##$TE3= 300
##$TEG= 300
##$TL= (0..7)
0 120 120 120 120 120 120 120 
##$TP= (0..7)
150 150 150 150 150 150 150 150 
##$TP07= 0
##$TPNAME0= <>
##$TPNAME1= <>
##$TPNAME2= <>
##$TPNAME3= <>
##$TPNAME4= <>
##$TPNAME5= <>
##$TPNAME6= <>
##$TPNAME7= <>
##$TPOAL= (0..7)
0.5 0.5 0.5 0.5 0.5 0.5 0.5 0.5 
##$TPOFFS= (0..7)
0 0 0 0 0 0 0 0 
##$TUNHIN= 0
##$TUNHOUT= 0
##$TUNXOUT= 0
##$USERA1= <user>
##$USERA2= <user>
##$USERA3= <user>
##$USERA4= <user>
##$USERA5= <user>
##$V9= 5
##$VALIST= <valist>
##$VCLIST= <CCCCCCCCCCCCCCC>
##$VD= 0
##$VDLIST= <DDDDDDDDDDDDDDD>
##$VPLIST= <PPPPPPPPPPPPPPP>
##$VTLIST= <TTTTTTTTTTTTTTT>
##$WBST= 1024
##$WBSW= 4
##$XGAIN= (0..3)
0 0 0 0 
##$XL= 0
##$YL= 0
##$YMAX_a= 586683
##$YMIN_a= -1077731
##$ZGOPTNS= <>
##$ZL1= 120
##$ZL2= 120
##$ZL3= 120
##$ZL4= 120
##$ABSF1= 10
##$ABSF2= 0
##$ABSG= 5
##$ABSL= 3
##$ALPHA= 0
##$AQORDER= 0
##$ASSFAC= 0
##$ASSFACI= 0
##$ASSFACX= 0
##$ASSWID= 0
##$AUNMP= <proc_1d>
##$AZFE= 0.1
##$AZFW= 0.1
##$BCFW= 1
##$BC_mod= 2
##$BYTORDP= 1
##$COROFFS= 0
##$CY= 11.3945322036743
##$DATMOD= 1
##$DC= 2
##$DFILT= <>
##$DTYPP= 0
##$F1P= 18.9103706918063
##$F2P= -1.10871071338519
##$FCOR= 0.5
##$FTSIZE= 0
##$FT_mod= 4
##$GAMMA= 1
##$GB= 0.15
##$INTBC= 1
##$INTSCL= 1
##$ISEN= 128
##$LB= 0.24
##$LEV0= 0
##$LPBIN= 0
##$MAXI= 10000
##$MC2= 0
##$MEAN= 0
##$ME_mod= 0
##$MI= 1.114404
##$NCOEF= 0
##$NC_proc= 0
##$NLEV= 6
##$NOISF1= 3.799351
##$NOISF2= 2.8
##$NSP= 1
##$NTH_PI= 0
##$NZP= 0
##$OFFSET= 15.70392
##$PC= 1
##$PHC0= -8501.648
##$PHC1= 15.20097
##$PH_mod= 1
##$PKNL= yes
##$PPARMOD= 0
##$PSCAL= 0
##$PSIGN= 0
##$REVERSE= no
##$SF= 200.130013532006
##$SI= 16384
##$SIGF1= 3
##$SIGF2= 2
##$SINO= 400
##$SIOLD= 16384
##$SREGLST= <1H.CDCl3>
##$SSB= 0
##$STSI= 0
##$STSR= 0
##$SW_p= 3612.71676300578
##$SYMM= 0
##$S_DEV= 0
##$TDeff= 0
##$TDoff= 0
##$TI= <>
##$TILT= no
##$TM1= 0
##$TM2= 0
##$TOPLEV= 0
##$USERP1= <user>
##$USERP2= <user>
##$USERP3= <user>
##$USERP4= <user>
##$USERP5= <user>
##$WDW= 1
##$XDIM= 8192
##$YMAX_p= 0
##$YMIN_p= 0
$$ End of Bruker specific parameters
$$ ---------------------------------
##NTUPLES= NMR FID
##VAR_NAME=  TIME,          FID/REAL,        FID/IMAG
##SYMBOL=    X,             R,               I
##VAR_TYPE=  INDEPENDENT,   DEPENDENT,       DEPENDENT
##VAR_FORM=  AFFN,          ASDF,            ASDF
##VAR_DIM=   8192,          8192,            8192
##UNITS=     SECONDS,       ARBITRARY UNITS, ARBITRARY UNITS
##FACTOR=    0.0002004,     1,               1
##FIRST=     0,             0,               0
##LAST=      1.6414764,     0,               0
##MIN=       0,             -1077731,        0
##MAX=       1.6414764,     586683,          0
$$ Real data points
##PAGE= N=1
##DATA TABLE= (X++(R..R)), XYDATA
0@%%%qJ7j7J7l3N6o4Q0j09J33j60J98k45K93l48M15m89N75o73P79r02J043j192
26f34J360j556J768j996K252k540K849l185L564l979M427m920N466o060O711p436
42c909Q235r113J0092j1190J2420j3813J5407j7246J9396k1950K5044k8887L3809
55A8295m0370M9620o3748Q8247j42569M66994k32990r00082N93826P45683l2691
66E50215p34590j75527L83792K53752l51904l30732Q0787L14820O9944j15405
76e4848j69078j25365m6006K10052K98548J9938l59706k10370K87729L80671j48344
87H3221l95877R4944N25852Q9644n35159l26599M29365N50057j33188n74376j31092
98c23208M44800K82927k73552l20215J09624K76632P296j79660o2178N0072M069
$$ plain form
0 0 0 0 0 -8 9 -8 9 -24 32 -32 48 -61 72 -88 110 -135 158 -190 225 -264 311 -362 417 -485 558 -634
26 -634 726 -830 938 -1058 1194 -1346 1503 -1682 1882 -2097 2330 -2590 2876 -3184 3527 -3909
42 -3909 4326 -4787 5305 -5885 6535 -7278 8129 -9117 10279 -11671 13373 -15514 18295
55 18295 -22075 27545 -36203 52044 -90525 376469 143479 -756603 -162777 582906 550215
66 550215 -184375 -359902 23890 277642 -74262 -404994 -324207 -9387 60557 -54848
76 -54848 -223926 -349291 -395297 -185245 113303 133241 -226465 -436835 -149106 231565 83221
87 83221 -312656 -217712 308140 397784 -137375 -463974 -34609 515448 382260 -192116 -323208
98 -323208 121592 404519 130967 -189248 -79624 197008 204304 24644 -37534 12538 16607
109A6607K0735J24384K3278k38403j70100K50648L39461j45302m63977p6034M39923
120A21220K92346k93388m48871L2004M13032J42299l16001k50237J71511K49318
130A13233q3816k51997k2461J96902J02407q1698q0983n348j0478K4650J41317
141D1728Q9169j37203j48112J26929K16291o9286k48655K4458L37624J41866l29341
152D5468l45148J72909M48483N7675l93728k43927K13879K76159q2704k76986
162a27920m6619K16152J28843j29130j84709k3679J12118J15987L1981p8813j20645
173a06434k8753J01402J16017n787j06667m3951R5556P7690q8587j12939P3583
184b8870J59938j2608j67404o4361J14092Q6714p4977r2130M8896R2238l5944
$$ plain form
109 16607 37342 161726 185004 -53399 -223499 27149 366610 221308 -242669 -318703 121220
120 121220 413566 120178 -328693 -296689 116343 258642 -57359 -307596 -136085 113233
130 113233 29417 -222580 -245041 -48139 54268 -27430 -108413 -113761 -124239 -99589 41728
141 41728 130897 -6306 -154418 -27489 188802 119516 -129139 -104681 232943 374809 45468
152 45468 -299680 -126771 321712 379387 -14341 -258268 -44389 231770 149066 -127920
162 -127920 -174539 41613 170456 41326 -143383 -167062 -54944 61043 93024 14211 -106434
173 -106434 -135187 -33785 82232 76445 -30222 -74173 21383 99073 10486 -102453 -28870
184 -28870 131068 118460 -48944 -113305 787 87501 12524 -79606 -30710 61528 25584
195B5584j12919k2297Q2774P1726r372o5404n0315J4465N0513L3680P287j3327
207A2395l7329j9419M4652N6012j8381o3825o85P8212M5916o8127r6554J9003
219d8130J14458N0018p0213q6414r795N3079M9523q52l8607k9146M232J9959J1592
232A9704j5262k6106J5671N0624m131p3922l2378N8890N4045k5630m8237L897
244b2835L2097j5016n3644J821P9520M4570o7003r6995l155R1217P0324l7960
256B2941q8101p645P3821L1026n0769l7558L5928N7117J3167m2108n2833K969
268d2045O4393N0143k1286n4412j3857L6031K2504k6031j8846L8155L2550m1556
280B5743o0809J0478O2882K3700m4633n3670R759N9194J6525n8311m9964K9261
$$ plain form
195 25584 -87335 -109632 -26858 44868 35496 -29908 -80223 -65758 -15245 18435 25722 12395
207 12395 -24934 -44353 299 56311 37930 -25895 -26580 51632 97548 29421 -67133 -48130
219 -48130 66328 116346 46133 -40281 -50076 3003 52526 51674 13067 -16079 -11847 8112 19704
232 19704 4442 -21664 -5993 44631 40500 -33422 -65800 -6910 47135 21505 -26732 -22835
244 -22835 9262 -5754 -59398 -57577 21943 66513 -490 -97485 -100640 -9423 60901 22941
256 22941 -65160 -72805 1016 32042 -18727 -56285 -20357 36760 49927 7819 -45014 -42045
268 -42045 22348 72491 51205 -3207 -17064 18967 41471 15440 -3406 34749 67299 25743
280 25743 -35066 -24588 38294 61994 17361 -36309 -26550 32644 49169 -9142 -59106 -29845
292b9845O4768J4879n4831n7757J6602P0089J8427n8148m3038L3538N4591P63
304C0038m9223l7133J7580M4382J9794j2671k4648k3767n525K3287K3741J610
316G465k827j268j9334k3086O767L0308K3222M183j3598k0242j1893k798J0389
329a2712L2199L6346k125m3626m1198n51L8687M2796J1754j2435k0344l6749l6877
342d4835K3987P8838L7063n0182o7386j1941K9683J5193j1396L507L2149O283
354D0963n6119o1230K247N9096N7073L951n8245o4596o026M7172L8732O15j7057
367a3424o618K295j3446k5010J0213N4060L5799k3534m4679j5777K0059L3444
379A3382J5891r475l642J2781l284k8153j0236L2295M2483K004m3753l3495K0640
$$ plain form
292 -29845 34923 49802 -5029 -62786 -46184 23905 42332 -15816 -58854 -25316 29275 30038
304 30038 -19185 -56318 -38738 5644 25438 12767 -11881 -35648 -41173 -17886 5855 7465
316 7465 4638 3370 -15964 -39050 -32283 -1975 21247 25430 11832 -8410 -20303 -23101 -12712
329 -12712 19487 55833 53708 10082 -31116 -31667 7020 49816 61570 49135 28791 -7958 -44835
342 -44835 -20848 57990 95053 44871 -22515 -34456 -4773 10420 -976 2531 34680 40963
354 40963 -15156 -76386 -74139 -15043 42030 45981 -12264 -76860 -82886 -35714 3018 3633 -13424
367 -13424 -20042 -17747 -31193 -56203 -45990 8070 43869 20335 -24344 -40121 -20062 13382
379 13382 29273 19798 16156 28937 25653 -2500 -12736 19559 62042 64046 20293 -13202 7438
392G438L5728n078k7740k901J7361O618j3533k3428j0195J2900J4134m326r672
405b694m324r827j3021p80R465R278L133p507j1650n303R6Q22J1477J5216L147
420b472k302m170j7333j2222K7032M5478J0275l2417l1308M938K8579J2103r022
433A7159M371J8245j0209l7501j2592K5153K5559K663j3213j7868j3937n875K195
446a5850J4042J8089O41j7071j8220j1856L313K6383K5737o382k2416q951M271
459h270O367P666Q123O381M316q568j9780q735J3299J7281P394p147j8999j5033
473a5705o8M877L692Q317J235j4504j5684k859M102R886R825k068p876O18J500
488a4712o477J623J7434J6872M87j7240j4341J0993K3354K812j2097J562Q561
$$ plain form
392 7438 43166 38088 10348 7447 24808 31426 17893 -5535 -15730 -2830 11304 6978 -2694
405 -2694 -7018 -16845 -29866 -30646 -21181 -11903 -8770 -16277 -27927 -33230 -33134 -32312 -20835 -5619 -2472
420 -2472 -4774 -8944 -26277 -38499 -11467 34011 44286 11869 -19439 -14501 14078 26181 17159
433 17159 21530 39775 29566 -7935 -20527 4626 30185 32848 19635 1767 -12170 -18045 -15850
446 -15850 -1808 16281 16922 -149 -18369 -30225 -26912 -529 25208 18826 -3590 -12541 -8270
459 -8270 -1903 5763 13886 20267 24583 16015 -3765 -12500 799 18080 25474 18327 -672 -15705
473 -15705 -15773 -10896 -7204 1113 2348 -12156 -27840 -30699 -26597 -16711 -6886 -8954 -16830 -16212 -14712
488 -14712 -21189 -19566 -2132 14740 15227 -2013 -16354 -5361 17993 20805 8708 10270 18831
501A8831n773j0075J61Q491P917O36q395r174k487K184R351R030p666j4819N747
516C959J4286p313j4281Q085J6852q28j6826j0899N574J1892k006j1984l669N49
530f609o632n391J446l925n649J594n83p615m576K073M008O755L187m446p40J0086
546a7017P820L194Q205Q813L514L317M192L249P072P386L042Q71k90q172n137
561C0059O797L287r799r048l093n383r596q732m448L397K275j2806j5187j114
575c3391L552L18N627N058p199q453O906J0742J591n67P423J2301K208j3176q547
590a5607J5472J9682j7j0321n493l575R97P600K6p034J965N802n739j3438n827
605a5507R172J8375N298j5995j5120O289J4567M789j971j012J850M925o38r832
$$ plain form
501 18831 13058 2983 3144 11635 19552 20188 11793 2619 132 2316 11667 20697 13031 -1788 3959
516 3959 18245 10932 -3349 4736 21588 20760 3934 -6965 -1391 10501 8495 -3489 -7158 -6609
530 -6609 -13241 -18632 -17186 -21111 -26760 -25166 -25749 -33364 -37940 -35867 -31859 -25104 -21917 -26363 -27103 -17017
546 -17017 -9197 -6003 2202 11015 14529 17846 22038 25287 32359 39745 42787 43658 43368 35196 30059
561 30059 36856 40143 30344 21296 18203 12820 3224 -5508 -9956 -6559 -4284 -17090 -32277 -33391
575 -33391 -29839 -29521 -23894 -18836 -26035 -34488 -27582 -16840 -15249 -15816 -8393 3908 6116 -7060 -15607
590 -15607 -135 19547 19530 9209 3716 141 1138 8738 8764 1730 3695 9497 3758 -9680 -15507
605 -15507 -6335 12040 17338 1343 -13777 -7488 7079 11868 9897 8885 10735 15660 15022 5190
619E190m292J0146J2724M03j4937j9807j752K0695R112k0859j8563J0216J4867
632C143o457k0772q396J7935K1639o347k4408l364J9616J1707n241o919K553J0693
646E382R462l532j0815n812O853J7295J1003j8088k8441M448K7864n17k8314q031
660b1243K2166J2619j9267l0014j814K9321K1596j0405k1297n816Q322J3214Q833
673F215k02l61P845N104p825p913L222J7475K2132J121k9966k6893R644K8410
687B8008J0929j4908k2467q234R353J893j8409r872J8415J9169j5099l6789j6974
700e4985K2190L4702N180k5925j9310N024J4722J0164m84o190N993J6658j111
713F628k2295r563K2295L2131Q998k8399l5101P314M4887J8532l1179k7764J6036
$$ plain form
619 5190 898 11044 23768 24171 9234 -10573 -12325 8370 17482 -3377 -21940 -11724 3143
632 3143 -3314 -24086 -32482 -14547 7092 745 -23663 -27027 -7411 4296 -945 -7864 -5311 5382
646 5382 14844 11312 497 -5315 1538 18833 29836 11748 -16693 -12245 15619 15102 -13212 -21243
660 -21243 923 13542 -5725 -35739 -37553 -8232 13364 2959 -18338 -24154 -15832 -2618 6215
673 6215 6013 5652 13497 18601 10776 2863 6085 23560 45692 46813 16847 -10046 -402 28008
687 28008 38937 24029 1562 -6672 2681 4574 -13835 -23707 -5292 13877 -1222 -38011 -54985
700 -54985 -32795 1907 7087 -18838 -38148 -33124 -18402 -8238 -8722 -14912 -8919 7739 6628
713 6628 -15667 -25230 -2935 29196 38194 9795 -25306 -17992 26895 45427 14248 -13516 2520
726B520L0152n553l4164p743L5437K5556k5014l6917k99K7934J9898o139k4777
739H91j7844J1195K2475K695j9551j6471O251J9909J638k8740j8552K6129L1645
752B1670j5163m3971j1043L4359L2186j2511l6350p495K5720J6455r892j1772
764a7807M871J4502P997j1731j7124O849K7900J3903j2513k0354r089J1793K4933
777B4130R868j8472j8862M308J4575J441j2585n643J3866J4387j3451k8508o130
790b1076K4002K3753l709k8759k0285J3532K5041j531j7976j873J0760J842q413
803d692q485l48J2450J4500l678k1180j5251Q936K5674J1761k1309k5095Q642
816a8075K5940J65k3733p419K2627K0290j4514l3600j224L6688J9121k0276k3283
$$ plain form
726 2520 32672 27119 -7045 -14788 20649 46205 21191 -15726 -16025 11909 31807 25668 891
739 891 -16953 -5758 16717 19412 -139 -16610 -10359 9550 11188 -17552 -36104 -9975 21670
752 21670 6507 -37464 -48507 -14148 18038 5527 -30823 -38318 -12598 3857 -6035 -17807
764 -17807 -12936 1566 9563 -2168 -19292 -12443 15457 29360 16847 -3507 -12596 -803 24130
777 24130 33998 15526 -3336 972 15547 16988 4403 -1240 12626 27013 13562 -14946 -21076
790 -21076 2926 26679 22970 -5789 -26074 -12542 12499 10968 -7008 -8881 1879 3721 -4692
803 -4692 -13177 -13525 -1075 13425 9747 -11433 -26684 -17748 7926 19687 -1622 -26717 -18075
816 -18075 7865 8030 -15703 -23122 -495 19795 5281 -28319 -29543 7145 26266 5990 -17293
829a7293K840J5825J0091k004j1734l450J2434R836q136j4955J30J8737J5134
842B7455j1588k5087k353K3581J3820j2084j8673k66J7152Q964j7575j8496J1860
855c290K3666k549k3433j1949Q513J6077N272j3024j5145K917J3380O57j1981
868a0889p199Q446J3409k692j9503q540J5497J5899r27j1752r186R89J2142Q640
882D334n529p054M088P162J851n241p806N000K0240Q510k0055j9580Q966K3953
896A8839P963j3045j4039L137J1220j131q588l89Q400O305l538j5023j5317P738
910g468K6237P754k1680k2474j616J5130J4026m544j4845k978R775N5j4469p473
924b4570J3348K0765K506k5754k4224Q544L0728J4807j3703k0864l488J5334R641
$$ plain form
829 -17293 -14453 1372 11463 9459 -2275 -5725 6709 16545 8409 -6546 -6416 12321 27455
842 27455 15867 -9220 -11573 12008 25828 13744 -4929 -5195 11957 20921 3346 -15150 -3290
855 -3290 20376 17827 -5606 -17555 -9042 7035 12307 -717 -15862 -12945 435 1092 -10889
868 -10889 -18088 -9642 3767 1075 -18428 -26968 -11471 4428 3501 -8251 -17437 -16448 -4306 4334
882 4334 -1195 -8249 -4161 3001 4852 -389 -8195 -3195 17045 25555 5500 -14080 -5114 18839
896 18839 26802 13757 -282 2855 14075 12944 4356 3967 12367 18672 15134 111 -15206 -7468
910 -7468 18769 26523 4843 -17631 -19247 -4117 9909 5365 -9480 -12458 -2683 -2628 -17097 -24570
924 -24570 -11222 9543 12049 -13705 -37929 -29385 1343 16150 2447 -18417 -21905 -6571 3070
937C070j0451o424J8253J5408j2534k3525l462J9214K3024N788j7195j8878j309
950i021J4309J4968M174j0757r982N289P100q310j1100R088K1477K784k5965k6500
964b2446Q259L2304R660k2533j9170J944O305J681J355r03m465k348p15l053l921
979a8046R95R294J0830o501k2079p782K0941K3349o65k0031j4043Q609J9178N431
993I480q499m26Q840j119r968l112R484J5692R011j0444k1994p860J3838J9479
1007B2402R425r010k1077j1371O967J1986M512j271k986m171p617j2615n375J7569
1021b632K4038j448k7257k3634n19K0926K1235M92j5846j0865k013j624L394J2346
1035c407R847L83o356j3106j1960M130K2813K3331j255k8582k4079J1235K9040
$$ plain form
937 3070 -7381 -13805 4448 19856 7322 -16203 -19665 -451 22573 28361 11166 -7712 -9021
950 -9021 5288 20256 24430 13673 3691 8980 16080 7770 -3330 5758 27235 30019 4054 -22446
964 -22446 -14187 18117 27777 5244 -13926 -11982 -5677 -3996 -2641 -3544 -8009 -10357 -11072 -14125 -18046
979 -18046 -17051 -7757 3073 -3428 -25507 -33289 -12348 11001 10336 -9695 -23738 -15129 4049 9480
993 9480 981 555 9395 8276 -1692 -4804 4680 20372 29383 18939 -3055 -10915 2923 22402
1007 22402 31827 22817 1740 -9631 -2664 9322 13834 12563 9577 5406 -2211 -14826 -20201 -2632
1021 -2632 21406 19958 -7299 -30933 -31452 -10526 10709 11201 -4645 -15510 -17523 -19147 -15753 -3407
1035 -3407 6440 6823 467 -12639 -24599 -20469 2344 25675 24420 -4162 -28241 -17006 12034
1048A2034R642j2316n608M246j251r103n882R489K0434P939j7830k3478n562J4880
1062b366K0575Q027j6030k2782k050J5477Q945p633q615L503R172l590j8135o572
1076b2074J8709J8302o382k0218j1447Q180J9968Q645j3806j4402L062J2721N818
1089G076m617o998Q42J1180L503j2308q830J0061J7014K994j6296j8466L339K2904
1103A1398J2348j2249k0321n853J1637J4166l319j7025l463J6880O795j8567j7956
1116b5529Q677K5003J1433j7923k6673k019K3938J8894m478j6787q954J0263J5047
1129A0892k337j6284J71K1130J2175j5475k5379j432K7384K2389j3999k9004l478
1142a3247J9123J0012r415j1004J147J1497L815j3495j4409L438J7425J1127p601
$$ plain form
1048 12034 21676 9360 3752 7998 6747 -2356 -8238 1251 21685 29624 11794 -11684 -17246 -2366
1062 -2366 18209 26236 10206 -12576 -14626 851 9796 2163 -6452 -2949 6223 2633 -15502 -22074
1076 -22074 -3365 14937 8555 -11663 -23110 -14930 5038 13683 -123 -14525 -11463 1258 7076
1089 7076 2459 -4539 -3697 7483 10986 -1322 -10152 -91 16923 19917 3621 -14845 -11506 11398
1103 11398 23746 11497 -8824 -14677 -3040 11126 7807 -9218 -12681 4199 10994 -7573 -25529
1116 -25529 -16852 8151 19584 1661 -25012 -27031 -3093 15801 11323 -5464 -14418 -4155 10892
1129 10892 8555 -7729 -7558 13572 25747 10272 -15107 -16539 10845 33234 19235 -9769 -13247
1142 -13247 5876 15888 6473 -4531 -3384 8113 11928 -1567 -15976 -12538 4887 16014 8413
1155H413k1227j0884J4385K1622j392j9214q713J0892J3326l931j7858m956J9686
1168A49J6029j1714k2588m495J4103J7094K786j4222j4549L524J4505P444n748
1181B318j0112J699J5020O023j4326j3988R977K3006Q889j4457k2134j439K2551
1194A3027J7329j0730j8768L15J3184L379j4095j1893R364K1056j280k7403j8897
1207b5412J0019K1713P243j3414j8776l516J0643O657o037o956L061J1214M526
1220I65j5402k0351Q010L2572J4961j9756k5591k70K0931J6755m653j0981K248
1233e62P858j693o436Q32P518Q038M290m431j1999o817O124J6155J0240r138j9192
1248G87l003J4348O476q274n357M257L100m580r344m284O525P218l683j0794o350
$$ plain form
1155 8413 -12814 -23698 -9313 12309 10917 -8297 -17010 -6118 7208 3277 -14581 -19537 149
1168 149 16178 4464 -18124 -22619 -8516 8578 11364 -2858 -17407 -13883 622 8066 2318
1181 2318 -7794 -6095 8925 14948 622 -13366 -3389 19617 28506 14049 -8085 -9524 13027
1194 13027 30356 19626 858 1173 14357 17736 3641 -8252 1112 22168 20888 -6515 -25412
1207 -25412 -15393 6320 13563 149 -18627 -22143 -11500 -4843 -10880 -17836 -14775 -3561 965
1220 965 -14437 -34788 -26778 5794 20755 999 -24592 -24862 -3931 12824 8171 -2810 -562
1233 -562 7296 5603 -833 -1 7517 15555 19845 15414 3415 -3402 2722 18877 29117 19979 787
1248 787 -2216 12132 18608 10334 4977 9234 12334 7754 -1590 -5874 651 7869 4186 -6608 -12958
1263a2958Q84N353L569q019j1676J812J1787L532j0213j1380J897J4191P766j0644
1277a4099j1340J0194J7030J158j4960r656J2064K6493J0778j8917k2244N237
1289h262K3967J4484n890j1985j186P356O6q803q56J2076R804m233j5638j6339
1303e439k026J5494J5059j624j4646j5457q168M253R774M469M18j937j0827j5424
1317b6081l549J1509J4102N680o294j3848r597r4R086J4180Q952o294j2098k890
1331a7236L430J410N933J3485R893m965j8246j2493J1463K6667J2375j2019j5999
1344C698k451P094P854J502m524O95Q052j66j3625j2888L496J8896J1247j3561
1358A5319k3318m058J4159O332o724p147m17L472K90p842p717L789R352N70o482
$$ plain form
1263 -12958 -12074 -6721 -3152 -11171 -22847 -21035 -9248 -5716 -15929 -27309 -25412 -11221 -3455 -14099
1277 -14099 -25439 -15245 1785 2943 -12017 -21673 -9609 16884 27662 8745 -13499 -8262
1289 -8262 15705 30189 24299 12314 11128 18484 18550 9747 8891 20967 30771 26538 10900 -5439
1303 -5439 -7465 8029 23088 21464 6818 -8639 -16807 -12554 -2780 1689 2107 170 -10657 -26081
1317 -26081 -29630 -18121 -4019 1661 -4633 -18481 -28078 -28172 -19086 -4906 4046 -2248 -14346 -17236
1331 -17236 -13806 -12396 -6463 7022 16915 11950 -6296 -18789 -7326 19341 31716 19697 3698
1344 3698 1247 8341 16195 17697 13173 13868 21920 21754 8129 -4759 -1263 17633 28880 15319
1358 15319 -7999 -12057 2102 8434 1710 -5437 -5854 -2382 -2092 -9934 -17651 -13862 -4510 -3940 -10422
1373a0422n056J165M323J070n213j980Q456P633l519q886l310O012R345M271m375
1388d86k082K672q1j558K939M364J456L525L414n202r187j474R324J3744M359
1403B5727j2563j5360r08J1507Q904m98p644o356J216L323m996p794K442J0924
1417G924N891r683j9686q642J5374J8838l848j6657o497M034L863o83j967K606
1431i133O848K64r965p172M492J1169P778k457r128k835P450L818l005M02P224
1446E750N431l317q817n673R263J4243J009j0721o277K184M794K932p11l701p22
1461E667K807k2m552m251o5N481N158m415j0303l472L980M411J743j690o317m033
1477i873L212L491p28j664j637Q15M445n83q735j236J0448P779n279r241j260
$$ plain form
1373 -10422 -15478 -14313 -9990 -8920 -14133 -16113 -7657 -24 -3543 -12429 -15739 -9727 -382 3889 -486
1388 -486 -2568 104 23 -1535 1404 5768 7224 10749 14163 8961 -226 -1700 7624 21368 25727
1403 25727 13164 -2196 -3104 8403 17307 16809 9165 2809 4025 7348 2352 -5442 -3000 7924
1417 7924 13815 4132 -15554 -24196 -8822 10016 6168 -10489 -16986 -12952 -9089 -9772 -11739 -9133
1431 -9133 -2285 -2021 -11986 -19158 -14666 -3497 4281 1824 -7304 -10139 -2689 1129 -1876 -1474 5750
1446 5750 11181 7864 -953 -6626 2637 16880 17889 7168 891 3075 7869 10801 10090 6389 5667
1461 5667 8474 8452 3900 -351 -416 5065 10223 5808 -4495 -7967 -3987 424 2167 477 -5840 -9873
1477 -9873 -6661 -3170 -3898 -5562 -7199 -6384 -1939 -2522 -11257 -12493 -2045 5734 455 -8786 -10046
1492a0046P551O643k855m675K216N598j585n085j460L847P796L326q764j0492
1506g985L961J1303K564o551n456J132N197J605p953m685P211Q413j587r297p186
1521i314K526J0617O664n603q888J24N190L609j687l894K863Q541o88j1337m163
1536e440Q157O723j388l507k854j871q55j036k17K612R12m637l464k398l116l63
1552a2742N309L726k672n806l750K033N459J181j799M440O015l955o178J820P733
1567H14O014L721M46l975l529J105M962O001K254l282k617j62l038m585K611P311
1583A4051K995m832j0330p552K881O747R44k057r50l759o896k729J726L416N405
1598i40K319p726r872k725N131O124L749k060m231k025k634k329L603P343M383
$$ plain form
1492 -10046 -2495 4148 1293 -3382 -1166 4432 2847 -2238 -3698 149 7945 11271 2507 -7985
1506 -7985 -4024 7279 9843 3292 -2164 -1032 4165 5770 -2183 -6868 343 8756 7169 -2128 -9314
1521 -9314 -6788 3829 10493 4890 -3998 -3874 1316 4925 3238 -656 2207 10748 10060 -1277 -5440
1536 -5440 2717 9440 8052 4545 1691 -180 -1035 -2071 -2288 324 1236 -3401 -6865 -9263 -12379 -12742
1552 -12742 -7433 -3707 -6379 -12185 -15935 -13902 -8443 -7262 -9061 -4621 1394 -2561 -8739 -6919 814
1567 814 6828 10549 10995 7020 3491 4596 9558 15559 17813 14531 11914 11752 8714 4129 6740 14051
1583 14051 17046 12214 1884 -5668 -2787 3960 4904 2847 1897 -1862 -8758 -11487 -9761 -6345 -940
1598 -940 1379 -6347 -16219 -18944 -13813 -7689 -3940 -6000 -10231 -12256 -14890 -17219 -13616 -6273 -1890
1613a890N18m208o862P1Q436Q583L495J335j508l799J27M018N058N482N472j211
1629B3117p114m904J079L744M446R51m334n238n943n253k430J336K286J216l886
1644i27j2057j1294K004R493K731l330k240j917k531k213J622Q154J0795K176
1658D66o310m555J176L399P130R856L847m696p360k962M031N703K655J558J978
1673A5916n927j3216l592J1035Q549l523n341k762j285l249k907M121J0304L826
1687A1949q803q619J032L476K297M062M740j224q432q124J853J0355L861q237
1701A86m186L549n80o982l452L953N241J900l653o495k098K064L277N635L109
1716A468l220n497K234O631J001l106L56P235N268n566j0510R57J1171L136p420
$$ plain form
1613 -1890 -1372 -5580 -12442 -12371 -3935 4648 8143 9478 7970 4171 4298 8316 13374 18856 24328 23117
1629 23117 16003 11099 12178 15922 20368 21319 16985 11747 5804 551 -1879 -543 1743 2959 -927
1644 -927 -12984 -24278 -22274 -12781 -10050 -13380 -15620 -17537 -20068 -22281 -20659 -12505 -1710 466
1658 466 -5844 -10399 -9223 -5824 1306 11162 15009 10313 2953 -9 4022 9725 12380 13938 15916
1673 15916 9989 -3227 -6819 4216 12765 9242 3901 1139 -146 -3395 -6302 -2181 8123 11949
1687 11949 3146 -5473 -4441 -965 1332 5394 10134 8910 478 -7646 -5793 4562 8423 186
1701 186 -4000 -451 -1031 -8013 -11465 -7512 -2271 -371 -4024 -10519 -12617 -10553 -7276 -1641 1468
1716 1468 -1752 -7249 -5015 1616 2617 -489 -133 7102 12370 6804 -3706 -2749 8422 11558 4138
1731D138l587L455J103o534o661L172J1015K655j2538r275O467Q226j994m423
1745d781K622O837Q55o136l931M846P764J912P03l27n508n808L803Q942K190o314
1761G669o520j724K341k093n170J491N289l232j1075k806N613J088m039N20N385
1776g263J759q664o957R033J5194O20j1134k074R672N197k696j882M650P817l67
1791A2905q008k913P084N494k462k794j082j102j142n5j046q4J042N6l207m947
1807b261k788L981P808q17j0508m862N440O423j673n845j947N938M814p418r827
1822a3542L597J1730K369r083o509K189N187k35l722J800O786j266r437l298Q235
1837e199Q318M21n221k854L444L813j305o78N955M609k556m872k002J321N156
$$ plain form
1731 4138 551 4006 5109 -1425 -8086 -4914 6101 8756 -3782 -13057 -6590 1636 -358 -4781
1745 -4781 -2159 4678 5533 -603 -4534 312 8076 9988 10691 10364 4856 -952 2851 11793 13983 7669
1761 7669 1149 -575 1766 -327 -5497 -4006 1283 -1949 -13024 -15830 -10217 -9129 -13168 -12648 -7263
1776 -7263 -5504 -14168 -21125 -12092 3102 3722 -7412 -9486 186 5383 2687 805 5455 13272 12905
1791 12905 4897 1984 9068 14562 12100 9306 8224 7122 5980 5925 4879 4795 5837 5893 2686 -2261
1807 -2261 -5049 -1068 6740 5923 -4585 -9447 -4007 2416 743 -5102 -7049 -1111 3703 -3715 -13542
1822 -13542 -9945 1785 4154 -4929 -11438 -9249 -4062 -4297 -8019 -6219 567 -699 -10136 -13434 -5199
1837 -5199 3119 3540 -1681 -4535 -1091 2722 1417 739 6694 11303 8747 3875 1873 3194 8350
1852H350N809n20o467m523l9L094J942q79j236Q01k657q034k893P470O321l335
1868C204p909l303L837K228m426l338P114O977n749j2135j104R023Q344j148q484
1883f869m382M849N564k053m109R95N314K870l796o025J095Q325L494n374l633
1898c735M495N310j8n455k428O559P051k561p182R05O277L4m751k596M017O876
1914A2798n49r861p302M657P170J057m536m881P0J605m265n999M447J0885R5j2016
1930f625r747J950R414N681l132m594J429K39o416l384Q225J2341K460r322j1763
1945a3244j034J1023R757N59l824j691n09j330k412K282R811R767n361j5235o164
1960g605Q211J0861L531m795n661q09j002m001j535P686P603l290j2221q690K754
$$ plain form
1852 8350 14159 13639 7172 2649 2610 5704 7646 6767 5531 6332 3675 -4359 -7252 218 6539 3204
1868 3204 -4705 -8008 -4171 -1943 -6369 -9707 -2593 4384 -1365 -13500 -14604 -5581 2763 1615 -6869
1883 -6869 -11251 -6402 -838 -2891 -7000 -6005 -691 2179 -1617 -7642 -6547 1778 5272 -102 -3735
1898 -3735 760 6070 6052 597 -1831 4728 11779 9218 2036 2941 9218 9252 4501 1905 5922 12798
1914 12798 12249 2388 -4914 -257 6913 7970 3434 -1447 -1377 228 -4037 -10036 -5589 5296 5391 -6625
1930 -6625 -16372 -14422 -5008 673 -2459 -7053 -5624 -5385 -11801 -15185 -6960 5381 7841 -1481 -13244
1945 -13244 -14278 -3255 6502 7061 3237 1546 1037 -293 -2705 -423 9388 19155 13794 -1441 -7605
1960 -7605 606 11467 14998 10203 4542 3733 2731 -1270 -2805 4881 12484 9194 -3027 -11717 -8963
1975h963R786M900n369m723J20m43l268j542M625P965J625q864r272M116J2073
1990B766K188p103l179N190M000l131n801R16R268L447p809p141L212P955J724
2005F502o247o003K678P871Q38q155l884M510N232j642n902j462P799N832p204
2020G63j0903L031J3240N025p560q412J213P422K385m819j148O747L562n966p631
2035c051k67P656P791j574q746n091K356K223L94L4R26K0l705o886m224P046R547
2052D449k875j0195m228L927M541k184l879L002Q293r47j1162n330R145J2511
2066E068J538q146o806M266Q402J119m810J469P341K451o688o566K922J0657N786
2081A8003p729r787K362Q127Q08o742l458M150O128m374j0983k867Q851O455m401
$$ plain form
1975 -8963 823 5723 354 -4369 -4249 -4692 -7960 -9502 -4877 3088 4713 -4151 -13423 -9307 2766
1990 2766 4954 -2149 -5328 -138 3862 731 -5070 -4154 5114 8561 752 -6389 -3177 4778 6502
2005 6502 255 -5748 -3070 4801 5639 -2516 -6400 -1890 3342 1700 -4202 -5664 2135 7967 763
2020 763 -10140 -7109 6131 11156 3596 -4816 -3603 3819 6204 1385 237 6984 10546 4580 -3051
2035 -3051 -3318 4338 12129 10555 1809 -3282 -926 1297 1691 1725 2651 2671 -1034 -7920 -12144 -5098 4449
2052 4449 1574 -8621 -12849 -8922 -4381 -6565 -10444 -7442 851 -96 -11258 -16588 -7443 5068
2066 5068 6606 -1540 -8346 -4080 4322 5441 631 2100 9441 11892 5204 -1362 1560 12217 18003
2081 18003 10274 487 2849 10976 11784 5042 1584 5734 11862 7488 -3495 -6362 2489 8944 4543
2096D543r759m467M609O239k238q888r14O299J370o535m994K954O379Q58n513
2111a0057l199M143L907k573j418M680N121j316m991J72Q018P051k822n402J618
2126B932P224J988k410j448J883L547J774m854n523K126O184q4o749o172L97M670
2142E485q69q289m221O245L712o984j0528M85J0930N948q173j2287K704J3527
2156b315M076r621n965O476J0355J044q878o265P896J2677o35j0989n610O451
2170a303Q983P02q002m754M504N306k346m976K35L728K221l334l960K056N312
2185D372J596m311j757L084K588p83r22l10K323J217k886l839K161M181l18n164
2201A232m165O07K458r48l152J011K458l305p562o63Q190N772l390q425k604P086
$$ plain form
2096 4543 -5216 -9683 -5074 1165 -1073 -9961 -10875 -4576 -3206 -9741 -14735 -11781 -5402 -4544 -10057
2111 -10057 -13256 -9113 -5206 -7779 -9197 -4517 604 -712 -5703 -5531 2487 9538 6716 1314 2932
2126 2932 10156 12144 9734 8286 10169 13716 15490 10636 5113 7239 13423 13339 6590 418 815 5485
2142 5485 4616 -3673 -7894 -1649 2063 -4921 -15449 -14964 -4034 1914 -6259 -18546 -15842 -2315
2156 -2315 1761 -7860 -13825 -7349 3006 4050 -4828 -11093 -3197 9480 8845 -2144 -7754 -1303
2170 -1303 7680 8382 380 -4374 130 5436 3090 -1886 -1651 2077 4298 964 -2996 -940 4372
2185 4372 5968 1657 -100 2984 5572 4789 3867 3557 5880 7097 4211 372 2533 6714 6396 1232
2201 1232 -2933 -2326 132 -816 -3968 -2957 -499 -3804 -11366 -12029 -3839 1933 -1457 -9882 -12486 -5400
2217e400P140k551n436K423P412Q70o718n337M374J1471M904r473j1920L30J0596
2232B685P457m796r557q05P136J541p932l273Q068P810k370j0106n231O771J1183
2247H581J814p218l115L819K834r12k048J914N396J692p534p924J341Q040L091
2262I771n143q292k971K403J236l247j580J695j363m393j794J964K169R47K23
2277h375n2J643J74j447K194P355M204l325m823J532P428O065j391o532o30N126
2293I146L549k282m920o47M016K534o068p802J613Q491R10q262p522R53P494L210
2309D413n660o710J940O126l34n522k089N271O663k354r742l566Q542Q671k330
2324C319q656l983M278N981n15o077m4N993R11m676l426K722N253L332j476m276
$$ plain form
2217 -5400 1740 -811 -6247 -3824 3588 4458 -2260 -7597 -3223 8248 13152 3679 -8241 -7911 2685
2232 2685 10142 5346 -4211 -5016 2120 3661 -4271 -7544 524 8334 5964 -4142 -9373 -2602 8581
2247 8581 10395 3177 62 3881 6715 5803 3755 5669 11065 12757 5223 -2701 -1360 6680 9771
2262 9771 4628 -3664 -6635 -4232 -2996 -6243 -7823 -6128 -7491 -11884 -13678 -11714 -9545 -8598 -8375
2277 -8375 -8427 -6784 -6610 -8057 -5863 1492 5696 2371 -2452 -920 6508 12573 11182 4650 4020 9146
2293 9146 12695 10413 5493 4846 8862 11396 5328 -2474 -861 7630 8540 278 -7244 -6291 1203 4413
2309 4413 -1247 -7957 -6017 109 -225 -5747 -7836 -2565 4098 1744 -7998 -11564 -3022 5649 3319
2324 3319 -5337 -9320 -5042 939 424 -5653 -5697 296 1207 -3469 -6895 -4173 1080 4412 2936 -1340
2340a340j836L197L935K487m95k456o20J403J39j98J927R11j556k421n04k1m76
2357B076j53%N5r05n145l028M081N176k185o484j654M216L103k134l610K027N777
2374A213l7n837j971M853N749Q74m706m030K324O427J067n112k657K254L752n33
2390C630m193l716L740N534j233p154k075L946M556n8m676l181L160L962j247
2405I95k835R8K056K178l61l622j065M168K685k694k313P13J353M68l26o44l0
2422H24P86j336j170J497Q04j184j016J006N90p02j250n14K197K118k173l592
2438c115Q98L180J073j710k217n86K306K536k437l851J169M307J109l718m118
2453e174J342M883K203l987l731J900L564Q41k155k853J254M022R66m173k439
$$ plain form
2340 -1340 -3176 21 3956 6443 5948 3492 2872 4275 4414 4216 6143 7054 5498 3077 2573 2552 2076
2357 2076 1923 1923 1978 1073 -4072 -7100 -3019 2157 -28 -6512 -8166 -3950 -847 -2981 -6591 -4564 1213
2374 1213 1176 -4661 -6632 -1779 3970 4844 138 -3892 -1568 4859 5926 814 -1843 411 4163 3630
2390 3630 -563 -4279 -539 4995 3762 -3392 -5467 -1521 3035 2977 -1699 -4880 -1720 2242 995
2405 995 -1840 -1742 314 2492 2131 -1491 -2556 1612 4297 1603 -710 3 1356 1824 1498 854 824
2422 824 1610 274 -896 601 1405 221 -795 211 801 99 -1151 -1665 532 2650 477 -3115
2438 -3115 -2217 963 2036 326 -1891 -2477 -171 2365 -72 -3923 -2754 1553 2662 -1056 -5174
2453 -5174 -3832 1051 3254 -733 -4464 -2564 1000 1841 -314 -3167 -1913 2109 3075 -1098 -3537
2468c537K692L679J068k601l823N14N219J451m297k242L090L458j771l460o73
2483a233L244K759j829k977M76J141j66N46K23j034j250J22O52o5j030j735O59
2500a497K228q30m713n89L700J187k231k080k3J591P21o90p98R58L86K85Q13M54
2518a128q42m11L228J602j175j838L61L563L046k947m009K287N528J21m887j917
2534E82K741L583n01m516j613L308K174l455l310M49K559N71k317k452p71J409
2550a559L94n94p36q88j592M23K053j494j892J188K259l18k975j700K717M187
2566e27J14l808m04L684J400k383K28L048K684j025k594J04L756J498j530J19
2582D364K248j284k687J189K468k8j061j661j40N84j972j910J291K229j674l916
$$ plain form
2468 -3537 -845 2834 3902 1301 -2522 -2008 3211 4662 365 -1877 1213 4671 2900 -560 -1233
2483 -1233 2011 4770 2941 -36 440 1581 1415 1961 2184 1150 -100 22 674 609 -421 -2156 -1497
2500 -1497 731 -99 -4812 -5401 -1701 -514 -2745 -4825 -4848 -3257 -2536 -3226 -4024 -3066 -2680 -2395 -1582 -1128
2518 -1128 -1970 -2381 847 2449 1274 -564 -203 3360 6406 3459 -550 1737 7265 7386 2499 582
2534 582 3323 6906 6405 1889 276 3584 5758 2303 -1007 -558 2001 2572 255 -2197 -2968 -1559
2550 -1559 -1165 -1759 -2495 -3383 -4975 -4552 -2499 -3993 -5885 -4697 -2438 -2756 -5731 -7431 -4714 -527
2566 -527 -413 -4221 -4625 -941 459 -1924 -1696 1352 4036 3011 417 521 4277 5775 4245 4364
2582 4364 6612 5328 2641 3830 6298 6270 5209 3548 3408 3992 2020 110 1401 3630 1956 -1960
2598a960j089J547k86j285p43O97P12j762k227N84J791M7n93J202J81j796J65
2615d815J804J267R18l72l16P23J095k79m80K224J998o0j442q61L25K004J418
2632E151j267k11K79p96j569M42M39L93J00p51k588j75N65k51m2R49n41j647r93
2651b513L71L43O79J247q32r15q36m65J649J852q01j835J189P91j013o05N89Q47
2669b58J488q8k306j227R21J725k30Q8j94j293L02R37p45k43J117Q12R0j540p86
2688a430J105K236K32k292O47J399l38j231O98N22N57K55j42j317k56K38L65O15
2706A863j99j662L22J457n56j893k16J700J080j034k303n89K190R42j844o09R95
2723c56J15j461j31R98j71j00n15o30N02j01j014Q4J443k3j140m2L19M49N31K95
$$ plain form
2598 -1960 -3049 -1502 -1788 -3073 -3816 -3119 -2407 -4169 -6396 -5812 -4021 -3974 -4567 -3365 -3184 -4980 -4815
2615 -4815 -3011 -1744 -826 -1198 -1514 -791 304 25 -455 1769 3767 3707 2265 1404 1729 3733 5151
2632 5151 3884 3673 3952 3156 1587 2029 2468 2861 2961 2210 -378 -553 12 -239 -281 668 127 -1520 -2513
2651 -2513 -2142 -1799 -1120 127 -705 -1620 -2456 -2921 -1272 580 -221 -2056 -867 -76 -1089 -1694 -1105 -258
2669 -258 1230 1142 -1164 -2391 -1470 255 25 113 -81 -1374 -1072 -135 -880 -1123 -6 806 896 -644 -1430
2688 -1430 -325 1911 2143 -149 498 1897 1559 328 1026 1548 2105 2360 2218 901 645 883 1248 1863
2706 1863 1664 2 324 1781 1225 -668 -884 816 1896 862 -1441 -2030 160 1102 -742 -1351 -356
2723 -356 -241 -1702 -1833 -835 -1006 -1106 -1621 -2251 -1749 -1850 -2864 -2780 -1337 -1360 -2500 -2542 -2223 -1774 -1243 -948
2743i48O81N72l19o00N85K109O24n87O86l49j70O12J382J6m32M4r73M6N34o24
2763B889q69j35N11q06j228j278k93J283L59k658j912J030J163k57j385k65N78
2780c273Q58n09r51K40J403J18J50J131n46j761Q02K366J477o10k041l27J797
2797C24Q79k19m38J513j08j059p1P18j07J120O93k05r42j204J61J593J692j021
2815C319k098R8J347j259j297R14J772M74k271l248r84K863K013j369j969q61
2831b556k06K01J25j502O45K406j65k487k141J048K536K610o24k970j001K422
2847a659J454L90j90m40J041J354k78k369M4K678K367j029k122j958J698K907
2863C888q05j719M02J334n47q52r30O6Q83J110n98j310o69P7M70L45r58j322N56
$$ plain form
2743 -948 -267 305 -14 -614 -29 2080 2704 2117 2803 2454 2284 2896 4278 4294 3862 3906 2933 2979 3513 2889
2763 2889 2020 1885 2396 1590 362 -916 -1209 74 433 -2225 -4137 -3107 -1944 -2201 -3586 -3851 -3273
2780 -3273 -2415 -2924 -3875 -3635 -2232 -2114 -1964 -833 -1379 -3140 -2338 28 1505 895 -1146 -1473 324
2797 324 1203 984 546 2059 1951 892 821 1539 1432 2552 3245 3040 2098 894 1055 2648 4340 3319
2815 3319 1221 1319 2666 1407 110 1024 2796 3270 999 -2249 -3233 -370 1643 274 -1695 -2556
2831 -2556 -2762 -2561 -2436 -3938 -3293 -887 -1052 -3539 -5680 -4632 -2096 514 -110 -3080 -4081 -1659
2847 -1659 -205 185 -5 -445 596 1950 1672 -697 -653 2025 4392 3363 1241 -717 981 3888
2863 3888 3083 1364 1766 3100 2553 1701 771 837 1720 2830 2232 922 253 330 800 1145 187 -1135 -579
2882e79K155j074k758j416J203K711O77k738k365P50J302o9o45O18N07J50m76
2899b047j617j397K250L627J327j895l500n82L176L365j02j578O0J213p71j104
2915D25j71J940L441J85l247l305P8K468L078M03k171l147L79O92q98K2J770J178
2933C120r44l152k859Q54L384J808j129k595k478O9K265J204j233j29P99j31k022
2950c169j155O61K872K326j399k941j273J951J445O71J26n33j53P55M31j268P70
2967A17J366J263j11j801j463J682K608k82k179k04J220M09J08j067r44P48J296
2984B766l46j210l25r68K18R05n87j309O27Q37j06k386q60N29K442P35k373k153
3002c564k8J812M35o2J14j113J60O62o55n96R05K003O17q80k173r35K567K807
$$ plain form
2882 -579 1576 502 -2256 -3672 -2469 242 919 -1819 -4184 -3434 -2132 -2201 -2846 -2228 -1721 -1571 -2047
2899 -2047 -3664 -5061 -2811 816 2143 248 -3252 -3834 -658 2707 2605 1027 1087 2300 1529 425
2915 425 254 2194 5635 5820 2573 -732 -654 1814 4892 5295 3124 -23 356 1048 150 172 1942 3120
2933 3120 2176 -976 -3835 -2981 403 2211 1082 -1513 -3991 -3922 -1657 -453 -1686 -1815 -1016 -1147 -3169
2950 -3169 -4324 -3663 -791 1535 136 -2805 -4078 -2127 -682 -11 115 -418 -571 184 615 -653 117
2967 117 1483 2746 2635 834 -629 1053 3661 3379 1200 996 2216 2625 2733 1666 722 1470 2766
2984 2766 2420 1210 885 -83 135 1040 453 -856 -229 608 502 -1884 -2744 -2215 227 962 -1411 -3564
3002 -3564 -3592 -1780 -1345 -1407 -1293 -2406 -2246 -1584 -2239 -2835 -1930 73 690 -190 -2363 -3298 -731 2076
3020B076l74j797j61L75R45J19n94M11J873P86j889j561m8J768K464q3k874k116
3038f80J625J734m84r64k33L97J74p80k017M09J462O44j182j284j392J18J689
3055g64P98j663l07P8k46L06l60q3P63R04p47j438P02O90J51N76R26j103q44L30
3075a331J409J039k89p27K75J120J17j726N95K374N42j384j391l62J549J307m10
3092B707j260J64J57K14m29k59p09P22J210p78k881r05K102J787j53k626j807
3109b744J090J446j177j105M71J044N6r62j723k0K121J860j455j594l38O00J503
3126i27N19m54J82O22k83q93L76J860O90l49j60m27n0K77P0R18P14k99p45m90
3146A151M33k0M35K60l54q99L08K23r28N9J29K90l99p04j464R54J072q95j722
$$ plain form
3020 2076 1702 -95 -256 119 1064 1183 589 1000 2873 3659 1770 209 161 1929 4393 4310 1436 -680
3038 -680 945 2679 2195 1231 998 1395 1569 789 -1228 -819 643 1287 105 -1179 -2571 -2453 -764
3055 -764 34 -1629 -1936 -1858 -2104 -1798 -2158 -2241 -1478 -574 -1321 -2759 -2057 -1367 -1216 -640 286 -817 -1661 -1331
3075 -1331 78 1117 828 101 376 1496 1613 -113 482 2856 3398 2014 623 261 1810 3117 2707
3092 2707 1447 1611 1768 1982 1553 1294 585 1307 2517 1739 -1142 -2047 55 1842 1689 -937 -2744
3109 -2744 -1654 -208 -1385 -2490 -2019 -975 -919 -1881 -3604 -3624 -1503 357 -1098 -2692 -3030 -2430 -927
3126 -927 -408 -862 -680 -58 -341 -1234 -858 1002 1692 1343 1183 756 706 983 1053 1971 2685 2386 1641 1151
3146 1151 1584 1564 1999 2259 1905 1006 1314 1537 609 668 797 1087 688 -16 -1480 -526 546 -349 -2071
3165b071M24J554o4k045j451O16K294K56j902n15J421K83j537rJ353R80P61j079
3183g31j789J94J780R49O76q9r35k38Q62J31o16J336K172n12j884j975O30K645
3201B606J610j428j436J77o55j065K02J619P05j42j254k844l47K137J601m31j362
3218c07n93r29k09k91M14K075Q38j991k325J68J220J445L83m97k02p2p34q80J397
3237a090K378J31j484j027k74L91J240O91l3k27N8l71r51k73R27J642K80j517
3255D91j483J269J065l50p91Q00P76m01p41j034J171J520m20j475J88J029k8j218
3273C68l23l22J421P70j382k026R5R96M30m52j672K47J575J66k745j138K118K721
3291H47o44k217j308Q88J701M28q10oJ427K34j503p46R57J774J240m47k395k68
$$ plain form
3165 -2071 -1647 -93 -157 -2202 -3653 -3037 -743 -487 -2389 -2904 -1483 -1200 -2737 -2746 -1393 -413 348 -731
3183 -731 -2520 -2326 -546 403 1079 990 55 -183 679 810 194 1530 3702 3190 1306 -669 -39 2606
3201 2606 4216 2788 1352 1529 874 -191 11 1630 2335 2193 939 -1905 -2252 -115 1486 1055 -307
3218 -307 -900 -1829 -2038 -2329 -1915 160 998 -993 -3318 -3150 -1930 -485 -102 -599 -801 -873 -1607 -2487 -1090
3237 -1090 1288 1419 -65 -1092 -1366 -975 265 956 923 696 754 383 -568 -841 86 1728 2008 491
3255 491 -992 277 1342 992 201 1001 1777 1376 635 -399 772 2292 1872 397 585 1614 1586 368
3273 368 45 -277 1144 1914 532 -1494 -1399 -403 27 -425 -2097 -1850 -275 -109 -2854 -3992 -1874 847
3291 847 203 -2014 -3322 -2434 -733 -305 -1115 -1121 306 540 -963 -1709 -752 1022 2262 1815 -580 -848
3309h48J322J198J05q74r3R93O66k264j459K152L056n83k374j681R31J293P35
3326B275j059o6P12n18j023k44N73J84l15J07o25j296o46k20J039J168r52k245
3344c151l24J79J285M71o68j196P88J554r97j013O80J483J297j11j277k24J475
3361B51J897o51m33j0R06Q31o4j320k02K158J142k056k232L11K630J000k078l071
3379i91M34L561J38l858j652K510K526j406k511j621J999J699q12j904j25O21
3395a392L03J92qj465k19J416N15j210j185O81J133Q01j720p65J455J161p62j171
3413b240J431J354l25l88j93J396J482n53j076P39J006j06n30R30L69k74m73k90
3431B259K33L56j062r08M95Q43n84k201o26Q58Q91j85j981j126Q65J047n29j468
$$ plain form
3309 -848 474 1672 1777 903 810 1803 2469 205 -1254 898 3954 3371 997 -684 247 1540 2275
3326 2275 1216 1150 1862 1344 321 77 650 834 519 626 1 -1295 -1941 -2161 -1122 46 -906 -3151
3344 -3151 -3475 -3296 -2011 -1540 -2208 -3404 -2616 -1062 -2059 -3072 -2392 -909 388 277 -1000 -1224 251
3361 251 2148 1497 1064 1054 1960 2791 2727 1407 1205 3363 4505 2449 217 528 3158 4158 2080 -991
3379 -991 -557 3004 3142 -716 -2368 142 2668 1262 -1249 -2870 -871 828 16 -1888 -2013 -1392
3395 -1392 -1089 -897 -905 -2370 -2589 -1173 -658 -1868 -3053 -2372 -1239 -438 -2158 -2923 -1468 -307 -1069 -2240
3413 -2240 -809 545 220 -168 -361 1035 2517 1964 888 1627 2633 2527 1997 2927 3296 3022 2549 2259
3431 2259 2492 2848 1786 878 1373 2216 1632 -569 -1195 -337 554 369 -1612 -2738 -1873 -826 -1355 -2823
3449b823k61P41J009j12j070r08O29J493L38l18p83o54J569J571j213j170J351
3466f11J641j94j814l69J822K188j213j738Q07K166j25k178J30J954J352j037
3482B781k015l88J752P83n40l88l67p66j19K27J39k64m29j08m82p66n73k25R29
3501h19K55r51n33K39m37j031Q09J932r9j352j173J64K088N56j323j90J367R03
3519D05j247q48O67J720J001l29j465j38J248O11K41l24K12J31k9p93k06Q35O98
3538B390m55r31L5l18R4J31J42m78j04l24k07n83j39r5J077Qr32j737Q21Q29j39
3559i15l40j68M49N30q27l24O48N42k06k41R05J65j273o92J434J101M5j279j099
3578a545J129J249o62j159P61J166l99j79p92P9R31O11M51p49r27K96Q74R50r63
$$ plain form
3449 -2823 -3084 -2343 -1334 -1446 -2516 -3424 -2795 -1302 -964 -1282 -2065 -2719 -1150 421 -792 -1962 -611
3466 -611 1030 836 -978 -1347 475 2663 1450 -288 519 2685 2560 382 512 2466 3818 2781
3482 2781 766 378 2130 2913 2373 1985 1618 852 733 960 1099 835 406 298 -184 -950 -1523 -1748 -819
3501 -819 -564 -1515 -2048 -1809 -2246 -3277 -2468 -536 -635 -1987 -3160 -2996 -908 -352 -1675 -1865 -498 405
3519 405 -842 -1690 -1023 697 1698 1369 -96 -234 1014 1625 1866 1542 1754 1885 1856 1063 857 1692 2390
3538 2390 1935 1004 1039 721 815 946 1088 610 506 182 -25 -608 -747 -842 235 243 -689 -2426 -1605 -776 -915
3559 -915 -1255 -1423 -974 -444 -1271 -1595 -947 -405 -611 -852 53 218 -1055 -1747 -313 788 833 -446 -1545
3578 -1545 -416 833 171 -988 -227 939 540 361 -431 -352 579 1190 1641 892 -35 261 1135 2085 1122
3597A122m54Q26M68j096j013L40J439N79r05j632J80O12%p21l72K68J08l16p14
3616a281n49L59J024N75j341j014K28P14P71j86p72M45P69l73o25M47K70K45N79
3635B85K67p28m77N35P45L63l17n12K63M63j82o85O96P61j13o39J75J30Q7K86
3655A403l52N96k13n93o10P74L29j079QN42k75o21o00P4O65n30p05n56P16%q88
3676a915J03M25J35n43L35K24l82R7O07N83j44n2m88J127P52p31m06Q22M66j65
3696H50k66M81M61oj98k10l12O98k27m52L05m07k15K62rn64k8K72j3k61k66j55
3718b60K11L18m01l97J64L23k81J25L5k64q6L2n7k80k50L06O10m3n86m21Q28M17
3740D3q23m98Q98N44n01o07J18K28P43l59l71K64L20L90l0J78k43j91P57N6k67
$$ plain form
3597 1122 668 1494 1962 866 -147 193 1632 2211 1306 -326 -146 466 466 -255 -627 -359 -251 -567 -1281
3616 -1281 -1830 -1471 -447 128 -1213 -2227 -1999 -1285 -514 -700 -1472 -1027 -258 -631 -1256 -809 -539 -294 285
3635 285 552 -176 -653 -118 627 990 673 161 424 887 705 20 716 1477 1364 725 900 1030 1117 1403
3655 1403 1051 1647 1434 841 231 1005 1334 255 263 805 530 -91 -691 -617 48 -482 -1187 -1743 -1027 -1027 -1915
3676 -1915 -1812 -1387 -1252 -1795 -1460 -1236 -1618 -1521 -914 -331 -475 -527 -1015 112 864 133 -273 549 1015 850
3696 850 584 1065 1526 1520 1322 1112 800 1498 1271 819 1124 717 502 764 755 191 163 435 422 161 -105 -260
3718 -260 -49 269 -132 -529 -365 -42 -323 -198 -163 -427 -513 -481 -538 -818 -1068 -762 -152 -195 -781 -1202 -374 43
3740 43 -780 -1278 -380 164 -337 -944 -826 -598 145 -214 -585 -321 -1 389 359 537 294 103 860 916 649
3761F49l06R1R85l08Q7j020N49O70n04p77P31P31j209k80L10K83k78m9l87K70
3781B38m00k64k33NO5n72k7N16j52m44k02M08M88k67k27r2K51J46J34K53j58m47
3803i81J90J043M5o26Q6O1R80J88q88n53R42O69n9l81k80J1Q68M97n76p69M11
3824H78P60J95j295o06Q53R58j2j350n92R18M11j133q51O96L19l02q71r17L32
3843a609J89N62j85j146l6K18O10m1q82L75J240K78l54k45M2J096O42n03j81O44
3863G14J49k10O82M73j86o84O0P44r2n28n74J74Q95m57j422J52M15L22l73Mm22
3884a64l90O19J36l27k49R6M47L90o41r63L55J657o79j115l47J049O06l57j586
3903a463l97J128J310j317j005J98Q96O17m51q86n40J183J676m31j655KJ512J209
$$ plain form
3761 649 343 434 1419 1111 1198 178 727 1397 893 116 847 1578 369 89 399 682 404 355 -32 238
3781 238 -162 -426 -659 -654 -589 -1161 -1188 -672 -824 -1268 -1470 -1062 -574 -841 -1068 -1160 -909 -763 -629 -376 -534 -981
3803 -981 -791 252 297 -329 -243 -182 798 986 98 -455 487 1156 1097 716 436 447 1315 1812 1236 467 878
3824 878 1638 1833 538 -68 785 1743 1731 381 -211 707 1118 -15 -866 -170 149 -153 -1024 -1941 -1609
3843 -1609 -1420 -858 -1043 -2189 -2225 -2007 -1397 -1438 -2320 -1945 -705 -427 -781 -1026 -984 112 754 251 70 714
3863 714 863 653 1335 1808 1622 938 998 1742 1650 1122 548 722 1617 1160 -262 -110 305 627 254 258 -164
3884 -164 -554 65 201 -126 -375 -279 168 558 -83 -1046 -691 966 287 -828 -1175 -126 480 123 -1463
3903 -1463 -1860 -732 578 -739 -1744 -1546 -650 -33 -484 -1370 -1910 -727 949 518 -1137 -1135 377 1586
3921A586m34j166k51J693L09r28n47P68K57K53m68o11J88K51K17j096N3k76J87
3940a5J80K3q41L5N65m09k10O92On13j19L31J75k97n58L39J323O4j221j049R02
3961e97J485p83j298K11M82P64l94j485J26R59P84o26k64m79N28J028N17j198
3979b40r59J225J598j16j483o95J722J690j250j857N71J644L10j381q30J1J391
3996A351L54j386r05N92J43K91m22p60m43P83M57l81q97J46Q24L25m77q63J01
4015a167P06M86p49j59P8J88N3M09R5n30M1K79L88j32Jr05M53N60M08m03j052
4036i52P08J214J27p97q17M38J473Q0j463q25J650J438j060j523l67K050P05j467
4054F12j357N45J395K7j188p34k6J236O89p50j317l03N11J552k74j828j070J975
$$ plain form
3921 1586 1152 -14 -265 1428 1737 809 262 1030 1287 1540 1072 461 649 900 1117 21 74 -202 -15
3940 -15 165 188 -653 -618 -53 -462 -672 20 26 -487 -606 -275 -100 -397 -955 -616 707 771 -450 -1499 -597
3961 -597 888 105 -1193 -982 -500 264 -130 -1615 -1489 -530 254 -372 -636 -1115 -587 441 958 -240
3979 -240 -1199 26 1624 1508 25 -670 1052 2742 1492 -365 206 1850 2160 779 -51 -40 1351
3996 1351 1705 319 -586 6 149 440 18 -742 -1185 -402 55 -326 -1223 -1077 -253 72 -405 -1268 -1167
4015 -1167 -461 25 -724 -883 -805 -617 -564 -155 -60 -590 -549 -270 118 -14 -13 -918 -465 95 503 100 -952
4036 -952 -244 970 1097 300 -517 -79 1394 1474 11 -814 836 2274 1214 -309 -676 1374 2079 612
4054 612 -745 -200 1195 1222 34 -700 -726 510 1199 449 -868 -1171 -660 892 618 -1210 -2280 -305
4072c05J324j082j622j58J651Q05j384j314R33J409l74j221K63O83L0k48K61O06
4090B57l47J81j53N54L86q15M51M41L37n73O8K18k60M18M30o95l37L12L7L8j84
4111G64o55M6M49R1j440o41J425Q40o80j706p3J181J040k72j943l40J152J278
4129E16o78j501l91J489J475r08j805k15J713R61n25j323K42J115O82j247p25
4146a125J073P44j87k04j86J75N57L47m41j69J10N73N01p90o19K16J411l03j064
4165F19o91P01M70q10o23k83N40M43j002j63Q2j23k33N9Q90l80j290PP34Q69r3
4186b77m70m26Q94P96n22l12l51P88R50o5j111o89P08J142n3j064p65O04J283
4205A060l75j044k27J342K90r72m98M10P11K83o49o57K57O89L08n72k67J45N17
$$ plain form
4072 -305 1019 -63 -1685 -1843 -192 613 -771 -2085 -1152 257 -117 -1338 -1075 -392 -362 -610 -349 257
4090 257 -90 91 -62 492 878 63 514 955 1292 719 787 1005 745 1163 1593 898 561 873 910 948 764
4111 764 109 155 604 695 -745 -1386 39 879 199 -1507 -1580 -399 641 369 -1574 -1914 -762 516
4129 516 -162 -1663 -2054 -565 910 2 -1803 -2018 -305 656 131 -1192 -950 165 847 -400 -1125
4146 -1125 -52 692 505 301 115 290 847 1194 753 584 694 1267 1768 978 359 575 1986 1683 619
4165 619 -72 629 1099 289 -334 -617 -77 366 -636 -799 -717 -840 -1073 -1014 -124 -504 -1794 -1787 -1053 -184 -277
4186 -277 -747 -1173 -279 517 -5 -317 -668 120 1070 1005 -106 -795 -87 1055 1002 -62 -827 -223 1060
4205 1060 685 -359 -586 756 1046 74 -424 -14 697 980 331 -326 -69 620 928 356 89 234 751
4224G51K94q83p50O28J358l24j519l65P89O61l56q41o83R36Q7n18k65J20J31R6
4244f53K31J81o93K31L03K42K34m45j43O3M23j08L29L1l32m37J002N03p51p32
4264e21K01J027O06j077o82N28J023L5j294K30Q75N45o99o30k73O99L35k87n75
4283F6j25P2Q13l44j032j92J142L20p03j743M39J169N76j162j034M34J357j44
4301i1q88m73P33L97j29l6m38l2M18M80j85Q9P8j48N41L5n38O28K45J01o68N94
4323G13O05o65L00o44Q68J20o08m09P13K45o96l44r7M41m58k6m7k32M07m61l92
4344f67Q2J54nJ27n34k62O2Q51M23j219m00R73N38m64q56L21P94O68n44j150P65
4365c43R10j99l30k94J93N31j69o3l14M54M74k65M7o12J71L28M29o86q9L87L14
$$ plain form
4224 751 1045 162 -588 40 1398 1074 -445 -810 -21 640 284 -557 -1240 -304 -217 -735 -1000 -880 -749 -653
4244 -653 -422 -241 -934 -703 -400 -158 76 -369 -512 -449 -26 -134 195 226 -106 -543 459 962 211 -521
4264 -521 -320 707 1313 236 -446 82 1105 1140 -154 76 951 1496 797 167 -106 593 928 641 66
4283 66 -59 13 826 482 -550 -742 400 720 17 -1726 -1287 -118 458 -704 -1738 -1304 53 -91
4301 -91 -979 -1452 -719 -322 -451 -487 -925 -957 -539 -59 -244 -155 -77 -225 316 351 -187 441 686 787 119 713
4323 713 1318 653 953 309 1177 1297 689 280 993 1238 542 198 101 542 84 58 11 -221 186 -275 -667
4344 -667 -585 -431 -436 -309 -843 -1105 -1043 -192 231 -988 -1388 -415 123 -341 -1197 -876 -82 586 42 -1108 -343
4365 -343 567 368 38 -256 -63 468 299 236 -78 376 850 585 632 20 191 519 948 262 173 560 874
4386H74m11l10L7O21p3l37m64M12K22l78j80L35k69o3m89O08n13LJ35m94J60l29
4408i03J00N86j15o84J06O22M8p00J28N79L8N8m99K71P01K85r63J32Q58r6o05
4429e3Q4M90Q5k69K00j21l47r5J81K64O3n35P4N93j76o14n6O49P4m67n1L41J70
4452D84k2l06m55O41M77j081J63K51j13l40J1J43l35L1k28j70J95q7K00l3j66
4473g40n5Q2L16M01p03J63O61j46n2j99L91L87ql39j07P63l84M1k15Q19n53k33
4495B90j67K20M5p3J66J53r5m44k12N58J04q21K75M17j06o11p8L48K44M5n95j52
4517d89M95j10o37L91M83l56o1l22J4L67j24J52j81nn5L0l4K30k13K41M58k00
4539G4o37N67K47M7m09L72J19J15k07L0j58M50K17m79m6K19l87L82j70K9j24L2
$$ plain form
4386 874 463 153 190 811 738 401 -63 349 571 193 13 348 79 16 -473 135 -378 -375 -240 -734 -574 -903
4408 -903 -803 -217 -332 -1016 -910 -288 -240 -940 -812 -233 -195 -137 -636 -365 336 621 -342 -210 648 552 -53
4429 -53 31 521 606 337 537 416 69 -26 155 419 482 -53 21 614 438 -176 -232 417 491 24 -27 314 484
4452 484 462 156 -299 342 819 -262 -99 152 39 -301 -290 -147 -482 -451 -679 -849 -654 -741 -541 -574 -740
4473 -740 -795 -713 -397 4 -699 -536 125 -21 -73 -272 119 506 498 159 52 815 431 472 257 1076 523 290
4495 290 123 343 388 315 481 634 539 95 -117 441 545 -276 -1 416 310 -301 -379 -31 213 258 -337 -489
4517 -489 6 -104 -741 -350 133 -223 -284 -606 -592 -225 -349 -197 -378 -383 -438 -408 -442 -212 -425 -184 274 74
4539 74 -563 4 251 298 -111 261 380 495 288 318 160 610 827 348 302 521 134 516 346 375 251 283
4561B83q5k7j07l0M7M36l86r52O29M96k28r67K45Q13n03K3k24L08Rmn84M58K61
4584h9p94m0P10l5j16j92M3N48q9j86m37P70L86p39J41N99k73l25K51L62k49k24
4606B2M86j30K51j2j71P3K74q17K76l4M38k27k75J1m55N00q4j35J1P4k72L2m3
4629b07j38k09Q5M82n12m06Q03j0l61l0j22J83K96k55rk5M20l71o1N60j85m51
4651e23M05Q99o01q7L52J13j86j05m87P92L98r85K42K45L99l54l13L28J77l11
4671C98o98P05K19k64o48k04R28Lq78K38M68k36l87p2M20R6j54n40J10N48j37
4692h5p14M57K78k47j86J34Qm5J12l33L81M60m44k09M57K7l61J99K80O3k40J07
4714I9L6p6L20M0J02J87o30M2M92j61k39j22N64j60n15L2L52K34n70k13J72Mj52
$$ plain form
4561 283 198 171 64 34 81 517 131 -821 -192 304 76 -891 -646 167 -336 -313 -537 -229 -220 -224 -808 -350 -89
4584 -89 -883 -923 -213 -248 -364 -556 -513 35 -54 -240 -677 93 479 -260 -119 480 207 -118 133 495 246 22
4606 22 508 378 629 617 446 519 793 -24 252 218 656 429 154 165 -290 210 126 -9 2 76 -196 -164 -207
4629 -207 -345 -554 -469 13 -499 -905 -102 -112 -473 -503 -625 -442 -146 -401 -410 -435 -15 -386 -447 113 -72 -523
4651 -523 -118 781 180 93 445 558 372 267 -220 572 970 -15 227 472 871 517 204 532 709 398
4671 398 -300 405 624 360 -288 -492 436 439 -439 -201 267 31 -356 -428 -8 88 -66 -606 -496 52 -85
4692 -85 -799 -342 -64 -311 -497 -363 -355 -400 -288 -621 -240 220 -224 -433 24 51 -310 -111 169 232 -8 99
4714 99 135 59 379 419 521 708 78 120 612 451 212 90 654 494 -21 11 363 597 27 -186 -14 -10 -162
4737a62l72L79N05o50l65L67J10j22k74M37M1k68m2l99P02q4l46q3N84J51m55
4758c46K3L35K10k53K7J33M4k96l06N22K91j27p2K06q6j53j44J96L22J35o44J74
4780A91K22L77m22m28M46P2o53K89L25j73j66n1M71k66m91K8J63J14j25o08K15
4801d70L88q4n36O4N35k45l18L87j61J6k5L02R9Q7m24j32O55O4n34j14R95p3p36
4824b60K64K31N2j16nJ12L74k85j27l8K35l97K46J77k59J45j36O0K63j56l31k46
4846a97M67k30m12K19N36j66n57o8j05L47j34P5K10k13l33K17K10l0m82RP13M5
4868A21n75j63O99k13R2K01m42N9j41P8M87j8kq51Q18L56j49m60K35K46l31M8
4890I5k14M73N0l5m15O45p4n09K5K3L53p66K66L01j55j5j74j62P1L41p25L66N02
$$ plain form
4737 -162 -534 -155 350 -300 -665 -298 -188 -310 -584 -147 -106 -374 -416 -815 -113 -197 -543 -626 -42 109 -346
4758 -346 -323 12 222 -31 -4 129 173 -123 -429 93 384 257 185 391 305 152 8 204 526 661 17 191
4780 191 413 790 368 -60 386 458 -195 94 419 246 80 29 500 234 -257 -229 -66 48 -77 -685 -470
4801 -470 -82 -166 -702 -638 -103 -348 -666 -279 -440 -424 -449 -147 -48 39 -385 -517 138 202 -332 -446 549 476 -260
4824 -260 4 235 287 171 166 278 652 367 240 202 437 40 286 463 204 349 213 273 536 380 49 -197
4846 -197 270 40 -372 -153 383 217 -340 -408 -513 -166 -300 -225 -15 -228 -561 -344 -134 -164 -646 -637 76 121
4868 121 -454 -617 82 -131 -39 162 -280 -221 -362 -284 203 185 183 -668 150 506 357 -103 132 378 47 95
4890 95 -119 354 404 369 -46 599 525 16 41 64 417 -349 -83 218 63 48 -126 -288 -217 124 -601 -235 267
4913B67k91m23J72j2J17j88N1n4RK42j0l6R2l02j64N60j08m06L84K76Q2q5k13
4936d0K73o9L57m42P1L21j77j72K93M68n65l89M30K93n03l69M35M54l31l34M4
4957D8J10L77m92l96O54l07q9j60J99l33L30j15K47L0m70k20M73J16j66m55L75
4978b44O06o05j56o9M21K46j38m42M23n5j97L71L90l63n41M18N26n68J98O4J88
4999D73l05j11m0J58L84k44j18oJ00M9k12J52P6k25q8J79J90j61l85J2J67j31
5021h6o63O00O0K19l58k97K53n9Q7M22n91J95l53L87J62o3m95K69L82J11m84j54
5043d56N24j37k1j18k50O10J64m54J21L19M4k79K71J31n19P7M55O3q4n70j38R28
5065F81L4p53M5K85J53p63J41O17m00K16q2j95j53k5L0K82l30l7n73P14L18k92
$$ plain form
4913 267 -24 -447 -275 -287 -170 -358 -307 -361 -352 -110 -120 -156 -64 -366 -530 30 -78 -484 -100 176 258 173 -40
4936 -40 233 164 521 79 150 471 294 122 415 883 318 -71 359 652 149 -220 215 669 338 4 48
4957 48 158 535 43 -353 301 -6 -95 -255 -56 -389 -59 -174 73 103 -367 -587 -114 2 -164 -619 -244
4978 -244 362 -243 -399 -468 -47 199 61 -381 42 -13 -210 161 551 188 -353 65 591 23 221 285 473
4999 473 168 57 17 175 559 315 197 191 291 340 128 280 356 131 43 222 412 251 -134 -122 45 -86
5021 -86 -749 -149 -89 130 -228 -525 -272 -331 -244 178 -413 -218 -571 -184 -22 -85 -580 -311 71 182 -302 -456
5043 -456 68 -69 -90 -208 -458 152 316 -138 -17 302 346 67 338 469 -50 27 482 545 461 -109 -247 681
5065 681 715 -38 7 292 445 -318 -177 440 40 256 174 -21 -174 -199 -169 113 -217 -254 -827 -113 205 -87
5087h7m33K67m8K99l77m2R1J38M3L1p2j1P6P4N34n98l23J54N79J68k74k45K78
5110B22K42k85m14N76j6J80k8l00j72m7L22K86l5n27kK45J53m10j59k6O55k77
5132A83p46L31N69K47p32q3j34L11L08p13P4j69L24o9J71j90m20N55L16p4m94
5153d35K9n9N33J9k48N5Q2k65J45L29J15k65k90N05K31m62J29Q4L93j51k33l15
5175g4M23K34l74l5L6j49L68k55k9l67L87P2k42j01k71JL18M03m15q96Q66N34
5197D34m72o07K41K80K89k36l91qK35J76o7P1k60NM41J86n04m04K79M49K17K1
5219C75n08j98M60M7m04K55K45M7k13l9J1K86j44P3L36j60j37j48M67k79l39o5
5241c2P37m67m22O7r4K16j8j71j59J51k28L66R1J11o90k77R46J61j174J41O50
$$ plain form
5087 -87 -520 -253 -301 -2 -379 -421 -330 -192 -149 -118 -190 -201 -125 -51 483 -115 -438 -284 295 463 189 -56 222
5110 222 464 179 -235 341 325 505 477 177 5 -42 280 566 531 4 2 247 400 -10 -169 -195 460 183
5132 183 -563 -232 337 584 -148 -231 -365 -54 254 -459 -385 -554 -230 -299 -128 -318 -738 -183 133 59 -435
5153 -435 -406 -465 68 87 -161 -106 -24 -289 -144 185 300 35 -255 250 481 19 148 232 625 474 241 -74
5175 -74 349 583 209 174 210 61 429 174 145 -222 165 237 -5 -106 -377 -376 -58 345 -70 -966 -100 434
5197 434 -38 -645 -404 -124 165 -71 -462 -470 -235 -59 -126 -55 -315 -310 131 317 -187 -591 -312 137 354 375
5219 375 -133 -331 129 176 -228 27 272 319 106 67 78 364 220 293 629 469 332 184 651 372 33 -32
5241 -32 705 238 -184 -117 -211 5 -13 -184 -343 -192 -420 -54 37 148 -542 -819 127 288 -886 -745 -95
5262i5j2Ml16j19K35P07m79k36J73o7L08K46O3o37M1M21R1j90o6j82M79j41l46
5285a18q1M9O87p07J37M18J78k67l43O9K89J5j04j09N77q56j94M90j31O7n29K87
5307a76L27j01l69k72K66K89r3m80l4M56k23J6K01k42q5K99N58r0m63j22J05K55
5329B2L14m96O06k04N1k64J49k19Q8kJ99J27o41L26K2P39q19k57K45K13K68q13
5351c46L14L74K5k51m28J41N27k63J03m95P2M42j02q9M4n85L59M15k91k43j37
5372d14J91K38p3m51q8N50K42n54j52K47L8j99L13Q0k6j14J64J35k39K0J9L04
5394B31J68k72k0rL90l25r1K91l06P7Mn9J8J28r6j28M80m09m00L81N53p61k55
5417d10L48P7j59P6j36l00K59J41n6J31O3m16J29K44k58j83J61M15P6j27p46L87
$$ plain form
5262 -95 -107 -103 -419 -538 -303 404 -75 -311 -138 -205 103 349 412 -225 -184 237 328 138 72 -110 369 228 -118
5285 -118 -199 -150 537 -170 -33 385 563 296 -47 22 311 326 222 113 690 -166 -360 130 -1 66 -463 -176
5307 -176 151 50 -319 -591 -325 -36 -129 -609 -643 -187 -410 -394 -193 -435 -520 -221 337 247 -216 -338 -233 22
5329 22 336 -160 446 242 293 29 178 -41 47 45 244 371 -270 56 78 817 -2 -259 -14 199 467 -346
5351 -346 -32 342 367 116 -312 -171 356 93 196 -299 -227 215 113 24 68 -517 -158 257 -34 -277 -414
5372 -414 -223 15 -58 -509 -597 -47 195 -359 -511 -264 -226 -425 -112 -32 -58 -172 -8 127 -112 -92 -73 231
5394 231 399 127 107 98 488 163 72 363 57 134 138 79 97 225 129 1 481 72 -328 53 606 -155 -410
5417 -410 -62 15 -144 -68 -204 -504 -245 -104 -160 -29 34 -382 -253 -9 -267 -450 -289 126 202 75 -671 -284
5439b84O55l10k53L2K19j24j23L33K94k84j12J04m0rL63l58L33j46l68L66J53
5460D41O3l23j75L22K9j34j87M05l05p3j01J79J95m80j05K44M1m14j19M46L18
5481B67m02k25PK03j3p3j18N4K97q9R0J6j17m38M77K28j40k91NK26J58M4l23L56
5505A99N9q2j91J97L53k71m84L04K09j22q7Q1K3j65r1J43J35j82k51J91M54j94
5527B28l80M5K08k30M57l70k0J59J57n08m4K66j4n18M47L40o47JL44j46J66k15
5549b74J60Qm0q1P7N27l92j55J50K02k59j70J31K56p1J17j59M54J01k70l55N48
5571E05j36l48L10j33j39N8r8l7K35q9l74J34K68j78j40L44j29P7n37K44J12J09
5593E8n98n3N03K11m64j43N19k53p7JL8J70k20j76M76q2j16j76K43O5O4J65p2
$$ plain form
5439 -284 371 61 -192 -160 59 -65 -188 145 439 155 43 147 107 98 461 103 436 290 -78 288 441
5460 441 504 181 6 328 357 223 36 441 136 63 -38 141 336 -144 -249 -5 36 -378 -497 -51 267
5481 267 -135 -360 -353 -150 -163 -236 -354 -300 -3 -92 -2 14 -103 -541 -64 164 24 -267 -262 -36 122 166 -157 199
5505 199 258 176 -15 182 535 264 -220 84 293 171 84 165 188 23 -68 75 210 28 -223 -32 422 228
5527 228 -152 -107 101 -129 328 -42 -62 97 254 -254 -298 -32 -46 -564 -117 223 -424 -423 -79 -225 -59 -274
5549 -274 -114 -106 -146 -227 -150 377 -15 -170 -20 182 -77 -247 -116 140 69 186 27 481 582 312 -43 505
5571 505 369 21 331 198 59 117 19 -18 217 128 -246 -112 156 -22 -162 182 53 130 -407 -163 -51 58
5593 58 -540 -593 -90 121 -343 -486 33 -220 -297 -296 -258 -88 -308 -484 -8 -90 -206 -382 -139 -74 -10 155 83
5616H3M41n67Q1L09K70m46J17qK96l5m91M54O0j46j93k7J58p1n4l97L67j88r8
5639h5j53J80J41k38J63p5j7o9j25J66p5r0J61l32J00L54j22K7j41J89k80j60
5661d81L20j12k66L61L05j70k91l5O38l38J79J26j89%K74k76J66K08l56k07N87
5682D43m9k14k34N34j92j1L4j87L3K95m19J47K44l23q0L13M0j91m38L57m4p6k30
5705b48k7L07k9j92j96N0J4j46J4O6J50o3J28kj21J6j74K07L66j06m6J12O7j00
5729D7k77P14K0j33N8r5j56L74m2k19o9P4j22j22K96j22q9O5k17K60m19K18J63
5752B07M9m38q1oJ44j89j60K61P8o3r2K1j60J37q4q2M55k62l7M44k4J89o68J44
5776b17L23l4k65J27K76j95k88J79L61J41k61j62L43jj52k72M91P9l78MJ15m6
$$ plain form
5616 83 524 -43 38 347 617 171 288 280 576 541 50 504 564 418 225 198 356 285 231 -166 201 13 -85
5639 -85 -238 -58 83 -155 8 -67 -84 -153 -278 -112 -187 -277 -116 -448 -348 6 -116 -89 -230 -41 -321 -481
5661 -481 -161 -273 -539 -178 127 -43 -334 -369 269 -69 110 236 47 47 321 45 211 419 63 -144 443
5682 443 394 180 -54 480 288 277 311 124 157 452 33 180 424 101 21 334 374 183 -255 102 58 -18 -248
5705 -248 -275 32 3 -189 -385 -335 -321 -467 -453 -387 -237 -300 -172 -174 -295 -279 -453 -246 120 14 -32 80 147 47
5729 47 -230 484 504 371 429 334 178 552 510 291 222 296 174 52 348 226 137 202 -15 245 -174 44 207
5752 207 256 -182 -263 -269 -125 -314 -474 -213 -135 -198 -290 -269 -429 -292 -376 -458 -3 -265 -302 142 118 307 -361 -217
5776 -217 106 72 -193 -66 210 15 -273 -94 267 408 147 -15 328 327 175 -97 394 473 95 99 214 168
5798A68K2m22K71J83O8l57J61Q6o6k31p1K25R4k12K3k18J33l04J62L06r4j47l10
5821e30O72j20j81k08N91m57K09j25J06J05J36m50K33P7K8n57K67L52k94J30n9
5842g5K74m48J99p2L55j6j94rK94J3k21l53M44L52k30k41Q5J26q8j10r5N12l98
5865A04m2K20%k85j70oJ98Pp0k64J81J9j55J56j0k85K51j80L59k72n6O8J35j5
5889a12j19K1K5J02O2m22K92M28k29k41K91k33K81k35K14L12m01K2K6M12j91k98
5911GK56K68m47q7K39L17l14j49J3L34n2j47j31r3K75m60k69M01J68n91L61o4
5933a65k80oJ35J23l2l60M23j53K3J56j16J59J50k29k58K93J29j14p8K13L22j03
5955B32l7m52M05l12L60k8j08L50k02j19n7M80m31L00k21J75k97P2n9L83k00k66
$$ plain form
5798 168 190 -232 39 222 290 -67 94 180 114 -117 -188 37 131 -81 -58 -276 -143 -447 -285 21 -73 -220 -530
5821 -530 142 22 -159 -367 224 -233 -24 -149 -43 62 198 -252 -19 58 86 -471 -204 148 -146 -16 -75
5842 -75 199 -249 -50 -122 233 217 23 14 308 321 100 -253 191 543 313 72 157 283 195 85 -10 502 104
5865 104 62 282 282 -3 -173 -179 19 26 -44 -308 -127 -108 -263 -107 -117 -402 -151 -331 28 -244 -300 -232 -97 -112
5889 -112 -231 -210 -185 -83 -21 -443 -151 277 48 -193 98 -135 146 -89 125 437 36 58 84 496 305 7
5911 7 263 531 84 -3 236 553 239 90 103 437 385 238 107 14 289 -171 -440 -39 129 -462 -101 -165
5933 -165 -445 -451 -316 -193 -225 -585 -162 -315 -292 -136 -252 -93 57 -172 -430 -137 -8 -122 -200 13 335 232
5955 232 195 -257 148 -164 196 168 60 410 208 89 32 512 81 381 160 335 38 110 51 434 234 -32
5977c2m6K45m03J91R4j9k31m42Q01n0k13Q5p7j07J23m11N7K66p8m81M62JM91m91
6001b65j55P0K17k63J07L71J15k10m16M07M34j98k64K34J17K36n85K23p9J83k58
6022B1L26J26j62q6k44M9K15k3q7L38j20r8m64L15J17k25l88L29J68m2J51k83
6044f7p4j96K82k04K69j96k7j69N52k29k48K1L31p4k59J83J65q2q7J46k4J31j19
6067B5k45K17M12j79J4l3r7p9J78j05M46l64j54R9J57J63l94k9J55J83k52J36
6089B54K6J5j77M1N3k43j93K02K70l40o1k41L22k92L9J09k19K53j42L38l00j5
6111c01P7l40L38K21j13j77K69L67k28l64L16j94J29K23k50J39J22p7p7j7L28
6132C91m45L27lQ6k03R7k6L00k92J04MO2k06k82J00K45j61J6j58J8k23n9M64k96
$$ plain form
5977 -32 -78 167 -236 -45 49 30 -201 -643 158 108 -105 -20 -97 -204 -81 -492 -435 -169 -247 -728 -266 -265 226 -265
6001 -265 -420 -350 -133 -396 -289 82 197 -13 -429 -22 412 214 -50 184 301 537 -48 175 96 279 21
6022 21 347 473 311 225 -19 30 245 222 135 473 353 255 -209 106 223 -2 -390 -61 107 65 216 -67
6044 -67 -141 -337 -55 -259 10 -186 -213 -382 170 -59 -307 -286 45 -29 -288 -105 60 -22 -109 37 13 144 25
6067 25 -220 -3 409 230 244 211 114 35 213 108 554 190 36 135 292 455 61 32 187 370 118 254
6089 254 280 295 118 159 212 -31 -224 -22 248 -92 -153 -394 -72 -364 -325 -216 -435 -182 -324 14 -286 -301
6111 -301 -224 -564 -226 -5 -118 -295 -26 341 113 -251 65 -129 0 223 -27 112 234 157 80 63 391
6132 391 -54 273 270 356 153 250 224 524 232 336 340 402 196 -86 14 259 98 114 -44 -26 -249 -308 156 -140
6156a40k76J83M31l05j65m10O2Q31m54p4K2N4k77J37m7L73Qj7k01q8N57l25J14
6179gM32J47m18r1K63n8l89O45m56L13k66l1J04M25l49R4k74L22K4k83J40K69
6201E56k35L3j45m00M64j88l76N21k80n9l92P6O80l4m76K07k16j08J87L7k43n8
6223d49OM3N99M8p94K39P65n59nj33K7J48j1K54J21j43j17K99P2R8j45k12J99
6246C50K56l14j35r9K08N4N9l10K48k37L4J33j3k11P8q0Mk5m11K65M7M1j1q4K83
6271A30p6m82J4K01K30m52o9L65n3J8j75k54J61L7K45K08JJ0l05L39J3k75J7K63
6295A11K95n8o2p9j34K97o8L1J19k22k98L38Qj85M4J73j54K10j84l7K5J04l94
6318a20n4J74J16n06K94q6J49O8j89Q8l62K91N7j63l0K8k16K74L71m00l82L45
$$ plain form
6156 -140 -416 -233 198 -107 -272 -682 -620 211 -243 -317 -295 -241 -518 -381 -428 -55 -47 -64 -265 -353 204 -121 -7
6179 -7 425 572 154 63 326 268 -121 524 68 381 115 84 188 613 264 358 84 406 430 147 287 556
6201 556 321 354 209 -191 273 85 -291 230 -50 -109 -501 -425 255 221 -255 -48 -264 -372 -185 -148 -391 -449
6223 -449 -443 -400 199 247 -547 -308 457 -102 -107 -240 -213 -65 -76 178 299 156 39 338 410 508 363 151 350
6246 350 606 292 157 58 266 320 379 69 317 80 114 247 234 23 101 21 25 0 -411 -146 -99 -58 -69 -153 130
6271 130 54 -428 -414 -213 17 -435 -504 -139 -192 -174 -349 -603 -442 -405 -160 48 49 59 -246 93 106 -169 -152 111
6295 111 406 348 286 207 73 370 302 333 452 230 -68 270 278 93 137 310 156 366 182 145 170 274 -120
6318 -120 -174 0 116 -390 -96 -182 -33 35 -154 -66 -428 -137 -80 -243 -273 -245 -461 -187 184 -216 -598 -253
6340b53k61M08k7m06K57J0M3J20J61j30l0N5N85k17k86J34LJ3J78M8j48j04M21
6363E74k09j37L29j89j19K50k2m04j80M67m55K83j28j71j37P1j44K52p9o2k87
6384d97P9K58K47l02k57O6j04J85O7j77J95j13P5K58m5k95j05N42k48P8qJ31J45
6407A75j60R6k71L93L10o15M05q2N8R7j89L29qj50p0n9M36l72l86K05M4M3m97
6430b68K31J79l10O1k2k8L9o2j48K06l04j49L87K68k93m06N62n6N7l97Q0M19j63
6453a17L30j61l11J49L81j09l58L26k13j62L36N46p08M6J39l09L61j93M39j32
6473B80J69k14j30M09k01ml01K86l44J21j04K78J19l69J36j80K87l59L5L1J5J64
6495A24l95J67j50K19l92J19J4K20j18j20J13O6l84L23M4ok20M21L02k54j44j22
$$ plain form
6340 -253 -514 -106 -133 -539 -282 -272 -229 -109 52 -78 -108 -53 532 315 29 163 166 179 357 405 257 153 574
6363 574 365 228 557 368 249 499 477 73 -107 360 -95 188 60 -111 -248 -177 -321 -69 -148 -210 -497
6384 -497 -418 -160 87 -215 -472 -406 -510 -325 -258 -435 -240 -353 -278 -20 -65 -360 -465 77 -171 -93 -101 30 175
6407 175 15 111 -160 233 543 -72 333 251 309 406 217 546 538 388 318 259 695 323 -63 142 186 229 -268
6430 -268 -37 142 -168 -107 -129 -157 -118 -180 -328 -122 -426 -575 -188 80 -213 -619 -57 -113 -56 -453 -373 46 -117
6453 -117 213 52 -259 -110 271 162 -196 130 -83 -245 91 637 -71 -25 114 -195 166 -27 412 280
6473 280 449 235 105 514 313 309 8 294 -50 71 -33 245 364 -5 131 -49 238 -121 -86 -55 -40 124
6495 124 -271 -104 -254 -35 -427 -308 -294 -74 -192 -312 -199 -133 -517 -194 -150 -156 -376 45 347 93 -51 -173
6517a73J14R2M29m42l5kL52j46J21P5m29N30O5j11j67J52j18L90l69Q8k51K43
6539D08l88J60p4o0K88l68J13m9k67K77n4k04K26m20O6M04m88J27O9J02j05j04
6561c41l4J01K76k10j04J79j00L23j68R4j45j58O21p7j44J26k16N5K65n5R5k02
6583A81L30j21k61L05j89M9r7J0N5l2n09M82J90k65j20j03j5M52m38k17K69k67
6605c11k0J9K22j74L5k39J30l9J56N3j44L36l50q6N17j47l06j09K25L3P6Q2Q1
6628D0q0J15j2q7K90j63Q3p8k5L17l79J04L17k23l43K47o9K04j00j1J19l28M14
6651C52q6Q4j95j05J23R0k33j18J92n99K80J52k86R4K45j35m2o5L26j84m78M82
6673a06l25P9j29P5J88J99j06j40K49j43J06j89J32J78L37n65L38k03L53j08K
$$ plain form
6517 -173 -59 33 462 20 -15 -17 335 189 310 385 -44 486 551 440 273 425 307 697 328 416 165 408
6539 408 20 180 106 46 334 -34 79 30 -237 40 -14 -218 8 -412 -346 58 -430 -303 -234 -132 -237 -341
6561 -341 -375 -274 2 -208 -312 -133 -233 90 -78 16 -129 -287 334 257 113 239 23 78 343 288 383 181
6583 181 511 390 129 434 245 294 197 207 262 230 -279 203 393 128 8 -95 -110 342 -96 -313 -44 -311
6605 -311 -331 -312 -90 -264 -229 -468 -338 -377 -221 -168 -312 24 -326 -412 105 -42 -348 -457 -232 -199 -123 -41 40
6628 40 -40 75 63 -24 266 103 186 108 83 400 21 125 442 219 -124 123 54 258 158 147 266 -62 352
6651 352 266 350 155 50 173 263 30 -88 104 -495 -215 -63 -349 -255 -10 -145 -187 -252 74 -110 -588 -106
6673 -106 -431 -352 -481 -406 -218 -19 -125 -265 -16 -159 -53 -242 -110 68 405 -160 178 -25 328 220 222
6694B22n3K65l21J64L49k93l09K03M04m76J11J9k1K27l15j03K6K80m87M3L77k47
6716F5j88L0J22J3j22j86o3K85l13K74j11k96K89l61L96j69L21j95J83p2l02K99
6738a01K10k12J60K16n41K25M3P7o1nJ61l9k57L36L42m66L55j94q5k7jK08j14
6761B30j19K94O1p58P14k97j83P6K75m52J70m4j05q5J84m3l25J65k82L65l25K68
6783b16j33L5K76q3l33o8L73r7m5n5J58L7j27M31o8l7o1J93J80j79L2j36J41k98
6807h0J59J45j8J27k47J81J55k13J08j81M00l73J10m14L09j75K79l82J91J9mq4
6829A2m54L33j26k64R9J72o9k92R2N48m90J90J5Qk53J58o4J83j52K93j32K42l8
6852A1k91n2K28R1K42j84K56Ok25o7K25K8K03o8k50N86k99n5K00r2M6m04J44J07
$$ plain form
6694 222 169 434 113 277 626 333 24 227 631 155 266 285 264 491 176 73 99 379 -108 -65 312 65
6716 65 -123 -93 29 42 -80 -266 -329 -44 -357 -83 -194 -490 -201 -562 -166 -335 -14 -209 -26 -98 -400 -101
6738 -101 109 -103 57 273 -268 -43 0 77 16 11 172 133 -124 212 554 88 443 249 164 137 136 344 230
6761 230 111 405 466 -292 422 125 -58 18 293 -159 11 -33 -138 -223 -39 -82 -407 -242 -524 -159 -484 -216
6783 -216 -349 -314 -38 -121 -454 -522 -149 -246 -291 -346 -188 -151 -278 153 85 48 -13 180 360 181 213 77 218 -80
6807 -80 79 224 206 333 86 267 422 209 317 136 536 163 273 -141 168 -7 272 -110 81 100 96 12
6829 12 -442 -109 -235 -499 -400 -228 -297 -589 -497 51 -439 -249 -234 -226 -479 -321 -385 -202 -354 -61 -193 49 11
6852 11 -280 -332 -104 -13 229 45 301 307 82 15 240 268 471 403 153 739 440 385 585 493 539 135 279 386
6876C86j80K2o3k39O0J5j13O3K87m31l56K98pk82J8K32o7L30o26K69P8j31n2L5
6900d54M34m81p6L45K38M8j20RJ03J73L2m23N56J61o37K73L69l06J39j13J65k21
6922B14P5L8J43k85J30k33J80J8q1J65L7l2k71J05r6j70K15m39K07Ok54Kj98j79
6946g03O28j83m4J45o8m70K70R9l4j0n0M58J00n54J84l07O36n45L28K0K33k39
6968a06J40N0p3k7K04oL7J87L1n4k4k3l38j24M00k0j38J66j2J7k83O7q5J84l23
6993a53L58j0l22k47M4K42J49n79N20l23K23m0m16K50M05m18l96L22L59k6m35
7014d93K53K05k28j13M42o7k45j70M77K73j59l9m1L24k39n7K73k39L53k07M8j06
7036B45J25P3m37M39k26k61P3L27K6n5k91R2R4k94J28j89J08j82jj97K53l1k38
$$ plain form
6876 386 206 228 165 -74 -14 1 -112 -49 238 -193 -549 -251 -258 -540 -522 -290 -357 -27 -653 -384 -306 -437 -489 -454
6900 -454 -20 -501 -577 -232 6 54 -66 -57 46 219 251 -172 384 545 -92 181 550 244 383 270 435 214
6922 214 289 327 470 185 315 82 262 280 199 364 401 369 98 203 107 -63 152 -287 -80 -74 -328 -326 -524 -703
6946 -703 -75 -258 -302 -157 -225 -695 -425 -326 -360 -370 -420 38 138 -416 -232 -539 97 -448 -120 -100 133 -106
6968 -106 34 84 11 -16 188 182 219 406 437 383 359 336 -2 -126 274 254 116 282 270 287 4 71 -14 170 -153
6993 -153 205 195 -127 -374 -330 -88 61 -518 2 -321 -98 -138 -554 -304 101 -317 -713 -391 -32 -58 -493
7014 -493 -240 -35 -263 -376 66 -1 -246 -416 61 334 175 136 95 419 180 123 396 157 510 303 351 245
7036 245 370 443 6 445 219 -42 31 358 384 329 38 130 224 -70 58 -131 -23 -205 -206 -403 -150 -181 -419
7059d19j08K77j99K6M19m13K39j28j58M20j42j83K34J47k48Nq2N21k31J24k11
7080a10K07K79k28K16k96M37n8l06n2K55m4K9j4R5l03M2K27l5j34j29J50q8l4
7103A06k38K72n9j1K9m27J60o2M7o1K24K82m45k67k04N33j77L28j89j20J54m70
7125e95J10M35k78K93l3p9j00L32Jk66L29k7LQ7J58j34l5p7j2J0K88j83L91k74
7149C44N0k92R3J14l34j4K81M2j35j48J25J38K0k92n0O7k93Q7m6J07k53J00J91
7172i8l68J26j8N3q5L31n03o5K21K31l36L94q4j27NJ92M6M1K65l09L48J94m8l96
7196A0N4J25k02M60k91M7j3M32k33J35j03R1l02J60j61M7K9m24M74j24k13L12
7218C10l35J83n13M61k77k09L49n15J12K17o8j5N9R7j86J7J49k35R6j42M99m99
$$ plain form
7059 -419 -527 -250 -449 -423 -4 -417 -178 -306 -464 -44 -186 -369 -135 12 -236 -231 -313 208 -23 101 -110
7080 -110 97 376 148 364 68 505 447 141 89 344 300 329 315 410 107 149 376 341 207 78 228 140 106
7103 106 -132 140 81 70 99 -328 -168 -230 -183 -244 -20 262 -183 -450 -654 -121 -298 30 -159 -279 -125 -595
7125 -595 -485 -50 -328 -35 -68 -147 -247 85 86 -180 149 122 125 212 370 236 201 124 112 122 410 227 618 344
7149 344 394 102 195 309 -25 -39 242 284 149 1 126 264 284 -8 -58 9 -284 -197 -243 -136 -389 -289 -98
7172 -98 -466 -340 -358 -305 -390 -59 -562 -627 -406 -175 -511 -117 -201 -328 -323 -131 -85 -44 221 -88 260 454 406 10
7196 10 64 189 -13 447 156 203 190 622 389 524 421 512 210 370 209 256 285 -139 335 211 -2 310
7218 310 -25 158 -355 106 -171 -380 -31 -546 -434 -217 -285 -300 -241 -144 -330 -313 -164 -399 -303 -445 54 -445
7240d45J68N8oj16nL97J76l09J18J75o7m4K89k40J86q6j00M95j98mj33J88k7m61
7264IP2oK25J14k08n5lJ64k89j86K70M2l69K22Pk72J3k5K03k19p6k36p2M55k3
7289b43j25R6j37J46Q2J07J7P9l1k12J66m1J52j59P8J60k86M66p3J05P8m03L41
7312C63k24J54j35K30L7J12o76K47M11m54J34l7Q0k97l3K63j27j60K70J40k48
7333E0j63K62k04J8J3o0q8K70m07L5J4J06k24J42m2R7J6M9m17J82k34L00J50L27
7357A92Mj88J40n9j74J51L4k98P21k46k43J66J54J96l86J70j22J49l2m1M60m89
7379B59l02J45O1j14J08j44K56l84j87L09Kj70L5j82k4O06l56j87j07M78k16j26
7401b40K07l28J22k04L56j94r4Q2K29J48j46k2k53N45l26o9N02k92J23r2K45j2
$$ plain form
7240 -445 -277 -219 -225 -341 -346 51 227 -82 36 211 144 100 389 149 335 249 149 644 446 442 309 497 470 9
7264 9 81 75 300 414 206 151 148 312 23 -163 107 149 -220 2 9 -263 -250 -275 -72 -291 -367 -603 -675 -220 -243
7289 -243 -368 -272 -409 -263 -181 -74 -57 22 -9 -221 -55 -96 56 -103 -25 135 -151 315 242 347 425 22 363
7312 363 139 293 158 388 425 537 -139 108 519 65 199 162 242 -55 -88 175 48 -112 158 298 50
7333 50 -113 149 -55 -37 -24 -84 -172 98 -309 -274 -260 -154 -378 -236 -278 -181 -165 -116 -533 -351 -585 -285 -135 192
7357 192 196 8 148 89 -85 66 100 -198 523 277 34 200 354 550 164 334 212 361 329 288 748 259
7379 259 -43 102 163 49 157 13 269 -115 -302 7 9 -161 -126 -308 -332 274 -82 -269 -376 102 -114 -240
7401 -240 -33 -361 -239 -443 -87 -281 -375 -293 -64 84 -62 -84 -337 208 -118 -187 315 23 146 54 299 287
7423B87R5q3o9J03k8K74k21M7j9k40j15K69L31m31k1J96k69J35M2l25M34j70o27
7446d05L24j3k07r0K14j25j30L1J45K61m41J25k27K9L06J06l75K19K11l86K83
7467a45L77l16M66m95k5M42k78j45N3O24k42j43k76N41p8m56K52L86l95L6J61
7488C44n6O9j25j99K39j0J17j05J54m02k38j51O83j50p04K51J40J15l2m8m62K75
7510b95K66m70O7J50j60J89j58L59m71J37J28j0ML43m79NP9L20L66k92J55J24
7532C57j58j10L6K13N7m07M18O6m78K95N5l79J67J17K57n53M15j25K33m65j49
7553a38L5K59P2k33l10K74nk61K59k47L2M9k9Q4j31K6q4m2j7J85k32P4J92j25
7577c13K05q2lj87O0L29P2K9o6k26M46K45k36j66L03j5j21J16n5p8k9J57q3K46
$$ plain form
7423 287 382 299 230 333 305 579 358 405 386 146 31 300 631 200 179 375 106 241 283 -42 392 222 -405
7446 -405 -81 -94 -301 -391 -177 -302 -432 -401 -256 5 -436 -311 -538 -509 -203 -97 -472 -253 -42 -428 -145
7467 -145 232 -84 382 -113 -138 304 26 -119 -66 558 316 173 -103 438 360 -96 156 542 147 183 344
7488 344 288 357 232 33 272 262 379 274 428 26 -212 -363 320 170 -534 -283 -143 -28 -60 -108 -570 -295
7510 -295 -29 -499 -432 -282 -442 -253 -411 -52 -523 -386 -258 -268 -264 79 -400 -395 -316 4 370 78 233 357
7532 357 199 89 125 338 395 -12 406 472 -6 289 344 -35 132 249 506 -47 368 243 476 11 -138
7553 -138 -103 156 228 -5 -315 -41 -46 -307 -48 -295 -263 -214 -243 -159 -290 -264 -348 -390 -407 -222 -454 -380 -188 -313
7577 -313 -108 -190 -193 -380 -320 9 81 110 44 -182 264 509 273 107 410 395 274 390 335 257 228 385 302 548
7601E48l12q4J95l0j65J57k50K39mk35m05M48j64j19j58K7K87k6m33K66k55K1
7623d52K27j66J52j06J50LJ4j05r6L25j34lk87L90j03J07k5L25l5l84M24M3P0
7646C34J8k34K35n5q2k46L56L96m37j35L86R6m25l83L89K90l77J90o4L3o4j54
7668F7O4m6k26j21l6J71R6l37NJ23k02K53l36N1M06m63K14P2K58m63L78r9j42
7691c13L4K35k13K47O5k14Q0R5N12o92PM64m4k66N54K0j53j52Q1J63k28m0j79
7714F3M99j96L34p27L76Pm57J00J13m7j66k40K19K76k75l16L9K17m9l2k07R7j49
7737e21M02r1j02L9p1j68K49L18j38m18K50P6M9l4L16j5j85J90j4J73j88j83K29
7760A63l5L56l11J81r3K33j05j06j7L42m1o83K79mj5Q7l03M16j74m53J42j70J5
$$ plain form
7601 548 236 152 347 317 152 309 59 298 294 59 -346 102 -62 -181 -339 -312 -25 -51 -484 -218 -473 -452
7623 -452 -225 -391 -239 -345 -195 -192 -178 -283 -379 -54 -188 -191 -478 -88 -191 -84 -109 216 181 -203 221 264 334
7646 334 352 118 353 298 216 -30 326 722 285 150 536 632 207 -176 213 503 126 316 252 285 221 67
7668 67 131 85 -141 -262 -298 -127 -31 -368 -363 -240 -442 -189 -525 -474 -68 -531 -317 -245 13 -450 -72 -171 -313
7691 -313 -279 -44 -257 -10 55 -159 -79 16 528 -164 -157 307 263 -3 551 571 418 266 347 510 282 242 63
7714 63 562 366 700 -27 349 356 -101 -1 112 65 -101 -341 -122 154 -121 -437 -398 -181 -230 -262 -469 -372 -521
7737 -521 -119 -210 -312 -273 -344 -512 -263 55 -83 -501 -251 -175 -126 -160 156 141 -44 146 132 305 117 -66 163
7760 163 128 484 173 354 261 494 389 283 266 608 567 -116 163 159 144 231 -72 344 170 -283 -141 -311 -296
7783b96K24l86K00J42kl05L77j30m04K53K79j15o04L81j5J36n1J47K19J38k60
7804g2j10R7K67j08j00N47o43K00k5K00j78O5K11r6N6PJ06j14nk32K31J14j1k
7828D05J78m05rqm7k13k0N05n08q4k27M37m27P7L99k08p0j36K96l74K19j74M5
7851c49K49k6n07L29Kl12O79j59J01l64L64p7J42P3k20R9N2J06k38L28J13l61
7873B4M3J52K22l34N0K96k3L1n23K68j21L32j54R7M7l79K36k01L85n99L1R7J32
7896A09k22o0j00j3K7L29m30N0N3k75L22Q0n04L53J88l73O0R7J47k68J87l2l1
7919c06k8L35K02n24M22O9J19j03P0j42M95j37j27k49O6M84l79J3q6r7K2L34n2
7942D01k50J36k72K66k6k96J0j17L4K42l58J09R9m51M67n50K91j49K24j75K56
$$ plain form
7783 -296 -72 -458 -258 -116 -118 -423 -46 -176 -580 -327 -48 -163 -767 -386 -401 -265 -316 -169 50 188 -72
7804 -72 -182 -85 182 74 -26 521 -122 78 53 253 75 140 351 255 311 318 424 310 305 73 304 418 407 405
7828 405 583 178 169 161 114 -99 -119 386 -122 -206 -433 4 -423 -346 53 -155 -225 -361 -65 -439 -220 -394 -349
7851 -349 -100 -126 -633 -304 -302 -614 65 -94 7 -357 7 -70 72 145 -75 24 76 182 -56 272 385 24
7873 24 67 219 441 107 157 453 430 461 -62 206 85 417 263 360 407 28 264 63 448 -151 -120 -23 109
7896 109 -113 -173 -273 -286 -259 70 -360 -310 -257 -532 -210 -130 -634 -281 -93 -466 -406 -309 -162 -430 -243 -275 -306
7919 -306 -334 1 203 -321 101 170 289 186 256 114 609 472 345 96 162 646 267 280 194 97 119 453 401
7942 401 151 287 15 281 255 -41 -31 -148 -114 128 -230 -121 -22 -473 -6 -556 -265 -414 -190 -365 -109
7963a09m44K17K17k4j17J8K91k45l9p6K30J99j67nKL3K05j50R1K12n28K12O11
7986F34k75o9q8j76M16J12k37l09K43L52k49j58N6j75K79l68K63l88j47J96j67
8007b55P6r7J56P1j66K26l85R0l37P6q0M98j60o4K94jj27j93L21j99j46K16J60
8030b6N9n1j21K57k96L85j75K91k73P7N6J4Q3o3J77N4p1k74K81j82P9L3J01l39
8054G6j56J53N25j85l74o1J51l0j97J32j01R0k73J25J33m6l48K66k21J85j26k49
8076e31K50l2J43p3J64k7n38M30J69k64J81n0j18M41K3k40J84mj52K40J90J1j95
8099B02J7J43L56k14l06K6K84p9l31J5L8J64l29k4L42l72J39p0m5o9N9o33N62
8122a25r2j00Ql2J54j07k43o0O83l48j98J90K2j01J91l83N13k42J30l3J68J90
$$ plain form
7963 -109 -553 -336 -119 -143 -260 -242 49 -196 -235 -311 -81 118 -49 -54 -52 -19 186 36 127 339 -189 23 634
7986 634 359 290 202 26 442 554 317 8 251 603 354 196 252 77 356 -12 251 -137 -284 -88 -255
8007 -255 -179 -276 -120 -49 -215 11 -374 -284 -621 -545 -625 -127 -287 -351 -57 -58 -185 -378 -57 -256 -402 -186 -26
8030 -26 33 -18 -139 118 -178 207 32 323 50 127 183 197 280 217 394 448 377 103 384 202 281 314 415 76
8054 76 -80 73 598 413 39 -22 129 99 -98 34 -67 23 -250 -125 8 -38 -386 -120 -341 -156 -282 -531
8076 -531 -281 -313 -170 -243 -79 -106 -644 -214 -45 -309 -128 -178 -296 145 168 -72 112 108 -44 196 386 397 202
8099 202 219 362 718 504 198 224 508 429 98 113 151 315 -14 -38 304 -68 71 1 -44 -113 -54 -687 -125
8122 -125 -217 -317 -309 -341 -187 -294 -537 -597 86 -262 -460 -270 -248 -349 -158 -541 -28 -270 -140 -173 -5 185
8144A85m03J49K27L9Q8k06M8J42L42p83M56J67l8k6q6O5L04m31N7K75l58nk95
8167h7N3L53l38M1K10Q5n79J69m4k21J23K85l78M99l74O2L5J71o00J94J16pk01
8190d33j04
$$ plain form
8144 185 -218 -69 158 197 285 79 127 269 611 -172 284 451 413 387 301 366 670 239 296 571 213 208 -87
8167 -87 -34 319 -19 22 232 317 -262 -93 -137 -358 -235 50 -328 171 -203 -141 -106 65 -535 -341 -225 -232 -433
8190 -433 -537
8191e37
$$ Imaginary data points
##PAGE= N=2
##DATA TABLE= (X++(I..I)), XYDATA
0@%%%Qj6QqK4l2L4n0O4p2R1j15J39j66K01k38K78l28L83m42N11n85O66p63Q69
28D61r79J107j254J409j576J764j969K188k434K710l004L324l686M083m515N000
44B629n544O148o829P610q506R545j0773J2248j4058J6343j9327K3417k9394L8967
58B2476n6785J00968m04287p40103Q10835P73601k53188q06963p8574N26200K43352
69A37532l72388k67561K29556L70933J1183k06999j36507J4777J03378K30265
79A14169J99735r3456l44833j07047L43393L22126k08848l82114J22372M58503
89D24000k3875n49740k10556N01079M45775k99499n96683j8067N13484K16921
99D02839l66819l18756J82343L02239m9808k38105n0807J11214M3480n532N2862
$$ plain form
0 0 0 0 0 8 -8 0 -8 16 -16 18 -32 32 -40 51 -64 75 -91 110 -128 150 -178 205 -237 274 -311 355 -408 461
28 461 -518 589 -665 744 -832 932 -1037 1151 -1283 1427 -1577 1747 -1939 2144 -2371 2629
44 2629 -2915 3233 -3596 4014 -4492 5053 -5720 6528 -7530 8813 -10514 12903 -16491 22476
58 22476 -34309 66659 -337628 -1077731 -266896 506705 253517 -553446 -632020 -105820 137532
69 137532 -234856 -502417 -272861 98072 109255 -97744 -234251 -219474 -116096 114169
79 114169 313904 220448 -124385 -231432 111961 434087 225239 -156875 -34503 424000
89 424000 400125 -149615 -360171 140908 586683 287184 -309499 -327566 185918 402839
99 402839 36020 -282736 -100393 201846 152038 -86067 -136874 -25660 17820 12288 65150
110F5150j7876j93647r1756K55426K51779k18166m18455L9479M66895J84650l86126
121f2647l90303J64433M49888O9255l67290k04633K46449K62333j16864k43914
131a93293M1747K43438Q0433j33863r5230L9393N2000L7715Q9337L0745j48229
142D4193j23270J33167J82271j01321k34221M8150K86556L7058l59879k55228
152c42524K60318M08004o6453m48724j72769L02631K68932j44679k81783J5656
162b01391K52178R2747j77863j63584N9072J68137Q9073l6948j09459q5366L0839
173h2565J28098Q4592n3509j17479k6003R8238N9528r2554r5884Q3888J35022
184A21372n1281j74358l1355J42325Q0432r1743r1175N9902R0411m3894j01839
$$ plain form
110 65150 47274 -146373 -238129 17297 269076 50910 -367545 -328066 138829 323479 -62647
121 -62647 -452950 -288517 161371 230626 -136664 -341297 -94848 167485 50621 -193293
131 -193293 -151546 91892 172325 38462 -56768 -17375 34625 72340 161677 192422 44193
142 44193 -79077 54090 236361 135040 -99181 -51031 235525 272583 -87296 -342524
152 -342524 -82206 325798 259345 -189379 -362148 -59517 209415 64736 -217047 -201391
162 -201391 50787 143534 -34329 -197913 -138841 29296 118369 81421 -28038 -113404 -82565
173 -82565 45533 130125 76616 -40863 -66866 31372 90900 -1654 -97538 -13650 121372
184 121372 70091 -104267 -135622 6703 87135 -4608 -95783 -35881 54530 10636 -91203
195i1203J2895J08756N5185m6220p3886k2957M5612O2416J7764k1151k8438k6171
207g398k232M4602L9344l3513o1981Q001O8932J8414p9914p4920M6576J09945
219G5856J4209j02029p8134K9030P5014L5482k6945n0459k0104K0615K6512N576
231D623j6085j8109J5455L6434j3208o5600j3196P1172M6972m2488n4460J0674
243c7816L8073q113l7852J4767O9870J9206p9196p3298L8181J04715M3639o5552
255B6624q3257J4167Q5100K4500n9969l1942M6377M8607j3276n4232l6186K5616
267g871O4156K5494m8020n9707j872M3622J9737k9927k2742K8865K0915m5606
279a2956m9978K8124O3733O161n6927m1876K7058N7773L155o1034l3229M7941
$$ plain form
195 -91203 -78308 30448 85633 39413 -34473 -57430 -11818 50598 68362 47211 18773 -7398
207 -7398 -9630 34972 74316 40803 -21178 -13177 55755 74169 -5745 -80665 -34089 75856
219 75856 90065 -11964 -90098 -61068 13946 49428 22483 -27976 -48080 -27465 -953 4623
231 4623 -11462 -29571 -14116 22318 9110 -56490 -69686 1486 48458 5970 -48490 -37816
243 -37816 257 -7856 -45708 -30941 38929 58135 -21061 -94359 -56178 48537 92176 26624
255 26624 -56633 -42466 42634 67134 7165 -24777 21600 70207 56931 2699 -33487 -7871
267 -7871 56285 81779 33759 -25948 -27820 15802 35539 5612 -17130 11735 32650 -12956
279 -12956 -62934 -34810 28923 35084 -21843 -63719 -36661 21112 24267 -36767 -69996 -22055
291b2055O0570p866o3110l7963L7927O8301L491o5555l1685M7898N0946j6696
303B4203n4452j9700L6924M6732M072l1871k7529p233J2473K9772K0484r882j5913
316H080n468j0897r293J9191L3052J0990j4965k3440j7185L5J3806J7507K1828
329D3241J1824k4812m9130k3042K4848M7067K7037j6214l7688k7557j7556o042
341d8024L8399O3532L311p5256o3056J4571N1247K0547j5386n534J6935o155n0152
354e5021l3918L8261P1755L3245l1085o6429l9395L0758O7557L2643j8905k8955
366E11p845P540j108p208J9737M6385J3592m4105m5112K651L6210L0547R18k2502
380C0211j4806N333l835k1973j538L2167K5567k0132n0934k3511L1065L5417j3154
$$ plain form
291 -22055 38515 30649 -32461 -70424 -32497 35804 39295 -26260 -57945 -10047 40899 24203
303 24203 -30249 -49949 -13025 33707 37779 5908 -21621 -28854 -16381 13391 33875 23993 8080
316 8080 2612 -8285 -17578 1613 34665 45655 30690 7250 -9935 -9900 3906 21413 43241
329 43241 55065 30253 -18877 -41919 -17071 29996 57033 40819 3131 -24426 -41982 -48024
341 -48024 -9625 53907 57218 -18038 -81094 -66523 -15276 5271 -10115 -15649 1286 -4869 -55021
354 -55021 -88939 -50678 21077 54322 23237 -43192 -82587 -51829 15728 48371 29466 511
366 511 -7334 206 -902 -8110 11627 58012 71604 27499 -17613 -14962 21248 51795 52713 30211
380 30211 15405 20738 16903 -5070 -6608 25559 51126 30994 -19940 -43451 -12386 23031 9877
393I877l4788j938J9414K292j8377j7433J780J9173J4461q417j3926j100p25l194
407c2901Q998J6119Q335j649q211p358L082J0618Q316J0835J0535l584j0290n275
421G570o083O75K7350L1357j1050m5105k5508J7879L1991O014j8636q167P731
434A6018j3388l1051j415L3737K0994j2428k4026j5651k763P885J2521J4652R657
447A4742q157k1155j1351N441J5886K4732J3574j7876k7578l628J3924J0187M295
460A3036J845k411o113j2132j5193j56J8533J3996m634j6125j8050n957J0530
473b2831J2779M508K840j583j3107q717Q500J4478J0863O079m574q953K135O573
487H990o79L619J4622Q304j0706j9285q197J4830J9949m065j9663l161P403n281
$$ plain form
393 9877 -24911 -26849 -7435 -5143 -23520 -40953 -39173 -20000 -5539 -13956 -27882 -28982 -29707 -32901
407 -32901 -23903 -7784 551 -1098 -9309 -16667 -13585 -2967 5349 16184 26719 23135 12845 7570
421 7570 1487 2162 29512 60869 49819 4714 -20794 -2915 29076 35090 16454 8287 16018
434 16018 2630 -28421 -29836 3901 24895 12467 -11559 -27210 -29973 -22088 -9567 5085 14742
447 14742 6585 -14570 -25921 -20480 -4594 20138 33712 15836 -11742 -15370 -1446 8741 13036
460 13036 14881 12470 6357 -5775 -20968 -21124 -2591 11405 6771 -9354 -27404 -33361 -22831
473 -22831 -10052 -5544 -2704 -4287 -17394 -26111 -17611 -3133 7730 13809 9235 282 2417 8990
487 8990 8311 11930 26552 34856 24150 4865 -3332 11498 31447 27382 7719 4558 11961 6680
501F680j0677K927R060L197n260j0479o898K581O726O723L203r798j3732O358
515i389J4068o937j4314P375J4343o661j9374o712J0514J1581m843j3535k449
528b6333N669j383k193N223K942j461M763N142j488J695R558Q780O704L634k532
543A8720R97J0985P735q83J701L243k893m724j009k904j774j042o542r532p303
558D775r701p395K529L70j3148j0428k69r75m664j594L544O892M714p028o988
573c9366R592J4509N462N606N681m133l847J0949J3127K22k859M275N827l577
587B1468j3665n687J5020J4531r792j8118n870J483K195N728n95p752l25M826
601C447m485r955J874J3994J3431k040j8053j1345J2084J7267k57q003l717r8
$$ plain form
501 6680 -3997 -1070 7990 11187 5927 -4552 -11450 -8869 -2143 4580 7783 -2015 -15747 -9389
515 -9389 4679 -2258 -16572 -9197 5146 -1515 -20889 -27601 -17087 -5506 -10349 -23884 -26333
528 -26333 -20664 -22047 -24240 -19017 -16075 -17536 -12773 -7631 -9119 -7424 2134 10914 17618 21252 18720
543 18720 19717 30702 38437 37554 39255 42498 39605 34881 33872 30968 29194 28152 21610 12078 4775
558 4775 -4926 -12321 -9792 -9422 -22570 -32998 -33267 -34242 -38906 -40500 -36956 -30064 -25350 -32378 -39366
573 -39366 -29774 -15265 -9803 -4197 1484 -2649 -6496 4453 17580 17802 14943 19218 25045 21468
587 21468 7803 2116 17136 31667 21875 3757 -2113 -630 1565 7293 6698 -1054 -1379 3447
601 3447 -1038 -10993 -9119 4875 18306 16266 -1787 -13132 -1048 16219 15962 7959 4242 4144
615D144R57k914r022k600J0377O707p899j7213j1997O231K1020O193k1946j3922
629c1884J6321J7094p065j6401J697K2867J7460j1258k2629K953K4202R573j0951
642A1979q569L468Q513K543r012j1513j693Q629J0865l40k1277k2776J0597K8564
656I978k176k8586l519K5644R603k0380k0184J2201L3922J5317j9415k2356K920
669g031J7755J3130L406n678n738K386O84r209p713N751J2775O611j3670l2686
683a9227j7911J9765K8570j094k5405k1169m25J5193N935j1842l924J9706J4851
696C023j8504k7851K408L5359L2394o414l0875j2622J7379K1442O826m949o520
709A1096K979J0886m384j9642k478K5110K1186r518l4488k3983J7940M1930N662
$$ plain form
615 4144 5101 2187 -6835 -9435 942 7649 -250 -17463 -29460 -23229 -2209 3984 -17962 -31884
629 -31884 -15563 1531 -5534 -21935 -20238 2629 20089 8831 -13798 -10845 13357 22930 11979
642 11979 3410 6878 15391 17934 8922 -2591 -4284 4345 15210 14870 -6407 -29183 -18586 9978
656 9978 7802 -20784 -24303 1341 10944 -9436 -29620 -17419 16503 31820 12405 -9951 -7031
669 -7031 10724 23854 27260 21582 15844 18230 18914 9705 1992 7743 20518 27129 13459 -19227
683 -19227 -37138 -17373 11197 10103 -15302 -36471 -36896 -21703 -15768 -27610 -31534 -11828 3023
696 3023 -15481 -43332 -40924 -5565 26829 20415 -10460 -23082 -5703 15739 22565 17616 11096
709 11096 14075 24961 20577 935 -1543 23567 44753 35235 747 -23236 -5296 36634 42296
722D2296m0187k6652K1884K7901j1195l3157j769L5187J5322l2929l4052J2066
734b5285L4498J0347j9114k5307p570J8461K1489m483k2544j0149J2724J8157
746A224j744k4479r073K9290K6356k1327l8270M360M3032K5179k3275l5047L216
759b0558L3735J5188j5817j3312Q069J3693J384j3201j2396J0978K4250K730k3321
772A1422k0447R27J7126J8539k082k4919j8154J0005J6073j560j3541m292J1730
785H27Q467j5801k2927N024K9017J5834j6007k8626r242K2333K5848o175k2335
798a3763r34J4149J638r084m145M901J1689P593r382j9698n464J7439K2594K266
812A9799k5533j9607J5700K7269l340k4203l025K3963J3555j9026k7626Q512L7679
$$ plain form
722 42296 2109 -24543 -2659 25242 14047 -19110 -20879 14308 29630 -3299 -37351 -25285
734 -25285 9213 19560 446 -24861 -32431 -13970 7519 3036 -19508 -29657 -16933 1224
746 1224 -520 -24999 -34072 -4782 21574 247 -38023 -33663 9369 34548 11273 -23774 -20558
759 -20558 13177 28365 12548 -764 7305 20998 22382 9181 -3215 7763 32013 34743 11422
772 11422 -9025 -8098 9028 27567 25485 566 -17588 -7583 8490 6930 -6611 -10903 827
785 827 9294 -6507 -29434 -24410 4607 20441 4434 -24192 -33434 -11101 14747 8572 -13763
798 -13763 -14697 -548 1090 -7994 -12139 -7238 4451 12044 2662 -17036 -22500 -5061 17533 19799
812 19799 -5734 -25341 -9641 17628 14288 -9915 -12940 11023 24578 5552 -22074 -13562 24117
825B4117J1465k9630k3592J1857K0742N498q927j1534j679J1402O310j1094j2629
838g694M456J7038O789j7126k2086L878K5453Q418j9273j8019M924J7316M569
851H643j7779j4395J4410K1360q151k5140n280J7084J4913o41j5340j1484Q515
864a3285J5203k76j2044k913J1150J0857n494j6432j818J9709J4562p950j4285
877c016m354P301J3277N294q843p808M488P544j730o038l800N656J4354K15k2716
892a76j5108J5054K2641p40j9863j3842O255J1696j707j0325p19Q189J499q245
906e391j2521n847J3592K1920j721k6441j6802J0328K0855R617r130j5291l07
919a7139J2610J851j0748j115J6478J4831o779k4547j3252K0130L2180M842k3189
$$ plain form
825 24117 35582 5952 -17640 -5783 14959 20457 11530 -4 -1683 9719 16029 4935 -7694
838 -7694 -3238 13800 20589 3463 -18623 -14745 10708 19126 -147 -18166 -13242 4074 8643
851 8643 -9136 -23531 -9121 12239 4088 -21052 -26332 -9248 5665 5024 -10316 -21800 -13285
864 -13285 1918 1642 -10402 -13315 -2165 8692 3198 -13234 -15052 4657 19219 11269 -3016
877 -3016 -7370 -69 13208 18502 9659 1851 6339 13883 12153 6115 2315 7971 22325 22540 -176
892 -176 -15284 -230 22411 21671 1808 -12034 -5779 5917 4210 -6115 -6834 1355 2854 -5391
906 -5391 -17912 -23759 -10167 11753 10032 -16409 -33211 -22883 -2028 7589 -1541 -16832 -17139
919 -17139 -4529 -2678 -13426 -14541 1937 16768 9989 -14558 -27810 -7680 24500 29342 6153
932F153j9605M440J9758Q831j0826p139J4217R958j6801k0863O174K3785J4831
945C2913p603k3665j5779P726J8295R502o085j4888r645N171P790p244r013R566
959b959J4886o279k6760j6184J8461L1732O59k9906j6677J1520J4052J261R3j622
973g723l668m36K944O04P29M451Q507N201q579j5923J673K5030J8313j1007k3266
988c150p084J5409J8988O59j3873m448O974j400r702k87J1058R031k655j6832
1002B688j8045N56J9731J4952l360j8268j9221l243J5076J3502l93p356o454m476
1016a4311l934l159L959J8227J5404j1887k8541j2167J6231K6761J4228r599k0954
1029i742q091O857P979O867R579L583p113j0543q162j306J2363K1316J0232j4882
$$ plain form
932 6153 -13452 -9012 10746 19577 8751 1612 15829 25787 8986 -11877 -5703 18082 32913
945 32913 25310 1645 -14134 -6408 11887 21389 15304 416 -9229 -4058 3732 -3512 -12525 -2959
959 -2959 11927 5648 -21112 -37296 -18835 12897 13556 -16350 -33027 -21507 -7455 -6194 -6101 -7723
973 -7723 -11391 -11827 -8883 -8279 -7550 -3099 5408 10609 2030 -13893 -12220 12810 31123 20116 -3150
988 -3150 -10234 5175 24163 24822 10949 6501 13475 12075 2373 2086 13144 22175 19520 2688
1002 2688 -15357 -14801 4930 19882 16522 -1746 -20967 -24210 -9134 4368 3975 -3381 -9835 -14311
1016 -14311 -18245 -21404 -17445 782 16186 4299 -24242 -36409 -20178 6583 20811 11212 -9742
1029 -9742 -17833 -10976 -2997 3870 13449 17032 9919 -624 -8786 -10092 2271 23587 33819 18937
1043A8937l0085j3490K1933L0495P17k2132j0100N041Q45o555p32J0665J3322
1056A8861l171k2664j8923O965K1584J5029m239k1530j8048O364K1115O992j1001
1069b666q853M660Q559m240j3100K14K0207J3505j3385k0319k300J6104J8212
1082A6598R47j7619j2512R039J4888J787q020p193K548R040O86j2087o333J1628
1096C397J2572m975j8565j1832J0412K2324M431k0127j8418K882J6929J0672o818
1109B884j6137n35J7409M512j7417j1177J5721K3614J117k2867k0001R387K8372
1122A4882J2815j4640j9514l019J3916J2977n304j6305J416J8698M714k0828j9982
1135b0174P838K7800J2327k3016k8735L989K4708P423j4477j0701M574J0539K32
$$ plain form
1043 18937 -11148 -24638 -2705 27790 28507 6375 -3725 1316 2161 -4394 -5126 5539 18861
1056 18861 15690 -6974 -25897 -18932 2652 17681 13442 -8088 -26136 -19772 1343 8335 -2666
1069 -2666 -11519 -6859 1700 -2540 -15640 -15426 4781 18286 4901 -15418 -17718 -1614 16598
1082 16598 17545 -74 -12586 -3547 11341 13128 5108 -2085 463 9503 10189 -1898 -8231 3397
1096 3397 15969 10994 -7571 -19403 -8991 13333 17764 -2363 -20781 -17899 -970 9702 2884
1109 2884 -13253 -13788 3621 8133 -9284 -20461 -4740 18874 19991 -2876 -22877 -13490 14882
1122 14882 27697 13057 -6457 -9476 4440 17417 12113 -4192 -2776 15922 20636 -192 -20174
1135 -20174 -12336 15464 27791 4775 -23960 -19971 4737 12160 -2317 -13018 -8444 2095 2327
1148B327j2812r143J0367J7158L705j3978j7161j444K0113J8121p919k1788m035
1161a6489J5635J1782o826j5526kK0090J0806j6874k0254M180K0847J2708n589
1174A4488j6877r489R533J6478L556r741r226L876J2366K696j5492j0434J3167
1187D901J9441j813k1450j7885O189K3342R821j8456k0826L427J4689L71j4299
1200a2548p788J1814J5907p634k6827r263K1218K2589j169j8283j4091M649J6712
1213d714P799o141n068M984R978R65j2790j0931J5217K9842M323k8634k1746J0898
1227f018K5832J1288j2840j4647J396Q904k223p359J862P413L304l368q765j0401
1241e622j483J0201J1808P99j5235j7975J824J6514N247j2135p030M051K784n519
$$ plain form
1148 2327 -10485 -19628 -9261 7897 11602 -2376 -19537 -20981 -868 17253 9334 -12454 -16489
1161 -16489 -854 10928 4102 -11424 -11426 8664 19470 2596 -17658 -13478 7369 20077 14488
1174 14488 -2389 -11878 -2345 14133 17689 7948 -1278 2598 14964 17660 2168 -8266 4901
1187 4901 24342 22529 1079 -16806 -10617 12725 22546 4090 -16736 -13309 1380 1751 -12548
1200 -12548 -20336 -8522 7385 -249 -27076 -36339 -15121 7468 6299 -11984 -26075 -21426 -4714
1213 -4714 3085 -3056 -8124 -3140 6838 7803 -4987 -15918 -701 29141 33464 4830 -16916 -6018
1227 -6018 19814 31102 18262 3615 5011 13915 11692 4333 6195 13608 16912 13544 4779 -5622
1241 -5622 -7105 3096 14904 15703 468 -17507 -15683 831 6078 -6057 -13087 -9036 -6252 -11771
1255a1771p167J10Q467N744n950r737j179N956P684K183o618o434O598J3668K422
1270C976r714o194Q287J5411N445j1341p908J1932J5719l752j5815m037J5870
1283A7879J9129j522k4972j8952J2349K4604M566j6828j6362r38P300n96q896
1296c239j155R451K863j1737j6540p857P488J7653R057j0710j8356r237L111J2230
1310a6978J2226J814m996n380o842o135O989J7594J2091j717j1582j1401j019
1323a5336J0535J3953J0321J093j1288j1982J631R811N205M303P242O87j2170
1336A4005j6138l065J6760K1954L22k2839j7792K182J0957O458l566p250k374
1349c86L420l434j2857o740R332J5916K475j8606j9900M227J9441O741j0064p425
$$ plain form
1255 -11771 -18938 -18828 -10361 -4617 -10567 -20304 -21483 -15527 -7843 -5660 -12278 -18712 -12114 1554 3976
1270 3976 -5738 -11932 -3645 11766 17211 5870 -2038 9894 25613 21861 6046 2009 17879
1283 17879 37008 35486 10514 -8438 3911 28515 33081 16253 -109 -1047 6253 5657 -3239
1296 -3239 -4394 5057 7920 -3817 -20357 -28214 -20726 -3073 5984 -4726 -23082 -32319 -29208 -16978
1310 -16978 -4752 -2938 -7934 -13314 -20156 -26291 -19302 -1708 10383 8666 -2916 -14317 -15336
1323 -15336 -4801 9152 19473 20566 9278 -2704 -1073 8738 13943 18246 25488 26175 14005
1336 14005 -2133 -5198 11562 33516 33838 10999 -6793 -4611 6346 12804 9238 1988 -386
1349 -386 3034 -400 -13257 -19997 -10665 5251 7726 -10880 -30780 -26553 -7112 -371 -10435 -17860
1363a7860K901N535N53m635l302P155J0628p31p431k338N028N712J736l303K11
1378a41P964N441o282q061J038R315P717n04o927l663K912J064k131K174L570
1393A3486j282j173o40o221p359K321J0295P254m995j5556j2632N422J4322N296
1407H538p208r961n354L137M715l646m793M511R618K00j1829j3791J439K0465
1421c959J5867r370j8864k123J1328O969l29j147K769M840j710q057k526R153
1435B841J1114K601o991r174m47R036M394m218j538M848J683o403q537r27R810
1450H092J0092n025j4593n224N558N624q2l216m396j520K418l44m466k487K440
1465g129N100K267o145q460J62Q394M844r00k977m574j361N852M545n49k654M38
$$ plain form
1363 -17860 -14959 -9424 -8871 -13506 -16808 -9653 975 244 -7187 -9525 -4497 1215 2951 -352 -141
1378 -141 7823 13264 6982 -1079 -41 9274 16991 16487 9560 5897 8809 9873 7742 9916 13486
1393 13486 12204 11031 10391 4170 -3189 -868 9427 16681 11686 -3870 -16502 -11080 3242 8538
1407 8538 1330 -8631 -13985 -10848 -6133 -9779 -14572 -10061 -443 -243 -12072 -25863 -24424 -3959
1421 -3959 11908 2538 -16326 -18449 -7121 -152 -481 -1628 1141 5981 4271 -3786 -6312 2841
1435 2841 13955 16556 9565 391 -56 8980 13374 9156 7618 12466 14149 7746 -791 -1718 8092
1450 8092 18184 13159 -1434 -6658 -1100 4524 4442 1226 -3170 -4690 -2272 -2616 -7082 -9569 -7129
1465 -7129 -2029 238 -5907 -14367 -14205 -5811 -967 -1867 -4844 -9418 -10779 -4927 -382 -931 -3585 -3147
1481c147J988L471o14n853N01J0627N339q463q882K022R609M599m910o315K354
1496B326N044k304n576L33N006M473j458r407p438O478J1466n52r461m960L336
1511b694N385J81o433k651P551O756m749j0155k434O521J0792K427r033q006K058
1526d484P297K448l178l604J999N232k775j0661k386J0057N702n624n919k281
1540h177j90O98K19J018K362om165k615J244J611K209N628L638l707m594J47N772
1557A092P294J343k732K497M374m040o182M556P887K596k106m281o211k929K590
$$ plain form
1481 -3147 -1159 2312 1698 -4155 -3654 6973 12312 3849 -5033 -3011 6598 11197 6287 -28 2326
1496 2326 7370 5066 -510 -177 4829 9302 7844 -1563 -9001 -2523 8943 8391 -1070 -6030 -2694
1511 -2694 2691 2872 -3561 -6212 1339 8095 3346 -6809 -9243 -2722 8070 10497 1464 -6542 -4484
1526 -4484 2813 5261 2083 -1521 478 5710 2935 -7726 -10112 -55 5647 23 -5896 -8177
1540 -8177 -8367 -7669 -7450 -6432 -4070 -4076 -8241 -10856 -9612 -8001 -5792 -164 3474 -233 -4827 -4680 1092
1557 1092 8386 9729 6997 9494 13868 9828 3646 8202 16089 18685 16579 12298 6087 3158 5748
$$ [...]
8191A93
##END NTUPLES=NMR FID
##END=
