##TITLE=1H_TG-2110-C1
 CDCl3, 8 sc, 
 1.7.2019
##JCAMPDX= 6.0         $$ Bruker NMR JCAMP-DX V2.0
##DATA TYPE= NMR FID
##DATA CLASS= NTUPLES
##ORIGIN= UXNMR, Bruker Analytische Messtechnik GmbH
##OWNER= root
$$ XWIN-NMR		Version 3.5
$$ Mon Jul  1 14:03:49 2019 Russian Standard Time (UT+4h)  she@DPX200
##.OBSERVE FREQUENCY= 200.13155
##.OBSERVE NUCLEUS= ^1H
##.DELAY= (6, 6)
##.ACQUISITION MODE= SIMULTANEOUS
##.ACQUISITION SCHEME= undefined
##.AVERAGES= 8
##.DIGITISER RES= 18
##SPECTROMETER/DATA SYSTEM= spect
##.PULSE SEQUENCE= zg30
##.SOLVENT NAME= CDCl3
##.SHIFT REFERENCE= (INTERNAL, CDCl3, 0, 15.7039)
##AUDIT TRAIL= $$ (NUMBER, WHEN, WHO, WHERE, WHAT)
$$ ##TITLE= Audit trail, XWIN-NMR		Version 3.5
$$ ##JCAMPDX= 5.01
$$ ##ORIGIN= Bruker BioSpin GmbH
$$ ##OWNER= she
$$ F:/spectra/data/she/nmr/H-F/1/audita.txt
$$ ##AUDIT TRAIL=  $$ (NUMBER, WHEN, WHO, WHERE, WHAT)
(   1,<2019-07-01 14:02:23.78 +0400>,<she>,<DPX200>,
      <created by zg, POWCHK disabled, PULCHK disabled
       configuration hash MD5:
       00 E9 B6 7A A2 85 ED C7 34 08 36 98 17 FE 4E 26
       data hash MD5: 16K
       4D 05 DD 42 EF AC 80 46 8A 42 72 43 24 9A 08 97>)
$$ ##END=
$$ 
$$ hash MD5
$$ C8 DD 87 6D 9B 24 74 9E B0 57 3D 32 FF 3A FA CC
##$RELAX= 
##$RELAX= 
##$RELAX= 
##$RELAX= 
##$RELAX= 
##$RELAX= 
$$ Bruker specific parameters
$$ --------------------------
##$DU= <F:/spectra>
##$EXPNO= 1
##$NAME= <H-F>
##$PROCNO= 1
##$TYPE= <nmr>
##$USER= <she>
##$AMP= (0..31)
100 100 100 100 100 100 100 100 100 100 100 100 100 100 100 100 100 100 
100 100 100 100 100 100 100 100 100 100 100 100 100 100 
##$AQSEQ= 0
##$AQ_mod= 1
##$AUNM= <au_zg>
##$AUTOPOS= <>
##$BF1= 200.13
##$BF2= 200.13
##$BF3= 200.13
##$BF4= 200.13
##$BF5= 200.13
##$BF6= 200.13
##$BF7= 200.13
##$BF8= 200.13
##$BYTORDA= 1
##$CFDGTYP= 0
##$CFRGTYP= 5
##$CHEMSTR= <none>
##$CNST= (0..31)
1 1 145 1 1 1 1 1 1 1 1 1 1 1 1 1 1 1 1 1 1 1 1 1 1 1 1 1 1 1 1 1 
##$CPDPRG= <>
##$CPDPRG1= <>
##$CPDPRG2= <>
##$CPDPRG3= <>
##$CPDPRG4= <mlev>
##$CPDPRG5= <mlev>
##$CPDPRG6= <mlev>
##$CPDPRG7= <mlev>
##$CPDPRG8= <mlev>
##$CPDPRGB= <>
##$CPDPRGT= <>
##$D= (0..31)
0 1.2 0 0 0 0 0 0 0 0 0 0.03 0 0 0 0 0 0 0 0 0 0 0 0 0 0 0 0 0 0 0 0 
##$DATE= 1561975343
##$DBL= (0..7)
120 120 120 120 120 120 120 120 
##$DBP= (0..7)
150 150 150 150 150 150 150 150 
##$DBP07= 0
##$DBPNAM0= <>
##$DBPNAM1= <>
##$DBPNAM2= <>
##$DBPNAM3= <>
##$DBPNAM4= <>
##$DBPNAM5= <>
##$DBPNAM6= <>
##$DBPNAM7= <>
##$DBPOAL= (0..7)
0.5 0.5 0.5 0.5 0.5 0.5 0.5 0.5 
##$DBPOFFS= (0..7)
0 0 0 0 0 0 0 0 
##$DE= 6
##$DECBNUC= <off>
##$DECIM= 24
##$DECNUC= <off>
##$DECSTAT= 4
##$DIGMOD= 1
##$DIGTYP= 9
##$DL= (0..7)
0 120 120 120 120 120 120 120 
##$DP= (0..7)
150 150 150 150 150 150 150 150 
##$DP07= 0
##$DPNAME0= <>
##$DPNAME1= <>
##$DPNAME2= <>
##$DPNAME3= <>
##$DPNAME4= <>
##$DPNAME5= <>
##$DPNAME6= <>
##$DPNAME7= <>
##$DPOAL= (0..7)
0.5 0.5 0.5 0.5 0.5 0.5 0.5 0.5 
##$DPOFFS= (0..7)
0 0 0 0 0 0 0 0 
##$DQDMODE= 0
##$DR= 18
##$DS= 0
##$DSLIST= <SSSSSSSSSSSSSSS>
##$DSPFIRM= 0
$$ [...]
##$SUBNAM2= <"">
##$SUBNAM3= <"">
##$SUBNAM4= <"">
##$SUBNAM5= <"">
##$SUBNAM6= <"">
##$SUBNAM7= <"">
##$SUBNAM8= <"">
##$SUBNAM9= <"">
##$SW= 24.9336996594482
##$SWIBOX= (0..15)
0 0 2 0 0 0 0 0 0 0 0 0 0 0 0 0 
##$SW_h= 4990.01996007984
##$TD= 16384
##$TD0= 1
##$TE= 0
##$TE2= 300
##$TE3= 300
##$TEG= 300
##$TL= (0..7)
0 120 120 120 120 120 120 120 
##$TP= (0..7)
150 150 150 150 150 150 150 150 
##$TP07= 0
##$TPNAME0= <>
##$TPNAME1= <>
##$TPNAME2= <>
##$TPNAME3= <>
##$TPNAME4= <>
##$TPNAME5= <>
##$TPNAME6= <>
##$TPNAME7= <>
##$TPOAL= (0..7)
0.5 0.5 0.5 0.5 0.5 0.5 0.5 0.5 
##$TPOFFS= (0..7)
0 0 0 0 0 0 0 0 
##$TUNHIN= 0
##$TUNHOUT= 0
##$TUNXOUT= 0
##$USERA1= <user>
##$USERA2= <user>
##$USERA3= <user>
##$USERA4= <user>
##$USERA5= <user>
##$V9= 5
##$VALIST= <valist>
##$VCLIST= <CCCCCCCCCCCCCCC>
##$VD= 0
##$VDLIST= <DDDDDDDDDDDDDDD>
##$VPLIST= <PPPPPPPPPPPPPPP>
##$VTLIST= <TTTTTTTTTTTTTTT>
##$WBST= 1024
##$WBSW= 4
##$XGAIN= (0..3)
0 0 0 0 
##$XL= 0
##$YL= 0
##$YMAX_a= 300086
##$YMIN_a= -232574
##$ZGOPTNS= <>
##$ZL1= 120
##$ZL2= 120
##$ZL3= 120
##$ZL4= 120
##$ABSF1= 10
##$ABSF2= 0
##$ABSG= 5
##$ABSL= 3
##$ALPHA= 0
##$AQORDER= 0
##$ASSFAC= 0
##$ASSFACI= 0
##$ASSFACX= 0
##$ASSWID= 0
##$AUNMP= <proc_1d>
##$AZFE= 0.1
##$AZFW= 0.1
##$BCFW= 1
##$BC_mod= 2
##$BYTORDP= 1
##$COROFFS= 0
##$CY= 11.3945322036743
##$DATMOD= 1
##$DC= 2
##$DFILT= <>
##$DTYPP= 0
##$F1P= 18.9103706918063
##$F2P= -1.10871071338519
##$FCOR= 0.5
##$FTSIZE= 0
##$FT_mod= 4
##$GAMMA= 1
##$GB= 0.15
##$INTBC= 1
##$INTSCL= 1
##$ISEN= 128
##$LB= 0.24
##$LEV0= 0
##$LPBIN= 0
##$MAXI= 10000
##$MC2= 0
##$MEAN= 0
##$ME_mod= 0
##$MI= 1.114404
##$NCOEF= 0
##$NC_proc= 0
##$NLEV= 6
##$NOISF1= 3.799351
##$NOISF2= 2.8
##$NSP= 1
##$NTH_PI= 0
##$NZP= 0
##$OFFSET= 15.70392
##$PC= 1
##$PHC0= -8657.616
##$PHC1= 14.20097
##$PH_mod= 1
##$PKNL= yes
##$PPARMOD= 0
##$PSCAL= 0
##$PSIGN= 0
##$REVERSE= no
##$SF= 200.130013532006
##$SI= 16384
##$SIGF1= 3
##$SIGF2= 2
##$SINO= 400
##$SIOLD= 16384
##$SREGLST= <1H.CDCl3>
##$SSB= 0
##$STSI= 0
##$STSR= 0
##$SW_p= 3612.71676300578
##$SYMM= 0
##$S_DEV= 0
##$TDeff= 0
##$TDoff= 0
##$TI= <>
##$TILT= no
##$TM1= 0
##$TM2= 0
##$TOPLEV= 0
##$USERP1= <user>
##$USERP2= <user>
##$USERP3= <user>
##$USERP4= <user>
##$USERP5= <user>
##$WDW= 1
##$XDIM= 8192
##$YMAX_p= 0
##$YMIN_p= 0
$$ End of Bruker specific parameters
$$ ---------------------------------
##NTUPLES= NMR FID
##VAR_NAME=  TIME,          FID/REAL,        FID/IMAG
##SYMBOL=    X,             R,               I
##VAR_TYPE=  INDEPENDENT,   DEPENDENT,       DEPENDENT
##VAR_FORM=  AFFN,          ASDF,            ASDF
##VAR_DIM=   8192,          8192,            8192
##UNITS=     SECONDS,       ARBITRARY UNITS, ARBITRARY UNITS
##FACTOR=    0.0002004,     1,               1
##FIRST=     0,             0,               0
##LAST=      1.6414764,     0,               0
##MIN=       0,             -232574,         0
##MAX=       1.6414764,     300086,          0
$$ Real data points
##PAGE= N=1
##DATA TABLE= (X++(R..R)), XYDATA
0 0 0 0 0 0 -8 0 -8 8 -8 16 -16 24 -24 32 -40 48 -57 72 -82 97 -114 132 -154 178 -203 234 -268 303 -344
29 -344 388 -438 492 -549 617 -689 765 -852 947 -1050 1164 -1289 1428 -1582 1750 -1940
45 -1940 2152 -2389 2664 -2975 3338 -3767 4281 -4912 5708 -6746 8164 -10238 13556 -19736
59 -19736 35215 -155023 -176500 195344 120859 -134999 -232574 -22217 101932 13695 -117153
70 -117153 -41970 93453 111191 10147 -32801 -10531 34712 80041 129433 96358 -11237
81 -11237 -65022 34000 142437 90136 -52994 -47884 93476 115316 -56925 -151016 -4890
92 -4890 160871 80784 -128510 -159199 17853 119525 6705 -121883 -71452 48060 47636
103 47636 -42757 -73543 -26461 9586 6800 3597 -4919 -46568 -70332 -4144 77310 28676 -103173
116 -103173 -108750 42185 124108 5679 -136614 -86833 81340 119206 -14288 -99729 -12205
127 -12205 93531 57943 -35204 -28993 54825 83695 29917 -15843 -2954 26323 36622 43241
139 43241 39967 -1630 -40364 -8544 47484 22694 -53400 -50649 35279 54746 -53153 -136677
151 -136677 -52133 90338 74958 -80029 -142540 -29493 78826 34982 -67024 -65245 26936
162 26936 65361 2170 -56949 -27874 38928 61440 33622 -6808 -29499 -14148 30178 54844
174 54844 27017 -20061 -26919 10648 30798 -2779 -34901 -6507 37020 17137 -40808 -47506
186 -47506 4482 34980 4741 -31527 -16234 20928 14607 -23122 -24724 16595 38909 15012
198 15012 -17724 -20075 2925 21406 19120 7293 -906 -8495 -10748 3230 16913 4677 -17648
211 -17648 -14557 8336 13437 -11319 -32322 -15159 20777 23585 -11427 -33497 -17145 9135 16143
224 16143 6314 -5937 -10060 -4434 2733 5291 3506 -400 953 8692 6127 -10812 -14987 5683
238 5683 20375 7596 -10287 -9118 2244 2101 -7866 -3647 17765 21744 -8712 -32405 -12133
251 -12133 25210 31313 3305 -20800 -12521 12368 17097 -1328 -10313 3429 16691 10130 -9339
264 -9339 -21103 -8899 16474 22192 -970 -22060 -16358 1736 7053 -2978 -8265 1750 7587
277 7587 -8283 -23668 -9528 16442 17569 -5531 -20588 -9092 13241 14786 -6398 -16702 1467
290 1467 20764 12712 -11004 -18977 -564 21444 16340 -9434 -18020 1302 16965 8086 -9651
303 -9651 -13844 -1559 12224 11066 -1848 -10081 -8741 -2570 5571 9395 3780 -2273 -2522 -3166 -5781
318 -5781 -787 9632 12538 5181 -4808 -8798 -3613 2795 4664 8158 12768 4523 -13749 -18954 -4596
333 -4596 12215 15676 6316 -5860 -13043 -16221 -13809 2013 20684 15667 -11681 -28000 -17443
346 -17443 1382 8605 4076 297 2109 -558 -13226 -19489 -4222 18743 26091 11068 -13415
359 -13415 -23897 -7356 18222 24556 11793 -87 -2234 -126 -565 -1169 6039 18916 18374 -360
373 -360 -15929 -12194 2442 12623 10783 197 -6610 -5116 -6187 -11201 -7638 5232 10930 -284
387 -284 -17486 -21577 -6569 8169 3588 -8746 -8619 -775 -720 -6442 -8056 -2483 5265 6993 1281
402 1281 -2808 -1443 -14 1830 7100 9677 6559 3807 3633 2306 2152 5297 7958 7861 5547 2186
418 2186 804 434 -3567 -4774 4272 11528 1901 -13776 -15692 -5227 2710 281 -6210 -5923 -2019
433 -2019 -6097 -13827 -10340 2215 7942 3706 -3064 -7330 -5942 975 6954 8869 9044 6332 1273
448 1273 -1998 -631 4637 12600 14817 4863 -5958 -6047 -175 2934 3162 2033 -788 -3693 -7485 -10957
464 -10957 -8642 -1245 2394 6 -5056 -10607 -11392 -4427 2986 3982 2362 812 -2220 -3818 -329
479 -329 5124 9512 9454 3703 -565 2175 4326 2141 3147 8584 8268 233 -5975 -4926 1777 6082
495 6082 2362 -2869 -2536 -1719 -4007 -3748 153 1760 907 -50 -2426 -5007 -3163 1661 4060 2076
511 2076 -3087 -5284 -1493 1313 -2901 -5185 -269 1693 -3897 -8705 -6958 -1852 901 -1021 -4764
526 -4764 -4176 -1401 -573 488 2991 3252 2816 5493 6645 4379 5027 9178 11211 9800 6887 4711
542 4711 5796 8011 6147 3103 2909 1652 -2510 -4244 -3954 -5338 -6962 -7093 -8223 -10296 -11792 -12158
558 -12158 -9891 -6307 -6496 -9250 -7310 -3434 -2947 -2776 451 3641 5108 6011 5229 4708 6797 9489
574 9489 10973 11440 8974 4407 4179 7543 6472 2608 2037 3120 975 -3555 -6708 -6129 -1844 -22
590 -22 -3908 -7928 -8410 -7516 -4674 -1035 -1709 -4113 -1787 857 -1722 -4426 -776 6031 8774 4225
606 4225 -2961 -3429 2892 6104 3697 2024 1676 -370 -1578 -1617 -2489 -1831 2223 3836 -397 -6494 -8165
623 -8165 -949 8144 6346 -3685 -5093 3488 6777 824 -2787 1875 8782 7933 -1130 -6549 -1213
638 -1213 5410 3808 -1348 -4266 -4908 -3138 -1043 -3582 -8173 -7380 -1930 578 -3221 -9631 -9053 1026
654 1026 6896 110 -6219 -296 8758 8492 1621 -1538 4319 13382 14015 5190 -720 2442 7546 8102
670 8102 4667 610 621 2894 -370 -7646 -8761 -2888 1532 -290 -7559 -15061 -14533 -5179 1442 -595
686 -595 -6579 -9493 -6247 -320 -543 -4417 -342 9702 9888 -1583 -8799 -1420 12028 16704 7770
701 7770 -2291 -1637 3870 5162 4412 4493 3943 2736 1827 -2518 -7419 -4255 5623 10406 2325 -12088
717 -12088 -15439 -1404 11589 5223 -8504 -8203 2302 3978 -4679 -8959 -241 10322 6699 -7817
731 -7817 -13118 -2955 7529 7727 64 -7669 -7578 712 5695 646 -5091 -2958 3475 4710 -2134
746 -2134 -8151 -2259 10345 10663 -2763 -10298 -2275 9808 11265 1806 -6420 -1980 6664 5786 -1820
761 -1820 -3146 2850 6161 1345 -6979 -8033 1227 8309 2952 -6760 -9070 -4772 820 3721 992
776 992 -4154 -5168 -1927 283 67 -1378 63 4639 4931 -2978 -8143 -503 10585 10099 8 -6382
792 -6382 -2702 4883 5784 270 -944 2715 2140 -2310 -3551 -1848 207 2681 3056 -2191 -8182 -7008
808 -7008 503 6254 2437 -6857 -7843 951 4451 -2385 -5868 892 6894 3102 -5871 -7726 1704
823 1704 10350 6264 -3475 -5381 515 5232 4937 928 -2133 929 5395 2950 -3112 -3328 2671 6796
839 6796 3496 -4271 -6499 609 6075 2116 -4634 -4475 351 2903 -33 -5847 -5723 1904 5386 -1025
855 -1025 -8030 -6226 1042 5240 930 -6238 -5134 2672 4204 -2312 -5039 -142 4980 3921 -1763
870 -1763 -4441 -447 4986 4642 885 -1060 -995 1283 3916 2975 -980 -850 3303 4165 343 -3381 -1948
887 -1948 3470 6622 1354 -5133 -3960 1476 3290 1130 -1198 -2073 -917 436 -1593 -3520 -900
902 -900 2772 2556 -2248 -7320 -6132 1990 6816 1604 -5554 -5923 -2044 1269 2233 314 -1568 -318
918 -318 926 -1438 -3706 -1467 4078 7766 3647 -6264 -8570 1504 10275 6784 -1343 -3247 879
933 879 2906 -287 -1931 3609 8873 3943 -5391 -7230 -1556 4669 7380 4591 -3031 -7955 -5751
948 -5751 459 4557 2686 -2241 -3372 -1536 -3729 -7181 -2758 6104 6912 -2184 -10575 -8967 829
963 829 7352 4541 -1418 -2825 -2373 -1997 627 3829 4054 2882 1584 -992 -2425 -234 3656 6749
979 6749 6090 -118 -6302 -3974 3742 7322 3974 -2229 -5111 -2319 1491 373 -1786 419 1883
994 1883 -2110 -6699 -5694 -200 4759 3597 -3441 -8076 -5828 -77 4514 5723 578 -6554 -6169
1009 -6169 1118 5035 3224 776 1482 2655 -302 -5256 -2250 8580 12819 3504 -7407 -7844 -142
1024 -142 7325 8582 3553 -2065 -4076 -3635 -1317 1918 2746 2055 1936 -1208 -8864 -11062 -1511 9543
1040 9543 8960 -3145 -13832 -11361 356 6105 2038 -2000 -1506 -1758 -4340 -5670 -2795 4472 9883
1055 9883 5287 -5778 -10804 -3990 7621 12981 6701 -3673 -5524 1315 5627 3881 2205 3881
1069 3881 6265 4477 -1862 -5898 4 9695 10359 1313 -7345 -7128 1019 6936 2849 -4728 -5009 -497
1085 -497 -415 -4523 -6721 -4091 701 1227 -5262 -10831 -8128 -540 3361 -168 -7709 -9715 -2155 5707
1101 5707 3202 -4800 -5585 1906 7376 4132 -2554 -1920 7218 11467 4492 -2551 -191 8040 12374
1116 12374 8217 -696 -3642 3483 10752 8197 -393 -4592 -129 6468 4055 -5786 -8057 852 6612
1131 6612 -319 -10780 -11364 -2415 4707 373 -9331 -10705 -3665 663 -2457 -6703 -6380 -1373 2570
1146 2570 -1421 -8279 -7217 1382 6824 3363 -4224 -6736 -518 7072 6225 -274 -2135 2326 6590
1161 6590 5555 548 -1592 4152 10767 8495 -85 -3128 2047 9094 9852 3507 -2077 -195 4562
1176 4562 4851 1526 -1063 -1127 1412 2811 -1368 -7624 -7125 -136 4061 -1008 -10755 -13519 -5101 2828
1192 2828 -1446 -9854 -9346 -2779 -1342 -6169 -8971 -3995 3715 3857 -3980 -8639 -3962 4026 8006
1207 8006 5680 -327 -2744 2208 7619 6003 2029 3121 8652 10208 3256 -4785 -1444 11170 15739
1222 15739 6218 -4451 -4827 2188 7303 5756 1163 -299 766 -585 -3608 -3916 -1257 1616 2237
1237 2237 -1543 -8698 -11002 -6643 -428 2028 -1627 -8755 -11936 -7778 -2958 -2455 -3540 -3798 -3471 -3685
1253 -3685 -5278 -6290 -2230 4296 5578 966 -2814 -1520 3076 7395 7781 5264 4414 6124 6925 5889
1269 5889 4621 5399 8925 11190 6077 -1669 -1215 6614 9792 3077 -5353 -5138 2445 5340 -2410 -10512
1285 -10512 -7968 -688 432 -4589 -9024 -8592 -4820 -2859 -5501 -7823 -5557 -1535 -254 -2925 -7551
1300 -7551 -7786 -834 5564 4039 -1301 -3527 -1793 742 3022 4418 5600 5556 2026 -1872 -862 3865
1316 3865 7089 7953 6196 1554 -2436 -1638 2621 6645 7695 4522 -204 -2194 -1894 -1255 1335 5237
1332 5237 5655 1191 -5416 -9470 -6345 2763 7820 2555 -6551 -10058 -6134 -661 186 -2732 -2963 637
1348 637 -126 -6687 -10099 -5077 3762 7934 2483 -7011 -9392 -2427 4611 5369 2055 -654 193 2224
1364 2224 443 -2136 958 7369 7764 1775 -2942 -1991 2731 5355 3748 1406 2209 2486 -43 -1639
1380 -1639 -383 2029 3456 2745 -668 -3654 -2676 63 1397 580 -1776 -2900 -1411 -55 -2208 -4430
1396 -4430 -3036 -609 865 398 -2597 -5730 -4459 212 3111 1475 -2279 -3992 -817 2928 1205
1411 1205 -2523 -1175 3611 5389 1941 -3411 -4075 1764 7506 5578 -588 -3130 -564 2640 2962
1426 2962 52 -943 2322 3869 -734 -5180 -2924 2510 4661 1190 -3501 -3782 -160 772 -1446 -1603
1442 -1603 788 1987 -41 -3121 -4819 -1681 3703 4512 -78 -4045 -3436 557 3411 1878 -1279
1457 -1279 -642 2532 1924 -1260 -2158 370 3085 3828 1304 -2272 -2692 -313 1958 2877 1333 -2004
1473 -2004 -3109 -695 824 -156 -988 -795 -680 -613 -1624 -3258 -2480 556 1632 -290 -2801 -3784 -1625
1490 -1625 1784 1915 -917 -1292 1066 1293 -708 -948 1712 4731 4357 -146 -2584 922 5155 4692
1506 4692 2107 801 996 2145 2696 913 -243 1582 3638 2193 -1723 -4693 -3091 2160 3526
1521 3526 -1584 -6419 -5063 -1856 -1681 -3506 -4291 -2752 -1426 -3337 -6476 -5454 -1529 333 -332 -1206
1537 -1206 -2231 -2392 -300 1618 2331 3301 3967 3074 2382 2394 2958 5195 7299 6416 3523 2383 2318 2922
1555 2922 3802 3872 2467 1483 805 -1284 -2914 -2263 -928 -271 -777 -3460 -6191 -6014 -4075 -2914 -2090
1572 -2090 -1772 -3555 -5105 -4394 -3449 -2525 -979 676 950 -139 -2495 -3565 -399 3992 4181 2003
1588 2003 990 432 -141 272 2197 4213 5544 3656 22 -1315 501 2536 4207 5329 3400 96
1604 96 -1067 76 1070 2258 3204 2726 1053 -2104 -4565 -3311 687 1761 -522 -2740 -4081 -5709
1620 -5709 -5531 -3464 -1697 -1049 -1929 -4171 -5509 -4787 -2970 -607 2256 2107 -756 -1564 252 1975
1636 1975 2676 4153 5926 6215 4115 531 188 4234 6669 5125 2865 1554 -133 -1708 -1501 -561
1652 -561 364 302 -1717 -4311 -5405 -5807 -5107 -2030 490 -1112 -4424 -5398 -4081 -1783 621 2323 3162
1669 3162 2884 -42 -2341 77 5187 6872 5023 2949 1803 1118 339 301 2449 5388 4185 -1478
1685 -1478 -5019 -3742 -1228 147 750 330 -1638 -4642 -6470 -4109 1136 2644 -588 -2466 -1521 -1310
1701 -1310 -2436 -1137 2188 4352 2762 -1228 -3115 -1153 1072 1703 3049 3190 -837 -4381 -2506
1716 -2506 1831 2536 -64 -1301 557 1768 -1258 -3948 -38 5554 4279 -698 -1461 2040 3402
1731 3402 1293 272 2656 5169 2871 -2017 -2183 1763 2618 28 -1627 -1679 -1830 -2306 -3105 -3421 -3232
1748 -3232 -3216 -3032 -2072 -2638 -5305 -5515 -1348 1602 -41 -2355 -1739 916 2472 1435 759 3355 5709
1765 5709 3717 1099 2399 4791 4093 2605 2820 4050 3344 -412 -2648 394 3974 1583 -3581 -4061
1781 -4061 -1407 -574 -2681 -3825 -2263 -46 -1155 -4431 -4043 -434 763 -683 -807 -82 -19 -37 350
1798 350 638 1549 1952 1425 1033 159 -1172 319 3538 2752 -1977 -3680 -325 2536 729 -3222 -2997
1815 -2997 1487 2882 -1854 -5158 -1216 3546 2592 -1128 -2070 -25 1873 1337 261 1381 2999 1509
1831 1509 -1177 -754 1457 2430 1954 401 -1098 -797 -182 -469 -626 70 553 119 -1434 -3362 -3169 337
1849 337 2967 1122 -2126 -2812 -1466 182 717 347 1045 1965 64 -3138 -2600 1615 4004 2357 -1015
1866 -1015 -2455 -878 482 -598 -893 1896 3521 9 -4709 -4440 303 4762 3644 -1233 -3205
1881 -3205 -949 845 392 209 1629 2744 1714 -1144 -3269 -1331 3060 4243 1490 -1619 -2331 -818
1897 -818 899 275 -278 1223 1737 -1368 -4251 -2460 1385 2932 546 -2729 -2292 532 969 -1317
1913 -1317 -1408 1233 2204 348 -1905 -1682 958 2662 709 -1775 -675 1775 1624 -509 -2152 -973
1929 -973 1650 2091 -708 -2095 313 1510 -898 -3111 -1385 2449 3562 -216 -4389 -3410 1254 2746
1945 2746 726 -678 -52 475 -432 -2461 -1881 2324 5243 2464 -2797 -4527 -1256 3364 4521 1953
1961 1953 -385 238 367 -1748 -1956 2209 5811 3951 -1787 -5571 -3227 1976 3390 1077 -625 -988
1977 -988 -2566 -4189 -3589 -329 3037 2181 -2894 -6587 -4786 -378 1519 522 -714 -1113 -858 -1927
1993 -1927 -2969 -376 4585 5560 1068 -2864 -1960 2249 5114 3897 1416 1818 2929 1351 -818 485
2009 485 3954 5047 2094 -2261 -3161 824 3095 534 -2572 -2050 55 -239 -2985 -4495 -2273 1045
2025 1045 -85 -4571 -5155 -1735 788 -554 -3482 -3696 -705 1606 10 -2208 -1139 1294 1626 521
2041 521 -32 1191 3208 2869 101 -744 2333 4894 3353 579 -17 2208 3244 931 -1411 736
2057 736 4272 2726 -2716 -4358 -632 3095 2166 -2416 -4327 -1588 422 -1451 -3414 -1726 722
2072 722 484 -2438 -4657 -2970 1254 2475 -528 -3061 -1775 860 1266 -695 -1559 1169 3835 1568
2088 1568 -3024 -2676 2176 5078 2824 -1669 -2201 1510 3659 1078 -1392 452 3228 2404 -761 -2150
2104 -2150 -406 2627 2608 -243 -1685 -676 -148 -1035 -870 -23 369 -1000 -3023 -3188 -882 546 -927
2121 -927 -2656 -2031 -557 -338 -1487 -1863 -243 2213 1949 -738 -1962 780 3593 3722 1693 126
2137 126 1347 3370 2465 -294 463 3827 3813 -444 -4029 -2305 2690 3505 -2039 -5838 -3087 1096
2153 1096 -297 -4657 -5015 -877 2359 -463 -5592 -5523 584 4649 2543 -1732 -2767 631 4122 3905
2169 3905 932 446 3192 4240 1757 -822 114 3120 4377 1212 -2578 -2116 410 519 -1030 -1549
2185 -1549 -1025 -891 -2417 -3741 -2515 526 952 -1417 -2767 -1627 204 930 660 596 1121 1283 202
2202 202 -181 1680 3288 1706 -388 -628 729 1864 328 -1618 -1080 1385 903 -2313 -3628 -847
2218 -847 2349 1571 -2164 -4597 -1335 3370 3564 -684 -2866 -430 2983 3380 89 -1647 1308 4264
2234 4264 1712 -2755 -3051 1108 4148 1628 -3588 -5013 -1323 1392 -467 -2786 -2137 -553 -933 -2980
2250 -2980 -3569 -297 3386 2800 -1103 -2807 -355 3206 4743 3187 1292 1657 2818 2190 1099 2040
2266 2040 3532 3298 903 -1624 -2204 -809 543 -275 -1365 -2365 -4453 -5401 -3814 -1184 -497 -2530
2282 -2530 -4804 -4700 -2190 -65 -640 -1256 167 1504 1288 72 -264 2182 5712 5649 1525 -743 1495
2299 1495 5142 5447 2405 -298 1085 3342 2101 -1267 -1352 1781 2898 -561 -4070 -3761 249 2303
2315 2303 -623 -4337 -3747 -495 519 -1401 -3279 -2408 119 667 -2203 -3724 -1473 1240 1054 -1490
2331 -1490 -3313 -2440 284 1516 -191 -1631 -1250 -293 75 302 438 849 1702 1277 518 1106 2442 2796
2349 2796 2668 2725 2292 2142 1726 1872 2715 3818 2437 -453 -834 1117 1930 318 -1627 -1731 -581 -645
2367 -645 -3188 -4270 -2031 -255 -1750 -4644 -5185 -2864 -437 -658 -3050 -3563 -1367 162 -593 -1630
2383 -1630 -1293 710 2515 1509 -1218 -1090 2350 4422 2718 -112 -280 2156 3880 2511 119 555
2399 555 2661 2791 837 -337 454 2081 2358 750 -885 -353 1027 965 181 -348 -466 -289 -158 -822
2417 -822 -1197 -561 -577 -1289 -1458 -1458 -1623 -1883 -1459 -1196 -1262 -1925 -2592 -1989 -505 -211 -1793 -2231 -745 346
2437 346 126 -870 -1139 373 1877 1426 -364 -130 1626 2949 2564 993 168 1839 3701 2785 561
2454 561 363 2068 3143 2073 -132 -678 1459 2962 1089 -1664 -1600 351 1506 93 -2436 -2785
2470 -2785 -351 517 -1793 -3519 -2446 -443 -410 -2422 -3776 -2660 -413 -361 -1885 -2184 -1473 -805 -391
2487 -391 -199 -407 -182 523 927 929 671 395 1351 3031 2761 707 450 1944 2842 2311 1332 1168 1506 1500
2507 1500 528 236 1153 1189 20 -377 -25 -706 -1400 -655 380 -67 -1713 -2839 -1623 251 -353 -2437
2525 -2437 -2003 3 144 -1822 -2468 -1048 905 866 -948 -1902 -382 964 489 -155 97 487 540 664
2543 664 325 122 508 1069 1262 976 -12 -487 753 1800 801 -404 -123 1072 1042 9 -1072 -192
2561 -192 1189 703 -1043 -1103 139 233 -774 -1033 -210 570 30 -1291 -1236 78 456 -396 -399 474 342 -663
2581 -663 -587 454 1153 715 41 -40 566 370 -333 332 1152 737 -263 -328 23 -264 -398 -67 377 404 -928
2602 -928 -2038 -1180 281 -170 -978 -710 -494 -1008 -1250 -1018 -155 588 61 -832 -804 82 235 188 946 1112
2622 1112 615 431 516 856 1149 1358 1343 1349 1407 360 219 1019 1450 1095 765 205 -176 -153 -208 -397 -376 7
2644 7 -524 -1075 -1660 -1810 -1625 -726 -508 -1386 -1865 -1772 -1428 -1055 -852 -869 -901 -287 -284 -769 -472 -10 749 1271
2666 1271 1195 442 241 833 1546 1593 1786 1514 1080 896 806 639 1175 1683 1288 116 -304 -251 254 777 338
2687 338 -563 -282 -100 -898 -1077 -604 -278 -212 -397 -1158 -1301 -869 -794 -522 -161 -352 -1097 -1146 -608 -538 -737
2708 -737 -574 -100 -74 -479 -1165 -795 507 649 -124 -354 442 534 110 317 870 1276 986 190 371 1449
2728 1449 1497 762 434 1082 1035 732 538 395 206 363 290 146 -94 -729 -1044 -311 348 -528 -1368 -1099 -369
2749 -369 -370 -675 -900 -522 1 -298 -1073 -502 603 615 -298 -489 -147 321 433 -126 -406 267 485 -29 -520
2770 -520 -281 32 113 224 -158 -596 -342 -26 95 210 -115 -482 226 1231 605 -402 -56 1151 1503
2789 1503 845 -28 -169 982 1619 827 45 362 495 333 316 -135 -360 -175 26 -164 -431 -1041 -1412 -626
2809 -626 15 -786 -1314 -795 -19 -681 -1398 -1249 170 1071 256 -1282 -1283 144 962 665 133 1 215 535
2829 535 105 -473 -5 1209 1349 306 -943 -1149 -147 1648 1725 46 -851 -306 292 434 307 -75
2847 -75 970 1531 192 -1418 -1144 654 2110 1652 -7 -1662 -1153 271 554 310 272 17 -563 -1127
2865 -1127 -1455 -1024 356 1013 19 -1290 -1855 -1364 77 1121 332 -808 -615 -126 -58 -356 -274 538 1507
2884 1507 1011 -762 -1353 -52 1315 1428 785 -365 -658 -16 660 510 68 170 423 617 -4 -811
2902 -811 -756 721 1286 192 -832 -519 308 825 183 -727 -490 693 980 342 -611 -963 -376 545 759
2921 759 -92 -505 -228 -201 -535 -625 -449 354 862 -256 -1698 -1634 -276 749 785 -35 -996 -1018 -214 -93
2941 -93 -267 92 896 881 50 -1327 -1412 223 2092 1841 122 -980 -1103 -43 1067 1257 793 540 352
2960 352 -396 -725 -268 945 1842 1387 -482 -1903 -1115 572 1264 800 38 -691 -732 -566 -452 -264 445
2979 445 521 -68 -1015 -1472 -1210 59 1252 311 -942 -1228 -877 -194 119 -64 -98 331 100 -841 -848 -5
2999 -5 548 914 625 -474 -727 -5 908 779 409 -119 -211 738 908 69 -318 449 951 681 25 -322 193
3020 193 717 642 -282 -460 456 594 102 -649 -819 -169 704 628 -713 -1059 -323 185 91 -602 -950 -511 424
3041 424 -7 -962 -1008 -426 239 336 -316 -1006 -537 274 176 -337 -154 114 316 149 -242 -320 441 853 423
3062 423 2 119 129 312 772 825 261 29 207 259 636 328 -94 108 672 58 -372 -220 228 351 295
3083 295 -288 -700 -406 130 -37 -260 -377 -408 -101 62 -675 -995 -290 704 390 -740 -1210 -541 620 683
3103 683 -317 -883 -161 538 131 -347 -246 377 875 356 -915 -727 412 1004 665 -48 -263 -362 248
3122 248 209 -102 258 787 322 -355 -651 -104 547 1097 692 -152 -525 -287 -82 324 759 558 74 -520
3142 -520 -939 -745 530 906 461 -279 -685 -608 -465 -54 298 651 364 -1100 -1522 -582 394 382 54 -208
3162 -208 -211 -556 -924 -756 228 1097 463 -828 -1079 -662 71 658 720 40 -6 23 -184 -216 262 983 1032 543
3184 543 -405 -494 485 1185 748 -38 181 668 542 106 -364 -21 827 532 -402 -557 108 234 -95 -485
3204 -485 -617 7 370 -335 -1183 -1001 -232 -54 -389 -758 -696 -247 -334 -1187 -1150 140 748 61 -671 -1074 -583
3225 -583 340 633 340 412 617 58 -345 -154 790 1727 1877 805 -513 -369 653 1250 1278 988 617 197
3245 197 -319 -618 -75 1083 1249 105 -1026 -1418 -1025 -174 352 89 -439 -986 -1405 -1625 -707 115 242
3264 242 -70 -816 -967 -1062 -360 48 475 962 390 -699 -1152 -70 1266 1579 659 -596 -378 541 453
3283 453 -234 180 868 1070 247 -874 -710 476 1352 616 -362 -486 57 485 270 -248 -258 464 919 -80
3303 -80 -960 -557 540 926 -156 -1192 -772 664 458 -1091 -1536 -276 810 231 -1137 -1506 -517 579
3321 579 17 -1014 -674 230 452 90 -410 -322 193 1065 669 400 89 -31 370 848 854 447 284 205 -69
3342 -69 10 268 157 247 289 -181 -695 -241 -258 -237 8 288 -322 -697 -565 -97 354 241 -291 -196 362 81
3364 81 -567 -106 1017 1098 -137 -996 -424 828 1044 -502 -1147 66 919 -28 -1098 -855 277 849
3382 849 164 -1064 -1081 -63 664 465 174 -290 -350 550 789 190 -398 420 1044 709 -268 -516 259 1105
3402 1105 425 -657 -577 358 122 -759 -700 211 533 -334 -1431 -1174 221 710 -330 -907 -124 388 164
3421 164 -166 -112 377 892 378 -9 232 598 415 464 691 577 192 -46 -151 93 594 433 -131 -582 -645
3442 -645 -356 54 210 -428 -1088 -472 12 -258 -830 -957 115 883 191 -1328 -1018 414 941 114 -566
3461 -566 -87 445 140 -282 -215 572 551 -278 -379 231 474 16 -96 294 528 460 -117 -229 292 679 448
3482 448 527 492 -74 -151 169 645 252 33 -67 31 176 -217 -412 -311 218 -424 -519 -157 -135 -872 -1117 -371
3504 -371 280 289 -836 -1542 -509 674 342 -791 -771 110 616 143 -751 -644 741 1328 531 -469 -326
3523 -326 340 960 872 325 161 585 725 195 70 282 710 898 528 -319 -665 103 667 308 -170 -164 102
3544 102 -322 -890 -1048 -15 646 -133 -1353 -1304 -511 -119 2 -352 -628 -235 -404 -666 -394 -9 -57 -1
3564 -1 447 352 -179 -315 174 884 914 420 -171 -21 457 484 156 407 271 210 141 109 -163 -41 302 389 248
3587 248 -293 -430 -155 650 331 -129 -40 302 219 -77 -311 -161 488 550 -192 -590 -162 250 -186 -401 -384
3608 -384 -223 76 -316 -1088 -1002 -132 309 -146 -708 -931 -457 137 19 -386 -375 -38 164 71 149 -18 308
3629 308 749 712 270 43 497 680 675 703 353 586 508 117 -98 423 615 227 -87 -17 -43 -122 -54 -31 0 -29
3653 -29 -382 -520 -149 -264 -356 -266 50 -268 -461 -521 -526 -219 -152 -558 -557 -265 -364 -444 -378 -87 -308 -303 -37 -94 -231
3678 -231 -143 93 353 516 297 70 284 650 645 505 507 622 409 613 612 527 722 545 115 313 243 234 30 27
3702 27 -270 -317 -205 -290 -478 -448 -512 -679 -397 -574 -650 -751 -410 -519 -444 -359 -453 -319 -95 -134 -325 -106 288
3725 288 180 93 62 142 519 454 164 32 465 471 186 129 359 440 163 243 206 8 173 122 33 99 -104 -201 97
3750 97 109 -257 -422 -15 298 -89 -404 -280 -83 340 70 -327 -247 -6 -51 -23 212 155 108 -13 1 4 250
3773 250 136 33 -10 -87 -207 -134 40 -72 -306 -18 -36 -365 -390 -377 -79 -2 157 -155 -277 -250 -83 182 440
3796 440 143 -81 -116 152 230 334 197 147 141 384 397 -100 -80 346 538 390 -197 -590 164 706 263 -354
3818 -354 -441 242 434 247 -393 -249 219 413 80 -420 -251 98 241 259 -481 -671 -96 59 -281 -679 -562
3839 -562 -55 3 -522 -916 -668 170 103 -572 -772 -275 330 376 12 -192 -39 477 594 563 578 458 512 759
3861 759 845 605 612 697 644 522 356 45 137 417 212 -175 -454 -548 -629 -79 -155 -592 -963 -677 -384 -526 -736
3884 -736 -614 -286 145 -155 -874 -668 103 620 129 -176 -421 109 549 441 -287 -97 518 585 -114 -645
3904 -645 -424 565 913 -143 -891 -414 549 658 231 -441 -250 642 780 65 -250 227 716 760 192 -156
3924 -156 12 746 799 -22 -230 55 284 -64 -348 -397 -261 -67 -494 -737 -451 -222 -296 -617 -421 -513 -720
3945 -720 -482 -72 154 14 -335 -319 161 670 286 -36 59 368 447 459 161 3 486 703 361 -278 -283 285
3967 285 884 390 -603 -771 336 896 42 -671 -356 371 681 -10 -749 -278 792 672 -274 -543 -167
3986 -167 364 453 -165 -534 -173 461 180 -533 -620 -200 261 260 -534 -995 -320 316 176 -510 -788 -413 272
4007 272 384 -232 -538 92 276 249 -46 -33 166 467 280 141 236 349 48 -57 403 543 119 -292 20
4028 20 457 299 -369 -586 212 699 -29 -670 -407 379 393 -227 -619 -379 420 311 -183 -503 -182 251 112
4049 112 4 -496 -505 318 670 -169 -915 -611 543 719 -153 -1197 -650 903 883 -447 -1002 -142 887
4068 887 613 -545 -831 -104 666 390 -361 -456 51 283 176 -69 -255 16 279 64 -20 185 130 203 165
4089 165 209 -52 124 266 265 324 99 128 119 273 70 18 121 -25 -154 -113 -45 -227 -182 65 -38 -323 -648 -723
4113 -723 -77 552 -86 -1075 -865 223 595 -342 -978 -417 697 870 -447 -1077 -213 1251 982 -179
4131 -179 -710 -201 760 907 68 -471 -16 424 505 -60 -212 -181 664 636 -250 -612 14 798 467 -91 -442
4152 -442 99 576 54 -528 -244 465 471 -232 -482 -361 206 232 -93 -510 -414 -264 -373 -227 -287 -535 -518 -78
4174 -78 -239 -232 -277 -189 -139 225 294 10 -224 148 542 714 289 -365 153 866 1034 339 -203 -8 659 848
4196 848 337 -348 -291 366 484 -247 -573 -327 205 269 -376 -1005 -390 534 199 -423 -723 -144 299 59 -520
4217 -520 -471 476 737 1 -692 -401 426 794 216 -383 -489 127 397 200 -190 -300 67 343 -26 -556
4237 -556 -329 199 401 3 -399 -297 -164 153 304 54 298 98 -132 75 554 403 -69 26 244 348
4257 348 100 -16 -101 193 434 169 -362 -256 -21 176 282 -364 -479 82 258 -225 -505 -34 229 175 -273
4278 -273 -590 -220 410 171 -629 -568 97 429 43 -310 -480 0 458 34 -511 -456 69 455 181 -292 -536
4299 -536 144 600 166 -384 -262 274 365 158 -126 -54 410 469 197 85 349 182 -18 95 176 271 220 69
4321 69 -131 94 229 66 -201 -191 -108 36 86 -191 -541 -102 65 -338 -420 -232 -155 -196 -332 -243 -18 24 -149
4344 -149 -474 -229 207 170 -196 -117 112 367 435 17 -238 125 531 426 136 -139 92 490 590 -103 -139
4365 -139 418 450 263 -189 -125 20 224 -40 -321 -247 100 109 -156 -186 -21 -212 26 -87 -123 -166 52 18 -221
4388 -221 -205 -124 115 222 -263 -344 -70 -8 -241 -156 -148 69 -36 -344 -470 -186 239 -120 -211 47 111 -106 -88
4411 -88 175 264 415 231 4 -29 263 502 293 161 93 290 488 183 -197 -107 500 299 -31 -331 -342 19
4433 19 161 -55 -237 -42 -68 -272 -381 -113 -39 46 76 -289 -324 -90 196 -27 -4 -88 55 279 -182 -328 -171
4456 -171 205 154 -272 -274 -36 -12 -70 -11 52 24 62 -121 -179 92 162 26 199 68 161 250 272 204 173 310 213 96
4482 96 163 36 44 346 190 -93 -58 85 -20 -172 -194 -106 -25 -25 -307 -392 -160 -143 -190 -259 -121 -185 -140 -59 -259 -62
4508 -62 159 171 -15 -120 -88 -27 179 107 -15 119 236 6 -246 12 248 91 -80 97 142 -29 -32 118 142
4531 142 219 176 -64 13 10 -57 88 317 -31 -32 2 163 78 91 46 64 267 -64 -405 -48 304 -2 -169 -78 38
4556 38 18 -104 -338 -108 188 -102 -405 -200 5 -92 -69 -68 101 -87 -46 -124 -93 62 -43 12 304 -3 -128
4579 -128 -61 126 140 73 -17 -54 168 161 89 0 172 347 107 107 142 93 -15 225 51 61 144 171 -69 -172 268
4604 268 65 -90 -76 -63 16 -98 -242 -63 62 -28 -307 -156 101 -105 -152 -139 -8 92 -84 -294 -78 26
4626 26 75 -201 96 53 -79 -56 39 184 -61 -200 -3 167 147 -91 -31 253 457 -44 -86 160 291 178 77
4649 77 105 150 215 146 -113 113 107 54 99 82 -21 -199 -63 66 -54 -126 -108 -153 39 -106 -128 -195 -50 -195 -171
4674 -171 -184 -109 -161 -98 5 -201 -26 -123 -2 -9 -66 50 -82 -4 -28 55 241 136 -37 55 180 -22 14 109 103
4699 103 83 -43 3 72 51 58 -22 145 67 30 -163 40 221 194 -56 65 117 54 -78 -110 155 101 -99 -197 69
4724 69 10 -194 -10 82 -79 -164 -195 -76 18 -28 -217 -322 52 -194 -240 -89 -61 -199 -98 31 80 121 -9 -71
4748 -71 151 258 -94 14 80 141 89 149 241 252 126 84 -48 -92 104 104 111 133 45 -121 8 15 -101 -7 62 39 -236
4775 -236 -88 -7 -33 -44 43 -54 -23 -103 -256 -3 76 -27 -206 -85 -118 -179 -164 49 22 -97 -138 -34 17 66 10
4800 10 -16 204 -16 -25 100 186 280 171 175 58 165 118 166 113 99 214 141 125 147 -38 6 161 239 -41 15 -124
4826 -124 4 -6 -44 -129 43 137 -171 -75 -16 -69 2 -168 -66 -100 -262 -220 38 -121 -170 -148 33 104 -136 -42 -3
4851 -3 129 73 34 -24 -118 -113 -45 -63 134 127 -104 107 153 11 -20 118 381 288 -48 33 113 218 368 -3 -9 183
4877 183 114 -36 81 79 -37 54 190 -111 -152 -92 30 118 -163 -206 -134 25 -43 -158 -27 78 -123 -59 -168 -228
4901 -228 -227 -38 49 -189 -181 -123 23 61 -67 -165 10 174 103 -40 -176 59 155 172 163 -122 91 180 117 47 135 70
4927 70 140 180 238 33 74 172 247 91 3 -125 55 65 -76 -202 -66 55 -56 -29 27 -242 -80 84 -29 -131
4951 -131 -118 38 -14 73 -199 -272 -48 78 -156 -184 -123 -29 54 74 -58 -125 21 165 140 -53 -214 -160 189 348
4975 348 -17 -248 26 272 311 66 -52 85 168 180 79 71 126 137 123 235 53 45 8 240 69 -155 -83 -3
4999 -3 160 43 -262 -255 10 115 -156 -212 -118 -97 -55 -100 -247 -221 60 16 -101 -203 -187 -120 135 42 -332 -253 -26
5024 -26 196 51 -20 -177 69 428 173 -236 -91 47 394 552 -14 -142 77 435 273 -133 -159 78 233
5045 233 208 -72 -61 234 144 87 207 -97 -77 94 155 -9 -236 -94 -34 36 -144 -219 -175 293 140 -362 -294 47
5069 47 291 -61 -269 -318 -66 105 35 -81 -182 45 184 153 -93 -238 -75 179 344 58 -202 -120 194 263
5091 263 149 -138 -131 145 284 194 -98 -69 -73 356 185 -28 -76 132 282 124 0 -99 -3 188 5 -260 -213
5114 -213 3 76 -13 -137 -212 18 -9 58 -307 -209 -21 218 35 -188 -350 -2 374 -17 -409 -183 177 286
5136 286 152 -228 -272 61 269 114 -113 -194 -68 259 180 -121 -377 -141 242 249 58 -55 32 198 234 -26
5158 -26 -76 60 31 54 150 88 -56 5 157 176 -23 -196 -148 120 125 -120 -227 15 -22 -28 -128 -141 -86 53 -118
5183 -118 -243 -303 36 142 -109 -399 -205 -24 216 202 -333 -373 165 318 76 -132 -175 252 355 253 -183
5204 -183 -211 121 255 313 -151 -242 41 256 179 -91 -307 110 301 65 -77 -250 140 204 96 -147 1 135
5226 135 150 -65 -50 39 11 -12 -3 -231 -91 41 41 0 -48 -270 -173 -10 -18 -181 -256 -137 53 128 -44 -156 -109 97
5252 97 186 84 -188 -118 200 404 137 -206 -91 180 357 248 -44 -151 143 392 255 -95 -99 -13 141 165
5274 165 -52 -251 -114 351 68 -273 -281 -7 139 -38 -402 -219 183 119 -72 -279 -108 66 149 -114 -219
5295 -219 -31 179 64 -87 -42 -156 -57 302 -65 -297 -192 253 169 -45 -149 -94 84 201 74 -19 -148 60
5317 60 104 181 233 -211 -51 318 200 89 -59 -39 125 176 39 -224 -237 17 151 13 -77 -235 -26 110 217
5340 217 -203 -299 -5 62 17 -150 -252 123 153 19 -301 -66 250 78 44 -136 -36 115 250 19 -82 -87
5362 -87 201 184 -49 -267 -248 143 210 -9 -247 -41 249 44 12 -129 -36 250 49 -76 -2 -21 37 55 178
5385 178 214 62 -10 73 123 112 84 110 23 81 -18 -124 -19 -26 -77 24 -7 -188 -59 116 -119 -183 -130 -41 26 51
5411 51 -242 -127 127 178 -181 -182 -4 123 -34 41 -137 21 139 108 110 16 -79 136 343 152 -121 -117 191 403
5435 403 -42 -122 -172 311 363 -11 -161 86 188 248 -92 -53 -93 -13 78 -34 -163 -138 -30 -73 -79 -173 -40 -152
5459 -152 55 -93 -273 -88 -52 14 -95 -81 6 -66 -182 -69 -7 8 -9 -98 47 -38 -1 -14 82 112 23 37 -40 2
5485 2 74 202 11 0 172 200 60 15 -145 167 249 137 63 -150 60 146 -77 -231 -109 128 49 -244 -84
5508 -84 -181 -51 27 -65 -71 -180 -97 -91 53 -209 -99 6 59 3 -78 -43 85 22 -159 -26 30 43 123 -138 -104 29
5534 29 57 -61 -128 139 -19 28 57 102 -10 -3 99 74 113 228 105 85 49 3 21 50 24 82 66 59 3 -148 8
5561 8 5 36 -135 39 43 134 -76 -196 -107 -132 69 -56 12 -79 -78 120 127 -219 -118 145 100 -46 -129 -87 84 76 -29
5588 -29 -61 89 195 50 -2 -146 143 -38 77 -96 -46 -22 17 122 67 71 -28 -72 183 41 -53 50 173 28
5612 28 -24 56 -4 174 -25 -42 -57 85 66 -80 -17 4 -1 21 -128 115 -42 8 -119 -3 -10 -116 -205 -120 -47 -16
5638 -16 63 -14 9 -80 -19 -65 -36 66 -128 -7 -24 -175 -54 -85 64 -90 -3 41 52 -12 7 -39 -50 142 87 138
5664 138 76 83 106 118 58 86 185 146 8 115 86 18 180 36 5 98 150 113 -70 -82 37 -161 -149 -136 -139 -68 -55
5691 -55 -104 -51 -30 -130 -166 -119 42 -153 -151 2 -115 -41 -22 38 13 119 24 -129 184 79 43 78 65 151 46 146
5717 146 221 147 152 87 374 134 145 81 166 247 3 178 100 97 -3 -95 -128 -109 -48 -95 -101 -79 -135 -99 -170 -55 -209 -247
5745 -247 -156 -56 -139 -84 56 -65 24 35 131 -54 61 86 -19 32 73 124 162 145 10 148 137 132 126 -64 37 -60
5771 -60 -12 7 -109 34 37 -40 -60 21 11 164 84 34 103 99 150 -90 195 -43 -15 -207 128 54 -104 -3 -32 -133
5797 -133 -53 -140 -168 -31 -12 -162 -121 -139 -225 -225 -61 105 -135 -107 -31 4 -67 36 23 198 99 19 3 249 125 7
5823 7 38 134 -31 105 21 98 -10 25 40 37 -12 -165 75 -63 8 -58 9 56 95 -107 108 171 65 11 -57 -14 -73
5850 -73 75 -25 143 5 -42 -109 -103 39 -74 -193 -58 -93 -168 -66 -274 -151 -122 -152 -91 -40 -102 -112 -36 50 41 71
5876 71 -11 98 125 209 -36 109 156 61 78 176 121 0 20 64 34 20 -32 28 -97 78 -52 -63 -102 -128 -77 55
5902 55 -9 -55 -83 -102 -55 -50 -139 -125 17 24 -27 -136 64 108 -126 -21 35 -51 -16 -51 7 102 30 -8 50 -64 -32 83
5930 83 121 125 101 -2 88 116 39 16 -4 86 102 149 106 38 31 -129 -40 14 -30 -114 -119 -76 2 -30 -106 -61 -69 -44 20 57 -89
5961 -89 -206 -68 32 50 -57 71 -105 5 -8 -74 -5 -42 149 -9 -62 32 116 9 25 101 50 -137 -6 13
5985 13 -18 -11 8 -43 53 151 -109 -36 -47 -153 -102 142 27 -120 -61 98 243 18 -36 90 105 73 -54 -11 156
6010 156 72 35 -27 94 53 82 -2 -21 89 -25 -7 -49 80 -10 -86 109 -26 -253 -84 112 -2 -57 -225 -77
6034 -77 -71 -30 -7 -129 29 -8 65 -4 45 -23 -130 151 229 78 -93 -79 9 84 226 77 19 -53 55 55 143 -89
6060 -89 -257 95 202 7 10 89 76 69 31 -68 23 -45 -58 -103 -46 -60 -6 93 -55 -86 -52 -112 -41 18 -2 -48 -10 109
6088 109 -134 -122 94 129 -88 15 -102 91 140 92 -106 -150 131 12 3 10 -12 -76 102 243 52 -33 30 -34 49
6113 49 189 0 -123 13 -5 49 -30 24 -99 -150 192 38 -104 -84 -127 -65 -129 -46 -156 -149 -34 -15 -79 -90 -93 -58
6139 -58 -36 41 156 -47 20 -106 -170 -54 -2 -6 -43 -104 -80 156 108 -59 -117 51 128 2 -158 -61 107 168 229 -28
6165 -28 -29 18 6 78 141 -78 -103 11 131 76 -145 -73 -82 87 62 -88 -61 -3 -172 -20 -70 -69 -192 -28 93 -69
6191 -69 -28 -87 -26 26 -96 -19 -44 103 -94 47 -117 51 7 -45 -35 -28 28 74 36 -142 179 -28 111 238 -32
6216 -32 -15 155 290 175 -22 -160 24 149 51 -227 15 14 12 -11 -42 -178 -208 33 83 -30 -226 -155 -72 -37 -141
6241 -141 -113 -96 70 -51 -33 -71 -20 42 4 44 9 -19 19 -36 8 153 81 55 -36 71 -77 52 -14 51 -103 50
6267 50 -54 27 -16 -19 -120 45 89 57 54 -20 -52 -71 138 119 -29 -202 -45 244 129 116 -154 136 150 66 27 -166
6293 -166 68 -88 116 -85 -176 -19 89 136 92 -145 -58 -63 74 -39 -114 4 55 -45 -70 64 52 -46 -71 -85
6317 -85 -138 91 37 -110 -241 -28 -53 139 46 -205 -180 110 118 76 -85 -93 34 144 105 -48 -13 95 -36 165
6341 165 294 -54 -87 -32 220 101 -4 -69 20 77 174 -180 -91 11 63 -62 -12 -57 -3 -113 22 -106 -70 -196
6365 -196 -89 10 -16 -89 8 38 -41 18 -99 168 112 9 20 72 95 -6 4 -56 32 64 100 -40 -78 125 117 122 -80
6392 -80 -198 -113 38 83 112 -65 -81 86 95 19 -137 -48 62 -15 101 -97 -89 2 -59 109 41 -114 -148 18 40 -38
6418 -38 -36 -64 -47 27 -70 -70 -38 34 -59 -22 91 77 -59 -14 123 14 -90 72 58 73 -7 -11 141 -7 -49 -69 80
6445 80 153 155 -96 -45 -74 -37 -35 36 -77 -140 -23 39 30 -19 -150 -157 121 62 -103 -66 88 65 -24 -71 -17 -24 6 -18 -77
6474 -77 -140 -15 179 51 2 -29 -64 217 39 -153 -90 20 3 80 -21 -122 -94 34 -61 -35 42 -98 -41 -23 -29
6499 -29 -78 13 216 142 -140 -96 92 -12 230 55 -12 13 85 42 76 41 54 2 137 -27 -80 4 96 80 76 -172
6525 -172 -178 111 109 5 -39 60 171 -63 8 -45 -122 90 32 -111 -78 -117 -148 -99 15 -98 -135 9 8 -71 -91 -58 -2
6552 -2 71 93 136 -3 36 -15 -125 -8 87 70 58 162 -67 -121 17 183 14 109 -52 -49 18 32 -56 28 18 12 -67
6579 -67 -28 31 18 17 -40 86 -81 -61 14 53 -66 -82 -143 32 21 55 4 40 -5 -52 81 -16 -71 134 89 143 -22
6606 -22 -37 43 33 -18 2 28 141 16 -67 -3 8 140 34 10 -77 4 -56 -28 68 -44 -96 -62 85 49 -166 -120 17
6633 17 -81 116 0 -4 -43 64 73 15 -93 -7 -39 50 13 -91 -31 126 -73 -14 -114 -31 -10 56 13 -60 2 120 84
6660 84 -71 -48 17 7 115 -17 107 -78 57 105 92 -48 -10 10 -159 -150 61 54 51 28 -3 -112 -109 -88 -39 -49 -15
6687 -15 -57 -9 60 -107 -78 -14 153 -27 47 -154 -117 -125 67 25 20 141 63 -79 0 139 5 -117 -42 -24 -22 -66 41
6714 41 47 82 -43 -46 -54 241 137 -138 -63 39 -57 -42 13 72 -30 -16 -159 31 -32 -74 -121 -56 -5 -110 98 17 -51
6741 -51 -41 -10 -58 127 -83 -17 18 115 -65 79 -19 53 52 9 -44 38 43 -24 -16 -47 -27 -4 -14 95 70 26 -4 -10 -53 -20
6771 -20 -42 -50 -65 -54 4 98 -69 -78 60 97 65 -31 19 -85 -105 -63 89 82 74 -86 39 -52 -10 95 -13 67 48 16
6799 16 -55 -11 49 34 -90 155 57 82 42 -67 -12 -8 -23 -6 93 32 -45 -181 71 76 -106 -11 -57 -35 17 -63 -8 -4 -40
6828 -40 6 -38 16 -30 -53 -82 -88 26 38 37 -90 87 -144 27 124 -15 -60 -29 29 211 85 150 194 92 56 14 82
6855 82 14 76 48 80 31 -6 -120 -108 -25 -119 12 -8 11 -36 -28 -125 -77 -127 -39 -107 -12 -83 -4 -47 50 -46 -83 -138 -40 -29
6885 -29 -61 18 154 34 -105 -37 -23 103 -7 58 119 59 -3 85 -105 84 129 -29 65 181 81 63 -26 138 94
6910 94 80 -87 36 -48 62 46 -1 -30 -102 -60 -20 -46 -162 -153 -34 -65 -178 60 -90 -63 -103 -60 -65 -55 -14 -22 -61 -94
6938 -94 -44 -11 27 40 55 -11 79 123 123 68 -12 209 94 -8 63 250 62 -36 88 11 56 101 165 181 19 51 69
6965 69 -21 57 -68 -45 -71 56 -20 -99 -154 -21 -87 -68 -111 -104 -97 -154 -155 -59 110 -224 -114 -126 -149 -42 -214 -37 -116
6992 -116 -22 31 -77 -117 16 33 52 25 -93 -47 19 97 175 62 244 35 -3 83 1 59 53 62 -24 151 78 -71 56
7019 56 60 18 -29 111 -142 22 -157 -29 77 -40 -160 -72 -3 -19 -6 -47 10 24 -97 -68 31 -39 41 -21 -37 66
7045 66 42 39 -91 -52 -129 -115 102 49 -30 19 -89 96 -37 87 -51 57 89 51 30 -27 8 -17 -26 -97 68 -91
7071 -91 -19 104 -66 -119 26 49 44 60 -52 54 -70 -68 41 22 -59 -7 -11 79 -34 -50 -112 -84 26 -10 -61 52 159
7098 159 -63 -30 -130 -12 -50 40 -39 13 -1 -42 29 81 190 25 142 17 -66 8 1 -45 -47 22 -2 24 -44 57 32
7125 32 -44 27 -28 -45 -6 125 42 82 50 64 101 -1 -69 -134 94 113 27 -23 6 -12 2 -24 -4 -25 30 74 -84 -88 58
7154 58 -78 48 -90 1 73 -121 -77 -68 78 5 128 -24 -123 9 -59 -25 -9 47 39 -94 47 109 -56 -89 -98 35
7180 35 -161 -64 79 -97 -54 104 89 -2 43 116 53 -38 101 -29 47 106 -115 -107 14 -34 150 58 -130 109 22
7205 22 14 -123 -104 -44 -28 27 -92 -5 22 -25 -32 1 -12 -17 -23 44 2 35 -7 -28 118 59 7 -35 -35 44 139 -30 50 129 32
7236 32 61 33 -24 -45 -8 -10 -13 10 -88 -16 -10 104 -121 101 -72 -25 3 51 9 -182 99 40 -18 -49 18 20 50 85 -34
7265 -34 68 20 -59 -10 119 -121 -53 -27 -47 -21 134 159 -4 54 -56 -47 145 33 18 47 57 73 -60 43 166
7290 166 83 24 7 -63 -80 -26 -117 -94 -5 -114 -28 66 17 -85 27 -104 -39 -18 -88 -11 -39 -4 -62 33 -18 45 -112
7317 -112 -181 49 9 111 -7 46 -118 -72 151 139 107 135 -83 13 16 -8 -70 -32 37 -12 -103 -7 11 75 -60 96
7343 96 82 -44 -69 12 -16 3 13 -14 53 64 67 -61 -56 -42 -47 -115 -38 -77 -68 38 127 -74 -156 23 -39 -50 77 -54 -24
7372 -24 -49 -40 -41 -12 -15 53 42 30 26 -64 -3 -17 -113 27 20 112 56 87 -61 -26 82 128 42 -55 30 200 116 -86 62 -25
7402 -25 -1 11 -27 38 -49 -18 83 70 -123 -26 -98 224 -13 5 -5 100 -23 -12 -49 29 -37 -3 -69 -6 -105 -84 12
7429 12 35 47 153 71 -54 83 22 -96 67 106 0 -65 33 13 81 -39 122 -42 1 134 -76 -74 -64 -95 -37
7454 -37 -7 -75 -53 -143 20 76 -82 -126 -42 51 -33 -48 -24 7 -18 -150 4 -77 -37 -29 22 178 96 -61 41 78 6
7481 6 -1 -44 56 8 -15 -20 32 10 -147 7 -68 -97 108 15 -17 -138 -4 57 -75 58 -92 -70 184 130 28 -45
7507 -45 -39 46 -28 -84 -85 -36 59 59 96 81 55 24 6 -18 -40 76 165 101 -22 45 55 -7 -15 84 -23 -113 146 -70 52
7536 52 32 38 51 24 -44 -44 3 68 14 -75 -30 37 35 12 -44 -75 38 -52 -79 -160 -79 26 -74 -109 -54 10 17 -49 -55 0 -36
7567 -36 -68 -34 1 102 30 -26 47 7 9 -120 4 42 16 -58 -11 -11 -38 36 100 26 -8 31 -40 -85 36 97 -62 -6 33
7596 33 -62 69 -213 42 35 -75 -71 35 96 -35 -1 -79 -106 -10 -41 16 -90 -75 142 0 -69 -9 13 10 -94 -94 -62
7623 -62 -33 -145 6 -5 146 49 13 107 81 -57 2 -19 64 53 -23 -20 51 52 -18 -6 96 52 -2 16 39 118 2 -79
7651 -79 32 4 37 -54 -14 61 96 -100 12 21 62 25 62 27 -19 -33 -31 -74 -5 -14 22 24 -60 -82 112 -21 37 -45 22 -55
7681 -55 -79 -46 44 58 -49 31 -54 22 77 62 72 69 148 -12 70 113 -82 -21 -90 -99 72 -20 -85 73 -38 48 81 -57
7709 -57 84 -15 -16 27 54 16 -45 35 -23 49 -85 -58 25 -14 33 -8 72 96 -37 14 73 21 -106 35 149 -27 77
7736 77 -198 -37 -13 -44 88 33 90 -88 20 -13 -23 -94 -86 -38 1 41 28 -90 -24 51 -120 3 36 -88 -80 25
7762 25 -8 -127 -90 -32 42 45 62 -58 151 55 -103 -70 11 89 -15 -26 67 -52 -67 43 -35 -88 39 -18 -141 44
7788 44 -41 54 -54 -14 -56 16 -17 11 -21 -4 -69 45 87 2 52 111 76 -13 -80 30 16 17 -56 -154 -1 61 -38 16 32
7817 32 112 70 -28 -53 126 -60 49 -131 -137 135 -6 18 -96 -125 -72 37 33 -146 -34 -40 -28 -110 65 -35 -4 -30
7843 -30 -2 5 -36 113 -104 119 23 -15 53 37 -38 -46 -26 -95 53 7 -62 -11 125 17 -79 -48 75 -140 -69 38 -2
7870 -2 -115 -139 -137 106 50 -74 -114 37 87 55 -19 -100 -29 9 -100 103 90 30 -109 -57 154 -9 -8 -45 1 61 49
7897 49 -41 25 -41 -67 -6 16 -50 -12 -14 -76 36 -28 -67 -84 -7 -130 -102 33 -155 -31 -77 -103 -56 -118 -30 -66 -10 50
7925 50 -87 -111 -10 -152 -114 90 29 -17 68 141 21 20 73 119 227 73 41 56 173 95 -30 42 33 -74 -93 -74
7951 -74 -56 -80 -46 -98 -217 45 -138 -65 -72 -29 0 -72 -72 -87 -45 -12 -59 59 20 -30 159 51 121 5 7 -129 62
7978 62 17 -7 130 70 52 111 -21 -4 -7 -43 48 -51 54 15 -40 22 60 29 136 -5 -48 50 -27 10 37 -39 -150 6
8006 6 -181 5 50 124 -52 -15 5 5 -36 -44 66 -60 6 -5 -88 87 71 -22 -82 -4 -3 -28 90 -1 44 4 105 -45
8034 -45 130 23 37 76 32 0 26 44 79 -47 71 10 -23 -129 20 -59 -113 -115 -173 -68 49 -28 37 -49 6 -90 7
8061 7 -9 47 31 46 -115 -80 -105 -6 -46 -3 25 -73 24 -3 -43 96 -83 -60 78 140 120 -18 -50 -54 7 -29 -8 -17 -9 -30
8091 -30 163 -122 -79 -26 26 102 -13 -31 -37 -8 -30 38 -85 -49 -6 -57 -89 -48 11 -12 -130 -5 -172 -17 -45 10 -106
8118 -106 67 19 -48 -53 97 158 109 38 -6 56 30 7 38 14 -15 -48 -47 46 103 -50 5 42 10 -34 38 69 23 -4 34
8147 34 70 43 -125 -68 13 100 123 22 -70 -14 14 -147 20 133 -37 -54 -39 -30 118 -41 -67 -28 65 -59 10 30
8173 30 -39 -72 209 4 -57 110 -73 89 111 -84 -63 -54 17 132 55 36 -7 -53
8191e3
$$ Imaginary data points
##PAGE= N=2
##DATA TABLE= (X++(I..I)), XYDATA
0 0 0 0 0 0 0 0 0 0 0 0 0 0 0 -4 8 -8 8 -8 8 -8 12 -12 16 -19 20 -23 28 -28 33 -36 43 -45 51 -59 63 -70 79
37 79 -88 94 -107 117 -127 143 -158 176 -195 217 -245 278 -315 361 -419 498 -599 742 -959 1308
57 1308 -1956 3401 -7964 50130 300086 175828 -131605 -155773 89231 210622 72384 -55513
69 -55513 27469 159999 128312 -778 -39388 20393 70521 82827 75102 17125 -75185 -89023
81 -89023 17716 98581 17378 -116778 -93664 44734 49618 -108917 -162394 4146 136527
92 136527 17815 -175768 -149397 53650 128858 -15296 -133882 -51587 77358 55764 -49777
103 -49777 -66053 5344 44319 22525 108 -7314 -26369 -28121 31216 83656 22065 -86140
115 -86140 -59659 88661 133105 -6581 -120850 -31591 131251 127163 -28406 -95215 15406
126 15406 114207 53173 -49280 -31315 55620 64400 -9815 -53774 -23423 15566 14908 -425
138 -425 -14768 -44817 -63805 -25060 23971 -4634 -70827 -55811 25430 32248 -64480 -109950 -4138
151 -4138 115273 63750 -89967 -112730 29653 123960 48167 -58921 -37340 61094 80583
162 80583 1357 -49534 -2148 64043 60363 6692 -32689 -33016 -2456 34708 38424 -3266 -44698
175 -44698 -35831 7524 22636 -12071 -37894 -6361 31374 5957 -45362 -36287 22804 43965
187 43965 3112 -31430 -9146 28175 18247 -18432 -14817 25732 36877 1322 -29295 -19094
199 -19094 10429 22978 9495 -9079 -15090 -13893 -9706 2618 11024 -3248 -22206 -13971 9342
212 9342 10400 -13458 -24980 -1667 28385 20724 -16822 -29956 -1826 25463 22064 2735 -9093
225 -9093 -7452 2222 9313 8449 3634 -291 239 4889 2184 -10145 -9859 10129 19684 1608 -16213
240 -16213 -10046 5309 6349 -2778 113 14800 12598 -15073 -28190 -38 32710 24869 -10616
253 -10616 -28126 -10195 15774 15296 -6587 -14574 1075 11324 -205 -17560 -19447 -1590 18489
266 18489 14474 -12230 -27007 -11806 10002 11730 -1298 -7189 1712 6626 -5943 -15291 2009
279 2009 23797 16622 -9535 -18274 -271 19601 14959 -7416 -13900 6327 20819 6536 -16105
292 -16105 -15943 6308 22037 9399 -16121 -18502 4782 17551 3096 -14201 -11839 4137 14101
305 14101 6892 -7933 -12347 -4202 4571 9344 8230 103 -6493 -4364 -1022 -1001 3267 10052 7735
320 7735 -2781 -10879 -9486 -614 6477 5496 3182 2380 -5837 -18334 -15460 3830 16790 10534 -4848
335 -4848 -15606 -15473 -8869 -446 11774 19687 6749 -19336 -25257 -3938 17477 18173 6512 -975
349 -975 -27 -390 -6679 -5982 11087 27045 21167 -1727 -20333 -17676 5903 26908 21927 -147
363 -147 -12803 -9514 -2691 -225 235 4526 10028 3405 -15329 -23961 -11022 6562 11008 2143 -10446
378 -10446 -14948 -9184 -5088 -6233 -2106 7686 7853 -5693 -17576 -13030 5580 17034 7895 -6575
392 -6575 -4642 5601 6074 165 335 6852 12049 9797 2009 -1827 1880 5129 6013 8079 7705 1965
408 1965 -1861 -1203 -828 -854 1474 2573 -260 -3834 -6749 -7089 -5683 -6228 -6084 758 4456 -6402 -18437
425 -18437 -13771 1169 7733 2259 -4910 -4192 1004 -407 -4819 810 12542 14098 4804 -2553 -3066
440 -3066 1995 9059 12178 9199 4663 494 -3808 -4352 -297 4487 7268 4081 -7132 -15288 -10414
455 -10414 -960 1484 -963 -3558 -6282 -7752 -7882 -6801 -1978 4969 6033 858 -3932 -5149 -1743
470 -1743 6406 12055 9135 3863 1748 396 808 4965 9061 8912 4721 -1693 -4915 -1192 2282 13
486 13 -837 2434 239 -7389 -10731 -5554 1826 3930 -1636 -7142 -5300 -1942 -2713 -2086 1597 2631
502 2631 -183 -1718 -2679 -3381 -606 3399 3532 -279 -4566 -5154 -542 2577 -1315 -3531 1134 3214
518 3214 -2265 -5161 -622 5131 6505 3310 159 1652 5603 6509 6132 7197 6604 4636 5526 5850
534 5850 2888 2136 4567 4369 47 -3787 -5472 -4417 -2879 -5082 -8942 -8907 -8552 -11093 -11188 -8388 -7587
551 -7587 -8194 -6564 -5437 -5477 -4325 -1706 1678 5128 5050 3028 5022 9392 9508 8297 10304 11745 10256
568 10256 8330 6403 4805 5526 6426 4800 2237 -1391 -5368 -5307 -1880 -2767 -7300 -7469 -5601 -6983
584 -6983 -9638 -9626 -6239 -1371 -60 -3957 -6532 -4049 -309 2849 5081 3849 987 2521 5006 2626
600 2626 533 3994 8751 7577 790 -5201 -3576 3620 5703 714 -2503 -2212 -2910 -3281 -1847 -1086
616 -1086 -267 2417 2468 -2056 -5626 -3574 4056 9986 5450 -4693 -5064 4362 6641 -694 -4317 843
632 843 5369 1717 -7110 -9837 -2442 4173 390 -6171 -7315 -4911 -2066 102 -1625 -4493 -1957
647 -1957 4016 5263 886 -2955 278 9447 12589 4393 -1859 4552 12212 8747 160 -1977 4197
662 4197 9785 6095 -4598 -9189 -3770 1379 -315 -5502 -8821 -7831 -5001 -6851 -11463 -9576 -1792
677 -1792 1452 -2453 -8493 -10682 -5012 5573 10053 4661 -1772 -2029 3319 8857 8153 3846 5941
692 5941 12399 9397 -2562 -6489 3731 14551 12409 -595 -9778 -5965 2018 2879 -307 -1631
706 -1631 -2431 -3950 -4663 -6383 -7622 -2615 5411 5652 -4519 -14455 -11242 4617 13920 3618 -10770
721 -10770 -7571 4628 5636 -3211 -5683 3244 10401 3439 -9896 -10527 2930 11619 6662 -3355
735 -3355 -8188 -4133 4800 7943 1147 -4261 -629 5336 4997 -1778 -5002 1954 11473 7897 -6116
750 -6116 -10226 913 11302 7841 -3890 -9714 -2827 5799 3196 -5252 -5746 925 2825 -2945 -8936
765 -8936 -6519 3126 7534 -259 -9508 -7823 285 5450 5157 738 -3952 -2998 1868 4209 2594 1118
781 1118 2039 4347 3590 -3175 -5866 2773 11226 6261 -5421 -9036 -2171 5466 4196 -2666 -4436
796 -4436 -337 -169 -4237 -4385 -795 1193 1562 342 -4116 -6874 -2877 4655 7314 1400 -6572 -5232
812 -5232 4306 7237 -395 -3627 3208 7735 2016 -5697 -4380 5548 10993 3572 -6493 -5758 2390
827 2390 6057 2921 -2011 -3944 -429 3323 164 -5295 -3950 2366 4197 -897 -7187 -6774 1107
842 1107 5624 -294 -6821 -4710 1188 2733 -1015 -5212 -3305 3738 5586 -1733 -7113 -2555 5162
857 5162 6655 883 -4961 -2387 5353 5940 -1129 -3314 2540 6412 3266 -2289 -3290 1818 6230
872 6230 3833 -1367 -2492 -589 1554 2807 1212 -2629 -2131 1841 1946 -2519 -4718 -1797 2879 3586
888 3586 -2293 -7445 -4061 2378 2915 -980 -3250 -3016 -1217 201 -1210 -2487 256 2945 958 -3553
904 -3553 -5617 -1921 5219 7319 162 -6390 -4141 2199 4792 3695 791 -942 360 1748 294
919 294 -1069 1871 5849 6041 223 -7052 -5719 5364 11204 3902 -5503 -5483 355 2752 -223 -2072
935 -2072 1963 4954 -1177 -9327 -7338 1113 5845 4203 -1420 -7582 -8829 -3044 3649 5054 788
950 788 -4389 -4612 -1177 -886 -2701 1458 7972 5358 -4475 -9134 -2834 7509 10875 4099 -3348 -3323
966 -3323 175 1839 3499 4964 3275 512 -958 -2026 -1881 1236 3929 3901 705 -4773 -7916 -3043
982 -3043 4595 5458 -772 -6555 -6653 -1929 2263 639 -2286 -871 626 -2585 -5297 -1975 3744 5975
998 5975 2207 -4436 -6134 -465 5623 7326 4659 -1211 -5778 -2774 5534 7835 3178 -737 -378
1013 -378 977 -754 -3281 223 8420 8298 -3270 -11913 -7141 3352 8071 4616 -3094 -7757 -6722
1028 -6722 -2943 218 2232 1760 -920 -2585 -4260 -7726 -6037 4226 11296 5462 -7800 -13325 -5014
1043 -5014 7933 10898 3009 -2708 -1488 225 -659 -96 3549 8190 9066 1809 -7537 -7431 2924
1058 2924 12488 11478 1280 -8147 -6413 2679 6568 2416 -781 152 990 -1419 -6062 -6986 -113
1073 -113 7039 3751 -7035 -12668 -7820 1581 5138 -1203 -8831 -7117 -940 -312 -4256 -4962 -793
1088 -793 2988 1914 -3893 -6642 -819 6787 7747 2000 -3606 -2410 5873 11589 6583 -1693 -633
1103 -633 7347 10383 4899 -1505 289 8138 9547 689 -5866 -1205 6472 6842 -405 -8286 -8110 126
1119 126 5115 -410 -9104 -10501 -3955 1652 -2026 -10316 -10056 -379 3734 -4452 -12404 -8667 1975
1134 1975 6697 85 -8407 -6883 2328 6235 1607 -2308 -357 4593 6734 2088 -3061 103 8574
1149 8574 10847 4210 -2765 -2347 5035 10720 7083 -722 -1551 3828 6688 3680 -1261 -2050 3276 7477
1165 7477 2506 -5888 -6555 425 5538 2829 -4672 -8918 -5044 357 -637 -5142 -6908 -5342 -2890
1180 -2890 -2512 -6062 -9738 -6780 711 2519 -3930 -10777 -8910 1378 7774 1780 -6278 -3535 4635
1195 4635 5581 630 -591 5036 10707 8025 -146 -2536 4624 11800 11421 5542 -338 -954 4613 8625
1211 8625 5274 15 780 4728 3800 -3131 -8088 -2585 8046 7824 -4692 -13597 -9199 119 3564
1226 3564 -684 -6413 -7410 -4918 -4871 -6659 -5332 -2117 -408 -1664 -5821 -9721 -8288 -1161 4267 3615
1242 3615 -1791 -7082 -6349 603 6063 5139 2494 2165 2784 3114 2778 3449 7226 11394 9637 3207 533
1259 533 3662 8138 9894 7405 3016 1366 2591 2785 815 -519 -321 1514 964 -4648 -10360 -7740
1275 -7740 235 1063 -7119 -13214 -9878 -1717 1 -7774 -13201 -7452 1096 1108 -4752 -7213 -4080 915
1291 915 2757 269 -1445 1668 5274 5189 1880 -903 950 7815 11422 6675 -34 -711 2879 5732
1307 5732 6564 5852 4591 2861 -384 -2701 -39 4792 5964 3380 -643 -4331 -5854 -2851 2191
1322 2191 3966 1890 -3003 -7037 -6835 -3758 -1671 105 1753 -341 -5670 -9650 -8847 -2656 5224
1337 5224 6275 -1859 -10036 -9127 -1719 4177 3689 -400 -1228 1714 1051 -3764 -4193 3012 9922 9336
1353 9336 1091 -6584 -4828 4507 10194 7381 1491 -1103 468 2546 1626 -406 2275 6630 4534
1368 4534 -2637 -5847 -2190 3153 4153 652 -2589 -1875 -1030 -2889 -3609 -1295 806 680 -1339 -4323
1384 -4323 -5664 -3058 419 796 -1075 -2847 -3391 -1285 231 -1416 -2739 -661 2090 2315 668 -1812
1400 -1812 -3043 -224 4440 5493 2096 -1636 -1855 1941 5103 2696 -1271 323 4692 4388 -226
1415 -226 -3934 -2543 3584 6879 2454 -4353 -5090 -781 2375 1658 -1344 -2311 363 1363 -2897 -5818
1431 -5818 -1930 3515 3635 -1199 -5110 -3744 937 1895 -651 -953 1208 1671 -881 -2872 -2259 1389
1447 1389 5430 3943 -1713 -4429 -1401 2900 4214 1565 -1787 -1015 1967 1424 -1871 -1809 977 2881
1463 2881 1793 -1431 -4017 -2797 490 2151 1295 -942 -3576 -3427 -340 1389 -182 -1141 -804 -365
1479 -365 -400 -801 -1405 -90 2675 2860 297 -1753 -1177 1814 4224 3367 78 -314 2114 2527 486
1496 486 220 2868 4160 2251 -2050 -3137 979 4466 2355 -1713 -2766 -1636 -499 -349 -1988 -3052
1512 -3052 -1399 -59 -2208 -5422 -6125 -2964 1668 1559 -4192 -7523 -3974 627 681 -1458 -1453 361 1677
1529 1677 198 -1620 660 4856 5740 3639 2130 1860 2519 4647 5969 5250 4576 3886 2495 1399
1545 1399 1582 2192 2949 3187 559 -2768 -3616 -2485 -1825 -1489 -2028 -3735 -4883 -4847 -5522 -5766 -3887 -2115
1563 -2115 -1949 -3038 -4654 -5372 -3503 -148 1252 1201 948 -416 -1376 574 2622 3408 3964 4336 3327
1580 3327 1802 293 632 3974 6939 5167 1182 -59 367 548 1327 3033 3618 2676 -61 -3067
1596 -3067 -2935 153 2335 2266 1316 -1461 -4349 -4216 -1774 -284 -103 -504 -1851 -3797 -5451 -5732 -3039
1613 -3039 842 924 -2717 -4559 -4256 -3377 -1788 932 2499 1884 590 -947 -758 1590 4103 5535
1629 5535 6205 4648 1559 886 3523 4878 4407 4142 4129 2363 -426 -2972 -2223 1545 2690 -864 -4280
1646 -4280 -4913 -5085 -5026 -3763 -2086 -1599 -2346 -3909 -5334 -4336 -2270 -152 2430 3695 1197 -1663 -1012
1663 -1012 1945 4539 5570 5442 4186 2494 282 -703 1992 5976 5295 952 -1866 -2508 -2536 -1859 -1410
1680 -1410 -20 944 -1244 -6325 -7710 -3713 298 901 141 -1118 -2868 -3956 -3141 549 4791 4538
1696 4538 182 -2038 25 1204 740 1685 4023 4198 1091 -2599 -3072 194 2748 2455 1657 637
1712 637 -2574 -4421 -1016 3471 3158 -320 -1536 483 1762 -535 -2182 1704 5929 3065 -2742
1727 -2742 -2875 1281 2527 -193 -1646 93 1445 -1527 -5756 -4596 -75 461 -2895 -4390 -3372
1742 -3372 -2531 -2506 -2541 -1950 -1105 -305 -28 681 717 -604 180 4372 6278 3453 927 1973 4484 5031
1760 5031 3385 2130 3644 4531 1761 -1408 -3 1997 764 -1513 -1713 -918 -1955 -4664 -5554 -1982
1776 -1982 1062 -1875 -6279 -5335 -1125 13 -2046 -2507 -425 1647 444 -2048 -837 2980 3626 1218
1792 1218 599 1472 1507 1225 1385 1666 1623 1185 264 -552 -739 -1224 33 2138 772 -3555 -3927 380 2738
1811 2738 98 -3225 -1924 2330 3023 -1651 -3724 853 5270 2824 -1835 -1969 1125 2674 1493
1826 1493 -174 425 1642 -250 -2459 -1372 1034 1227 -263 -1782 -2611 -1879 -556 -461 -960 -326 190
1843 190 -804 -1696 -2185 -944 2176 3625 643 -2586 -2030 597 2146 1893 791 634 942 -539 -2683
1860 -2683 -1053 2904 3936 514 -2897 -3038 -525 1324 335 -427 1657 2175 -1580 -4659 -2228 3153
1876 3153 5464 2428 -2793 -3763 -32 2311 1351 450 1169 1272 -93 -2426 -2878 33 3606 2888 -1126
1893 -1126 -3701 -2935 -507 1176 465 -634 219 463 -1879 -3612 -802 3057 3143 -424 -2872 -1500
1909 -1500 1538 1964 -578 -699 1659 2057 -368 -1885 -861 1662 2490 32 -2253 -776 1870 1141
1925 1141 -1409 -2192 -415 1741 1504 -1362 -2383 106 1455 -626 -2368 103 3071 2492 -1445 -4294
1941 -4294 -1689 3181 3864 487 -1499 -445 525 -76 -985 176 3313 4446 124 -4654 -3799 1282
1957 1282 4786 3785 -452 -2904 -1485 -333 -1528 -1109 2188 3757 -60 -5254 -6384 -1856 3413
1972 3413 3105 -1072 -3230 -2605 -2503 -2821 -786 2152 3615 1108 -3447 -4932 -755 4176 4580 2145
1988 2145 278 -7 596 849 888 3030 6064 4669 -643 -3382 -486 3958 5008 1971 -1486 -1029
2004 -1029 310 -877 -2643 -1019 1833 1107 -2601 -5770 -4648 -453 1548 -1769 -4669 -3158 -601
2019 -601 -962 -3013 -3318 -415 2141 664 -3252 -2653 1704 3714 1413 -1027 -203 2838 4288 2013
2035 2013 -93 1229 3483 3095 1544 1039 1951 2914 2007 -633 -962 1927 3449 626 -2435 -2182 122
2052 122 716 -1554 -3432 -1198 1429 -935 -5436 -5422 -394 2592 91 -4229 -4672 -821 1422 -545
2068 -545 -2197 -312 2020 1068 -1733 -2338 482 3974 4029 -40 -2016 214 2881 2542 595 -112 1985
2085 1985 3673 884 -2944 -1546 3514 4977 940 -3267 -2614 1588 3118 -90 -2719 -567 1978
2100 1978 440 -2721 -3118 -472 1913 715 -2336 -3337 -1429 -245 -1023 -1166 -217 -138 -1407 -2409
2116 -2409 -1570 984 2143 312 -1359 -158 1707 1617 641 646 2089 3633 2573 -507 -643 2229 4124
2133 4124 2528 -337 -1573 6 1599 140 -2374 -1823 921 226 -3916 -6020 -2597 1878 1339 -3951
2149 -3951 -6392 -1972 2469 719 -3191 -2294 2473 4556 906 -3065 -1128 5104 7372 3010 -1645
2164 -1645 -1193 2725 5178 3288 -308 -921 1553 1902 -1199 -3107 -1624 1267 1044 -2592 -5466 -3529
2180 -3529 -148 -114 -1935 -2274 -1165 -744 -1663 -1888 -14 2602 2453 -438 -1490 827 2758 2573 1707
2197 1707 1112 1115 1088 66 -223 1198 1919 -38 -2066 -1782 25 526 -780 -2512 -1438 834 298 -2462
2215 -2462 -2708 930 3134 1395 -2199 -2956 1129 4848 3276 -1507 -2822 534 3437 2283 -1207
2230 -1207 -2517 233 2397 -609 -4408 -3349 1274 2803 -828 -5207 -4552 282 2880 347 -2025
2245 -2025 -838 1379 967 -342 83 2986 5188 3174 -915 -1655 1960 4875 4243 1191 -1246 -762
2261 -762 559 -177 -1564 -978 56 -1280 -3857 -5077 -4269 -1912 -813 -1704 -3017 -3239 -3421 -2927 -234
2278 -234 2258 2017 -163 -1282 5 3130 4633 3444 2199 3106 3818 3014 1655 1689 3768 5065 3247
2295 3247 -1224 -2915 259 3178 1780 -2128 -4067 -2267 70 -1282 -4172 -3657 -233 269 -3261
2310 -3261 -5571 -3428 810 1941 -1580 -4474 -2532 1290 1723 -543 -2004 -463 1726 1641 -990 -1877
2326 -1877 974 3272 2113 -902 -1675 94 2916 3229 919 -489 610 1945 2287 2059 1917 1767
2342 1767 2149 1604 827 1229 2249 1961 864 281 -149 -576 -772 -691 -471 -375 -1906 -4190 -3917 -1378 -770
2361 -770 -2687 -4322 -3691 -1917 -1844 -3310 -3517 -827 1125 -789 -3044 -2081 1121 3038 2065 -82 -213
2378 -213 2338 3820 2436 1228 1694 3555 3985 2378 -100 435 3616 4462 1465 -1440 -874 1736
2394 1736 2680 560 -1794 -1207 1045 710 -1433 -2241 -1026 344 80 -1618 -2841 -1638 -74 -485
2410 -485 -1553 -1941 -1649 -1377 -992 -1549 -1767 -971 -810 -1369 -1262 -1076 -824 -726 -171 138 162 -245 -334 477 1827
2431 1827 1712 281 231 1817 2683 1998 987 973 2250 3181 2093 168 615 2307 2764 1473 -216
2448 -216 -660 964 2203 645 -1678 -1617 18 717 -769 -2710 -2684 -320 502 -1847 -3979 -3043 -541
2465 -541 42 -1665 -3606 -3049 -397 336 -1869 -2923 -1045 943 761 -1128 -1860 107 2365 1914 -68
2482 -68 22 1460 2202 2127 2013 1582 1728 2280 2083 1690 1337 1280 1662 2572 1558 -512 -764 909 1583 133
2502 133 -1024 -1225 -696 -756 -1671 -1568 -916 -758 -2052 -2164 -1451 -1524 -1881 -1019 -323 -760 -1970 -2146 -524
2521 -524 1118 501 -1507 -842 1392 1265 -481 -826 1091 2512 1792 -275 -871 1066 2159 1321 333
2538 333 609 863 955 750 424 275 588 870 578 148 -606 -806 337 1169 -225 -1394 -857 337 230
2557 230 -893 -1436 -517 708 133 -1673 -1489 254 480 -865 -898 89 579 -17 -1000 -677 831 1196
2575 1196 29 -121 698 597 -415 31 886 1121 349 -407 -499 293 154 -352 -74 573 -45 -1256 -1013
2594 -1013 -244 -473 -627 -231 0 -114 -1146 -1647 -328 1135 575 -661 -366 292 189 -82 430 1281
2612 1281 1398 822 -134 209 1253 1309 1103 1360 1206 389 198 493 677 692 718 144 96 -376 -908 -1119 -316
2633 -316 65 -571 -1283 -1568 -1709 -1334 -1020 -1156 -1179 -912 -1002 -1635 -1656 -1093 -363 300 218 -615 -865 -39 517
2654 517 902 1236 1088 910 1243 1221 815 1232 1781 2019 2014 1406 356 324 1030 1269 1012 658 166 -476 -442
2675 -442 -449 -454 -168 83 -700 -1673 -1679 -1288 -536 -316 -803 -1484 -1122 -648 -1073 -1124 -499 -134 -207 -490 -804 -876 -92
2698 -92 250 289 292 -21 -509 -241 494 687 129 423 854 723 298 -86 522 1640 1525 459 97 1015 1032
2719 1032 427 679 1006 1058 490 -240 -126 752 777 -382 -855 -100 -110 -692 -865 -831 -801 -741 -727 -980 -978 -1184
2741 -1184 -1204 -344 87 -437 -1297 -585 265 200 -191 -80 361 645 301 -414 208 1158 960 -165 -269 308
2761 308 651 470 25 -307 319 560 -73 -443 52 283 363 333 16 -277 104 711 768 582 276 -4 581
2782 581 1078 533 -440 58 1132 1069 84 -719 -622 483 822 -451 -1167 -686 -456 -735 -929 -914 -953 -811
2802 -811 -457 -460 -922 -1050 -1016 12 593 -143 -707 20 763 209 -481 149 1407 1694 549 -763 -380 1186
2822 1186 1805 749 13 13 243 574 213 -231 216 1177 712 -441 -1235 -997 344 1766 1019 -840 -1391
2841 -1391 -442 439 530 165 -156 382 615 -907 -1754 -870 1064 1677 286 -1521 -2375 -1203 643 627
2859 627 -57 -433 -635 -988 -1162 -692 47 945 1018 -223 -1352 -1155 56 1499 1719 703 -623 -268
2877 -268 690 621 263 544 1167 1278 521 -1024 -1014 822 1613 1056 -14 -818 -744 -100 753 298 -427 -137
2897 -137 94 106 -325 -941 -487 725 1063 -274 -1262 -490 595 552 -292 -873 -441 661 720 -451 -1119
2916 -1119 -873 33 758 519 -489 -1040 -453 -48 -391 -307 184 551 488 -485 -1575 -870 892 1615 830
2935 830 -265 -734 -556 479 721 454 681 989 577 -413 -928 -230 1223 2260 1150 -883 -1582 -666
2953 -666 687 1351 1152 -25 -477 -501 -633 -773 48 911 1060 -27 -1670 -2208 -628 1131 1073 -129
2971 -129 -1024 -1262 -847 -198 -25 97 400 202 -563 -1124 -988 -265 958 1370 302 -1084 -958 43 765
2990 765 835 497 190 502 364 -229 -172 683 1343 921 423 -540 -660 428 1242 714 -29 -299 22 556
3010 556 535 -386 -623 257 718 36 -889 -707 -212 432 46 -816 -687 143 195 -491 -936 -838 -159 623 110
3031 110 -1165 -1039 98 421 84 -522 -656 16 638 173 -819 -338 428 958 441 -138 -596 121 999
3050 999 736 64 72 500 523 342 136 87 737 1020 155 -319 -17 181 278 476 338 -192 -493 -210 77 53
3072 53 -209 -478 -362 129 -313 -782 -608 -29 9 -125 -801 -686 -295 143 30 -364 -384 -95 172 215 -274
3093 -274 -657 362 1069 362 -683 -760 225 1299 1079 -353 -698 169 907 215 -298 138 375 701 87
3112 87 -642 -430 900 1151 214 -359 -433 -69 507 418 22 278 325 -84 -790 -400 88 705 594 52 -877
3133 -877 -849 -315 125 335 473 35 -650 -838 -851 -282 564 847 -224 -950 -879 -519 -112 291 426 320 -91
3154 -91 -983 -1154 129 1131 616 -110 -179 -135 -344 -165 49 956 1321 258 -970 -749 269 897 1048
3173 1048 756 -2 -212 215 130 -36 498 903 635 -140 -860 -716 384 978 198 -783 -512 -14 -71 -576
3193 -576 -722 -273 491 -112 -1166 -1117 -75 1 -406 -639 -569 -86 218 -479 -1181 -571 362 504 -3 -216
3213 -216 -123 272 269 -260 -6 1068 1426 542 -408 -405 539 1349 1302 691 433 534 223 -224 214 1033 1407 881
3235 881 -492 -1252 -698 498 803 284 -336 -776 -1174 -1233 -997 -416 444 201 -1290 -2056 -1382 -524 237
3254 237 531 -22 -687 -885 -896 -450 519 1266 842 38 -241 -354 176 978 1218 1068 967 408 -582 -422
3274 -422 796 1716 1449 13 -921 -542 727 556 -270 -13 568 467 -587 -1209 -688 641 1026 -56
3292 -56 -1091 -765 -35 229 -12 -375 -388 190 322 -712 -1291 -400 569 459 -503 -1297 -614 731 441 -1070
3312 -1070 -1250 380 1216 404 -839 -873 270 1409 697 -473 -18 873 1057 373 -19 142 832 1214
3330 1214 648 -246 -299 -9 374 521 366 -373 -558 -279 -438 -452 -160 -233 -398 -288 -599 -733 -405 -65 -45
3351 -45 -16 43 -328 -462 -25 416 592 374 -80 -173 359 304 -276 123 856 553 -669 -1055 -193 948 700
3372 700 -727 -1312 192 855 -77 -1341 -521 767 967 101 -865 -559 784 1244 490 -176 -277 52
3390 52 784 718 -137 -569 208 679 57 -641 -833 18 562 -187 -1145 -825 248 -38 -665 -550 302 405
3410 405 -334 -936 -450 872 1099 -79 -482 272 783 530 190 192 611 687 237 -226 108 455 108 7
3430 7 9 -103 -581 -650 -586 -132 104 -187 -816 -950 -573 -282 197 274 -442 -848 -64 312 75 -280 -145 754
3452 754 1036 84 -1042 -239 1247 1297 127 -405 -29 588 320 -161 -18 712 634 -392 -418 167 435 34
3472 34 -36 337 333 14 -230 -463 247 484 94 -93 -159 -373 -459 24 282 -345 -580 -445 -331 -334 -403 -625 -317
3495 -317 42 -359 -564 -137 -27 -551 -485 198 868 421 -544 -802 521 1470 849 -313 -31 919 1075 270
3515 270 -274 67 1261 1515 275 -714 -266 710 986 444 -111 -296 -27 78 -333 -439 -102 251 22
3534 22 -499 -1124 -1079 -36 264 -349 -848 -644 -371 -446 -788 -797 222 729 -188 -1280 -816 95 709 399 -87
3555 -87 48 281 313 133 413 673 578 492 554 572 51 96 708 1075 784 -43 -450 -114 450 376 -72 -37 79
3578 79 -248 -224 -179 -271 -203 234 238 -207 -622 -552 -42 457 162 -512 -409 86 -8 -528 -439 -74 251 175 -636 -867
3602 -867 -240 52 -152 -458 -372 -27 170 -191 -602 -432 469 801 151 -344 -208 309 879 775 249 351
3622 351 593 716 501 461 488 501 734 489 -184 -213 124 319 44 17 -187 -122 -117 -491 -644 -179 34 -272 -767
3645 -767 -607 -464 -361 -316 -386 -188 -215 -457 -489 -160 -55 -316 -269 -16 -236 -434 -275 136 50 200 68 -145
3667 -145 188 246 121 234 493 321 285 470 438 323 444 584 603 731 440 31 509 584 455 94 138 211
3689 211 -63 22 -186 -170 -148 -282 -616 -603 -352 -623 -558 -660 -590 -609 -327 -559 -603 -465 -283 -291 -196 -78 -58 -91
3713 -91 33 246 185 363 270 287 578 546 346 242 640 579 309 148 458 564 308 36 -62 250 370 -91
3735 -91 -289 63 23 -116 -232 -252 -224 -166 22 -171 -307 -407 -248 4 10 -337 -528 -36 201 -51 -370 -175
3757 -175 254 486 30 -173 -121 176 139 60 137 96 -15 -30 20 -114 -32 72 -95 -374 -183 -186 -140 -84 -109 -307
3781 -307 71 90 -230 -204 124 202 187 292 77 -95 -51 232 456 436 315 -62 -51 346 291 403 211 -32 -13
3804 -13 115 107 -220 -175 215 302 -76 -458 -556 31 529 144 -480 -546 128 247 -62 -447 -476 61 280 -289 -638
3827 -638 -299 102 85 -230 -489 -450 -16 265 -314 -485 -199 368 126 -270 -330 79 891 619 -116 -132 630
3848 630 994 847 174 109 562 939 666 488 372 297 122 316 296 -116 -236 -136 -98 -497 -619 -536 -508 -488
3870 -488 -508 -823 -866 -742 -678 -208 -151 -565 -679 -248 152 74 -176 7 342 749 163 -288 1 969 1016 337
3892 337 -122 114 521 844 231 -363 14 437 416 -274 -476 81 834 692 -206 -884 -149 870 651 -52
3912 -52 -579 -188 477 580 -161 -468 102 480 93 -556 -675 -174 297 29 -730 -951 -312 -119 -359 -704
3932 -704 -442 -269 -107 -396 -572 -379 263 -128 -166 79 87 -47 234 442 573 340 86 271 688 719 368
3953 368 98 226 350 348 212 55 -93 231 206 -72 -527 -371 34 475 161 -780 -775 267 818 -99 -837
3974 -837 -364 530 548 -300 -970 -226 767 367 -599 -803 -89 430 98 -499 -777 -56 265 36 -702 -562
3994 -562 89 414 147 -486 -573 82 859 380 -137 -409 136 753 634 24 -297 415 614 409 8 -25 294
4015 294 432 201 -42 21 114 -69 -246 179 316 -317 -546 -143 181 158 -594 -694 -34 523 -202 -864 -400
4036 -400 572 327 -411 -722 -176 450 307 -263 -499 -57 434 158 -88 -544 -161 401 547 -145 -789 -176
4056 -176 754 714 -365 -1031 -136 1005 763 -608 -1030 336 1062 428 -598 -687 244 959 270 -401 -445
4075 -445 178 434 210 97 -43 175 159 54 35 42 233 13 34 26 27 -129 236 94 -240 -96 -222 -172 18
4098 18 -60 -259 -327 -272 -548 -392 -168 -266 -263 64 -65 -275 -370 -262 358 610 -91 -686 -215 826 901 -62 -634
4121 -634 151 1117 854 -304 -733 439 1379 664 -517 -722 -44 926 610 -331 -531 -64 360 108 -306
4140 -306 -541 -178 518 172 -564 -773 165 553 143 -554 -619 -96 270 -283 -737 -364 351 20 -582 -699
4160 -699 -313 318 231 -404 -623 -227 -79 141 -145 -191 -82 44 296 264 231 369 448 260 639 427 166 53
4182 53 406 784 510 179 -405 -47 810 559 -387 -831 -232 390 317 -398 -763 -552 221 45 -589 -770 -278
4203 -278 101 121 -520 -818 -235 641 408 -307 -619 95 695 284 -373 -232 554 671 -230 -673 -138 650
4223 650 596 -64 -669 -511 255 427 104 -401 -111 285 331 -41 -550 -101 583 406 -135 -410 -13 242 387
4244 387 445 33 90 -14 -121 122 420 233 -223 -267 74 86 -19 -189 -209 37 151 -278 -632 -311 36 213
4266 213 4 -413 -465 49 207 -235 -431 -25 256 91 -333 -495 74 562 228 -524 -311 251 459 -22
4286 -22 -431 -280 370 581 90 -393 -276 382 682 293 -188 -452 307 719 204 -330 -93 412 460 74 -47
4307 -47 -57 191 113 -191 -166 60 41 -287 -218 -28 -55 -201 -187 -321 -283 -17 -164 -388 -304 -178 -88 -121 -349 -393
4331 -393 -211 13 -61 -326 -21 63 90 30 -7 230 345 98 -78 240 636 304 177 81 363 530 296 -68
4353 -68 -192 267 629 287 -165 -212 -68 334 206 -401 -529 44 120 -324 -543 -426 72 43 -199 -502 -187
4374 -187 112 -52 -169 -246 -108 -98 47 31 -217 -56 112 -4 -242 -154 160 126 305 -125 -268 62 271 -144
4396 -144 -161 142 182 -34 49 -39 217 348 205 49 250 330 -70 84 322 437 301 196 -96 -34 217 121
4418 121 65 9 -108 14 117 -252 -453 -190 123 77 -508 -586 -459 -13 124 -330 -359 -78 -45 -105 -243 31
4440 31 148 133 101 -133 -207 103 276 62 -77 93 75 92 -14 -221 83 326 195 -163 -298 294 321 -30
4462 -30 39 -42 153 191 -51 27 236 240 139 160 151 75 -14 169 -11 2 107 8 -198 -193 -205 -244 -25 -207 -333 -310
4488 -310 6 -199 -420 -201 -44 45 -38 -418 -369 38 40 56 16 127 77 -97 105 102 125 175 290 -16 -115 106
4512 106 135 151 129 20 60 108 -32 -145 44 226 103 39 -185 10 -122 39 71 49 179 -141 -232 -35 -15
4535 -15 -4 37 196 -157 -319 -138 105 -120 -50 -187 -10 -34 -206 -323 44 145 -182 -376 -227 54 12 -167
4557 -167 -159 97 87 50 -320 -85 51 156 -32 165 73 -23 136 54 100 -21 114 211 227 17 -62 43 319 214
4581 214 39 137 21 74 25 61 -153 72 216 49 -92 135 62 -18 -10 -64 -185 -74 -166 -256 -105 64 -65 -248
4605 -248 -169 -18 -144 -177 -164 -59 40 9 -358 -136 251 110 23 -148 80 163 -114 -35 87 257 167 -66 164
4628 164 215 80 -147 242 306 30 -136 118 252 220 33 68 332 215 -105 -154 91 186 -69 -14 -37 28 26 -9
4652 -9 -163 -95 -93 -218 -272 -92 12 -228 -49 -309 -124 -195 -64 -141 -41 -15 -147 -105 57 -65 -93 65 182 60
4676 60 185 107 34 158 251 88 16 100 71 87 24 51 131 73 119 -158 125 238 137 -84 60 154 7 -83 -84 189
4702 189 190 -72 -109 64 83 -41 -270 -36 106 -173 -35 -23 -146 -95 -131 -161 14 -36 -233 -232 -71 70 -115 -52
4726 -52 61 -53 -148 -199 -26 126 133 -167 -5 128 66 0 29 192 7 58 199 178 55 42 35 220 213 146 -93
4751 -93 85 1 -33 -36 143 20 -198 -170 -139 -57 5 77 -173 -95 -72 -111 -62 97 -151 -138 -88 -41 -152 -71 100 -9
4777 -9 -113 -28 -160 -76 -27 -106 15 40 27 -192 -108 -30 -18 114 123 89 -32 -63 20 131 220 176 11 126 166 16
4803 16 46 221 261 175 88 20 85 110 22 2 157 24 -133 9 4 -112 -107 99 65 -138 -298 -226 -25 46 -123 -164
4829 -164 -45 -20 -267 -100 -111 -107 -71 137 -53 -174 -154 9 82 106 -83 -152 155 58 45 -230 137 193 117 61 -53
4854 -53 -69 -10 289 242 99 92 -5 2 94 67 -130 127 119 37 -74 -56 16 59 53 -229 -95 103 6 -147 -105 -19 -25 -30 -52
4883 -52 -102 -283 -155 56 -33 -169 -273 -231 -96 6 -139 -18 101 11 -153 -168 -144 -48 181 192 -69 -165 55
4906 55 260 316 108 -69 -13 296 314 -38 -110 164 94 174 -21 -53 16 100 7 87 35 -114 -38 137 -35 -191 -119
4931 -119 -52 37 -49 -45 -92 63 95 -121 -210 -27 -46 -99 -74 -87 -125 -103 51 19 -155 -216 -25 30 -11 -246 -222 100
4957 100 262 50 -164 -69 221 191 58 58 -92 210 391 100 22 -86 -9 319 297 121 -175 16 326 239 -124
4980 -124 -78 60 145 172 -31 -59 10 85 -164 -42 -203 -148 -40 -27 -120 -409 -179 6 3 -54 -290 -128 132 69
5004 69 -152 -68 37 68 29 -1 -160 -12 276 177 102 7 -12 174 198 98 -178 -139 286 228 63 -147 -3 -2 218
5029 218 74 -224 -145 81 276 360 -27 -325 -91 334 179 -278 -332 -76 66 101 -175 -302 10 52 54 -72
5051 -72 -40 -64 61 -48 -138 -272 -117 84 3 -234 -104 168 153 -47 -414 -235 141 287 -33 -182 -72 -36
5073 -36 206 122 -90 -14 122 173 135 202 18 80 205 361 -102 -184 75 226 301 193 -293 -152 130 214 -4
5096 -4 -118 -102 -51 180 129 -85 -281 -11 115 -1 -132 -257 -46 80 -107 -202 -170 80 -114 -181 -194 -116 36
5119 36 140 2 -185 -134 100 119 58 -184 -226 334 441 68 -308 -11 337 331 59 -181 -112 241 363 107 -259
5142 -259 105 73 291 133 -128 -295 -94 317 107 -81 -173 -156 25 -48 6 -161 -26 104 42 6 -38 -134 -59
5165 -59 148 -59 -255 -251 13 118 77 -88 -36 -65 -22 -143 -154 -31 72 131 -54 -103 -14 149 163 91 -168 -156 292
5190 292 383 171 -328 -40 363 440 31 -313 -101 242 459 63 -286 -84 57 333 -34 -134 -302 -27 328
5211 328 108 -304 -339 46 266 109 -166 -266 99 290 32 -254 -248 106 -37 -217 -76 -153 -52 -63 -47 -109
5233 -109 11 64 -47 -60 -104 -196 113 248 8 -164 28 112 134 182 139 -49 254 246 279 202 13 2 138 623
5257 623 57 -281 -255 210 280 105 -288 -327 77 149 -48 -266 -286 -123 135 71 -234 -337 -69 214 192 -230
5279 -230 -116 23 255 37 -220 -78 66 231 -19 -167 56 169 -10 -140 -95 -48 154 142 -146 -84 -84 163
5301 163 229 -10 -188 47 289 228 -6 -31 0 259 242 38 -71 -71 122 134 219 -112 -121 -68 112 240 -27 -176
5325 -176 -131 -14 72 -157 -362 -301 44 37 -56 -265 -30 -44 100 230 -136 -172 49 121 97 -200 -186 143 197 16
5349 16 -260 -18 297 52 -110 -112 4 137 206 -109 -236 -7 130 81 61 -161 -117 259 245 2 -170 11 238
5372 238 214 -95 -110 -56 175 62 -93 -31 13 209 -69 205 -9 -157 -89 117 -35 -164 -210 -72 69 -28 -179
5395 -179 -178 -101 -98 70 -20 -40 -260 -128 119 64 -181 -65 4 240 222 -278 -34 170 231 4 -41 113 263 212
5419 212 15 -130 -23 232 287 19 2 61 247 285 101 -274 -74 274 135 -57 -201 55 110 195 -95 -245
5441 -245 -113 121 -28 -154 -184 -95 17 51 9 -63 -104 3 -84 -130 -34 -119 60 -41 -96 -155 100 169 -46 5 57
5466 57 28 111 161 91 111 -109 138 3 245 47 -63 62 202 126 -32 25 33 41 63 31 -64 -181 -71 -9 -76 -115
5492 -115 -191 -104 118 -20 -227 -261 82 115 -118 -268 -151 77 94 -193 -53 140 162 -32 -81 52 -68 170
5514 170 47 -81 -121 -14 13 134 -75 -45 4 196 111 -17 -8 108 60 -96 -110 1 14 119 -60 -18 117 119
5538 119 -45 98 70 35 -91 106 -11 -49 36 -52 -3 13 49 -115 -42 -97 -171 -2 -64 -166 -33 67 -3 -4 -76
5563 -76 -150 6 -24 -41 -187 -81 132 24 40 33 -34 92 173 -19 -95 -57 164 156 -69 39 -89 100 183 -50 -185
5588 -185 84 128 65 -2 -112 175 47 -67 -80 -41 -15 -155 -49 16 32 56 13 125 -54 -50 -65 240 205 -33 -46
5613 -46 37 3 14 -83 -19 172 -76 -57 -11 -9 -213 -28 45 19 -122 -106 -62 67 46 -81 -147 82 -21 -61 -50 -13
5639 -13 -14 -72 89 21 -34 110 -52 -21 158 36 -1 100 181 8 38 87 42 122 57 -20 98 131 -29 5 -89 94
5665 94 162 102 50 8 60 112 -72 -116 -64 -69 -134 -125 -160 -125 -32 -40 -135 -165 -59 9 -68 -137 -99 9 -56 -87 -79 -24 -53 -52 183
5696 183 70 31 110 214 119 23 59 201 151 158 99 225 224 96 -74 -15 137 194 -44 -38 164 156 0 -72 -33 43 18
5723 18 -132 -41 -43 -133 -192 -169 -53 -129 -252 -259 -141 -305 -108 -206 -166 -114 -17 -145 -28 100 27 57 137 83 106 134 -47
5750 -47 193 112 203 121 51 45 11 198 212 119 15 115 -155 16 81 142 88 -52 12 8 121 -33 -49 35 73 -55
5776 -55 10 106 57 -73 -46 36 0 -115 -179 -50 -42 -14 -185 -105 34 32 -70 -131 15 -134 -55 -80 32 7 93 9 8
5803 8 162 11 -3 111 337 -19 98 157 102 65 149 150 39 -30 14 55 95 80 -79 -105 89 -249 -36 -92 -59 11
5829 11 -132 10 -15 -103 -62 -41 69 -58 6 28 1 41 -135 -79 -47 -60 -26 -92 46 30 -140 -109 -98 26 -148 -50
5855 -50 -169 -22 -138 -75 84 13 107 -5 39 161 33 -82 83 227 125 64 92 157 157 97 148 115 221 8
5879 8 -5 -40 61 -130 -46 -54 45 -166 -344 -139 -259 15 -61 -148 -95 30 -87 -143 36 0 -102 64 69 -81 -40
5904 -40 120 19 -7 -73 121 18 45 -46 -75 113 28 -80 12 188 99 79 -54 -42 148 -78 -93 115 40 -187
5928 -187 167 42 122 -15 -59 115 94 -3 -107 -143 2 -29 -70 -66 -72 38 -81 -181 11 8 -135 -83 68 -77 -67
5953 -67 -29 -85 -37 43 -12 85 -12 -14 9 4 69 -49 29 83 129 57 -18 -65 93 53 27 95 79 54 7 -15 163 19 -39
5982 -39 -22 -6 -18 27 -42 -175 -54 101 16 97 -47 -78 118 84 -16 -57 20 -2 167 32 -172 -151 -62 30 -111
6007 -111 -37 -23 116 -32 0 -41 -63 -265 -74 -20 -81 57 -15 -72 -41 -34 -18 146 -35 -50 -72 107 77 59 22 -66
6033 -66 112 19 112 -14 41 -33 57 144 200 33 3 93 103 148 40 -134 -73 -33 -29 9 -110 -6 76 -35 3 -157
6059 -157 -199 107 145 21 -256 -57 10 130 -162 -12 -165 -46 98 -82 -8 0 19 100 -74 -21 -105 -7 -5 -44 62
6084 62 10 191 -50 -74 -65 137 212 -18 -70 69 248 44 -43 -38 5 110 232 36 15 4 -19 71 138 -38 -166
6109 -166 -2 -36 12 -68 -92 -83 24 89 13 -74 -65 -38 -32 96 50 -60 -129 -35 -61 -10 -43 -107 20 94 -42 -77 -26 69
6137 69 -52 -47 48 89 -16 -52 47 99 130 58 -5 7 -54 78 99 136 -82 -239 197 184 19 -183 -130 12 119 -15
6163 -15 -173 -45 -8 110 60 -60 -177 -160 -46 90 -67 -56 -146 12 149 3 -30 -184 -2 27 16 24 6 -141
6187 -141 -54 29 74 92 -57 -24 45 28 108 68 4 44 55 83 68 121 -30 87 46 71 58 137 70 79 35 77 -61 -157
6215 -157 -72 84 199 -84 -268 -150 -76 50 155 -253 -236 11 89 -94 113 -90 59 91 256 18 -132 -179
6237 -179 61 212 -33 9 92 131 136 -53 60 81 135 -98 -23 28 15 -127 33 120 35 60 -41 -66 9 -9 67 -59
6263 -59 -155 -126 -15 74 116 -110 -48 -102 60 14 -56 79 33 -40 36 139 -18 -13 -32 162 175 77 -117 -56 21 141
6289 141 128 -84 48 117 75 41 109 -166 -95 123 61 19 -208 -76 -8 86 -44 -104 98 69 -54 -56 -5 57 25 -57
6315 -57 -68 -77 52 38 -98 -44 46 25 -40 13 -35 -191 103 229 61 -59 -15 152 285 141 -31 -41 68 211
6339 211 38 -38 -83 19 143 191 33 -4 -95 -11 -17 -66 52 -146 -78 32 -135 -98 -41 -88 112 186 -10 -153 -11
6364 -11 75 137 97 -81 53 111 128 106 79 156 155 -177 121 114 60 32 -122 -28 -78 -2 47 29 -65 -124 101 198 80 -74
6392 -74 -39 145 84 -1 -6 -135 -3 129 60 -75 -125 -73 143 -1 -30 -35 -135 -4 -56 -108 -48 -60 105 74 -74 -59
6418 -59 38 22 36 -23 -35 -75 58 75 129 144 137 23 106 94 -23 18 39 141 53 -162 153 67 59 -109 -158 -94 108
6445 108 -1 -98 -97 36 8 40 -125 -102 -51 -23 108 41 -50 -9 -14 4 15 -85 -97 169 104 -89 -37 -47 -51 9 92 -15
6473 -15 65 -54 71 24 -92 -99 -48 51 0 42 -25 -23 33 -114 97 29 128 79 160 5 51 104 54 45 112 69 9 63 148
6502 148 -58 -9 15 128 19 -104 52 8 31 -44 59 -30 -122 -12 168 7 -141 -22 56 26 -92 -97 -44 155
6526 155 143 0 -79 17 0 -8 51 34 -25 -27 24 -37 14 -113 -2 162 111 -79 68 85 4 99 -74 95 84 55 108
6553 108 68 160 168 -50 -15 103 72 14 -59 88 -48 -121 -13 12 -52 -12 -147 -120 21 -37 -101 -124 45 15 -97 -52
6579 -52 -30 42 -1 39 -51 -74 -75 -84 5 -64 -18 37 -34 -6 34 15 36 33 3 182 68 28 67 0 -4 69 63 -110 179 79
6609 79 -156 51 83 -1 -68 -49 34 -12 16 -71 -93 26 -79 -38 -73 -84 -147 -133 -33 -10 -51 -159 -28 67 31 -46 162
6636 162 -82 137 -63 -69 120 -10 -37 11 -43 84 17 1 25 40 -26 -143 36 118 -106 45 53 63 41 -11 20 -20
6662 -20 -65 63 -68 8 -15 -13 39 -39 -10 -95 27 -16 -101 -146 -83 5 -93 -148 -67 64 172 -147 -32 -107 47 53 -19
6689 -19 33 -119 -24 172 112 36 -21 -5 37 107 -34 -32 -104 54 -30 -88 157 79 -50 78 116 -26 17 18 78 23 -31
6716 -31 36 44 30 51 -225 -27 176 -28 19 -11 65 -46 80 -101 30 -26 -31 91 81 38 -19 -48 -41 -45 10 -26 -83 27
6744 27 2 37 57 -63 44 46 -3 -2 -11 10 44 -47 -105 -83 -54 -15 -31 12 19 30 -122 -80 -104 -41 148 65 -75 -84 -66 -21
6774 -21 -45 27 67 -37 96 66 48 -10 -75 76 78 18 62 72 18 108 75 51 40 60 56 174 141 107 -10 -88 77 -49
6802 -49 -53 26 44 -43 -33 -106 54 -26 3 -203 21 -36 -132 -135 -94 -67 -18 98 -121 -48 3 30 53 139 37 -63 18 51
6830 51 148 87 85 14 61 -52 23 -11 35 -30 65 53 73 -9 85 94 3 -60 -74 13 83 -60 -30 37 24 20 -13 57 -80 -69
6860 -69 -16 -166 -8 3 -73 -33 -16 -139 -112 -36 -22 -20 -119 -92 -10 -47 -48 -9 100 31 -4 152 30 105 28 44 186 111
6888 111 89 55 270 163 85 112 23 196 -83 50 44 -32 94 51 -17 43 -54 -28 -12 38 -70 -90 -47 -25 -42 -158
6914 -158 -98 -29 -14 -74 30 39 -84 -29 -76 -81 77 -74 -7 -119 105 -68 -41 127 102 59 -18 60 62 127 82 38 96
6941 96 93 89 121 69 89 -73 97 113 106 8 84 -12 17 -24 -37 33 2 -50 -72 -106 13 -63 58 -120 -110 -100 -46 -44 -13 -40
6971 -40 -31 -43 -50 -37 -83 -87 -21 -53 -83 -115 95 38 -134 78 47 -92 -7 65 120 118 25 34 84 2 100 46 -34 67 6 -10
7001 -10 144 162 -8 67 13 98 90 -19 -105 26 5 -226 31 -31 -42 -92 30 -94 14 -97 -76 -94 193 -37 106
7026 106 -109 -100 -29 -11 114 18 110 34 -52 -33 -41 64 139 30 -83 79 133 46 -19 98 76 -17 63 -12 99 -3
7052 -3 -85 -33 42 -50 -89 -96 27 33 -25 -29 -51 104 82 -10 -15 -60 -47 -11 2 -23 -3 74 -72 -91 -84 212 -64 37 66 22
7082 22 2 -11 -10 -73 -21 71 30 -42 -51 11 48 18 -7 -1 -10 -21 15 34 48 -111 -23 -33 -44 12 -75 -7 -60 47 72 -1 58
7113 58 -134 -61 -174 -35 92 -23 32 67 125 78 -40 220 105 -20 -68 -70 70 -45 -4 175 6 24 -19 -54
7137 -54 29 -48 -132 -74 -13 95 -14 -37 50 -57 3 69 2 49 -87 90 69 87 -115 -186 -39 25 -118 121 69 7
7163 7 72 249 110 123 -48 -41 -45 -6 -20 60 93 -21 178 -41 16 17 54 -65 80 39 -57 120 81 -101 87 -55
7189 -55 10 82 122 -105 -103 -42 232 -132 -43 40 38 19 -127 65 -24 1 -98 40 66 -80 -20 -13 -45 -9 -3 99 60 78
7217 78 82 -98 1 125 -92 119 28 208 51 79 -30 27 126 12 6 20 35 -155 -88 114 -61 -196 65 -45
7241 -45 -40 -94 -21 -59 34 -55 -22 -71 -194 -35 -83 -158 2 21 97 37 186 -42 44 175 -7 -2 73 -31 27 4 63
7268 63 -35 -33 -42 148 37 1 89 76 17 46 11 48 13 88 -15 -66 15 15 -13 -22 -65 46 -113 -135 -103 0 60 3 45
7297 45 -60 -43 -65 55 -7 -57 -8 54 28 12 50 110 136 -28 13 -99 126 118 70 41 -73 56 -3 128 44 -15 6
7324 6 72 -47 79 -27 -36 -37 101 1 -24 -112 24 53 -13 28 -240 -130 40 -65 24 -4 75 -10 139 38 -90
7349 -90 69 92 34 31 -96 6 -22 -20 33 8 64 -5 -27 64 -47 -104 -28 82 25 93 -107 -7 55 57 -224 2 74
7376 74 28 -15 -100 29 114 13 -4 129 -57 -20 123 53 -121 20 30 -23 -109 -21 -70 86 -15 35 -29 -51 -97 8
7402 8 -49 40 27 -128 10 47 -1 41 -37 41 145 4 -38 17 6 37 -15 56 79 3 84 -30 27 112 22 -23 27 90
7430 90 75 129 53 120 26 -24 5 93 61 43 -67 140 -6 -83 5 -11 84 5 -27 -111 47 4 -70 102 -23 -102 -13
7457 -13 52 29 26 -40 157 135 18 10 70 68 104 51 -46 136 139 -99 131 45 -7 41 -27 93 -89 76 81 74 -103 -149 -95
7486 -95 80 50 -41 91 28 -43 -20 -66 1 -192 0 -42 57 30 17 30 113 95 -131 -41 -22 -26 -14 -37 69 -58 64
7513 64 46 29 144 -22 -30 137 159 -160 -9 7 142 34 26 104 79 24 6 -103 26 20 -96 -49 -14 -135 -45 -56
7539 -56 -21 9 -142 -4 4 52 -133 80 -86 67 -71 -73 30 -77 64 -56 96 74 25 122 91 28 119 47 51 -38
7565 -38 -37 -54 -62 10 48 -35 -56 -22 -27 129 -46 75 49 -76 9 67 117 -35 5 21 5 -122 43 51 90 19 64 -15 30
7594 30 -40 6 -88 23 -14 4 102 -100 5 -87 -54 29 92 25 -72 -36 0 -65 -4 7 125 -46 -102 84 8 130 -32
7621 -32 11 68 -46 0 -58 -68 -66 -121 88 13 -33 18 -36 28 4 79 -202 -115 -65 9 -61 71 16 -50 90 -22 -92 -126
7649 -126 18 -81 1 -28 -37 -26 -33 46 -117 -37 -65 63 -32 -30 9 39 13 44 96 -5 51 46 -61 17 35 40 117 -23 -128
7678 -128 -77 67 -16 112 88 -44 -10 -51 68 36 -23 12 5 101 23 29 50 -34 -37 -36 50 -63 2 17 -52 23 27 62 12 -38
7708 -38 -127 -3 10 13 23 -81 58 140 26 62 -183 -69 106 -38 -27 -120 34 126 -105 54 145 -35 -67 48
7732 48 -21 10 -46 83 31 -19 -32 6 88 115 7 -32 146 -6 -82 -56 -51 -41 178 -68 138 97 19 15 81 152 -6
7759 -6 -26 -32 -4 -54 -2 82 13 5 7 10 -7 -13 -49 74 28 125 1 -47 -90 -26 -20 11 19 -69 20 -88 36 67 -16 -35 6 -34
7791 -34 -22 104 80 48 66 -65 -87 -3 -3 67 107 74 31 20 1 -29 52 66 -58 51 -73 -149 13 63 -35 -3 14 87
7819 87 35 -11 -79 -106 28 80 16 54 25 16 -44 56 176 1 21 58 181 -73 30 91 51 94 -7 -99 19 -49
7845 -49 3 21 -98 126 -155 -33 3 -47 20 -83 58 -80 -79 5 2 54 -65 0 8 46 -76 -3 -59 -4 -63 -76 11
7872 11 74 145 77 91 57 24 129 18 85 -2 37 2 94 132 -115 24 47 54 -32 -45 -55 111 3 -28 94 74 -57
7899 -57 -9 91 12 -82 -17 55 174 21 -72 -51 8 28 34 -106 1 -9 92 98 -33 81 25 100 75 -64 123 10
7925 10 89 82 101 100 53 117 -114 -27 -14 -107 -4 -6 -43 -89 114 -77 -68 -146 -103 -101 -71 -22 -125 -41 -19 -14 43 -84 -2 9
7955 9 5 23 -146 2 97 36 96 215 -12 39 16 78 166 50 -21 29 82 35 -18 72 185 56 -19 96 81 -11 -24
7982 -24 20 17 -74 66 68 19 124 -42 32 19 -113 -225 19 67 -119 -86 -48 -127 94 -57 39 23 -24 -73 -33 25 -130
8009 -130 -12 47 35 -38 -82 -99 82 53 112 17 39 -12 49 88 -30 -45 55 86 78 146 -92 5 30 -131 38 -22 -31
8036 -31 51 21 -107 -47 -40 -119 -24 -56 -104 -33 -26 -87 22 -11 -97 -68 -8 91 -79 -61 -92 15 -2 17 155 18 81 -58
8064 -58 -86 -16 2 46 -66 4 -58 76 20 46 -31 53 91 -5 27 58 37 8 57 193 -16 156 18 -12 81 103 46
8091 46 -109 46 -45 -129 -111 -114 96 -76 0 -48 -170 -10 4 -84 -22 79 45 12 -113 -23 -81 -148 -94 43 15 133
8117 133 145 156 -31 -105 -12 35 83 -3 6 66 58 70 -21 -42 74 -15 -83 29 28 0 -135 127 40 48 -75 -65 -43 158
8145 158 -40 -24 -31 -5 29 -31 107 -11 -6 32 70 -63 -9 -62 50 11 2 -28 2 14 -18 -31 -125 -24 -162 -50 -63
8172 -63 -9 110 59 34 97 4 47 -2 -101 -18 -117 16 34 -9 -109 -19 44 9 -31
8191c1
##END NTUPLES=NMR FID
##END=
