##TITLE=1H_TG-2110-C
 CDCl3, 8 sc, 
 27.6.2019
##JCAMPDX= 6.0         $$ Bruker NMR JCAMP-DX V2.0
##DATA TYPE= NMR FID
##DATA CLASS= NTUPLES
##ORIGIN= UXNMR, Bruker Analytische Messtechnik GmbH
##OWNER= root
$$ XWIN-NMR		Version 3.5
$$ Thu Jun 27 14:39:14 2019 Russian Standard Time (UT+4h)  she@DPX200
##.OBSERVE FREQUENCY= 200.13155
##.OBSERVE NUCLEUS= ^1H
##.DELAY= (6, 6)
##.ACQUISITION MODE= SIMULTANEOUS
##.ACQUISITION SCHEME= undefined
##.AVERAGES= 8
##.DIGITISER RES= 18
##SPECTROMETER/DATA SYSTEM= spect
##.PULSE SEQUENCE= zg30
##.SOLVENT NAME= CDCl3
##.SHIFT REFERENCE= (INTERNAL, CDCl3, 0, 15.7039)
##AUDIT TRAIL= $$ (NUMBER, WHEN, WHO, WHERE, WHAT)
$$ ##TITLE= Audit trail, XWIN-NMR		Version 3.5
$$ ##JCAMPDX= 5.01
$$ ##ORIGIN= Bruker BioSpin GmbH
$$ ##OWNER= she
$$ F:/spectra/data/she/nmr/H-F/1/audita.txt
$$ ##AUDIT TRAIL=  $$ (NUMBER, WHEN, WHO, WHERE, WHAT)
(   1,<2019-06-27 14:38:04.21 +0400>,<she>,<DPX200>,
      <created by zg, POWCHK disabled, PULCHK disabled
       configuration hash MD5:
       00 E9 B6 7A A2 85 ED C7 34 08 36 98 17 FE 4E 26
       data hash MD5: 16K
       98 16 7E 96 48 AC 80 B0 F1 AC 6A 2C 01 E0 6F 1F>)
$$ ##END=
$$ 
$$ hash MD5
$$ B1 CE E8 15 5F 9D 64 B0 98 D3 AA 5C 52 15 4A AB
##$RELAX= 
##$RELAX= 
##$RELAX= 
##$RELAX= 
##$RELAX= 
##$RELAX= 
$$ Bruker specific parameters
$$ --------------------------
##$DU= <F:/spectra>
##$EXPNO= 1
##$NAME= <H-F>
##$PROCNO= 1
##$TYPE= <nmr>
##$USER= <she>
##$AMP= (0..31)
100 100 100 100 100 100 100 100 100 100 100 100 100 100 100 100 100 100 
100 100 100 100 100 100 100 100 100 100 100 100 100 100 
##$AQSEQ= 0
##$AQ_mod= 1
##$AUNM= <au_zg>
##$AUTOPOS= <>
##$BF1= 200.13
##$BF2= 200.13
##$BF3= 200.13
##$BF4= 200.13
##$BF5= 200.13
##$BF6= 200.13
##$BF7= 200.13
##$BF8= 200.13
##$BYTORDA= 1
##$CFDGTYP= 0
##$CFRGTYP= 5
##$CHEMSTR= <none>
##$CNST= (0..31)
1 1 145 1 1 1 1 1 1 1 1 1 1 1 1 1 1 1 1 1 1 1 1 1 1 1 1 1 1 1 1 1 
##$CPDPRG= <>
##$CPDPRG1= <>
##$CPDPRG2= <>
##$CPDPRG3= <>
##$CPDPRG4= <mlev>
##$CPDPRG5= <mlev>
##$CPDPRG6= <mlev>
##$CPDPRG7= <mlev>
##$CPDPRG8= <mlev>
##$CPDPRGB= <>
##$CPDPRGT= <>
##$D= (0..31)
0 1.2 0 0 0 0 0 0 0 0 0 0.03 0 0 0 0 0 0 0 0 0 0 0 0 0 0 0 0 0 0 0 0 
##$DATE= 1561631883
##$DBL= (0..7)
120 120 120 120 120 120 120 120 
##$DBP= (0..7)
150 150 150 150 150 150 150 150 
##$DBP07= 0
##$DBPNAM0= <>
##$DBPNAM1= <>
##$DBPNAM2= <>
##$DBPNAM3= <>
##$DBPNAM4= <>
##$DBPNAM5= <>
##$DBPNAM6= <>
##$DBPNAM7= <>
##$DBPOAL= (0..7)
0.5 0.5 0.5 0.5 0.5 0.5 0.5 0.5 
##$DBPOFFS= (0..7)
0 0 0 0 0 0 0 0 
##$DE= 6
##$DECBNUC= <off>
##$DECIM= 24
##$DECNUC= <off>
##$DECSTAT= 4
##$DIGMOD= 1
##$DIGTYP= 9
##$DL= (0..7)
0 120 120 120 120 120 120 120 
##$DP= (0..7)
150 150 150 150 150 150 150 150 
##$DP07= 0
##$DPNAME0= <>
##$DPNAME1= <>
##$DPNAME2= <>
##$DPNAME3= <>
##$DPNAME4= <>
##$DPNAME5= <>
##$DPNAME6= <>
##$DPNAME7= <>
##$DPOAL= (0..7)
0.5 0.5 0.5 0.5 0.5 0.5 0.5 0.5 
##$DPOFFS= (0..7)
0 0 0 0 0 0 0 0 
##$DQDMODE= 0
##$DR= 18
##$DS= 0
##$DSLIST= <SSSSSSSSSSSSSSS>
##$DSPFIRM= 0
$$ [...]
##$SUBNAM2= <"">
##$SUBNAM3= <"">
##$SUBNAM4= <"">
##$SUBNAM5= <"">
##$SUBNAM6= <"">
##$SUBNAM7= <"">
##$SUBNAM8= <"">
##$SUBNAM9= <"">
##$SW= 24.9336996594482
##$SWIBOX= (0..15)
0 0 2 0 0 0 0 0 0 0 0 0 0 0 0 0 
##$SW_h= 4990.01996007984
##$TD= 16384
##$TD0= 1
##$TE= 0
##$TE2= 300
##$TE3= 300
##$TEG= 300
##$TL= (0..7)
0 120 120 120 120 120 120 120 
##$TP= (0..7)
150 150 150 150 150 150 150 150 
##$TP07= 0
##$TPNAME0= <>
##$TPNAME1= <>
##$TPNAME2= <>
##$TPNAME3= <>
##$TPNAME4= <>
##$TPNAME5= <>
##$TPNAME6= <>
##$TPNAME7= <>
##$TPOAL= (0..7)
0.5 0.5 0.5 0.5 0.5 0.5 0.5 0.5 
##$TPOFFS= (0..7)
0 0 0 0 0 0 0 0 
##$TUNHIN= 0
##$TUNHOUT= 0
##$TUNXOUT= 0
##$USERA1= <user>
##$USERA2= <user>
##$USERA3= <user>
##$USERA4= <user>
##$USERA5= <user>
##$V9= 5
##$VALIST= <valist>
##$VCLIST= <CCCCCCCCCCCCCCC>
##$VD= 0
##$VDLIST= <DDDDDDDDDDDDDDD>
##$VPLIST= <PPPPPPPPPPPPPPP>
##$VTLIST= <TTTTTTTTTTTTTTT>
##$WBST= 1024
##$WBSW= 4
##$XGAIN= (0..3)
0 0 0 0 
##$XL= 0
##$YL= 0
##$YMAX_a= 514632
##$YMIN_a= -936818
##$ZGOPTNS= <>
##$ZL1= 120
##$ZL2= 120
##$ZL3= 120
##$ZL4= 120
##$ABSF1= 10
##$ABSF2= 0
##$ABSG= 5
##$ABSL= 3
##$ALPHA= 0
##$AQORDER= 0
##$ASSFAC= 0
##$ASSFACI= 0
##$ASSFACX= 0
##$ASSWID= 0
##$AUNMP= <proc_1d>
##$AZFE= 0.1
##$AZFW= 0.1
##$BCFW= 1
##$BC_mod= 2
##$BYTORDP= 1
##$COROFFS= 0
##$CY= 11.3945322036743
##$DATMOD= 1
##$DC= 2
##$DFILT= <>
##$DTYPP= 0
##$F1P= 18.9103706918063
##$F2P= -1.10871071338519
##$FCOR= 0.5
##$FTSIZE= 0
##$FT_mod= 4
##$GAMMA= 1
##$GB= 0.15
##$INTBC= 1
##$INTSCL= 1
##$ISEN= 128
##$LB= 0.24
##$LEV0= 0
##$LPBIN= 0
##$MAXI= 10000
##$MC2= 0
##$MEAN= 0
##$ME_mod= 0
##$MI= 1.114404
##$NCOEF= 0
##$NC_proc= 0
##$NLEV= 6
##$NOISF1= 3.799351
##$NOISF2= 2.8
##$NSP= 1
##$NTH_PI= 0
##$NZP= 0
##$OFFSET= 15.70392
##$PC= 1
##$PHC0= -8499.407
##$PHC1= 12.20098
##$PH_mod= 1
##$PKNL= yes
##$PPARMOD= 0
##$PSCAL= 0
##$PSIGN= 0
##$REVERSE= no
##$SF= 200.130013532006
##$SI= 16384
##$SIGF1= 3
##$SIGF2= 2
##$SINO= 400
##$SIOLD= 16384
##$SREGLST= <1H.CDCl3>
##$SSB= 0
##$STSI= 0
##$STSR= 0
##$SW_p= 3612.71676300578
##$SYMM= 0
##$S_DEV= 0
##$TDeff= 0
##$TDoff= 0
##$TI= <>
##$TILT= no
##$TM1= 0
##$TM2= 0
##$TOPLEV= 0
##$USERP1= <user>
##$USERP2= <user>
##$USERP3= <user>
##$USERP4= <user>
##$USERP5= <user>
##$WDW= 1
##$XDIM= 8192
##$YMAX_p= 0
##$YMIN_p= 0
$$ End of Bruker specific parameters
$$ ---------------------------------
##NTUPLES= NMR FID
##VAR_NAME=  TIME,          FID/REAL,        FID/IMAG
##SYMBOL=    X,             R,               I
##VAR_TYPE=  INDEPENDENT,   DEPENDENT,       DEPENDENT
##VAR_FORM=  AFFN,          ASDF,            ASDF
##VAR_DIM=   8192,          8192,            8192
##UNITS=     SECONDS,       ARBITRARY UNITS, ARBITRARY UNITS
##FACTOR=    0.0002004,     1,               1
##FIRST=     0,             0,               0
##LAST=      1.6414764,     0,               0
##MIN=       0,             -936818,         0
##MAX=       1.6414764,     514632,          0
$$ Real data points
##PAGE= N=1
##DATA TABLE= (X++(R..R)), XYDATA
$$ [...]
2523B887n002J356N344N03m139o24L254K397j394k536j064K190K055j853q65n8
2539B451q63k14J183l10k340j68J379l8j481j599r64J671K142k151k941J262J981
2556a000q15j479r45Q89K646m0k824o42L008M45j236m6K484J147j881j850P47
2573a392L388J417k683o87K046N45k877L79K594R30r93k533q84J955P32j732L82
2590E87K016j663l457R08K151l28j021L74R12J40k813j614K989M217j962l295
2606a859J113J668p27j633J734J857J94j693j937M80K443k13q90J190J23k445
2622e95n66J285rn15L92j38l17r74j306o9K647M16j957k64J21p18q7J545K80k
2642h31Q53r5j210l26R23J759J832k7k505m64J765P94jJ148J26j155m42O5n72
$$ y = [2887, -2115, -759, 4585, 5088, 949, 325, 3579, 5976, 4582, 2046, 982, 3172, 5227, 3374, 2509, 2451, 1588, 1374, 2557, 2247, -93, -261, 1118, 1080, -401, -2000, -2964, -1293, 849, -1302, -4243, -2981, -1000, -1815, -3294, -4239, -3350, -704, -744, -3568, -4210, -1202, -757, -1993, -2039, 445, 1592, -289, -2139, -1392, 1996, 3413, 730, 43, 2089, 2634, -243, 136, 2730, 3660, 2667, 134, -750, 1205, 1937, 205, 587, 2603, 940, -2517, -1609, 542, 214, -807, -433, 479, 619, -2194, -3808, -819, 3398, 1436, -1859, -746, 922, 195, -1438, 296, 2153, 2347, 654, -1283, -803, 1640, 1427, 537, 1727, 1850, -595, -1161, 124, 115, -400, -8, -146, -463, -1437, -2743, -2812, -165, 251, -1706, -1970, -1849, -2567, -2654, -1109, -829, -831, 22, -73, -1283, -1609, -686, 1073, 2905, 2878, 373, -91, 1674, 2468, 2467, 3615, 3741, 2586, 2144, 2209, 1637]
2661A637M19N30R2J14j268k588q58K083J212j734n20j38j451j209O39R12R58J60
2679a010j820j485P81P59M88J654k51j698R9J733j51m17J136J119Q8k97j236k76
2697g84J860J386j155k38Q80p91q06J599P58j228K42R49o8j022q91L12J862N45
2715C410k935q42K503R1k411o35J746L53j343j769p71K060R82k618j533J788M36
2732a488j456K35J66j005M25J735J85m10j396J47K502K139j692k678K217K541
2748B167q08j140P83J062N05m72j320L63J883Mk153n1Q19l39N50o75j577O4J923
2767A588m27j680k49M00Q79L54j098r95Q13J705p07m64j03m21J15K086r15k797
2785a916k43K479J205j371k210j454K062K068j704k519J265P17k99l84K13j85
$$ y = [1637, 2056, 2586, 2678, 2792, 1524, -1064, -1922, 161, 1373, -361, -881, -1019, -2470, -3679, -3040, -2128, -1170, -1010, -2830, -4315, -3534, -2775, -2287, -633, -884, -2582, -2483, -750, -901, -1318, -182, 937, 1025, 728, -508, -784, 1076, 2462, 1307, 1069, 1949, 1158, 352, 1951, 2709, 1481, 1723, 2672, 2604, 1582, 691, 1003, 2865, 3410, 475, -367, 2136, 2227, -184, -819, 927, 1280, -63, -1832, -2603, -543, 439, -2179, -3712, -1924, -1488, -2944, -2709, -2543, -3548, -3123, -1388, -1203, -1613, -3009, -2862, -360, 1779, 87, -2591, -374, 2167, 1359, 219, 1002, 2064, 2569, 2097, 777, 1140, 3023, 3027, 874, 823, 1642, 1303, 1853, 1178, -399, -335, 1588, 1161, -519, -768, -368, 511, 865, -233, -1228, -415, 1290, 583, 119, 16, -405, -290, 1796, 881, -1916, -2159, 320, 1525, 154, -2056, -3510, -1448, 620, -1084, -3603, -2338, -1621, -1920, -2304, -2091, -2276]
2801b276N37J303J99q84n12M2J660L124j167k631P43L079q83k109J048K633J095
2818E001j906l725m69L727K077j430k079j296m12P47J464j541j057K012L39k161
2834g09k254j093K922M428o06n211k686K251K698L90k59p65m94O59j254j939Q78
2851c044L374J527n54l397l119J342N135J545k172j368K01o74J18J047J341J606
2867B908N23k165k248M37J421K214K050j568l583q36K770J074q65j166j6J109
2883B059k83k764j263K307K230j179j854p82j295P85K194k58k078j022J286J585
2899c32K10k727j050K335K803j812j983Q00J448M23o11j154J92K658J527j985
2915G42k252r38J476L001K208k489l252N37J560Q6j24J452P58j63j649l367M55
$$ y = [-2276, -1739, -436, -237, -1121, -1633, -1591, 69, 3193, 2026, -605, 138, 3217, 2334, 225, 1273, 3906, 5001, 3095, -630, -1099, 2628, 4705, 3275, 1196, -100, -512, 235, 1699, 158, -899, 1113, 1452, -709, -2963, -4056, -1134, 3294, 2688, -2523, -5209, -2958, -260, 130, -129, -894, -1388, -729, -1983, -3922, -3044, 330, 1857, 1303, -2094, -5213, -3871, 1264, 2809, 637, -731, -530, -1204, -1086, -39, 1302, 2908, 3431, 1266, -982, -545, 876, 3090, 5140, 3572, -11, -847, 1923, 2997, 2132, 966, 950, 2059, 1776, -988, -2251, 56, 2286, 1107, -747, -1529, -2824, -2039, 155, -103, -2181, -3203, -1917, -332, -122, -2849, -3899, -1564, 1239, -573, -2556, -1756, -308, 115, -496, -1650, -1458, 1200, 2727, 742, -1510, -2448, -972, 2029, 4237, 1748, -1504, -967, 593, 679, 555, 2007, 2765, 2602, 953, -2414, -1959]
2932a959M017K220m01k500k977j478K831K913j08r85k86j314j191j186M08K801
2948H05K939j277n296k025J622J821K922O99k551k876l5N62J104J474Q35N1l64
2965D10k799k556K231M974J370k710j977j417P68J777J550l36K53m98j234k45
2981d39P60m7J046K397o09l711r80K122J969j14p11j250K55Q86j421o64J264P31
2999A484j180K40m49j724M28K174p7j668j348MJ885J326k478k384J678K589m89
3016A1j906p1Q2J033Q31j406l67J517O98o27p20q26L49K912J808k993k511J480
3034g06K148N15p95j027J90J666P9k352j89J509J309J48p21k097q37K374J423
3051B637q17j428N7jJ43l82q41Q68J331j428j695J98O68j000J421R99j416j976
$$ y = [-1959, 2058, 4278, 3877, 1377, -1600, -3078, -247, 2666, 2558, 1573, 1287, -27, -1218, -2404, -1996, 805, 3744, 2467, -2829, -4854, -3232, -1411, 1511, 2210, -341, -3217, -3252, -2690, -1586, -112, 723, 774, 410, -2389, -4945, -2714, 2260, 3630, 920, -1057, -2474, -1706, 71, 1621, 1285, 1538, 1040, -194, -439, 321, 274, 1320, 3717, 3108, -603, -1583, 539, 2508, 2394, 1683, 433, 688, 1574, 153, -511, 753, 1484, 304, 544, 95, -1629, -1201, 973, 896, -772, -2120, -2116, -231, 1095, -1383, -3767, -2089, 500, 11, -1895, -1966, -1884, -851, -20, -1426, -1793, -276, 422, -205, -925, -1751, -1402, 1510, 3318, 325, -2186, -706, 1442, 1957, 1162, 135, 325, 1991, 2070, -282, -471, 1038, 2347, 2495, 1774, -323, -1160, 1214, 2637, 1820, 392, 449, 448, 591, 209, -632, 236, 1567, 139, -1556, -1358, -690, -1690, -269, 730, -686, -2662]
3069b662J35R27J537j64j719k19J211K93j989K96K201N54p98n37n54O70J591L53
3087A126o84P6m52j45J638L72j803O39K581k68k825j394J272K698J113k587k858
3104a501J310J825l58j083M19K59l31l85j491j008J767K270n20j934j865l01K143
3121g84J277o44j000R89o10j815j47J849J314L29r18j894n69J210J105R58J070
3138A720r67k271K69O65K95K178J364j636k459l10P72J119J316P5k79j13k147
3155d09j759K297L429o30k539j063M04N44o2k40P60J459j115l078j71J966J051
3172H44M1l31p75j311M56Q64p8N0J10k57L39j041j111J394K249r68k633M07K047
3191B96L09r40j225n46K464Q27j610p09R72N81j103l02Q75M56J629k27l049q99
$$ y = [-2662, -2527, -1600, -63, -227, -1946, -2165, -954, -661, -2650, -2354, -153, 401, -397, -934, -1488, -818, 773, 1126, 442, 518, 66, -79, 1559, 1931, 128, 767, 3348, 3080, 255, -1139, 133, 2831, 3944, 1357, -1501, -191, 1634, 1276, 193, 612, 871, 540, 155, -1336, -2344, -577, 1693, 1173, -761, -2626, -2927, -784, 493, -151, -1151, -162, -772, -2587, -2734, -885, 429, 758, -160, -2054, -2623, -1413, -308, 650, 1720, 753, -1518, -1249, -584, -289, 1889, 3253, 1617, -842, -1152, -380, 739, 2055, 2130, 1851, 1738, -409, -2168, 129, 3558, 2928, 389, -674, -270, 274, 212, -28, 732, 2191, 1076, -2002, -2173, -207, 844, 885, 554, -221, -1532, -1076, -212, -290, -240, -130, -387, -48, -1089, -2200, -806, 1443, 475, -2158, -1751, 296, 605, -335, -1560, -2106, 358, 1185, -425, -1134, -162, 419, -684, -986, -111, 345, 1974, 1747, -1302, -2201]
3209b201K217K047L72j118r74k48P30q96p81K739K443j986k903r42Q40K474J189
3226C002o69j699o23r35j037J683J727Q42n45j896l244q76L140K701m45j808j634
3243b316p98M5M38Q85K363Q99k958k933J92K529J662J169L58j908r77l21J057
3260f14J916K253r71j499l31k82j00J858J330m85r79j20j414q75J021J903Q92
3277C503j309l525q65K999J174j895j667J326R89j045r58j198J307K013j004k047
3293b202N1J000M35K87j072j220P02K251J94k812p33K120J789n01k565k90L183
3310F17J616l255k373K508L630J56k104j899P29K359J340j349q46J306k49m50
3326A736Lp15L55J591M22k360j103k72O30O74K39o64j202o34n10m27J615K40r99
$$ y = [-2201, 16, 2063, 2435, 1317, 343, 95, 825, -71, -852, 1887, 4330, 2344, -559, -1501, -661, 1813, 3002, 2333, 634, 11, -924, -1961, -278, 1449, 2291, 1746, -150, -3394, -4270, -1130, 1571, 1126, -682, -2316, -3114, -3069, -2631, -1746, 617, 1516, -1442, -4375, -4183, -1654, 8, 1177, 1535, -373, -1350, -1671, -614, 1302, 3555, 2584, 1085, 754, 472, 372, 2230, 3560, 3075, 2096, 1976, 562, -313, 708, 2611, 3503, 2194, -1331, -2196, 803, 1977, 82, -1585, -259, 730, -315, -1273, -2471, -1164, 849, -155, -2202, -2151, -1151, -716, -429, -1501, -2721, -2019, 232, 426, -2386, -3119, -999, 790, 289, -2276, -2566, 617, 2233, -1022, -3395, -887, 2743, 2899, 795, -1104, -375, 1984, 3324, 1975, 1129, 2435, 2186, 1736, 1739, 1024, 1379, 2970, 3392, 1032, -71, -343, 287, 961, 1200, 536, -666, -1300, -1810, -2237, -622, -382, -1381]
3345a381j94l94n71J30J298J06Q1M36p11q54O23P54R93O09m88j709L85J568q55
3364a74j042J809J727j631k603pK652K338j435l072J77L500Q4k323l16J823J076
3381B583K5j785j006J065J283O18n25j185j488P53J684m48k035l11J292o5k158
3398a703q98N06J943n57k409m14K252M01k174mJ764J240r51j632n7K247J933j143
3416C44j550O86J362K79k62J65K9R91R0j624k71J515M03o80l51m33l20J14l3k09
3436B45L59J406r21j782k82L84J202J168j009k488q0J988P19q49j308J46J931
3453H29L65k549j712K256K613j149k317j82R28N33n77n70P89J165j493q99J628
3470c42J115j163l16R87M67j6m37k02M52P14p18L97Q05l35j740R41Q23l80n97
$$ y = [-1381, -1575, -1969, -2540, -2410, -1112, -1006, -925, -489, -1200, -2054, -1431, -677, 316, 925, 437, -1272, -887, 681, -174, -1216, 593, 2320, 689, -1914, -1921, 731, 3069, 1634, -1438, -1261, 2239, 2323, 0, -316, 1507, 2583, 2608, 823, -183, 882, 2165, 2783, 2258, 1073, -415, 338, 2022, 1574, -461, -772, 520, 455, -1703, -2601, -2095, -152, -709, -3118, -3532, -1280, -879, -3053, -3057, -1293, -53, -1004, -2636, -2693, -446, 1487, 344, -1206, -520, 842, 1121, 859, 1024, 1053, 2044, 2134, 510, 239, 1754, 2157, 1477, 1126, 693, 373, 487, 454, 245, 604, 2010, 1089, -693, -975, -591, 611, 1779, 770, -1718, -1798, 190, 909, 60, -1248, -1102, 829, 1194, -1355, -3067, -811, 1802, 653, -1664, -1846, -918, -385, -962, -1532, -743, 422, -1071, -1970, -342, 773, -390, -706, 281, 748, 732, 295, 93, 545, 1259, 541, 938, 1743, 1408, -332, 609, 1432, 1052, 455]
3489D55J17N76m98p57m14P52O25r66r05J127P07j714j268J294K332r0j562k187
3507b376M8L054Q89j708j364P53J103k4j252j324J508K889m61l106j157J195J975
3524F42N98r05r86jQ19m29l45M10J203k52K18j415j141P23K212K24j370n91L07
3543g9L54k58q38M68K052L43k603j729K111J377K86l81q79l96J27P4M15Q12j53
3562A103j536O58R60j015j666Q58J078K24m10j373k09Q20M65n10L3J70p40l06
3580a396J320n59m28N10J308K89j431r41M96J518R55j328p21J394J40j064j34
3597g2J65O10K74K18j763n24J426N05q13k21m16P36M57p12j646R15K216k90r53
3616A12j191M22R01R81m75n61J58j8k10L4K68m23K8J261q71j595L39R26K19j65
$$ y = [455, 572, 1148, 650, -107, -521, 231, 856, -110, -1015, 112, 819, -895, -2163, -869, 1463, 1373, -189, -2376, -2328, 726, 1615, -93, -1457, -704, 399, 375, -877, -2201, -693, 2196, 1735, -1371, -2528, -1333, 642, 1240, 335, -651, -652, 167, -262, -607, -197, 1006, 754, 972, -443, -1584, -861, 1351, 1575, 205, -386, -79, 275, 17, -821, -353, 1699, 2042, -561, -2290, -179, 1198, 1484, 1103, 224, -172, -45, 29, 444, 1256, 1103, -433, 225, 1185, 170, -1496, -638, 440, 664, 254, -1119, -1328, -508, -43, -553, -520, -350, -1090, -1396, -76, -635, -1063, -553, 755, 1044, -387, -1328, -832, 686, 1641, 313, -408, 986, 1126, 62, -72, 93, 703, 977, 1195, -568, -1092, 334, 839, 26, -195, -611, 125, 582, -130, -1776, -861, 1355, 1065, 112, -1079, -657, 244, 1225, 750, 189, 347, 329, 119, 153, 421, -2, 26, 1287, 416, -1179, -840, 86, 305, 140]
3636A40p79k37N56k4j069P05J060n97q99P09J29m09p0P46R9K81k71j036O40J202
3656H76o17n95J044J23q12K1L39J11K31k67k61K61J16m21J79N48Nq60M56M58m28
3677E07m69J88O08L60m68o10k1K95J11m27q9J58r86l6N85l81n25N93j09o22r4
3698a432n4M13j18L4n73O25J000j019L6J084O0q9J69N85k50k16M61M20J43k9k33
3719A017K5Q61j11j251R27R39j220q23P42n0m3n1j261o5N37q0r84P35j58r64K94
3740i84K54k17r58N13P28k85l16q63L78J579l07j228N54J558n96q85L22N57P31
3759E35M75p23l68R31M7k75O74L35r12k46M52r0o46P44N48j033k8ok75M74l3o84
3781a04M62L0n61o20O63j70M22j79J7k64m78J87o5J027L97j167r05M50N66j54
$$ y = [140, -639, -876, -320, -344, -1413, -708, 352, -245, -1144, -435, -306, -715, -785, -39, 60, 341, 70, -966, -326, 876, 259, -336, 708, 831, 19, 40, 379, 490, 721, 454, 193, 454, 570, 149, 328, 876, 881, 21, 477, 935, 507, 38, 226, 834, 1194, 726, 116, 95, 390, 501, 74, -15, 143, -843, -879, -294, -675, -1200, -607, -716, -1338, -1432, -1486, -1073, -1191, -1157, -1730, -1105, -105, -1124, -1088, -4, 56, -33, 136, 721, 471, 255, 716, 1136, 1279, 1250, 1017, 1042, 1903, 1792, 541, 1468, 2407, 1187, 364, 1106, 1056, 1013, 962, -299, -364, 173, 93, -891, -156, -314, -1278, -984, -730, -947, -1905, -1392, -664, -949, -1265, -2128, -1750, -171, -478, -1706, -1152, 406, -190, -1075, -753, -196, 535, 1010, 287, -81, 850, 897, 622, 1296, 1631, 719, 473, 925, 835, 189, 933, 1481, 448, 420, 414, 139, 613, 580, -104, 358, 388, -173, -793, -130, -300, 122, -57, -40, -304, -782, -595, -660, 367, 764, -403, -1308, -858, -292, -446]
3801d46O27l88j209O26Q94k39r19J25R21L78p6j141n38K209J158j719j212R07
3819d2R23P59q20p45P5R31J98j028j3K00j32L66l42j162k35J971J40j661o38N58
3839f97J273j29j107p32J487J017j040r52Q92J090j85j11o27o78O10R65L8m49
3857F65j79j078K4Q64Q7p48K9P1n61k45L85k45k53P40k75p29j48J73N17J743k45
3878E92j809mJ648N80l82m53P10P5P52q98m72Q56J302l15j003j155n99J254J540
3897B219j524j748M47J202N3j356n90N54K027l59k480j006J989J713n20o56r15
3914i50p8J241R80j512o48N60P57m34m32q32R88J397q12j639m18J478L33k87m79
3933g87Q5K27L07p89N64J273k71q17L82R07k17n95N87N25R5m96p32L90J256l32
$$ y = [-446, 181, -207, -1416, -790, 104, -135, -1054, -929, -8, 370, 294, -847, -1385, 824, 1982, 263, -949, -42, 881, 1640, 820, 75, 150, 1081, 1279, 251, 238, 438, 306, 672, 330, -832, -1067, 904, 1044, -617, -1255, -697, 576, 447, -660, -1392, 95, 1112, 72, -880, 12, 1102, 917, 806, 179, -499, 111, 1076, 1114, 665, 486, -592, -568, 296, 383, -365, -336, -265, -826, -1071, -686, -931, -1184, -444, -719, -1448, -1596, -1423, -906, 837, 592, -1217, -1221, 427, 1007, 625, 172, 882, 957, 1709, 811, 339, 1195, 2497, 2182, 1179, 24, -575, 679, 2219, 695, -1053, -606, 596, 649, -707, -1297, -743, 1284, 925, -1555, -2561, -572, 1141, 621, -35, -950, -1028, 213, 1193, -319, -967, -407, 350, -84, -516, -1348, -360, 1037, 225, -1414, -1832, -354, -21, -308, -787, -702, -475, -168, -957, -393, 880, 609, -208, 174, 1081, 864, 269, 856, 1381, 1476, 980, 248, 638, 1894, 1562]
3953A562o26o91K5k30O30K25j292p88R06N79p46j205N4J282J192j182k805P94
3971b316K695O19j666j148L90J532N08j006r87R50J326J41j756l94P16J211L83
3988A198j423j147P75J464k08r03l57P17J007k30j633j3J188J246o25q86l79N20
4006C11J166O14j705o06R72K04k26l36j85j7K47n33m56P01k17r44N3J384j27k061
4026a761k24J074J392q14j551k43K143R01j822j704J658J601j83j034l36K43J410
4043G50N28r58j020N25Q48N90j86j454k4K037P88k149j585J304K137M35k250j851
4061a535J045K825n55k529n53J233J325m21j411r90J095J528p86j419k16K67R05
4078a92M17n52n44J43N49l24k4N34k90l10J36M2k33P58R7m7k73r2l05N19N48l22
$$ y = [1562, 936, 245, 270, 40, 670, 895, -397, -1185, -279, 300, -446, -1651, -1597, -315, 877, -305, -3110, -2316, 379, 998, -668, -1816, -1426, 106, 614, -392, -1379, -429, 897, 1038, -718, -1112, -396, 815, 1198, -225, -1372, -597, 867, 659, -244, -601, 116, 1123, 893, -740, -753, 435, 1681, 1056, 170, -209, 311, 1477, 2091, 386, -220, 752, 956, 730, 394, 209, 192, 439, -94, -550, 151, -66, -1010, -957, 427, 300, -1761, -1985, -911, 481, -333, -1884, -2127, 16, 917, -905, -2609, -951, 650, 467, -567, -903, -660, 750, 1278, 320, -700, -175, 673, 1263, 1077, -377, -401, 1636, 2424, 275, -1310, -6, 2131, 2566, 316, -1535, -490, 2335, 1780, -749, -1302, -69, 1256, 835, -576, -1566, -471, 1057, 271, -1148, -1364, -1097, -192, 225, -327, -871, -728, -179, -503, -527, 7, -283, -593, -457, -415, -648, 110, 207, 160, -113, -205, -510, 9, 557, 235]
4100B35j61j8l31k05N02L56k90m82R13K35l54q56j37J734J541k348k270R85K807
4119A856O19k187j585O39K497q2k269j278K482R66p56j437j249N26K064P39j824
4136b79j533O13P29R13q09r49K58J399p9j797j83J754J043q33q66n00J149N70
4154F00m89o74O54K83j60n30p3R8P10N78j114p89P97P43j28L05o48l54K38N37
4174E84L38P5K6r94k98J366N93j004m31J16K98O04j055j708R36J682j68j779j076
4193a895L56J016J311r80k026m34J773J017p97q19K00J188J06j120q68J552K105
4210A685q06j299m45J112Q07L1q44J91J130M9j158p57P98O97O93l99j817o05J112
4229A75J623j045r24m46O25N37l70p81L74Q12l53o40k87L52r6L81L56k81k11m85
$$ y = [235, 74, 56, -275, -480, 22, 378, 88, -394, 519, 754, 400, -456, -593, 1141, 2682, 334, -1936, -951, 1856, 2475, 288, -1297, -658, 1839, 1757, -512, -1790, 692, 1658, 902, -535, -1784, -1258, 806, 1545, -279, -1812, -1199, -470, 443, -366, -1315, -1057, 342, 263, -1534, -1717, 37, 1080, 247, -619, -1119, 30, 600, 111, -563, 91, 374, 214, -316, -389, -291, 419, 997, -117, -906, -109, 634, 506, 811, 163, -191, 47, 584, 922, 997, 1023, 29, -269, 1097, 1690, 686, 255, 371, 669, 1273, 218, -1490, -554, 1128, 960, -819, -1895, -1539, -523, 788, -192, -2218, -2652, -879, 138, -659, -1478, -1278, -90, 16, -1104, -1972, -420, 1685, 879, -420, -865, 247, 1054, 1085, 241, 432, 1562, 1611, 453, -304, 494, 1191, 1884, 1485, -332, -937, 175, 1798, 753, -171, -617, 8, 545, 175, -606, -232, 580, 227, -413, -700, -348, -444, -63, 293, 12, -199, -684]
4249f84m67J112N74n75j073K40L79K49J18p8n65J93P64m94k83p6N53R35m46j035
4269f59m32J709R55j313p74Q28N66K8o51n28M76J074k42j474M1J196J31J82j134
4288b1r95Q98J602n43j430m03R37P30k58j398l66J047R23n88j236O14N85j73L3
4307d2j59j67J74m1n09N02O44o33m91O72j94j71O62j31p83L82P64n93m54K58K76
4328c4O71j60j131j10J182K40q10j72P17k60J20l54O6P63ll10n24L92Q10k51l63
4349D79k80j17L71Q74p81j326O73J007J19j334p15M45J137o8j634k10P66L45n03
4368g52k73L71k51L44L52n04j40Q49J31l55K57l81K2P31q3k31J65Q64n93l34l58
4389a69N34N32l31o06j67R40l97p26L85P34k56n74k55M3M94O80r23L07j00k79
$$ y = [-684, -1151, -39, 535, -40, -1113, -873, -494, -245, -127, -205, -770, -577, 187, -307, -590, -666, -113, 822, 376, -659, -1091, 618, 1573, 260, -514, 314, 880, 908, 257, -271, 205, 1279, 1037, -437, -396, 800, 931, 1113, -21, -1016, -118, 1484, 941, -489, -892, 45, 775, 517, -881, -1247, -200, 723, 135, -1101, -487, 98, -75, -42, -201, -368, -194, -235, -744, -242, 402, -231, -722, -50, -244, -415, 247, 116, -667, -285, 479, -114, -568, -310, -34, 637, 477, -654, -764, 418, 658, -152, -324, 393, 133, 253, -101, -35, 728, 725, 415, -109, 283, 1093, 842, 479, 199, 82, 453, 1327, 546, -780, -107, 900, 1019, -315, -1030, -585, 552, 484, -1150, -1360, -594, -249, -752, -1025, -654, -905, -561, -209, -713, -853, -4, 127, -228, 29, -352, -330, 401, 318, 87, 252, 1116, 523, 189, -169, 365, 897, 566, -40, -207, 733, 336, -390, -5, 729, 473, -101, -356, -313, 181, 861, -62, 245, 145, -134]
4409a34k06M89m6k55K94O19j269m09R88K72q5o78k56M94L50n88o46J90J262l69
4429A7p58m65P10J23M39J3o18L44K36r7J33J16k48L49N98j085M0R33L26k09q44
4450E3K24M56K64o16p47M07R16l82j014P45J00o01jL72j33j80L44j82j06j18k3
4471b22m64P28j27l2k2K23m83k89N46J49l33O6k75o2N88m25l21N43L4p1p22N03
4493d68N33l51L90l09m86M24J57N00K11j51k71N99k9l57LO38L64r68k51L97o6
4514E09K11m30J46K38k99q43k73Q92L06n67k24L47m73O5L8Q5O6j52M4j33J1j87
4536f23J27N48K72p79m64Q16n6l11J61k02L21J97n39R7N01P48n19l98L77J4m9
4557B39r4J18o4O82n14j77K57j17n2K89o8m3m20O21l94l50J60P5K14k86J3j18
$$ y = [-134, -340, 149, 103, -152, 142, 761, -508, -917, 71, 343, 258, -420, -676, -182, 168, -420, -1066, -876, 386, 17, -741, -1206, -496, -373, 66, 79, -539, -195, 41, -56, 77, 193, -55, 294, 892, -193, -153, 780, 1106, 897, 53, 277, 733, 997, 381, -366, 41, 957, 575, -439, 306, 406, -195, -196, 176, 43, -137, 207, 25, -81, -199, -222, -686, 42, -85, -117, -139, 84, -399, -688, -142, 7, -326, -260, -535, -597, -9, -434, -755, -212, -178, -249, -971, -468, 65, -286, 104, -205, -691, -267, -110, 390, 601, 450, 179, 778, 749, 392, 395, 1033, 1397, 429, 178, 575, 509, 720, 290, 436, 674, 375, -468, -741, 151, 457, -110, -334, 13, -460, -395, -357, -272, -206, -358, -314, -447, -436, -623, -496, 52, 324, -455, -919, -103, -159, -470, -309, -511, -190, 7, -532, -435, 66, 814, 295, -103, 274, 288, 239, 145, 263, 199, 881, 367, 190, 447, 330, 278, 567, 499, 456, 36, 657, 263, -87, 73, 148, 362, 76, 89, -29]
4579b9P5K37k46k1j45j02n20N38j26n6r9L23o7k16K32k98K31J27k52M9M28k79
4601b16n85L67Q13m20k51j4N02J36k44oK26P10m81q22O38L72m58k74N13K60k81
4622D85jj97M57k84j29m58O54o2p22L5P25q4n20k85K52n5k81P7k66O71o3n90L3
4645f08N58j49o4j22J98n01M48O6J4k42J84j02j99N45k59JK25J19m06K12P1J4
4667CL90L89p03j45K49J59j97K82l80L78K63J4p32O2N35j96j81N48j79m81MJ59
4689B41j48K03m3n71L44J91k95p58J038o5p21n7J60J04J41m30R6M51K88n46l60
4710g37P06K67p17J72N84k94k79J38K31J91Q6n48J63O11o44q1N08K65l65n78M92
4731A71J19k19K66L44n29L96m70j70P44L2n77j40N79o56k82N32J32j44j24j37
$$ y = [-29, 46, 283, 37, 16, -129, -231, -751, -213, -339, -395, -494, -171, -238, -454, -222, -520, -289, -162, -414, -365, 63, -216, -801, -434, 379, -41, -292, -306, 196, 332, 88, 82, 308, 1018, 537, -285, 353, 725, 267, -7, 506, 766, 485, 484, 287, 744, 460, 331, -127, 527, 465, -257, -222, 503, 419, -101, -386, -134, -189, -470, -393, -659, 12, -51, -641, -608, -50, -199, -263, -385, -187, -688, -240, -174, -160, -402, -218, -320, -519, 26, -233, -232, -7, 112, -294, -82, -11, 3, 393, 782, 79, -66, 183, 342, 145, 427, 47, 425, 688, 702, -30, 32, 567, 371, 190, 738, 559, 78, 82, 241, 93, 296, 253, -318, 26, 217, -78, -836, 202, 137, -584, -641, -481, -377, -236, -666, -570, -119, 169, -377, -737, -31, 236, -481, -309, 275, -19, -298, -160, 71, 262, 348, -200, -37, 574, -70, -151, 357, 622, 257, -321, 171, 290, 71, 337, 681, 152, 548, 78, -92, 652, 684, 107, -33, 546, -110, -392, 140, 272, 128, 4, -133]
4751a33o3k19K43k22N68j34m98N18m08L02m42L73q7K5l4N7m07O14p9k12K56L87
4773D05o09m33Q93K40p05K19L36r5j28J87Q4n2K03l12j18M55n9o40K36O74m02
4794C79n63K87P3k33K02P4J1L3j9n67N20J69n70K9N50k53l60j07L8J47J95n59
4816e24j52P72k9p24L3M58j5r6j9o0j63M00k25K10L43l10J8M8J88j00L18q8M76
4839G59p57J0M38l82K81O9mJL07l91j8K82r1j64K54l26k51j78M99k13j80K24j92
4862b3l5K10m98J47K51K27n34R7o2n3n42P97j62j64j92J42K50M3p8j70N04J38
4884B93p41N8N01k1k04L30l8R4k13J88k17K08o5m0K26M43n24n12N49L06l25k96
4906@kj5O18k43m01K98K66m00j25J24l8n45K83M74m03k35k47J65L11j70l41P0
$$ y = [-133, -196, -415, -172, -394, 174, 40, -458, 60, -348, -46, -488, -115, -202, -177, -211, -154, -561, 53, -26, -238, 18, 405, -204, -637, 256, 496, -209, 10, 346, 251, 123, 310, 394, 342, 545, 233, 115, 570, 511, -129, 107, 781, 379, -184, 103, 176, -57, 145, 219, 230, 263, 244, -323, 197, 366, -204, -175, 375, 122, -238, -345, -307, -160, 35, -524, -676, 96, 67, -657, -624, -166, -181, -277, -296, -356, -519, -119, -344, -134, 209, -101, -83, -35, 153, 53, 371, 283, 759, 2, 12, 450, 68, 349, 418, 414, 415, 722, 331, 313, 595, 504, 340, 594, 268, 17, -161, 338, 125, -55, 169, -23, -58, 152, -346, -199, 52, 279, -255, -158, -220, -273, -815, -18, -180, -344, -536, -394, -144, -101, -179, -349, 155, 293, -448, -390, 111, 90, -114, 216, 178, 272, 59, 247, 30, 238, 173, 133, 359, 802, 278, -234, 315, 621, 296, 0, -2, -17, 601, 358, -43, 255, 521, 121, -4, 120, 82, -463, -180, 294, -109, -344, -591, -426, -115, -285, -626, -556]
4928e56J040j33r02R0M80l08r9L04l31k19L51K98Rk64J69Q6K42m7q79M29N59L30
4950F49n78k30M89j65L16j33l31L63L87l75k64J60k90n1J174o76m55l5M10J11
4970D76m58j54k69N38K76j21n40M4J86j34J58j25l65J16L28j70p0j33P0j9M64
4991I8m21n81O32L56m37j09O06k4k33R4k80K16o4L20MJ20l68o2O26J78o35m69
5013d33Q48L31k1l63j68j96P46J0n20l12k27L78M31q2m06o72M81P07k21j134L03
5034e20M57M60k74o28M7L16J41l48j0K21n40P68j04r9m49J97K00K26m17k91N73
5055g4O02j65j144L92O02K73n20R8oN79j47o07l11P07M14m85J9K14n24J25L64
5076D06J84n62J98K26j75L58n40m19N81M6k03r4l06k3J64P31o32n56j71N70L06
$$ y = [-556, 484, 351, -551, -461, 19, -289, -388, -84, -415, -634, -283, 15, 24, -240, -71, 15, 257, 210, -669, -240, 319, 649, 71, -159, 330, 165, 481, 348, 17, 380, 767, 392, 128, 288, -2, -53, 1121, 445, -10, -45, 365, 476, 18, -136, -405, 133, 409, 288, -252, -208, -22, -156, 2, -123, -488, -372, -44, -214, -284, -417, -347, -366, 98, -323, -904, -272, 84, -353, -462, 144, 120, -113, -19, -299, -83, -147, 173, 177, 297, -71, -133, 493, 671, 36, -433, 415, 746, 725, 362, 194, -2, 744, 754, 234, -78, -305, 73, 504, 422, 16, -656, -175, 532, 311, -823, -520, -63, 397, 123, -505, -458, -142, -1, -349, -359, -138, -678, 90, -14, -113, -562, -365, -165, 61, -356, -647, -74, 528, 363, -781, -389, 213, 486, -34, 64, 58, 637, 490, -117, -428, 279, 693, 208, 227, 441, -83, 42, 406, 590, 28, 226, 452, 277, 635, 95, -324, 257, 303, 100, 6, -300, -323, -159, 572, -60, -616, -787, -217, 89]
5097H9J91p58j63L64Q73q00l32Q4L51oj44l0Q8R0K46o8l76J27L7O94l97n42M02
5120B0N19J59o20l32M28M85p3n00l07K69P51m7p48j68K94J49J20L73o87l22QN17
5142B88oo40j35O82K01j3r84K42J1O38k71m97J94n25O31J69j70K03j96k28L74
5163c2N20r00QQ23k47r9l23K47q2K04M94p00q9K50K17m3k32K8K2O53m14q93L85
5186b03Q93m7m85m07J90M28L85n90o05M92L99j29k41p92k4O42N01J39j310K74
5206d90O08L09k84j050M1Q25N27n86m04q6L49J71O2Ol48M61J48k52j88L11j28
5227BK35K19n98L7l3P92o86O2J15k13L81k91j9J45J9n5K4j20l6k07M76M34n50
5250A33o2J22J22J89k1q81q9R36l75j53k60J51k23Q07j13r31k11M05R16l22p66
$$ y = [89, 280, -478, -641, -277, 596, -204, -536, -452, -101, -107, -251, -281, -193, -103, 143, 75, -301, -174, -137, 557, 160, -382, 20, 539, 698, 78, -254, 174, 659, 586, 86, -221, 48, 799, 752, 4, -164, 130, 279, 399, 772, 85, -237, -229, 288, 282, -358, -493, 189, 390, 377, -607, -365, -354, 284, 13, -484, -290, -815, -184, -15, -185, 18, -178, -406, -32, 488, -412, -404, 419, 172, 73, -250, -3, -85, 119, 613, -87, -176, 74, 291, 248, 16, 44, 66, 719, 305, -588, -203, 690, 643, 158, -249, -59, 369, 754, 164, -441, 51, 450, 321, 80, -712, -736, -94, 407, 546, -764, -490, 118, 427, 143, -907, -866, -41, 486, -100, -504, -590, -241, -70, -8, -2, -350, 111, 259, 7, -181, 130, 2, 237, 456, -142, -105, -138, 654, -32, 30, 145, -68, 313, 22, 3, 148, 167, 112, 136, 16, -20, -227, 249, 683, 133, 71, 193, 315, 504, 483, -398, -487, 449, 74, -79, -339, -188, -411, 396, 283, -648, -859, -454, 462, 140, -626]
5271f26m30N93O52o8r78L50M50R9n48j52K98O4L69l9m59M85K84r2n5K06k99j31
5293b7O72k88l70J79K58k0j97l33NO39K36p89o9q3L37r7K29j96k03L3K49O8k41
5316hr1o73O59K17l28j67J72J86J8J36j21o34j42P72j25l69q0R4Q52q0p14k25
5338f51N75N13k88q04M52L98N4N9l27K21K83J84l85j97K11o0K31J21o73j57Q84
5359F44k35q32J91L30m3K70m94l67K93N33N9q71k70N07L88j80K64l96M4j72N06
5380A69j01l8k30r2M06k54j74N38m01J25m39N80k8k61J14M5M09j81l01k15M28
5401I9N01r11O8N18K82m12K9j68L87n7j60k42K14J94P1m16J89k48l6M80j67n04
5423b89MO74j27k37k12l88P43L29r39j80M06M61j56R4j82m25M44j13m4K5p7K27
$$ y = [-626, -1056, -463, 189, 121, -857, -507, -57, 42, -506, -658, -360, -296, 73, 34, -425, 60, 344, 252, 197, 403, 104, -27, 645, 357, -13, 166, 424, 404, 207, -126, -121, 518, 754, -35, -104, -187, 150, 53, 282, 86, -117, -84, 165, 233, -8, -99, -772, -113, 104, -224, -391, -219, -33, -15, 121, 0, -634, -776, -4, -129, -498, -578, -484, 368, 288, -426, -651, -76, 437, 149, -655, -203, 195, 249, 308, -19, 202, 485, 669, 284, 87, 298, 238, 469, 590, -83, -240, 644, 409, -423, -232, 98, 55, 325, -169, -536, -243, 290, 349, -522, -792, -285, 103, -77, 187, -209, -165, -337, 169, 68, 30, -200, -292, 114, -140, -314, 224, -177, -52, -491, 89, 61, -200, -86, -41, 368, 187, -114, -329, 99, 600, -311, -243, 275, 557, 145, 174, 6, 393, 336, 176, -66, 148, 342, 413, -3, 186, -62, -98, 382, 215, -289, -285, 389, 262, 25, -187, -575, 168, 497, -442, -622, -216, 245, 89, 183, 1, -424, 20, -93, -137, -112, -189, 38]
5445C8R7Q4o44R1M79j33q5J26J88j42r4J1K96ll74J2K02K42l31k50K33N50m80
5468A13j33Q5M47k42k99j19Q4M01k10j36L45k26j01k64L28l36J43K32J27j45n93
5489d99J00M17K85j00o76OO41k51l45K4K94Mn2J49n16Q3O05j23L2k75K5J59Q0
5512F7L46m31J6L79j69q1k8M5N21j57n28K80K08J65o63J51L19k65j80K10j2n22
5534c29N35M5l07k72M75k04k55J99Pj97J97J06j16QM3M5o50N98k25J80j44k92
5556e53M39O22n19k79J18K43r7j81K15j94kL45j80p7j5Q4K02j0Km77M25O17n79
5579A49M4K7J39r8QO0L0L13p39k22L75J49k42L59k97l16L25j73K2k57R2k05K44
5602b13PK6l90L06P3L68p00K16R6k56J23k9J53O94l80n9PP4r9k72M76J06k16o1
$$ y = [38, 135, 219, -425, -334, 145, 12, -73, 53, 241, 99, 5, 16, 312, 309, -65, -53, 149, 391, 60, -190, 43, 593, 113, -20, 65, 512, 270, -29, -148, -64, 337, 127, -9, 336, 110, 9, -255, 73, -263, -120, 112, 239, 94, -499, -399, 18, 303, 203, -473, -467, 174, -77, -422, -398, -104, -100, -152, -3, -519, -436, 169, 46, 78, -197, -172, -13, 67, 413, -18, -2, 377, 208, 127, 99, 144, 665, 508, -20, 260, 468, 633, -30, 121, 440, 175, -5, 205, 193, -329, 206, 251, -56, -328, 147, -57, -312, -113, -106, -303, -106, 0, -116, -108, -65, -20, -670, -72, -297, -117, -261, -553, -114, 508, -11, -290, -172, 71, -26, -207, 8, -186, -188, 157, -23, -100, -115, -31, 171, 161, 163, -314, 111, 728, 149, 193, 220, 359, 261, 269, 329, 359, 672, -67, -289, 86, 235, -7, 352, 55, -261, 64, -109, -87, -344, -252, -457, -213, -206, -180, -570, -264, -191, 177, -523, -307, -211, -467, -344, -373, -220, 474, 94, 35, 42, 116, 17, -255, 221, 327, 111, 50]
5626E0J2L0k29M16o3l05K69nJ19L20n10k19L64J7o11M08L84l43l12J14J0L01m25
5649b08J60k46J12j9M3J30m1j79M5L19r7k31k4Nq6K75j55m1K00j11K14m49O89
5672C05j61k89J81K3k76L67J14l39L79k2r1M5j4k56j2K03L30m11r9M93m01J40
5694B09k26P4J29J81m32j27J38r4j38K18j0K1k1l9k00J34L90k07n3nJ00k44L45
5717A43J06q06J83O60k03M2n2R4j02M7k89k3R7L74n00K43L06j36n06L17J83n05
5739c27K17K62KJ18m56J04J98m5l8p3K09J88l62K97J41j90r3Q3k58J15J0k06J49
5762D5K32k57q7j20K62k05J35K28j31l31Q4m5j31K13k36l2N00J07o80M74L48m51
5784g8PK70n83K98qO5p0M04k73j54K36J61m68j67L06J07k9M36m10Nn5NJ6P7L12
$$ y = [50, 62, 92, -137, 279, 216, -89, 180, 175, 294, 614, 104, -115, 249, 266, -345, 63, 447, 104, -208, -94, -84, 217, -208, -48, -294, -182, -201, -158, -28, -69, -248, -203, 116, 19, -212, -236, -231, -317, -42, -197, -238, -38, -149, 65, -384, 305, 144, -145, 36, 59, -217, 150, 264, -75, 304, 282, 191, 236, 222, -34, -46, 157, 487, 76, -23, 470, 69, 209, -17, 57, 186, 367, -65, -192, -54, -148, -286, -68, -78, -57, -78, -117, -317, -183, 207, 0, -53, -58, 42, -202, 143, 249, -557, -374, 286, 83, 125, 73, 167, 65, 112, -177, -200, -103, 271, -229, 14, 320, 184, -322, -5, 178, -327, -110, 152, 154, 272, -184, -80, 118, 73, 35, -38, 171, 359, -3, 294, 435, 245, 152, 235, -23, 92, 102, -104, 45, 277, 20, -67, -187, 75, -130, 5, 233, 102, -229, -145, -190, -321, -108, -344, -376, 124, 231, -449, 25, 373, -78, -71, 199, -384, -86, -94, -29, -99, 305, 32, -122, 114, 275, -193, -360, -54, 53, 24, 460, 50, 55, 0, 5, 21, 98, 410]
5809D10n09J04J06J01n02K10O21l59k38J29j13K78l2n03J57K17j10l44O65o84
5829c96J61M3K61l89N1L6K39n3O0q9k22L87J0qj5M8p4j7j26K11q3r5K18M0j33
5854F5J27k40qj32K79k57N24m42l39L58L07l03K45n16K39L14r5m76L27R4k81L02
5876I2L85j60m19M7J42r8J60Q8l72L94j10n9r9N2ql65n5L45L6j73m26M07j0J31
5900g5K55m19J36j37K85J97k62n79L68O59j89k71L85r5j32q8J37J76j82K0k90
5921a01M07r0l35K06p2p6K9k00k6K81L44l85m2q5P4L52n60J96J15j21n4K96k64
5944a11o1O6J98k48L5j96j6K89q1k63M77j47k55O6J57M3j41J12k96K4N76j14k22
5967a08J89K03l51J15L08l23K19pJ25m46J90j37J78j22J08j45L28k56l96L04K80
$$ y = [410, -99, 5, 111, 212, -290, -80, 541, 182, -56, 73, -40, 238, 206, -297, -140, 77, -33, -377, 288, -396, -235, -192, 69, -320, -269, -233, 6, -47, 13, -76, -298, 89, 99, 91, 76, 124, 50, 33, -93, 118, 35, -60, 158, 198, 65, 192, -48, -56, -188, 91, -166, 358, -84, -423, -65, 242, -61, 184, -332, -93, 221, 126, -350, -23, 71, -210, 92, 477, 317, -102, -55, 87, -11, 149, 237, -135, 259, 149, 90, -9, 43, 35, -330, -385, -40, -4, -177, -603, -196, -206, -75, 180, -239, -103, -240, 45, 242, -20, -599, -231, 428, 239, -32, 353, 258, 126, 38, 175, 351, 169, 189, -101, 306, 216, -119, 87, 15, -61, -32, -232, -258, 23, 367, -18, -60, -145, -71, 281, -279, -83, 32, -89, -143, 153, -111, -172, -106, 92, -156, -121, -317, -333, -44, -125, -388, 89, -58, -313, -247, -90, -47, -188, -76, -372, -348, 228, 114, -108, 81, 284, -67, 48, 356, 33, 252, 245, 370, -76, 114, -23, 155, 33, 141, -4, 324, 68, -328, -24, 256]
5988B56jn67K44k62M31j73l37L06J45q4k7j67J27k75o9K99J1P7k5M9k09k5J5O5
6012a96J84M7k41K40K08j47m78J70M77k06K69n09K02m5J83k00N1K67m35J82K98
6033C21j17m41mN61J10j16l04j91K17L70j71l94J22j21j12L05M57q34KL90M7j39
6055d2J45n87J33N59j24l21j90K10J16O4q3j31j03J82J26m9J6M6k05M03k35o3
6077a33J48K92l54l73N66R8k64J11O2j65K40J23l16N3K72q0k81nk33QN25J09o02
6100a99J09Q2l9J56j58k72J51N27l17q7K29q7l84M12l29j06K32K08k26N0M4k0
6122b4k15K42K06k29j54J29k91O7L10oJ38k92L24l61R0k24N9K27L38l38k97L81
6144H0pl6j67J75j98Nj4j67N08J95k97k36L46k87p2N46j06p07K98R3M49k55k00
$$ y = [256, 255, -312, -68, -330, 101, -72, -409, -103, 42, -42, -69, -236, -109, -384, -453, -154, -143, -66, -91, -42, -251, -276, -261, -196, -12, 35, -206, 34, 242, 95, -383, -213, 264, 58, 327, -182, 20, -25, 158, -42, 9, 276, -159, 23, 321, 204, -237, -241, 320, 430, 314, 10, -181, 36, 406, 235, -159, -37, -158, -270, 35, 492, -342, -340, 50, 97, -42, 103, -484, -351, 208, 84, -237, -427, -217, -101, -37, -120, -251, -354, -172, -46, -95, -79, -33, -238, 165, -70, -133, 15, 307, -47, -420, 146, 244, -20, 91, 153, -12, 228, 351, 35, 88, 360, 280, -1, -6, -239, -231, 294, 403, -199, -90, -8, -47, 109, -49, -321, -170, 357, 40, -47, 182, 95, -289, 123, -206, -312, -80, 128, -98, -48, -4, -24, -239, 3, 209, -20, -174, -45, -336, -269, 41, 35, 173, -119, 205, -156, -66, -290, -231, -4, 334, -4, -301, 80, 73, 37, -130, 45, -153, -148, -162, -329, 179, 374, 77, -159, 187, -100, -172, 374, 268, -439, -141, -48, 401, 146, -54]
6167e4j69J27M83k69j75K2r1J13O7J46k4m16k40J33K68J92m75K38J16J61n73M91
6189G1J43k06j8j13j33mL32o6KJ4o3k89K80K24l22L21K01l76p7L47k78L02k50
6212D2p3J01j24L46P9n89L69j24n2P5k85L1L82k16j37J49m6n3K33N9m69r2L34
6235f0j68J15j57K18k92j6K23O5oK81k56K26j58j15p8R5K84k65L35k62J64j85
6257a2J43n1L18k18j05J49q6M38o16q5K62k08K07J05K41m89j7m13N52K4j22k80
6279b63k05N78j24J03p4l59J35J44J07J6j45R5l8l4M3n6J14J99k48j08p5K91q2
6302A4j66K65J04k48M00k30J41m55K52J78q5J10k05q8L32jm97K63J36j20k18J43
6324B5j53J8k5J94k25j3m58L56L39j50k75K32K22K3j59j34J2N46J29n60p2PJ35
$$ y = [-54, -223, -96, 387, 118, -57, -35, -126, -13, 54, 200, 176, -240, -480, -347, -79, 113, -362, -124, -8, 153, -420, 71, 214, 8, -10, -123, -256, -260, 72, 6, 8, 22, -41, -330, -50, 174, -148, 173, 374, -2, -79, 268, -10, 292, 42, -31, 70, -54, 292, 371, -218, 151, 27, -25, 50, -235, -204, 178, -38, -175, -26, -72, -125, 108, 167, -302, -394, -60, -228, -113, -270, -52, -344, -360, -137, -72, -78, 203, -53, 173, 15, -100, -178, -83, 201, -64, 271, 9, 173, -12, 131, 80, 398, 180, 75, 224, 138, 576, -40, -125, 137, -71, 136, 241, 482, -7, -24, -437, 115, 139, 17, -263, -468, 110, -14, 89, 15, -344, -209, -65, 42, 58, -87, 8, -30, -64, -21, -77, 37, 236, -12, -120, -195, 96, 14, -152, 113, 217, -31, 369, 139, 280, -175, 77, 255, 170, 280, 75, -13, 319, 318, -179, 84, 220, 100, -118, 25, -128, -110, -135, 59, -166, -179, -637, -281, 58, -92, -367, -135, 87, 110, -49, -183, -171, 375, 504, -56, -128, -121, 14]
6347A4J0J36j29kj99M02j76k4L3N0k27L13m76K9K80j17N2J58j23j67J90P4r9k04
6371b02J21J9J36QN0R2k06K92n58K37L23k68L3j05j58L95m5j58l0J30P1k09L4
6394BN9m97J43N31J9m77R5J87j65K39k41k49M15K69k92Kk9k34J6K26j21J91n6
6417C3q4jL20l3R2l78K56j24m18N46o2L7k02K66n83M00M8R5j91N5J12p2K5j05
6441C2j38J50J18l8n1j56J66L80m60j49n8J08N3l19P9L55j33p9L98m59pO5K50
6464A07k05j18L07l26K16m1M7k23K90J56k80J21J88j2n92N15J8n6J42o4k24K97
6486B63j73l00M49k5l3k48n5J10P7o2r2l2J31j13nJ18L9l1j77M14j61J75k64K09
6510B14k64O7j37J18L57l79j85J12L24k21j68j34O4M70p0J01m45O0K24m7P3K18
$$ y = [14, 24, 160, 31, 29, -170, 232, 56, 32, 65, 115, -112, 201, -275, -246, 34, -83, -31, 127, 4, -163, 27, 101, 2, -202, -81, -62, 74, 82, 132, 224, 18, 310, -248, -11, 312, 44, 77, -28, -186, 209, 164, 6, -24, 106, 177, -32, 2, 61, -436, -293, 238, 257, -220, -125, 62, -103, 136, -105, -354, 61, 330, 38, 40, 11, -223, -207, 19, -102, 89, 33, -51, -52, 268, 235, 327, -51, 205, 81, -337, 209, 147, 184, -18, 248, -335, 65, 113, 208, 17, 72, 184, 112, 137, 32, -106, 44, 162, 124, 73, -83, 83, 463, 3, -146, -204, -96, -43, -362, -283, 72, -61, -140, 258, -201, -208, -143, 107, -98, -216, 91, -235, -19, -60, -13, -236, 54, 210, -70, 51, 239, 227, -365, 150, 168, 112, 254, 190, -34, 263, 90, -210, 239, 214, 181, -67, -122, -12, 65, 3, -89, -121, 10, -103, -108, 10, 49, 18, -159, 255, 94, 269, 5, 214, -50, 17, -120, -2, 355, -24, -209, -97, 227, 6, -162, -296, -232, 238, 168, 269, -176, -116, 108, 61, 134, 352]
6532C52n17M40k28l4q7J35rO5o2nQ7m3j51N6K96k48j56q9J87j7j08O40m59Lj64
6557a16j78K63L6K13o96P41r0j13Mj57J19j83R3KQ8r3l16j0M07J41l13o1M00l31
6581a50r0K94k42M6R8J67m17K42J5L44k57J79q8l18L42l71K91j62L24q1m77O76
6603C65k3n31K49k46m9J53K22K78k60r4R2m02J60m6k16L66k07J91j92RL73l23
6625a31O3l3j16L24M2m95K42j8J55J8J89k19n3o1j37r0N32k96j48K71j20J76p1
6648B4K29l4j28J02j14k78N83n1k59K24n9P3l68K24j41p2j01N22k35j09J34k00
6670c4K07q6j46M2J09j65k11M30j40Pr7L50o13L72J3l89M18j32j37K5L21m06K68
6693FJ1j43l5J65K7L5j96K2R9K14J7l22N2M00k92L2k31N77k35j9k03Q6J9J9N8
$$ y = [352, -165, 275, 47, 13, -74, 61, 52, 117, 55, 50, 137, 94, -57, -1, 295, 47, -109, -198, -11, -28, -136, 504, 45, 48, -116, -294, -31, 5, 218, -478, 263, 173, 60, 64, -93, 26, -157, -64, -62, 26, -67, -383, -393, 14, 155, -158, -219, 181, -150, -240, 54, -188, -142, -44, 123, -294, -52, -37, 307, 50, 229, 141, -177, 165, -206, 85, -77, 247, 166, -311, 365, 342, -189, 60, -186, -235, -82, 140, 418, 158, 64, 156, -246, -86, -132, -348, 18, -189, 2, -190, -181, 192, -131, -68, -101, -217, 107, 149, -346, -104, -122, 33, 51, 240, 21, -32, -93, -230, -320, 212, -84, -232, 39, -81, 95, 24, 253, 219, 91, 193, 79, -199, 384, 333, 74, 298, 239, 312, -56, 168, 27, -45, -146, 376, 141, 32, 166, -34, 173, 87, -59, -17, 92, -73, -284, 146, 6, 13, -84, 266, -347, 25, 38, -351, 67, -65, -202, -177, 144, -262, 6, 17, -126, -161, 4, 31, 66, -130, -108, -9, 205, 222, -100, -48, 352, 60, 92, -139, 438, 203, 184, -19, 67, 86, 105, 163]
6718A63l47L44j20k8rK46o01o5M26j12L84n51L22J77k67k66K85o4J95L16n42Q4
6740c0ml07L43r7pJ08k17O6P1K34l93N34l36N9j47q6L36j92j29N93k72p6j53K09
6764A07M0J8l68K87P4n4k82K58J96k83q0j3J20J3j34J5L5K38j99k70N39k23k31
6787a97N0L97n2N9mm58Q6J79j42Q7j25L52l77k9M75m06k79N47J58r4j77M02p40
6810b88N03j36J36j97L92m28k54M05n5j37J8J16k73M81l83N6L63j85j35K51l46
6831i6L55jm1K4k76j40K07k2l0pK59J6n3j10j14j04K08j08M5M62m31J4J69m87
6855b61K57p4L41m51L23j59o9J87q4k66K10O7k09K81nj6j52L3k16n2K90J40l76
6878b61P5K50J37j97J55m67L26M8QJ99m81K81j33L1l8Q8j75J12P8k22j25J44J69
$$ y = [163, -184, 160, 40, 12, 3, 249, -352, -417, 9, -103, 281, -270, 52, 229, -38, -304, -19, -83, 112, 428, -114, -30, -34, -341, 2, -95, -102, 6, -211, -145, -74, 160, -233, 301, -35, 24, -123, -209, 127, -65, -194, 399, 127, 51, -102, 107, 147, 165, -203, 84, 158, 104, -178, 80, 276, -7, -87, -100, 20, 33, -101, -86, -51, 187, -12, -282, 257, 34, -197, -147, 250, 198, 257, 253, -205, -119, 60, -82, 5, -120, 232, -145, -174, 301, -105, -384, 163, 321, 227, 50, 452, -288, 215, 79, 215, 18, 410, -18, -272, 133, 78, -59, -41, 75, -198, 283, -100, -44, 319, 134, -1, 250, -96, 259, 258, 217, 241, -35, -175, 32, 10, -20, -27, 232, 248, 195, 85, -29, -133, 75, -33, 12, 474, 43, 57, 226, -261, -4, -78, 263, -188, 135, -24, -93, 94, 10, -256, -46, 21, -188, 93, 88, 72, -80, -47, -263, -315, -25, 115, -261, -186, 64, 201, 4, 159, -308, 18, 66, 74, 273, -208, 73, -60, -29, -67, 21, -154, -42, 36, -186, -311, -167, 2]
6901BR2k61M3M02k75Lj72m1K18k2J8J13k36J35Q6o9K7k87N33n05J74M04l27Rk34
6926a70J94K20l80K87m06L65m6K2j42q3J64K33m01r2P25k48m27P3J24L5K9m20
6948c44K64O0K42j39j54K45k43o2j13L58k63P5N9o8J58k06K06r2J51L9n00N20
6970A93j68L6p1J5J82l02M8J2j86o4J10N6J00P7L98m02J98k78J34K5k9j60L6O5
6994B5M9J4j18J09M5j71k1R4K71l95J25j62O1K63k86K08L23l77k32R2K07j25K23
7017B22l21M3J30L8k06K77O9n11J49j22M02j02L0J38j76j43K4L8L27k35k17J26
7039b0l2O9r3j65L92J4J68l27q8J29n0j5O5n3J48n2l43L99rj08l0Rj46r6K95J88
7065B49j16Mk94O02j86j97j39J97k08j81O6K20J62k00o8K19j93L2k04o4M37j54
$$ y = [2, 94, -167, -124, 278, 3, 6, -166, -207, 11, -11, 7, 120, -116, 19, 105, 36, 63, -224, 309, -196, -22, 382, 55, 64, -170, 24, 244, -136, 151, -255, 110, 64, 86, -56, -139, 25, 258, -143, -235, 490, 242, -185, -112, 12, 47, 76, -344, -80, -20, 222, 83, -71, 174, -69, -131, -244, 114, -149, -74, -15, -83, 75, -131, 75, -17, 134, 173, -327, 193, 25, 61, -10, 5, 187, -115, -67, -55, -241, -305, -195, -139, -39, 38, 436, 34, 232, -46, 88, 113, 84, -76, -40, 25, 74, 88, -30, 79, 124, -47, -68, 26, 297, -98, 27, -135, -74, 189, -97, 111, 434, 57, -175, -83, 124, -1, 222, -99, -56, 74, 112, -94, 183, 252, -259, -110, -232, 170, 68, 98, 236, 60, -83, -59, -21, 306, 71, -146, -20, -52, 17, -76, -241, 151, 165, 333, 6, -82, 47, -3, -18, 47, -6, 142, 90, -253, 146, 137, 29, -1, 8, -138, -234, 61, 249, 133, 137, -157, 445, 259, 62, -77, 120, -88, -269, -203, 17, 179, -21, -89, 130, -63, -31, -235, -299, 138, -16]
7087a6jq8j6l31K93j08J23R2n9J97K02r2m92M34O9m00Q2N9k42M08m8K71k09l18
7111a90L81k25Nj77M77k79J69k8j34k48M45k16O6K02j61K0j37j54N6J77k53N24
7133C20m29n7K12p5J21j43j41M6L24j42j58J69J25N5n16L25j67K25k99K57k39
7154a87n8K0k0N46l35N26n59j36K12J61l25J53P4q0P5K24k35K14j31j53l0J91
7176A47j69j13Q0J04K89o76J67M89j40j89k79L35j08J02r5J48K05m65J82p6J9
7197d3k72L36k06K56K04j59J21j90j6M8j23L08l56R7j99M06m42L07J5O6k56j7
7219a15K57J29k03k01K37J81o09L22K29m8j92O1k04J25K29k82K4L53k67l40J88
7240a26P7J25k42Q7M85l82k65J51Q3K80j37j71J40j47q7q6R7J6j29K83M04l62
$$ y = [-16, -17, -105, -121, -452, -159, -267, -144, -52, -111, 86, 288, 196, -296, 138, 207, -193, -111, -52, -294, 114, 66, 337, 128, -190, 191, -34, -29, -206, 271, -8, 161, 133, -1, -249, 196, -20, 46, 248, 87, 107, -30, -184, -128, 49, -204, 320, -109, -166, 46, -29, 92, -51, -192, -146, 178, 36, -122, 47, 172, 227, -289, 36, -131, 94, -205, 52, -187, -245, -225, -245, 301, -34, 492, -67, -203, 9, 170, -155, -2, 72, -8, 67, 291, 56, 270, 139, -14, -44, 147, -22, -135, -55, 49, 338, -338, -171, 318, 178, -11, -290, 45, -63, 39, -56, 92, 297, -168, 14, -62, -43, -315, 21, -185, 71, 275, 116, 237, 47, 31, 79, -44, 264, -92, 5, -194, 212, -230, 77, 92, 158, -98, -115, 142, 271, 68, -133, 104, 285, -324, -2, 227, 179, -13, 48, -156, -31, 198, -84, -60, 293, 26, -314, -126, -49, 76, -166, -79, 406, 24, -241, -90, -7, 273, 136, -35, 105, -42, -129, -215, -118, -102, -231, 52, 456, 94]
7262I4k22K19M8k02N01m18K3r3L66k69l58N20l8l09K13K25k07k46J36L1m8K18
7284A84l71L77O8l68r8K57J11j84j27K89l13L44k84N8J02p8o5J79l44N69m46K41
7306A01J18l98N14l07J07K00l39l3j28K14j54P0m0K88k19j17L20j28j29J92j18
7327A4J5j03K62j06j30Q7j75NJ34j64J18M2r1J89j01P7j05k14K68m7r4K62J9l57
7351a95K41J97m96L90l38M85O4n52J39N3Q4J07J6j56Q0j8%l50J76j34K55j58m4
7374a54P5m6N3J02j39j24J89o1K17j26K14j84qk5J06j88J17l35M10p3J71j24K62
7397C29J20k18k53L28r9l70L82Pk35r8J54m2K3M0r3J28l7n2oN5k0r3j54M5N19
7422C60m12K25k37Kj12q2l7K97J48L6k51j7K2N8o4K64m19R5j93K75M9K3j39K63
$$ y = [94, -128, 91, 139, -63, 438, 20, 43, -50, 316, 47, -311, 209, 171, -138, 75, 300, 93, -153, -17, 14, -34, 184, -187, 190, 258, -110, -208, 49, 160, -24, -151, 138, -175, 169, -115, -57, 45, -33, -98, 81, -263, 306, -140, 101, 219, -179, 335, 28, 135, 335, -4, -37, -165, 49, -105, -35, -75, 213, -6, -123, 197, 69, -60, 132, 14, 29, -74, 188, 82, -48, 39, -136, -131, 3, -161, -43, -1, -92, 97, -4, 73, -32, -246, 22, -25, -119, 143, 162, -195, 46, 243, -253, 137, -201, 284, 348, -204, -65, -12, 72, 179, 195, 39, 119, 101, 101, -249, -73, -207, 48, -110, -154, -79, -125, -72, 30, -109, -233, -44, -105, 112, -14, 200, 16, 8, -17, 89, -99, 18, -317, 93, 20, 191, 67, 329, 449, 231, -22, 306, 207, -163, 219, 226, -9, -107, 47, 5, 28, 68, -25, 103, 66, 14, 8, 63, 43, -50, -204, -159, 360, -52, 173, -64, -62, -174, -256, -293, 4, 152, 188, -63, -80, -58, 0, -64, 200, -219, -124, -317, -42, 7, 30, -109, 154]
7446A54O7k30P2l2r0J82M6j55j2L82k68j45N52m06rq4J41mn7K71j35o3R5j03l67
7471a98O7J84k86K39J75n11J79j35M6J48M4R9k87J58n1j10M62P1l71o6L48k2p1
7494A12j96L0L6j60L34l7n8k34j67M25l6o6o9K0L28q3j11Q8j5q9J55k66J26o0
7518GJ28N7j93L0j68K95l0m75Q5J53k96L36M2J38j74n6m3L06l11R7j9j58K71m7
7542b5j09k19M1M13l19J10K37l6L3j98J93L15l15l80N34J24k85n00N18r2J3j52
7564i9R0k8K95k55L5L27k85k02L20l04J27O7j3k0j73L54l43N4n0J72J16Q2k40
7587B7q7l39O04j33k29J87k1l70j6K08L68j60j75k6P3K28J18m92K61k22J66J04
7609G4j28L4O6k60L97j33N2l06L0K35K23l94J18K33m9R4l15J21k29M92n19j04
$$ y = [154, 221, -9, 63, 31, -59, 123, 169, 14, 2, 384, 116, -29, 523, 117, 108, 24, 165, 161, 104, 375, 240, 177, 272, 169, -198, -131, 53, -233, 6, 181, -330, -151, -286, -240, -92, -48, 51, -236, -78, -129, -239, 223, 294, -77, -143, 205, 183, 112, -84, -54, -18, -178, 156, 119, 61, -173, -340, 85, 49, -17, -86, -66, 262, 179, 68, 156, 141, 52, 207, -59, 67, 7, 135, 192, -1, 29, -139, 156, 126, -349, -264, -111, -407, -71, -29, 109, -65, -121, -164, 142, -169, -72, -91, -249, 22, -25, -134, -353, -312, 101, -218, -108, 129, 93, 126, -72, 121, 436, 121, -259, 275, 399, 114, -386, 132, 40, 53, -99, -9, -37, 258, 3, 38, 365, 80, -122, 198, -106, 21, 88, 75, 55, -118, 236, -107, -53, -103, 69, 185, 267, 27, -60, -399, 205, 72, -157, 30, 9, -361, -377, -169, 199, 39, -136, -162, -89, 139, 257, -235, 26, -196, -30, 74, -54, -20, 46, -214, 183, 50, 102, -204, -174, 61, 284, -110, 8, 241, 192, 286, -29, 92, -137, 355, -164, -268]
7631b68J75j08L58Kr4l0j76J38M7O6r7k0l7J4M2J07P0l47M0L86l20Q5l57L22r
7656a1nj64KK73m5l84M23P2j92J58r6k4j16M0P2J77j59K01l22L36j22q1k28L96
7680B01J20l98J6K33j10r3j34J06Q3N1Q6l56Q8L92k84RL85k97k43L99J43k72j30
7703el1n7J93J58l53K80j86k44K9O9J77k9j59L17j9j76O5j36O0R5j98K52k41P1
7727f8j38Q9J04K94l07L28j84N3q5r9j58J20J36j65m1K86k55J06p1Pj51L87j27
7750F1K6J7k09M0K1L58l35R5k05L3J78l6R9p5l54J03L7j60K45K70j76l35M08n1
7774E5l29M66l26J11J20l74K20J81Q8k66l02J46L71k02N4k3J2q8k2LK11j11L09
7797C04k95L8J2O9l7J59Q0m81L36k01R6q7K45q3j21j38PM21l32k76J81M5m6L36
$$ y = [-268, -93, -201, 157, 159, 65, 35, -141, -3, 44, 110, 13, -7, -44, -30, 12, 119, 189, -158, -118, 268, -52, 33, -324, -2, -11, -16, -180, -178, 95, 50, -334, 89, 161, -31, 127, 31, 7, -109, -69, 3, 180, 21, 222, -100, 236, 114, 33, -195, 201, 321, -77, -61, 172, 62, -31, -165, -59, 24, 75, 161, -195, -107, 285, 1, 10, 395, 98, -145, 254, 397, 125, -5, -36, -93, 100, 258, -95, 185, -1, -245, -216, -147, 30, 1, -158, 159, 140, -36, 29, -107, -47, 48, -150, 102, -139, -68, -206, -117, -13, 281, -26, 302, 118, 171, 86, -13, -171, -51, 85, -80, -121, 165, -90, 16, -55, -48, -199, 188, 61, 87, 104, -105, -65, -44, 314, -21, 74, -131, -98, 80, 44, 143, 68, -286, -183, -146, -306, -61, 209, 33, -302, 106, 55, -274, 192, -134, -23, 97, -277, -57, 124, 212, -54, -356, -210, 161, -41, 13, -10, 2, -86, -108, -105, 106, -5, 304, 9, 47, 59, 128, 91, 250, 330, -151, 185, -16, 80, -7, 238, 155, 34, -104, -97, 324, -8, -284, -103, -58, -104, 232]
7821B32j46j98J45K4r3J37k24P7k97K14M91m80J6p7q6J29L5J21q7K19l75K45j92
7844a70K99N9r1l2l1j35L30r6L1r2R8j62J51j77n9K60j91J16K20j16k33L06l2
7867B53k32K09j63J7K07m14J85j3k58J77K1k11MJ24J13j20Q8o5J91l44K36l02
7889b97K87O1K7k41K36k1j8j72L19j80P4j04J61Q1p5j05P8m7k55M09jp4J67l3
7913B77j41m5j93J18J82k92l8p3L28K7j22k28J53L42k61k96k4N22l11K2j12J1
7935a54O4l23J79J3K40J9R8j05J05j76k78K99J42n74K44M01k90MP3K7p1J41m24
7958c46M65J05k60J02k60K18K59j43p1J8k27J46j8K84l80J99j8P2Ll35K25N0R1
7981A79l13kK63k07r2J32L13m78K82m9k92N11k25k26J06K00j82j89O2L77l00k7
$$ y = [232, 86, -112, 33, 57, -36, 101, -123, -46, -343, -129, 362, -118, -102, -179, -265, -136, -101, 20, -67, 152, -223, 22, -170, 129, 188, 97, 65, 34, -101, 229, 133, 164, 72, 170, 8, 159, -18, -77, 183, -8, 108, 328, 212, -21, 285, 253, 21, 230, 67, 84, 291, -123, 62, 49, -209, -32, -11, -222, -218, -94, 19, -101, -13, -78, 113, -231, 5, -297, -10, 51, 78, -163, 73, 52, 34, -138, 181, 1, 75, -29, 132, 213, 138, 33, 111, 64, -191, 218, 217, 143, 310, 277, 136, 91, -102, 16, 198, -94, -132, -205, 123, 150, 28, -200, -47, 295, 34, -262, -286, 236, -75, -53, -165, -154, -90, -413, -234, -221, 19, 38, 136, 31, 136, -40, -318, -19, 123, -451, -207, 194, -96, -92, -19, 8, -63, 78, -346, 119, 224, -36, 66, -194, 24, 283, 140, 69, 87, -140, 6, -12, 272, -108, 91, 73, 145, 148, -187, 38, 88, 179, -134, -136, 127, -80, -172, -40, 273, -205, 77, 28, -264, 247, 22, -204, -98, 102, -80, -269, -207, 170, -130, -157]
8003a57J30Q8K15m49k9J62J56j25o7m9M6l5m5K41k93L71R4k24K3L3j59kM15k7
8027C13k15O4k28L18k22J14k42q1K07j84k5N1j47j44L26k25M71j17k8j78K05k63
8049b30L21l01K94j9k9q2J05j49M2j3K23j52J19j65O2n6J85n2K05l06o3J41r7
8072a7k81M71l9J40j49O3km41M42k55K25J36k01k5J16O6k80J8j7L64n77L46O5
8095A68l40m8k2K04K14l80J27j21J13j10J48k57N69k54k53p9O43k64K47l36J73
8116A42k42o0K03j81K12k41J22k59N92l90L8M11k24l0P2K2L8k11j2j53K51K4j59
8139c5M3K28l4k01Q9m2k31Q6J51J27j10k32QL06j44j95J17Ll8p9R9R7k67J02J26
8164b6j18K11l54J2J81M06k99k05L27o8k34J3P8r8N35n00K30q5O0K1n3k42M26
$$ y = [-157, -27, 61, 276, -173, -202, -40, 116, -9, -76, -125, -79, -114, -159, 82, -211, 160, 254, 30, 53, 86, -73, -75, 340, 313, 98, 162, -66, 252, 30, 144, -98, -179, 28, -156, -181, -130, -277, -421, -95, -320, 151, 34, 6, -172, 33, -230, 91, -210, 84, 65, 36, -46, 59, -90, -48, -61, 162, 10, 129, -36, 26, -30, 155, 103, 308, 2, -61, 80, -17, -298, 173, 134, 274, 125, 188, 186, -255, 187, -68, 157, 293, 92, 67, 183, 249, -31, -13, -30, 334, -243, 103, 168, -172, -220, -242, -38, 176, -204, -77, -198, -85, -195, -47, -304, 265, 11, -242, -321, 322, 58, 305, -31, 142, -100, -160, 43, -138, 74, -167, -45, -304, 288, -102, -64, 347, 123, 93, 165, 187, 225, 14, 2, -151, 100, 124, -35, 8, 236, 202, 1, 90, 48, -183, -97, 54, 181, 71, -161, -153, 153, 9, -186, -69, -66, -104, -183, -84, 13, -254, -152, -26, -144, 67, -287, -275, -94, 312, 13, -192, 135, 67, -167, -154, -76, -174, 361, -139, 91, 6, 66, 87, 34, -208, 218]
8187B18j54j22L00k73
$$ y = [218, 64, -58, 242, -31]
8191c1
$$ Imaginary data points
##PAGE= N=2
##DATA TABLE= (X++(I..I)), XYDATA
0@%%%Qj6QqK4l2L2m0N6o5P7j00J20j41J70k01K36k77L21l72M33m96N65o48P38
28C92q33R40j062J193j333J493j670J856k063K299k549K819l126L464l830M239
44B229m701N215n793O454p215Q098r140J0390j1925J3867j6404J9876k4954L3099
58A9096m8271Q5946l42896o50693O97698O87646k04878p09912q8029M66316K31274
69A43297l32346k52060K09521L39780J003j91932j10592J6597P7339K00658J86842
80B88107q1214l15255r6408L09709K83079j95993l41480J19099M12151l2334m99310
91a49849j83803M52048L96236k71078n32006j3187M57078J86395l28748k73977
101b60891J68021K60482m7845k03615m4461R0899M4472O854M3868k3637j69068
$$ y = [0, 0, 0, 0, 8, -8, 0, -8, 16, -16, 16, -24, 32, -33, 44, -56, 64, -77, 93, -108, 128, -149, 172, -200, 233, -263, 302, -346, 392, -441, 499, -563, 630, -703, 790, -880, 976, -1087, 1212, -1337, 1482, -1644, 1820, -2010, 2229, -2472, 2743, -3050, 3404, -3811, 4287, -4853, 5537, -6388, 7479, -8925, 10951, -14003, 19096, -29175, 56771, -286125, -936818, -239120, 448526, 243648, -466264, -554293, -87977, 143297, -189049, -441109, -231588, 108192, 109195, -82737, -193329, -176732, -99393, 101265, 288107, 206893, -108362, -204770, 104939, 388018, 192025, -149455, -30356, 381795, 349461, -149849, -333652, 118396, 514632, 243554, -288452, -301639, 155439, 341834, 13086, -260891, -92870, 167612, 119767, -83848, -128309, -37410, 7062, 13916, 57784, 34147, -134921]
112a34921p6585K27080K27075j88492l76152K8709M21340J74539l47582l57036
122d02025J53449M13440N2962l41206j70777K35436K21146j18741k04213M8247
132a12282K02082O1245j07309p7028K5887L7473L5590Q2247K2899j34337j05981
143f9514J20262J54424r9691k07138M9104K58962L1329l28980k33872K36782L70236
154B81904o3532m02547j46606K71671K33039j32247k45871J9042K28490Q4298
164A27641j60785j47497N4965J51264Q0731k5979r3578q2224K3336J18853P9719
175A26446n0819j06426j5139R1999M3047r4692p5384Q8527J12855n9221j48816
186h7623j8485J18594O1901p6998p6517N2594Q1876m1140j00810P282J06459N7277
$$ y = [-134921, -211506, 15574, 242649, 54157, -321995, -293286, 128054, 302593, -44989, -402025, -248576, 164864, 217826, -123380, -294157, -58721, 162425, 43684, -160529, -112282, 89800, 151045, 43736, -33292, -7405, 30068, 65658, 147905, 170804, 36467, -69514, 50748, 205172, 105481, -101657, -52553, 206409, 237738, -91242, -325114, -88332, 281904, 218372, -184175, -330781, -59110, 173929, 41682, -204189, -185147, 43343, 127641, -33144, -180641, -125676, 25588, 106319, 80340, -13238, -95462, -72126, 46727, 126446, 75627, -30799, -45938, 46061, 89108, -5584, -80968, 7559, 120414, 61193, -87623, -106108, 12486, 74387, -2611, -79128, -26534, 55342, 14202, -86608, -79326, 27133, 84410]
198H4410m7073p6488j9779M7321N1771J0316j4655j9137k9925q141M4389L7000
210F0009l4603n4075J3620N9170J0810p0041o2521M3159R6085J0121q6275o1636
222g6177K3342N6085L1972j2232l7628k2069J1988K3163J0408j0757j7451J3107
234f249L4388j1241n8435j0856O0272L7784l1481m1276N351K6190q744l2720J5605
247b1412O7691J4718q0539o6907M0898R3236L1106o0240o7219J4786O7435J5129
259D8682n0409k4430L7914M3031o777n2646m2577K5308O8714J9970n1627m9033
271c3880P428L4761Q097k5842q352L3517J3635m9349m3408L2512O0141O636m9615
284a3719l9365K2156N5635O358n6057l0491M5127N6667p008o0387l7929L9006
$$ y = [84410, 37337, -39151, -58930, -11609, 40162, 50478, 35823, 16686, -13239, -21380, 23009, 60009, 25406, -28669, -15049, 44121, 54931, -15110, -77631, -34472, 61613, 71734, -14541, -76177, -52835, 3250, 35222, 22990, -14638, -36707, -24719, -1556, 8852, -1905, -19356, -6249, 28139, 16898, -41537, -52393, 7879, 45663, 14182, -27094, -21743, 4447, -4297, -37017, -21412, 46279, 60997, -19542, -86449, -45551, 47685, 78791, 18551, -48668, -33882, 33553, 48682, -1727, -26157, 11757, 54788, 48011, -4635, -47212, -21904, 46810, 66780, 15153, -33880, -26452, 8309, 16406, -9436, -17788, 15729, 29364, -19985, -63393, -30881, 29260, 35896, -13719, -53084, -30928, 24707, 31065, -24992, -55483, -10356, 46311, 39303, -21084, -59013, -20007]
296b0007O7742p46o5700k8162M4440M3939j3708m6611k2172K7414M3150M732k9629
309D682k4482o836J0103K3684J3131r649p840j83j4488j3975J5498L0065J2682
322C2392j1265k1593j3687M280O562M433K3302K6084j7393n0957k4725K1639M0454
335A9526K4794o654k3668k4427k7695j1790M0954O3084K048o2943m8914P493L2789
348a5403J7140m060P87J6073o548m7395l3558K7053O1472L9701j7831o2733m5693
361g0995K3101N8315K7697j0789j8078r308k385p029p144K0008M3393J2852l6298
374B3340m0165o852K4420L2163Q945j9721j3306M237q561k2709J613L3787K6265
387D3456j7457m7573k4307L0364L4735j1645k8628K643J6460j470j6528j1933
$$ y = [-20007, 47735, 46989, -18711, -46873, -2433, 41506, 27798, -18813, -40985, -13571, 29579, 34311, 4682, -19800, -26636, -16533, 7151, 20282, 10633, 2793, 2610, -11878, -25853, -10355, 19710, 32392, 21127, -466, -14153, -9873, -3311, 1122, 24424, 50508, 33115, -17842, -42567, -20928, 19526, 44320, 37666, 13998, -10429, -38124, -49914, -8960, 54124, 56172, -6771, -55685, -48192, -15403, 1737, -2323, -1536, 14537, 7989, -39406, -72964, -45911, 15561, 55262, 37431, -25302, -70995, -47894, 10421, 38118, 27329, 9251, -57, -2442, -9471, -16615, 3393, 46786, 59638, 23340, -16825, -23677, 743, 32906, 41851, 22130, 8824, 13061, 4500, -18209, -16596, 17191, 43456, 25999, -21574, -45881, -15517, 19218, 7573, -21055, -18412, -1952, -3422, -19950, -31883]
399c1883N866J9384Q415j0043n865L30n774j672J3382J1866J464Q43l951q831
413f469M84R889Q397N831K009k869O34l574j8428o256L1506L0164j6018m0863
427e563j7348J4996K0838Q83j3356j92P807j5326k7053J460K4140J5770J80j2528
441e292j8929p376J0133J4033J1592R632k213j2670j0584l718J0896K8364J6568
454D0436j6904k4046l314O804O367O446K677k952m166j2086j5885k063J3892J0911
468F117K297r657k1895j1054J0935J3406L665L723R4j0750r423L064J2039J5574
482H135O414r758o975P098J300q123O761J9810N447j4859j7983l754J4708J2775
496B0996o753r718K259q04r919j868O674L011K053J394p477j0193O86R893R921
$$ y = [-31883, -26017, -6633, 1782, -8261, -14126, -13796, -19570, -21242, -7860, 4006, 5470, 6313, 2362, -6469, -5985, 3904, 12301, 18132, 20141, 17272, 17906, 14332, -4096, -10352, 21154, 51318, 35300, -5563, -22911, -7915, 12923, 13806, 450, 258, 8065, -7261, -34314, -32854, -8714, 7056, 7236, -5292, -24221, -31597, -21464, -7431, 4161, 13793, 11580, -1090, -11674, -15392, -4496, 23868, 40436, 23532, -514, -3828, 2976, 9343, 15789, 18466, 15514, 11348, -738, -16623, -18686, -4794, 6117, 8414, -1243, -23138, -34192, -23257, -9851, -6186, -2463, -2369, -13119, -22542, -19478, -7439, 8135, 14549, 4791, -2184, 4914, 6214, -1909, 4852, 24662, 30109, 15250, -2733, -6487, 8221, 20996, 14243, 4525, 6784, 5980, -3939, -5807, 867, 3878, 5931, 7325, -152, -10345, -9659, 234, 10155]
511A0155L73j3187p575J1328O837j3536o895J3442P461j1024j3304l734O617Q351
525d691l213r122j658J566j504K864M563k881J163J0010K683o869K392J1313Q078
540A4694M294k20k469M152O593n38K37O271j953q423j767k66o093l271L43m242
556G342p922r058r060k96N485n413r808O73K411n541k871O285N945N649L894k275
572a4560k089O285Q470Q457J0012q06q588J954J1588M41m392L546N178k078q968
587A4450j1283k592J0277O020q498r785p013n611M277Q109m136p571O531O425
601d00q817j0784M051J6460J3274m511j7396l963J2968P097j611L85O62l686n74
616C155j634p261k125J0491Q681m582j7815j3529J0738K4066l97k2560l839J9280
$$ y = [10155, 10528, -2659, -10234, 1094, 7931, -5605, -12500, 942, 8403, -2621, -15925, -19659, -13042, -4691, -7904, -17026, -18684, -17118, -18622, -15758, -11195, -14076, -12913, -2903, -220, -7089, -4697, 6616, 14694, 18988, 18768, 16299, 20451, 27044, 26506, 26743, 33014, 31061, 22638, 20871, 20605, 14512, 11241, 11584, 7342, -580, -9638, -18698, -18994, -13509, -18922, -28730, -28057, -25646, -31187, -34058, -27773, -21828, -16179, -12285, -14560, -16649, -10364, -1894, 6563, 16575, 15769, 7181, 9135, 20723, 21164, 16772, 20318, 25496, 23418, 14450, 3167, 575, 10852, 16872, 8374, -1411, -8424, -14035, -9758, -1649, -5785, -13356, -6825, -400, -9217, -20001, -15950, 510, 13784, 9273, -8123, -12086, 882, 7979, 6368, 6753, 7415, 3729, 3155, 1521, -5740, -7865, 2626, 11307, 6725, -11090, -24619, -13881, 10185, 9788, -12772, -16611, 2669]
630B669Q053j2750j0763Q032K0140Q706j6018j5353P157J4326J739n196n970m559
644B13M585O526q633j5881k500J2541J1000p373k3599j0397K0710J7614j4539
657i733j8043R731K0701L396j5132j3437J0674K8120J2053j4453j5193K975J2782
670A4441J0328p70q385J050R953m594j8577p403R278J2763M812j3923k6952j1458
684b9437J4094J7256J064j4335j5622R87J2943j931j5790N525K8672R562k3535
697a0547k4299N416L1359K2644q475j9729k466Q238M601L908K820j586L181O061
711B1126r722k0211k352K3637K3490o423l7088k3521K3650L5232o807l1572m293
724a4854K1875P822j9694j9311J2820L1062L534l0431k0955J0289K2494J1557
$$ y = [2669, 10722, -2028, -12791, -4759, 15381, 24087, 8069, -7284, -127, 14199, 15938, 10742, 4772, 213, 4798, 11324, 2691, -13190, -15690, -3149, 7851, 478, -23121, -33518, -12808, 4806, -9733, -27776, -18045, 2656, 6052, -9080, -22517, -11843, 16277, 28330, 13877, -1316, 1659, 14441, 24769, 23999, 15614, 16664, 26617, 22023, 3446, -3957, 5321, 18084, 22896, 8973, -17979, -29437, -15343, 1913, 2977, -11358, -26980, -25993, -13050, -14981, -30771, -25246, 3426, 12988, -10547, -34846, -29430, 1929, 24573, 16098, -3631, -6097, 2141, 6742, 10650, 13470, 11884, 15065, 21126, 11404, -8807, -11159, 12478, 35968, 29545, -7543, -31064, -7414, 27818, 21011, -10561, -14854, 7021, 14843, -4851, -24162, -11342, 19720, 23254, -7177, -28132, -17843, 4651, 16208]
736A6208q629k1974r122J6951J6435q624j7352m92J6805J1408j4501k4546N803
749b1630L4158J2417k6749k5059Q489K9328J4395j6713k2689O102K2763K856j6577
762A091o950J2988J4727l325k2687j2711J8490K3100m211k0375j1698P53J0236
775e72J1069k038j2727n945M751M151k494p372J664J6166P845k0586k1865J0898
789a7055K8543R456j6735j8547J297J7598N609j1094k704J1354J687q685m815
802d091j063J439J0416R523q343j9071p999J4120K0277j064k2898q542J8358J0214
816A1276j5810j2583J2075J9474m6k1817j6120J3750K5113J523j7793r869M528
829f299R967O309n815j0647M196J4651p90j6231p477J0725J7408J841j9206j4007
$$ y = [16208, 7579, -14395, -23517, -6566, 9869, 1245, -16107, -16599, 206, 11614, -2887, -27433, -21630, 12528, 24945, -1804, -26863, -18374, 10954, 25349, 8636, -14053, -7951, 14812, 17668, 1091, -5859, 7129, 21856, 18531, -4156, -16867, 1623, 24723, 20512, 137, -11561, -10808, -572, 10497, 8459, -4268, -10213, -5462, -1311, -3805, -11177, -9513, 6653, 14498, -6088, -27953, -17055, 11488, 20944, 4209, -14338, -13041, 4557, 10166, -928, -3632, 7722, 9409, 724, -4091, -5154, -3715, 6701, 16224, 7881, -11190, -19189, -5069, 15208, 14144, -8754, -17296, 1062, 11276, -4534, -17117, -5042, 14432, 14386, -7431, -23551, -9801, 15312, 16835, -958, -10827, -6299, 3668, 9977, 4162, -6485, -2289, 12362, 11572, -4659, -12136, -1411, 15997, 17838, -1368, -15375]
843a5375J1421J7168k117j3598n007P070J0665k071j7104p278J7388J5956r558
856G560j9681o252J2786J6398k409j9282m979J5677P885j2832r861O680J3595
869E285L738j1688j2869M167J4696N343m517o461n080L142J1157J776j0570k142
883d023J0681N804o942j0806j833J3728J3965q213j8172k796J1086P192n86n366
897C719n514K108M536l755p571K747R510N799p140j7799p645J6983J9301n264
911A0015j7256p142L565O862N099j352n186K294L385m845p911p50J0673J6910
925A4361J003k4233j8094J4905K5236L271j4566r137N684Q151n564j0012R441
938D46K0177j17j9120j2006J988J0819J5045O144j2723j7586m680R957J2963J797
$$ y = [-15375, -3954, 13214, 11097, -2501, -7508, -438, 10227, 8156, -8948, -16226, 1162, 17118, 7560, -12121, -18373, -5587, 10811, 8402, -10880, -15859, -182, 7703, -5129, -14990, -8310, 5285, 9023, -2665, -15534, -11367, 3329, 8672, 4155, -2306, -7386, -4244, 6913, 8689, -1881, -4023, 6658, 12462, 5520, -5286, -7119, 6609, 20574, 12361, -5811, -8607, 2479, 9671, 9085, 3719, -1795, 313, 4849, 1094, -6477, -3730, 5780, 11579, 4439, -13360, -21005, -4022, 15279, 10015, -7241, -14383, -10818, -3956, 1143, -209, -5395, -3101, 284, -4561, -12472, -13222, -2549, 14361, 15364, -8869, -26963, -12058, 13178, 16449, 1883, -7254, -1570, 6581, 1017, -8995, 446, 20623, 20506, 1386, -10620, -8632, 2187, 17232, 23376, 10653, -6933, -11613, -1656, 11307, 13104]
952A3104j0020l601O588m556j6256m99J9763J4089q803k3240j2938J0706J9792
965D129L331q487o380m160l013N428P386K43m08K981l080o225k230M685J2020
980F220J0175n701j8180n895J2539J6190M556j0888j3794J682J2221J220p273
993C072K127P574k894j1805p079M620J3596P955j0345j5932n857K515J1540J4811
1007A3898k332k0884j3222Q367J3661K851n175j124N691k138j7205p367K2002
1020b977K4607l178k2158j5791Q75J6221J7291L156q816j0470p121K049R688M512
1034G888l86P614L466j6903k2696L138K8554K2787q414l2375j7980J3153J9797
1047G643K649n716k035j983l916p397p525O747K1805J0978j6918k7527q942J8217
$$ y = [13104, 3084, -517, 6071, 1515, -14741, -15240, 4523, 18612, 9809, -13431, -26369, -15663, 4129, 7460, -1027, -7407, -11567, -14580, -9152, -1766, -1523, -1931, 1050, -2030, -8255, -10485, -5800, 6220, 16395, 10694, -7486, -13381, -842, 15348, 19904, 9016, -4778, -3096, 9125, 10345, 3072, 5199, 12773, 9879, -1926, -9005, -4385, 9211, 17166, 6821, -9111, -14968, -12453, -913, 13898, 11566, -9318, -22540, -14173, -512, 2339, -2836, -3960, 1731, -407, -17612, -24979, -2977, 21630, 18452, -3706, -19497, -18622, -2401, 14890, 18046, 9230, -1240, -8361, -6312, 3376, 7888, 7502, 15116, 18582, 1679, -21017, -17879, 10675, 33462, 25048, -7327, -25307, -12154, 7643, 10292, 4576, 2541, 558, -3358, -10755, -18280, -11533, 10272, 21250, 4332, -23195, -32137, -13920]
1061a3920K8097N865k1472j7928N832J2820J578m056j64P978Q654p553j9489k855
1075a6613K1229K0125j792k1920j7044R119K4302M585j6762q626P953P590l751
1088H395r196m150R139J1112n188j7042q516Q031J5075O005j5295k2110K691K3114
1102B065Q855j6313j6458L536J6948O641j4711j2874J2554J8999k564j7206q365
1115a8893R289J9862J0281j3433k0784R6K1475J5616p277j8993l931J8282J2849
1128B4439j6263j8967R994K3436L054k1259j9622N192K4224R568j7185j7143K319
1141h213J1270M304o815j0304J850J4516L695j8008j4805P661J9177Q630j2550
1154D08k0976k312J8371J1320q677j2019j714R913R245o326j5931P48K0479J1585
$$ y = [-13920, 14177, 20042, -1430, -19358, -13526, -706, 872, -3184, -3348, 4630, 13284, 5731, -13758, -16613, 4616, 24741, 22949, 1029, -16015, -6896, 17406, 21991, 5229, -3397, 4556, 12146, 8395, -801, -4951, 4188, 15300, 10112, -6930, -15446, -7415, 7660, 13665, -1630, -23740, -21049, 2065, 10920, -5393, -21851, -18315, -1367, 5274, -9437, -22311, -9757, 9242, 6678, -10528, -18893, -9604, 10258, 20539, 7106, -13678, -13582, 7893, 23509, 16232, -2761, -6692, 11590, 24439, 8176, -10791, -797, 22639, 25693, 4434, -15188, -9996, 14228, 23796, 6611, -10532, -8213, 3057, 7361, 546, -9758, -7908, 6608, 10303, -7705, -22510, -14849, 4328, 12958, 408, -20568, -22880, -4509, 6811, -1866, -13885, -15599, -5686, 3559, -2767, -18698, -17950, 2529, 14114]
1168A4114j1516j7248k319J6047J7004j332j5128m585R676P996J016l543m462
1181E720L270J1361K043j4323j1795O968J8707Q576j8122k4769K084K3164O060
1194A8944j8605j1551O782P931o325j4562m892J4471J3585p802j8277q834N697
1207b3438J5188J2223p174j7766j750J4716P432p381o552R283J7967J200k3986
1220a0038j4707J9095K8593L564j6855j5188p16J2308J0937l74m404L60n83l426
1234H566k542j894L484J1161O082j0884j6720o051P718J4594P628j0943j7221
1247g022m230N519L726m37j982j342N83l743j1727m467J1143J0820k821r447p304
1262b2731J25Q583P343j525l466J682M822L531j714n002L945J7486P180j4917
$$ y = [14114, 2598, -14650, -16969, -922, 16082, 14750, -378, -4963, 4713, 12709, 13725, 10182, 5720, 8990, 20351, 22394, 8071, -3724, 3244, 21951, 30527, 12405, -12364, -10280, 12884, 18944, 339, -11212, -4430, 3501, -2824, -17386, -22278, -7807, 5778, -2024, -20301, -29135, -23438, -8250, 3973, -3201, -20967, -22717, -8001, -569, -7950, -14502, -5219, 12748, 13948, -10038, -24745, -5650, 22943, 26507, 9652, -5536, -6252, 6056, 16993, 16619, 12215, 12575, 11992, 8566, 6024, 4130, 7614, 18775, 24857, 13973, -2747, -8798, -1080, 13514, 21142, 10199, -7022, -11252, -5733, -2007, -2444, -4426, -5768, -5185, -8928, -20655, -25122, -13979, -3159, -5980, -15427, -22731, -22606, -14023, -6680, -8205, -11671, -9989, -5167, -1636, -3350, -8352, -4407, 13079, 20259, 5342]
1276E342j2478J0670K0787M478j6700j5040J0304K2859R11k0429j1642P312J0459
1289A6833J907o535r184j574M056j165p359n073K742Q556M132j2280j9808m41
1303b5193J7102J0663l116q782p871l896K793N688O605P386j513j0578p187J216
1317a6683N576J0646J2368m31j3592j1251O00J1661J4291M731n718n892l027m879
1331a600j15J0257J2007N798n950j9051j6043Q451K4657J1773j0845j9600r241
1344i502P243Q701l541n834O629P667p892j7302r073Q042K0187R740j3535k0854
1358a9324m416J0818J1304K313o847l648N982J547j0087n193J2071J3017j017
1371F520j0183o644L606Q417J448l690K173N219j594l127j650p26L420P899J661
$$ y = [5342, -7136, 3534, 24321, 28799, 12099, -2941, 7363, 30222, 31133, 10704, -938, 6374, 16833, 18740, 12205, 3021, 1447, 5503, 4338, -3021, -8094, -5352, 3204, 7336, -4944, -24752, -25193, -8091, 2572, -544, -9326, -17197, -21093, -18300, -12612, -6007, 1379, -134, -10712, -17899, -16683, -11107, -461, 11907, 11476, -2116, -13367, -12767, -1106, 13185, 17916, 12198, 6306, 3279, -1600, -1715, 8542, 20549, 26347, 20397, 1346, -14697, -6246, 18411, 30184, 19339, -261, -9502, -2259, 6442, 2901, -2933, 3696, 11363, 3471, -13831, -22904, -14862, 5325, 15065, 1530, -19324, -23740, -12922, -1618, 695, -6152, -9800, -3818, -2271, -12358, -17551, -5480, 7537, 6520, -3663, -10307, -6701, 1716, 3164, -526, 1647, 6866, 5272, 2145, 495, -231, 3189, 11088, 12749]
1386A2749o245m902K70L964M171k349n539J372O828l40p754m953j121M390R176
1401I717K184j1751j2086k95J0322Q899m028j2357k405J0586K724j0650p011O889
1415i262J2304N369r576j6332j708J5883J2439k564r524n604L631P540q28o879
1429e111M358J2175L23j3144q155N524J2776N608p745q241K394M021l126k509
1443h52K926M556K135k356j0476p164Q011J2271J497q971r456j019R064M567o374
1458a641m279N686L962l733n911j354L950O466L258m411n855k234J478P161N795
1473H338m076p693L35M348R8l75l3k51K053J139n046m956K539O064K941k424q001
1490e000m300O633O581m430n698L469M526k530p419j842P871J0123l498j2140
$$ y = [12749, 6504, 1602, 1872, 5836, 10007, 7658, 2119, 3491, 10319, 9979, 2225, -2728, -3849, 541, 9717, 11901, 150, -11936, -12231, -1909, 6990, 2962, -9395, -11800, -1214, 1510, -9140, -16151, -9262, 3042, 8411, -1165, -17497, -19205, -3322, 9117, 6553, -2971, -8575, -4944, 2596, 1768, -5111, -753, 11422, 11745, -1399, -9554, -4030, 8746, 14354, 6609, -1632, 762, 4783, 1657, -852, 2074, 6630, 8765, 6409, -4067, -11231, -3220, 9051, 10548, 1577, -7879, -8898, 166, 4733, -1641, -5920, -234, 3728, -5, -5916, -7270, -3320, 3146, 6404, 1993, -3862, -6096, -4618, 2543, 8338, 4262, -3431, -3096, 1252, 1350, 975, 942, 691, 2744, 3883, -1163, -6119, -3580, 2484, 5425, 3001, -5000, -9300, -2667, 3914, -516, -6214, -2745, 1781, -749, -8168, -10010, -2139, 7984, 4486, -7654]
1504g654k272P690N609K25j170l181J36M925J243n185j389O300P610M71r764r958
1520f364O158J4522K350j0813o063K710K903j678m058o13N263J269q510p052J322
1535h654K170J482K156k600o313k127J903O7J248K912K034l95j916l427J380P978
1551b102N232m04j9m4j501J899M689J282J702L818o91m025k787o06K714O198J248
1568A6603p063n283j584k119Q24L967N80m066l743l508l175j60K340L262M246
1583A121k767j0704n108O589O336N45Q27M05l555m224k254L111Q578N798k975
1598A723n905k634j609J382Q962O825k327m525k329l4J224L395N151N778N19q461
1614G135p253M197O671J473J251Q62n200p517k434J747L470J830k135n109l811
$$ y = [-7654, -9926, -2236, 3373, 3598, 2428, -753, -617, 4308, 5551, 366, -1023, 5277, 12887, 13358, 3594, -6364, -206, 14316, 16666, 5853, -210, 2500, 5403, 3725, -333, -946, 4317, 5586, -2924, -9976, -8654, -6484, -5002, -2846, -5446, -11759, -13886, -11983, -11916, -10668, -7756, -5722, -6117, -8033, -11460, -10080, -2102, 3130, 2726, 2707, 2663, 1162, 3061, 7750, 9032, 10734, 14552, 13861, 9836, 7049, 6443, 9157, 15355, 16603, 9540, 4257, 2673, 554, 1378, 5345, 5925, 1859, -1884, -5392, -8567, -8727, -6387, -3125, 1121, -1646, -12350, -17458, -10869, -4533, -3988, -3161, -2756, -6311, -10535, -12789, -9678, -1100, 4698, 1723, -4182, -6816, -8425, -7043, 1919, 8744, 6417, 1892, -437, -471, 753, 4148, 9299, 15077, 15596, 7135, -118, 4079, 10750, 12223, 13474, 14336, 9136, 1619, -815, 932, 4402, 6232, 4097, -1012, -4823]
1629d823n846l784M880P037k045n560j611r31k025o50M288Q481N192m560q846
1644a0803J186P853M231K680M930M32m376l408L3K671N295L162p61l123o523q000
1660d521L5Q641M073l444n398m816m689q52K167N497O441m72j0140p272L868P623
1676c259M803L156qj908k150l309j341P722J0468M17p857n340k765k30L323N369
1692G091K966j966j0508r991M183R956O79n107J41J328m100m916M29O436P666
1707D287lo025k222l14k233L878J1213K137j0799p864M845P497j335o908K49R563
1723E966J399j3686p314J0364R627m321p095J725N672k4o313j285R759P841n276
1738G039p383K320N058j09K94J432p80j103l70j027j831k502k479L642M269n590
$$ y = [-4823, -10669, -14453, -9573, -2536, -4581, -10141, -11752, -12683, -14708, -15358, -11070, -2589, 2603, -1957, -10803, -9617, -1764, 2467, 5147, 10077, 10509, 6133, 2725, 2758, 5429, 10724, 13886, 13125, 10002, 3479, -4521, -4486, 4155, 8228, 4784, -614, -5430, -10119, -10971, -8804, -3307, 3134, 2662, -7478, -14750, -10882, -3259, 1544, 4700, 4692, 2784, 634, -2675, -4016, 3706, 14174, 14591, 6734, 1394, -1371, -1601, 1722, 7091, 10057, 8091, -2417, -12408, -8225, 1731, 2410, -2697, -2556, -1228, -5328, -10244, -9815, -3379, 4287, 4284, -1741, -3963, -4277, -6510, -2632, 8581, 10718, -81, -7945, -3100, 4397, 3062, -3846, -3597, 5966, 7365, -6321, -13635, -3271, 6356, 2035, -5060, -3335, 2337, 2313, -4000, -5285, 4474, 12315, 7039, -344, 1976, 7034, 6925, 7219, 8651, 7871, 6768, 6398, 5371, 3540, 1038, -1441, 2201, 6470, 880]
1754H80j1114j893N966L130k810m033j025J526J69l680O10O929L224l961j150
1769g232M177K124o54K41N152P211K1q997m157Q942R278l814p085n90L590R15
1785I122n025m247L868N930n068q616k8L476r0j023L34r76j516n81J43O70R13
1802b714L73K754K544n788p283O340J1839l49j1403m398P109P783m421r988J576
1817f026J1827R82j2145n796O999P360j579l984j733J517J118k622M72O424L123
1832E937m292m167L26K129M394L322k341l534O80J233j453p51J413K866K891m502
1848D151r500j583Q373N717k663m384l438o54R36L11K33M575K883n131q046o41
1864h861N786P068J152n532m170L192Q70n427l38Q762O644n086j1088o005P273
$$ y = [880, -10234, -12127, -6161, -3031, -5841, -9874, -10899, -9373, -9204, -12884, -12274, -5345, -2121, -6082, -7232, -3055, -931, -1585, -1344, 3808, 11019, 11040, 2043, -2114, 6828, 16106, 12292, 5207, 4617, 8207, 9122, 4097, -150, 3718, 9648, 4580, -4036, -4064, -588, -678, -1701, -1367, -2343, -3859, -4440, -4297, -3627, -2714, -2341, 413, 2957, -2831, -10114, -3774, 8065, 7716, -3687, -8085, -976, 6807, 2386, -7602, -6026, 5801, 6783, -5362, -11158, -4159, 3201, 1622, -2362, -4095, -2578, -1460, -4082, -3610, 2814, 5937, 1645, -2522, -2196, -67, 4327, 7649, 5308, 1774, 2454, 3687, 2234, 1483, 2896, 5762, 8653, 4151, -5349, -6932, 1441, 7158, 4495, 111, -3327, -3981, -3045, -2734, -2501, 2074, 4957, -174, -8220, -8861, -3075, 3993, 5145, -387, -4557, -1365, -495, -5922, -6260, 2502, 9146, 4060, -7028, -13033, -5760]
1879e760J2090K78p978k827K392j35j418P31L349M101J446n939o333J584P130
1894B711N292n92n430l217L225K609m011j144O801L461o863p417N06O926M403
1909G260n232p317K596O159j744o706k78M150K463k055l700j300N135K692n193
1924c070m452L292O019K416l240p047m30P497K622n055l63O231J564p138p283
1939h437K940J1334P230p382j1436l67N628K729J52P52J078K36m428q011q64J0168
1955A322J0079j162j0747r699R6R713O503l487j843K788k084r431l500R185J3154
1970A0887K747j1243j1835J770Q361L694K03K029j80m427o417l097M989J1160
1984H641M168r000j0694j571M709N256P24l667J5K153n081r114K685J2203N510
$$ y = [-5760, 6330, 6608, -1370, -4197, -1805, -1940, -3358, -2627, 722, 4823, 6269, 330, -6003, -4419, 2711, 8003, 7411, 1981, -1236, 1989, 4598, 587, -557, 6244, 9705, 2842, -4575, -4069, 2857, 7260, 2028, -5289, -2693, 3466, 1722, -4984, -5262, -1112, 1351, -704, -4404, -5704, -569, 2123, -3070, -7522, -4230, 1789, 4205, 965, -6082, -6512, 985, 3607, -1448, -1811, 4420, 5984, -1154, -8437, -5497, 5837, 13067, 5685, -5751, -6118, -490, 2239, 2391, 3143, 4221, 4457, 29, -7982, -8846, 1322, 11401, 10239, -508, -10207, -10111, -398, 6105, 2618, 775, 3563, 1479, -7952, -11452, -2267, 10887, 13634, 2391, -9444, -7674, 687, 4381, 4584, 6613, 6433, 2006, -4411, -7508, -2519, 8641, 12809, 3809, -6885, -8456, -3747, 1509, 2233, -1434, -1419, 734, -4347, -13461, -10776, 1427, 6937]
1999F937o673r925j977P436N830k998k770M721L569m380m633J708P050O314k027
2014H182q699k231Q244N817l785n529J06M958L289n282o787L241P714k286r071
2029b119k780N758M950k751q804l361M738M507k945l558O44M06j217j278q25K773
2045e862N876m98p786l904O196P731J303m794k413M648N288n668n789P042J2278
2060A3648q6j1681p442N550J1380K372p971m981M458J902m510l787L153M846K231
2075I082o087r745j428R158N704m911p382j193N090K387o042n464P357R589m477
2090A638j2539l203R266R521j529r138l330O604M499m134l042L630M666L9l512
2105e64l731K292O453K045l597r64J677j26j303K70K225L884p52p385l298N994
$$ y = [6937, 264, -9661, -11638, -4202, 1628, -1370, -4140, 581, 4150, -230, -4863, -3155, 3895, 10209, 8182, -517, -2748, 5496, 11313, 7528, 1999, 2105, 7063, 10352, 5070, -1717, 1524, 9238, 6952, -2119, -4899, 859, 5809, 3058, -5746, -9107, -4369, 138, -2807, -6365, -5721, -5315, -6532, -7810, -8635, -5862, 14, -484, -8270, -12174, -5978, 1753, 3056, -1738, -4151, 497, 5785, 117, -5672, 1370, 13648, 13562, 1881, -5561, -11, 11369, 13741, 5770, 789, 5247, 7149, 2639, -1148, 2005, 6851, 9082, 2995, -6750, -8178, 980, 6684, 1773, -5609, -6802, -1712, 675, -5367, -10831, -3474, 6115, 1638, -10901, -14104, -4838, 4683, 3154, -5984, -9314, -2710, 1789, -2345, -5387, -1757, 2909, 2948, -564, -4295, -2003, 4450, 6495, 2898, 1934, 3611, 3485, 2182, 2452, 4677, 8561, 7809, 424, -2874, 3120]
2121C120M648l398m974l62K414R25m013n006K236O199j7o750m330K360M666L319
2137A037k909n013K343O671j292o233K02R075O952n156j1602l16J3495P858r741
2152E371j0249L943Q717M20r228o240N571R656k018j3020o368N981Q852J945p352
2167d019p804J347Q439K342n531j702N916M761j713n910k60Q820O391m358n790
2182I29K146M355q95j598J47K399O32m438n610J424N163J0m720k817q54O60L33
2199b734o05j062J521L47m337j637M302M981j68m663l408L596P433q38p105k82
2215d659P206K491n911n268K181Q698L821p895j0209J641J0541O003m140q426
2229c926k114O917O210m127n619M262Q490l54q907n536O193J1812J826j1515p529
$$ y = [3120, 7768, 4370, -604, -966, 1448, 2373, -1640, -6646, -4410, 1789, 1772, -4978, -9308, -6948, -2282, 1037, -1872, -6885, -4542, 2129, 837, -5396, -5194, 3881, 10833, 5677, -5925, -6241, 7254, 15112, 5371, -4878, -935, 7782, 8202, -1026, -7266, -1695, 7961, 5943, -7077, -13445, -7464, 1388, 3333, -4019, -11823, -10476, -2037, 305, -5226, -6928, -1012, 3749, 2036, -3874, -4134, 4686, 11077, 6719, 929, 3075, 7430, 6535, 4937, 5084, 7483, 8115, 3677, -1933, -509, 4654, 4664, -56, -2873, -3727, -3067, -2734, -3339, -4401, -2880, -2533, -6870, -8507, -4205, 776, 608, -4055, -7463, -3867, 3566, 2728, -4377, -4659, 2547, 5038, -873, -6141, -3960, 4738, 8559, 664, -9545, -7904, 2637, 8640, 4500, -3926, -6040, 877, 7087, 2960, -2659, 1603, 10093, 9739, 832, -4704, 1489, 13301, 15127, 3612, -3917]
2244c917M313N499j373l526k79J248j329o048o324K311Q649J908o220p815l202
2259a6105N212P037M62l471P66J842q04j396L551O334L941j145m260n48L838K248
2275G502N86L457K308n494p420K92O001M659k174q045n225K314K933k075k564
2290b945r81M56P50j814o367p9Q538N758n431q830n47Q470P806k979p610P05Q345
2307C245J069n884j816N549N847j805q070l563N807P972j521o714l970J690N598
2322C434J948m749l243L888L799l160m699R56M814M064k402o461k037M611L439
2337D202n49j794k195j828j11J276j53L48M99k989k478M39J089M42L53K87l03
2354c465K29j185k276L384P308P10o593k674M687O228N15m543j064M973L093n424
$$ y = [-3917, 396, 5895, 4522, 996, 717, 1965, 636, -5412, -11736, -9425, -776, 1132, -5088, -12903, -16105, -10893, -3856, -3394, -6865, -6099, -4257, -5061, -6457, -2906, 3428, 7369, 6224, 1964, 1416, 5254, 7502, 8088, 11545, 13853, 8359, 939, 1231, 7232, 11891, 9717, 1672, -3553, -1239, 1694, -381, -2945, -3926, -3470, -2720, -4534, -10901, -10980, -2442, 3316, -2115, -10945, -11492, -3022, 4784, 1805, -5805, -5100, 3245, 4314, -1570, -3386, 2163, 8010, 6205, -1865, -5428, 379, 8351, 6830, 116, -3854, -2164, 3434, 5382, 633, -2610, 1278, 5077, 1917, -2782, -1826, 2988, 7052, 4650, -1811, -3848, 763, 4202, 3653, 1859, -336, -2164, -2275, -999, -1152, -804, -305, -3294, -5772, -5333, -4244, -3802, -3449, -3162, -3465, -3236, -4421, -6697, -3313, 3995, 4705, -1888, -4562, 125, 6353, 6868, 2325, 1261, 6234, 9327, 3903]
2370C903m729M225N923k13n390n537M46N113K351m253m768J49K396R00k158m643
2386f285M75O276J662p093n455M446O796J554n259m866K571O402j43m095l62K606
2402g70K061n83k082j273K233L677r27k448q52O70J782K085j440j804J365J410
2418C104j157l00J571K23j140K47O46n27r12o94J208K241j311m957n32M588J413
2435C711l545l347o0K295J618k270l758Q49L415J60k791k615j9L516M209k964
2451a596n624N55N942K857l787l259J286N443K454m791l575L845N616p1l178l163
2467a046J797N057K017m423l043K949L284o71l514j714K745L361j554n233j611
2482a599L431J203j551j358j515j452N39K30o07p30o48m73J756r46l792K14M786
$$ y = [3903, -826, 3399, 9322, 9109, 3719, -1818, -1372, 3741, 6092, 1839, -2929, -2780, -384, 516, -1642, -6285, -5810, 466, 2128, -4965, -10420, -5974, 822, 2376, -2883, -7749, -5178, 1224, 1081, -3014, -3376, -770, 1291, 708, -1374, -2647, -414, 3263, 2336, -112, -964, -294, 1488, 3573, 2133, 329, 1694, 3104, 1947, 1647, 3218, 3441, 2301, 2548, 3194, 2667, 1755, 1061, 2269, 4510, 3199, -1758, -2290, 2298, 3711, 166, -3181, -3241, -946, 672, -1598, -5356, -4507, -1092, -932, -3723, -6338, -6357, -2841, 1368, -1596, -7220, -6665, -723, 2134, -1653, -4912, -3626, 1817, 4271, -520, -4095, -250, 5366, 5295, 2117, -1046, 751, 5808, 7825, 3402, 359, 3308, 6592, 5921, 2407, 693, 3438, 6799, 5245, 12, -1599, 1832, 3035, 1484, 126, -1389, -2841, -2302, -2072, -2679, -3409, -4057, -4530, -2774, -3720, -7512, -7298, -2512]
2499b512J783l361k431J632K294J244k08J01J189R45j746N87L261K36j780J596
2515B830K694j888k611N18L962K411l231n328J800N098o81m850q05L142J358k824
2531A595l008n38K473J281j910k488M26j57K4J050o93j941L52J586p5j253p47
2548d023K26J893J627j800k079K010K357r02r51N9J349J993M49k992j57L033J444
2565C536j830n65J962N3j475j152L97K848Q26l475j546K336O9k488J22K251L99
2582B268k073k349l71K291R34j706m4J287j511k044Q44L162l32j459M17J124m42
2599dk405J16L237L213k328l941J131K758r79j239J269J191o53j788j373Q20K473
2616A498o06j599K50K61j944m7J949J68n24O5j03n69n62m68J115J988N93k262
$$ y = [-2512, -729, -4090, -6521, -4889, -2595, -1351, -1559, -1458, -269, 676, -1070, -483, 2778, 3014, 1234, 2830, 5524, 3636, 1025, 1543, 5505, 7916, 4685, -643, 1157, 6255, 5574, 724, -81, 3061, 4419, 1595, -1413, -1951, 522, 1803, -107, -2595, -2169, -2326, -2302, -1252, -1945, -3886, -3534, -1948, -2023, -3276, -4023, -3797, -1904, -277, -2077, -4156, -2146, 211, -691, -1642, -1583, -234, 1759, 2208, -784, -941, 2092, 3536, 1706, 1141, 3103, 3156, 1681, 529, 926, 3774, 4600, 1125, -421, 1915, 1984, -504, -382, 1869, 2268, 195, -2154, -2525, -234, 700, -1006, -1050, 237, -1274, -3318, -2474, 688, 356, -1103, -686, 438, -4, -2409, -2293, 944, 4157, 1829, -2112, -981, 1777, 798, -441, 828, 2019, 1366, -422, -1795, -975, 1498, 892, -707, -457, -196, -2140, -2187, -238, -70, -594, -529, -632, -1201, -1763, -2231, -1116, 872, 1465, -797]
2634g97n81J331m3L63J460M93n73K54q7j076j0J663J084P42j434k510o59K283
2652A903L74o68j5m12j679p48L38l32L88O59r33o68j069j760M52K709R90k231
2670b702o15N56n61L98J191J441J48N2j453n16J702J707N72K40N7j837J06J947
2688B433j72q54J228N89p92n60r70m4J691Q40j616j047R52p79r84J585J93j161
2706E32o06N99o27q53l43K68J964o4l521r18K760P07k775j52J622P61j835j273
2724c754L34K536O12k088j363K345J352j115j65J102j23M14J464L52q56j71J89
2741A065K062J340j977k179J770K228j315k186P89R76m08q32j359K29J255l03
2757A155k368j3J065k36l75j90o08L1J856o51j568K83J204M75O5q05j015J044
$$ y = [-797, -1378, -47, -90, 273, 1733, 2226, 1653, 1907, 1820, 744, 734, 2397, 3481, 4223, 2789, 279, -380, 1903, 2277, 1609, 1594, 1182, -497, -1245, -907, -1239, -851, -192, -1125, -1793, -2862, -4622, -4170, -1461, -471, -2702, -3317, -2761, -3322, -2924, -1733, -292, -144, -92, -1545, -2061, -359, 1348, 1920, 2160, 2217, 380, 486, 2433, 2261, 1407, 2635, 3224, 2432, 1872, 902, 858, 2549, 3389, 1773, 726, 1678, 899, -85, 1500, 1693, 532, -74, 525, -102, -955, -1298, -1030, 934, 870, -2651, -3569, -809, -102, -2877, -3029, -1407, -646, -2481, -3754, -3420, -884, -272, -2360, -3723, -1378, -26, -1141, -1306, -204, -327, 87, 1551, 1903, 1047, 876, 1065, 3127, 4467, 2490, 311, 2081, 4309, 2994, 808, 1597, 2573, 2165, 1333, -26, 203, 1458, 1155, -1213, -1226, -161, -397, -772, -962, -1570, -1539, 317, -334, -1902, -1619, -415, 60, 125, -680, -1695, -651]
2775f51J262l90j368M69m35N95N33l25k469M08K518M91j773j614k13K438K043
2792A519k073j776J597J900q04m64J114Q6M8J338p47n67J24J61J982J496k010
2809B924l169Q04L163j451k471R33J993j42l004k868O04L979J661l498k280l61
2825c183P9J533J447j240r28Q85M73j793j309J254L008K795j543n223j611M398
2841i58K956m48j089j243k05O31K44j378J342L394L05k437l025j191K838N098
2857D834J17l491j941P64J91P47Q51J124K12o31k762j656J603J942J146o7k336
2874F47m008L19L406J422k132j643M29N89m76j956m91K890K327k299k100j05M17
2891b764J591J629l17k095r3J822J051j35j695r09K752K591k195k353J183K121
$$ y = [-651, 611, 221, -1147, -678, -1113, -518, 15, -310, -2779, -2371, 147, 638, -1135, -2749, -2962, -524, 1519, -554, -2330, -733, 1167, 363, -101, 1013, 1099, 1147, 2485, 1738, 1171, 1295, 1456, 3438, 4934, 2924, -245, 559, 3722, 2271, -200, 733, 2726, 2584, -420, -3288, -2684, 1295, 2956, -542, -2822, -3183, -3104, -1571, -124, -1364, -2292, -1407, -934, -2727, -4036, -2782, 226, 3021, 1478, -3745, -5356, -958, 1998, 1550, 461, -782, -987, -356, -112, -1490, -148, 3246, 3551, 1114, -1911, -3102, -264, 4834, 4951, 1460, -481, 283, 474, 1221, 2072, 3196, 3408, 2777, 15, -1641, -38, 1904, 3050, 2983, 647, -3361, -3042, 364, 1786, -346, -1989, -1560, -971, -1447, -3403, -3894, -1004, 1323, -976, -3076, -3181, -2764, -1173, 456, 139, -1956, -2049, -227, 824, 689, -1006, -1915, 837, 3428, 1233, -1120, 63, 2184]
2907B184m22o86j102N47K099L88k289k038Q68J750K324K97l319l223J543K829
2923A750l47m88N53L77j168j801j725J563L873J212l044l168j543L46L623K851
2939B864j641k519n64l59l57J90J289J870J927k864m594n36L581L569R17r14l075
2956a216k039Q71K396J202R84j04r82j354j238o34K651M629l47m433k088N92J337
2973B27K236O43j209j013l08o11k6J040N3K07J295j361l615K48K902J328r45j588
2991d97j500P41J019p40o52Q41Q84q30m76n21q57R35J853k49j812p27J374J656
3009D42N47k053j859K216K631p24k024j06J021O18L01m60n39J164R57j304q31
3026cj90J150K005P10l421k383K453K792q21j530n83L00J283p27j629k82K031
$$ y = [2184, 1762, 1076, -26, 521, 2620, 3008, 719, -1319, -451, 1299, 3623, 3920, 601, -2622, -1079, 1750, 1403, 915, 1468, 1845, 677, -1124, -2849, -1286, 2587, 3799, 755, -2413, -3956, -3610, 13, 2864, 1223, -1296, -1860, -2219, -2576, -2386, -1097, 773, 2700, -164, -4758, -5294, -1713, 1856, 2773, 1859, -1216, -3255, -2384, 12, 1214, 2198, 2094, 1112, -242, -1480, -2114, 537, 5166, 4819, 386, -1702, -1110, 227, 2463, 3106, 1897, 884, 576, -35, -61, 979, 1032, 1239, 2534, 1173, -2442, -2194, 708, 2036, 1091, -497, -1997, -1256, -237, -977, -1629, -788, 96, -734, -1210, -1731, -2588, -1653, 200, -49, -1861, -2588, -1214, 442, 989, -1064, -2923, -707, 1924, 1200, -824, -930, 91, 709, 1010, 550, 11, 1175, 2132, 828, -3, -193, 957, 2962, 3672, 251, -2132, 321, 3113, 2292, 762, 179, 479, 1762, 1035, -594, -876, 1155]
3043A155M68r53j190j472n9K374R87j514j765J30P98J18J1p28Q51N03j048j906
3061c240J305J150J06J11J000j172j813R88J756R36m23j467j78J796L54j598L98
3078IK235K67j691p76O06M91J388J22j364j52j41k88J118j31j659O9K300r75k977
3097a549l86K131J741k01k804k293J722K325n54j657K97N52o89J06j230K84J878
3114c27J365j287k471n6J021J983J165j278j522R80O8j101O06J842J052n43j586
3131h9j321M32J707J511j9j11j592j733Q54J226R27Q13K12k425j991P87J369Q52
3149A409N13n14j339o46j025l56K253K984j768l473o57J337J079l59k44J024L57
3166E75j240k230K61K991O55r09l08r92j125J063J528l66l30L15j34j27j16p18
$$ y = [1155, 1623, 670, -520, -1992, -2051, 323, 1310, -204, -1969, -1839, -1041, -923, -912, -1640, -789, -286, -1334, -3240, -1935, -785, -679, -568, 432, -740, -2553, -1565, 191, 1127, 704, -763, -941, 855, 1209, -389, 9, 2244, 2511, 820, 44, 650, 1141, 2529, 2651, 1287, 1135, 994, 706, 1824, 1693, 34, 103, 2403, 1428, -1549, -1935, 196, 1937, 1736, -1068, -3361, -1639, 686, 132, -1525, -1228, -676, -1365, -1259, -2489, -2205, -327, 1038, -249, -2720, -2776, -1755, 228, 1393, 115, -1407, -427, -359, -1460, -854, 988, 2040, 1497, -89, -1410, -978, 729, 2240, 2221, 2110, 518, -1215, -361, 865, 1792, 2605, 2817, 392, -1599, -812, 557, 1409, 1922, 1408, 69, -577, -1602, -1958, 295, 3279, 1511, -1962, -2619, -1282, -203, -562, -806, 218, 575, -665, -2895, -2634, 357, 1012, 103, -205, -1197, -2322, -1259, 269, -97, -427, -112, -246, -373, -489, -1207]
3184a207J144K045r72k824M24K566P6j469n02N90J067Q76j604m90J047M54j076
3201A45O8R39L84K4j57k636l35K751J869r79j735r71J24Q44k18l75J565J526l077
3220b44k866L0K635K132J60j988j984j73L1K32J201J609j56j884j297j583N59
3237c586M035J902k019k103q29N23J262J316P84J042K22l105k080J820L722P81
3253C687p2j232k023q00J485J263J297N35j658k717J20M41J09J102P60j392j573
3270f68k65m77m06J212J583j69k536k115J91K862J591k267j079J254O69q54j208
3287b682P70J433J167r71j859J41J790O19k26m59o91Q55K216q09k481j12L059
3304A760J297j337j942JK862R22k955k372L248L280j069l019j596J392J926N85
$$ y = [-1207, -63, 1982, 1010, -1814, -1390, 1176, 1252, -217, -719, -129, 938, 1814, 210, -280, 767, 1221, 145, 213, 1152, 1536, 1560, 1403, -1233, -1568, 1183, 3052, 2073, 338, -633, -509, 335, 117, -258, 1307, 2833, -244, -3110, -3080, -445, 1687, 1847, -141, -2125, -2298, -2267, -2035, -834, 775, 619, -1265, -2562, -4145, -3586, 449, 2351, 332, -1771, -2600, -2077, -815, 501, 1285, 2327, 2549, -556, -2636, -816, 2906, 3687, 3615, 2383, 360, -440, 1045, 2308, 3605, 4140, 2482, -235, -115, 326, 435, 1537, 2297, 905, -668, -933, -1410, -1816, -604, 979, 810, -1726, -3841, -3650, -788, 803, -1464, -2543, -1289, -620, -1474, -2682, -1912, -479, 688, -283, -2142, -2001, -211, 408, 182, -277, -968, -113, 2103, 1294, -1187, -1299, 1760, 3057, 1720, -222, -221, 2641, 3563, 608, -1764, 1484, 4764, 3695, 676, -920, 472, 2398, 2983]
3320B983j899j493J232j22j144l24o4J45J181m45k277j170J287Q00J68L98j466
3337b210q99M32K70L33J862p2r76o08J009j18P72J209pn42J76k79n79P07J336
3356A816K01m01p07j465J266J182q30r62J576L83j667k123J163K622J025j878
3372A201k836Q90L321l73l118L84J995L88j197j573l69R27J153l92j034j248j66
3389b047M67J510n56k414L31J678j69j658j40J462J562o71j622j46K776P78j923
3406g82K63K004R64j715j195J072K002J531j893k076J053J288J1j012j86m6K71
3423A554l16j515m29J829K37j066j027l0M4j84M19l93O06O09j201j025L84J055
3441d49Q59K26j139j825L25K378O50j641p54L60J388J40k304j326K857K227j260
$$ y = [2983, 1084, -409, 823, 701, -443, -767, -831, -686, 495, 50, -2227, -3397, -2110, -1310, -1142, -744, -2210, -3109, -2677, -2407, -2074, -212, -284, -1260, -1868, -859, -977, -205, 1004, 997, 455, 631, 352, -227, 480, 1816, 2017, 1616, 909, -556, 710, 1892, 1062, 100, 1676, 2059, 392, -1731, -568, 2054, 3079, 1201, -1635, -745, 2576, 2203, -915, -531, 1464, 1852, 655, -918, -1287, -360, 793, 401, -633, -1881, -2047, -1580, -70, -626, -3040, -2709, -1031, -1200, -2858, -2998, -1536, 26, -645, -2267, -2413, 363, 1141, -782, -519, 1485, 2449, 734, -461, 611, 2613, 4144, 2251, 175, 1228, 2516, 2527, 1515, 1329, 1283, 1554, 1238, -277, -706, 1123, 1360, 294, -733, -763, -719, -903, -484, -877, -271, 338, -863, -1888, -1504, -449, 410, 636, -503, -2328, -2003, 375, 1025, -616, -1370, -1010, 378, 518, -1786, -3112, -255, 1972, 712]
3458G12k780Q57J598N86r30k51P83Q02r67j187J689J292j560m53J016L60l76m18
3476G73k46M55J21k44o04L62m79j188L72J714q06j213M13K01l95m62M70L29N61
3495A34m37j482J057J078j572o14J771J485n39j905j629J369K675Q33k187j536
3511a499J516O70k42q29n34J152J863q71l060l47K371J974k65j643j112J87J045
3528C76o7k61K42R02p41m64m44r25J043K539p59k019j99L68P26q0o01J38J930
3547A704k48k723r47K336J761o42j410n10m7L31J02N23L16n75q40P6J023j018
3565g88j134J426J191j85j557m18k14J497R64q79k87M17j42j09J034j09p78O07
3583E36J064n55j288j65Q58J318J75j640r33J225K94j220j08O17M58oq56r55k25
$$ y = [712, -2068, -1211, 387, 973, 43, -208, 575, 1377, 410, -777, 912, 2204, 644, 191, 1207, 1567, 1191, 773, 527, 982, 1103, 859, 255, 617, 138, -1050, -678, 1036, 230, -983, -570, -369, -764, -1226, -756, -427, 134, -303, -1785, -728, 350, -1222, -1836, -65, 1420, 881, -1024, -2653, -1284, 1391, 2224, 37, -1499, 17, 687, 445, -384, -918, 234, 2097, 1226, -1834, -2181, 190, 2164, 1899, 256, -856, -669, 376, 309, 48, 290, 1192, 451, -13, -457, -1382, -339, 2200, 1441, -578, -777, -409, 317, 237, -364, -226, 1704, 1456, -1267, -2214, 122, 1883, 1241, -169, -679, -726, -395, -293, 230, 546, -29, -869, -793, 230, -788, -1922, -496, 695, 510, -1047, -1465, -1679, -182, 782, -97, -384, 33, -109, -218, 816, 707, -71, 536, 1600, 1045, -243, -408, 450, 1768, 1943, 303, -630, 595, 889, -331, -439, 178, 636, 630, -226, -1181, -1406]
3602a406J744L32j076l28M6N40L88m47j071J118K055p69j695o14R43O64J050q03
3620F71j222J25N80k92jq5l69K57L28j36j544O72P99L69m80k76j36M28K67n88
3640f33L67J173k26j574P86J034o07j89N81K59P4o16n03L99R64j47j181O99M35
3659A095j210Q2O32N6n82R9j82K73j85M1l60Q21l44o67K02M64k93o40O55K96m47
3680a94j15n63j99M57K64n62k61L67n17m5R59m94n44J145L53r10O9L94M59M09
3700D72l6k31O16M43n99Q4Q16L99r17L91K91n86q9M04K00j57l55p63j80O04l80
3721D27p97P4M43q12o02M14L21k21n95k82Q7M47j32p05N87O40p49RQ72j74n54
3742a302R80M86k17l6k90O45R55j09j026N36J168m78j128O41O72N8J53n88l00
$$ y = [-1406, 338, 670, -406, -734, -688, -148, 240, -207, -1278, -160, 1895, 1126, -569, -1183, -240, 424, 1474, 671, -551, -426, 154, -138, -139, -224, -593, -336, -8, -144, -1688, -1016, -217, 152, -328, -604, -740, -312, -45, -633, -266, 907, 681, -893, -107, 927, 320, 131, 712, 971, 1045, 429, -74, 325, 1289, 1142, -39, 660, 1095, -115, -33, 599, 655, 73, 172, -10, 263, 78, 119, -241, 580, 236, -431, -229, 235, -58, -698, -43, 253, -194, -309, -872, -1071, -614, -350, -912, -1173, -806, -1323, -1368, -409, -903, -1447, -302, 51, -859, -790, -396, 63, 472, 436, 205, 821, 1264, 665, 749, 1565, 1964, 1047, 1438, 1729, 1143, 1054, 1458, 1658, 1501, 1146, 383, 203, 807, 427, -370, -296, 147, -665, -1267, -853, -532, -753, -1348, -1630, -1543, -1096, -1228, -1933, -1346, -706, -1455, -1446, -574, -748, -1302, -322, 164, -53, -89, -379, 266, 1221, 1112, 86, 622, 1790, 1312, 184, 825, 1497, 1555, 1708, 1120, 820]
3761H20K15N5l47m6J31o35m77M33o6m33L04n7n38m46L83Q4K91o8o25J2N13l25
3783h22q1O83K03n35m5K76K9q7q6K68M69J05q93o50Q28Q23L0p49N03q44L76J185
3805I86l32q58K40N86L38r7r65o0J671K36j793r55Q12J609k99p94q45J3P89J41
3825D23q57k07M85J25j50j39q68k5J470J66j278p49J309J002J9j074o60J645O96
3844A333j154j139J473Q25l60p86p61q4O42Q97l22p91n92k82o2J351k73j009O2
3863a032L41k40q6P50N6l3O25l42k32L1N85N63J003l17k082O30J475N46r41o19
3883F81k4L74L92j224r33J104P80m29j853l65j7J378R01j470j464P09J793m92
3901a59j043l77J371J077o93j996j42K323J267j254j081n44Q48J409M12j738r88
$$ y = [820, 1035, 1090, 743, 697, 828, 193, -284, 149, 83, -350, -46, -103, -641, -1087, -704, -620, -329, -397, -1022, -1010, -497, -822, -903, -220, -17, -552, -597, -321, -292, -379, -465, -197, 272, 377, -516, -1166, -338, 485, 515, -234, 269, -575, -199, 986, 654, -204, 36, 622, 960, 863, -102, -162, 1509, 1745, -48, -1003, -191, 1418, 1119, 325, -520, -507, 282, 423, -434, -641, -156, -31, -181, -320, -1188, -1213, 257, 423, -855, -1604, -295, 707, 726, -348, -1008, 637, 1333, 179, -960, 513, 1338, 978, 192, -569, -653, -11, 886, 564, -227, -819, -1101, -1163, 188, -85, -1094, -1032, -691, -931, -1017, -267, -211, -244, 381, 39, -193, -162, 423, 986, 1989, 1672, -410, 220, 1695, 2241, 1300, 681, 657, 1031, 1423, 199, -734, 370, 1150, 721, -1132, -1497, -1514, -136, 765, -705, -2169, -1460, 333, -159, -1202, -1579, -208, 869, 176, -1820, -1962, 361, 1628, 374, -707, -1251, -403, 1006, 1418, -320, -1308]
3918a308J361N57k70r06l98Q71J094m49j823O44J393N67q07m31L91K05R5q0K3
3937G29O89j27j085L36R98o53o49M10O73q83l81r30O19P37l2j547o69P86J07M15
3957d57j85q02l23J172N72j066n55O23J597K46j152j581R16K974o0k585o92J355
3975cJ036L34j459l87P37J487q57j515J38J120P01J20j625q27J186J524p82j353
3993d25J70R93M38j79j195l67J636M16j139r30k32P88J092k62j523m74Q86L72
4011F5j62j075M16J18j5l09l31M41K08q82M86J358l60j625K54J699O09o03j530
4030a238J47K274O82j807j170J523J761q40j252j40R09O97K84j794j11N74P42
4047A241j00m23j391J62J827R4j938j355J518K289q52k278j343K167K044r89k652
$$ y = [-1308, 53, 610, 340, -566, -964, -93, 1001, 552, -1271, -627, 766, 1333, 526, 95, 486, 691, 786, 706, 729, 1418, 1291, 206, 542, 1540, 887, 238, 648, 1321, 438, 57, -873, -254, 483, 451, -1096, -1765, -979, -872, -457, -642, -1444, -1767, -595, -23, -1089, -1644, -1021, 576, 822, -330, -1911, -995, 1979, 1919, -666, -1358, -3, 1033, 1367, -92, -479, 258, 1745, 888, -627, -489, 631, 1332, 1452, -173, -1000, 186, 1710, 928, -425, -255, 738, 1176, 997, -198, -565, 1071, 1487, 348, -582, -814, -26, 1066, 804, -719, -1193, -307, 65, -97, -1172, -756, -638, -653, -962, -1293, -852, -644, -1526, -1040, 318, -42, -1667, -1413, 286, 895, 292, -1238, -1091, 1183, 1865, 58, -1112, 411, 2172, 1332, 80, -60, 849, 1546, 1830, 36, -75, 499, 1241, 1141, 718, -673, -511, 1316, 1410, -528, -1883, -365, 1924, 1072, -1206, -2549, -382, 1662, 673, -1979]
4064a979q2J832Q81p64j342m07J182J500q73j414M09Q08L12K13m26j054P72P99
4082C67j80%L14m4p21L62N96m19K51O5m33K1P9n02N21O13m41m37k21p6K55M77
4104D47L05n37j74M87q7l76m87N64Q68R73k342j669Q28L362m04k647j160J398
4122f51J891m90k215n64K167R56j458j586n4J451J239K17j627j567J125J800K32
4139H66q64q56K94J291Pj656K76J777M54j158j408R45Q34M12o72q14K90O99m12
4158C05k81J50j1M86M87q19j173N69J557j38p60k82l10K74N04K37m39k18n81j03
4178e46J156J03r67r25O05P13O6j304q46N94J649m59j563o96J194J707j34p13
4196c66j594M79K229L34q63q40O99R60K27j124l95J645J555j514j921J66J366
$$ y = [-1979, -2061, -229, 652, -112, -1454, -1861, -679, 821, -52, -1466, -1057, -249, 63, 276, -150, -1204, -432, 367, 187, 187, 501, 457, -264, 98, 694, 275, 526, 591, 158, 179, 258, -244, 277, 890, 449, 12, -209, -285, -30, 447, 752, 215, 41, 528, 441, 65, -422, 142, 1010, 1983, -359, -2028, -1200, 2162, 1758, -889, -2049, -651, 1240, 750, -1465, -2029, 138, 1094, -364, -1950, -2004, -553, 686, 903, -724, -2291, -1166, 634, 866, 2, -854, -560, 731, 738, -918, -642, 1135, 1589, 431, -977, -32, 802, 1214, 542, -272, 18, 717, 305, 24, 174, 163, 649, 1136, 317, -856, -287, 1270, 1132, 372, 90, -220, 54, 558, 795, 356, 138, -443, -546, 610, 713, -254, -1179, -574, 139, 205, -1099, -1945, -1351, 298, -161, -1724, -2420, -1226, 481, 347, -366, -1960, -1481, 748, 1082, 219, -621, 78, 1038, 1265, 141, -254, 1391, 2946, 1432, -489, -323, 1043]
4213A043R27n57j072k64J080k17j281l69J030N07k27p05j410l49K067Q97j406
4230c06j148L20O74J43m9n95M41J025o10r81L59K98Q3L25L56k50r11m5J60J021
4250C10M31o56j319O50R96q5j78l1L5J08N45n06n10oJ052J55m12p22J4J159L79
4271A409j475o60Q26P67m38q22o4N45O26l57j535L64J291K38r82k46o98R83P94
4290E66k78j480J62R49O90q57j037q5J316J036j110r10N58J298o93j34Q5n36L85
4309g5K66k37K4L51l92r7K52L4q2P11n47l68K57L97j92n98N70K51q6p1o38n1Q99
4332E78K89j190j48J077o3l78j79K60J24J62m83o45P77M94l30n37l31L0L56M71
4352C34p38j125Q12J158m95j241k33R79P28Oj404p08J764M55o94k4K00L26M88
$$ y = [1043, 1970, 1413, 341, 77, 1157, 940, -341, -710, 320, 827, 600, -105, -1515, -1864, 203, 1100, -306, -1454, -1134, -460, -317, -366, -961, -520, 505, -105, -1086, -727, -429, -346, -21, 335, 85, -826, -871, -711, 310, 741, 85, -1234, -584, 412, 327, 149, 118, 153, 261, 806, 300, -210, -216, 836, 991, 579, -143, -129, 1030, 1409, -66, -726, 100, 867, 429, -393, -457, 88, 714, 357, -1178, -814, 477, 715, -267, -513, -1211, -228, 566, 288, -1192, -1030, -81, 609, -248, -1285, -1370, -54, 982, -128, -1038, -480, 818, 125, -9, 76, -460, -75, 191, -46, -22, 329, -63, -160, 92, 126, 44, 755, 208, -160, 97, 494, 302, -296, 274, 525, 439, 368, -270, -321, 578, 867, -323, -471, 606, 543, 165, -14, 246, 370, 532, 49, -596, 181, 675, 345, -192, -523, -493, -137, 334, -404, -1529, -717, 441, -54, -1295, -1528, -549, 179, 185, -1219, -1927, -163, 292, -402, -426, -226, 100, 588]
4371E88J87q67L39N63K39n48M08o11j49P67L93j116J42Q18m91j022K60M07K64
4390E71k41p43j26O91N2j010P40N10m93q97N33j20N89Kp6j63l93L88l30L7M66
4411a3Q9k56K56p44l41J134J33n49m23p7L58K95l2p74Q24N83q5j279N80N05O54
4432H38l13J03n57N3P07k7k00n3J42J19K7p65j3N62L65o55r97P14J05j85k9l27
4454c86k35N77j25q13N43N24n84k28L87rK3j83%J63J13K14k65K84k2n68M06M14
4476B30l82p7L91J7n40k00M60L05lJ57n83O16K96n37n58O10M32j4q7l8o00K74
4498A69Q81n08K61j63k20K35O4n53l09R34m6j316j94N98L21m28j36J29Q7l98k70
4519h62j25Q33K58p25l48L29j06j09O67J27lq1L13k55P5q6K69L98R4p73l32Q63
$$ y = [588, 775, -92, 247, 810, 1049, 501, 909, 298, 149, 916, 1309, 193, 335, 1153, 662, -360, -100, 307, 571, 330, -413, -539, 152, 204, -806, -66, 444, -49, -946, -413, -533, 56, 58, -18, -181, -574, -186, -516, -479, -13, 76, -180, 76, -668, -1009, 125, 258, -291, -714, -791, -433, -138, -170, -944, -120, 463, 378, -901, -321, 184, 838, 525, 628, 71, 124, 831, 804, 604, 551, 693, 812, 839, 74, 61, 623, 988, 333, -664, 50, 155, -30, -59, -386, -621, -44, -169, -982, -439, 85, -499, -727, -340, -349, -326, -509, -509, -346, -233, -19, -284, 0, -22, -590, -184, 230, -152, -229, 162, 179, -361, -561, -101, 204, 201, 358, -225, 391, 687, 150, -408, 202, 634, 620, 533, 495, -105, 169, 1050, 542, 803, 640, 420, 655, 719, 166, -143, 791, 745, -571, -765, -167, 154, -274, -410, -281, -194, -592, -862, -987, -154, 104, -621, -969, -640, -746, -855, -188, -61, -64, -145, 168, -87, -12, -98, 171, 569, 663, -110, -442, 421]
4541D21M69o30j71K76N2L14n87j94O22O79r98k48M29J13k35J92k87M2j93M56p03
4562a81jP2K5K16N1m87l22L56j16l56L11K67k06J23m57K50J48j8L66k01j72k67
4584e99M1O70k60l51K53L72j44l45K8K15J21N17n62J65L80k59j90N1P90m60j12
4605C21OJ21J68q28J22P96K46p65p26O22O80o38j21O23p5p62q3N09l22n1Jm42
4627e98M10O8o27K5P71r5n66K32J12K09k65k82K77L31K50o87k54P87K04n80J83
4648i5L91k16oM2j54J87P5m11L63L59Jk81J07J15j19J6J69l49Q0N21k27o40K59
4671A87K96j33j66n8J95J73k43m36L8L61o4o17L53L9m57k1P2M72k71k06l05M44
4693c47L10n99OM49L57q53p9P23K91m58K10l43M51P6k05j45N30J78o27J74K53
$$ y = [421, 890, 260, 89, 365, 417, 731, 144, -50, 572, 1251, 253, 5, 434, 547, 312, 504, 217, 259, 66, 522, -181, -182, -110, -85, 131, 182, -305, -627, -271, -387, -743, -432, -165, -371, -248, -705, -455, -307, -325, 41, -160, -332, -599, -558, 112, -148, -499, -246, 126, -18, -363, -335, -120, 1, 518, -44, 121, 501, 242, 52, 103, 893, 433, 321, 327, 448, 616, -212, -90, 706, 952, 187, -539, 83, 763, 125, 4, 627, 552, -210, -293, 216, -106, -157, -156, -598, -188, -120, -747, -722, 49, -46, -612, -380, -268, -59, -324, -606, -329, 2, 252, -435, -689, 98, 302, -278, -95, 296, 80, 74, 116, -38, 149, 224, -187, 176, 535, 536, 255, 362, 477, 358, 374, 543, 194, 274, 795, 568, -72, 187, 483, 350, 184, 126, 321, 494, 251, -185, -147, 214, 150, -467, -114, -75, -532, -553, -481, -9, -280, -486, -791, -347, -37, -636, -630, -181, 176, -677, -756, -33, 258, -200, 10, -333, 118, 194, -11, -156, 374, 552, -75, 99, 352]
$$ [...]
8191b46
##END NTUPLES=NMR FID
##END=
