##TITLE=1H_TG-1160-A
 CDCl3
 8 sc, 
 8.06.2022
##JCAMPDX= 6.0         $$ Bruker NMR JCAMP-DX V2.0
##DATA TYPE= NMR SPECTRUM
##DATA CLASS= NTUPLES
##ORIGIN= UXNMR, Bruker Analytische Messtechnik GmbH
##OWNER= root
$$ XWIN-NMR		Version 3.5
$$ Wed Jun  8 12:28:05 2022 Russian Standard Time (UT+4h)  she@DPX200
##.OBSERVE FREQUENCY= 200.131
##.OBSERVE NUCLEUS= ^1H
##.ACQUISITION MODE= SIMULTANEOUS
##.ACQUISITION SCHEME= undefined
##.AVERAGES= 8
##.DIGITISER RES= 18
##SPECTROMETER/DATA SYSTEM= spect
##.PULSE SEQUENCE= zg30
##.SOLVENT NAME= DMSO
##.SHIFT REFERENCE= (INTERNAL, DMSO, 0, 16.1788)
##AUDIT TRAIL= $$ (NUMBER, WHEN, WHO, WHERE, WHAT)
$$ ##TITLE= Audit trail, XWIN-NMR		Version 3.5
$$ ##JCAMPDX= 5.01
$$ ##ORIGIN= Bruker BioSpin GmbH
$$ ##OWNER= she
$$ F:/spectra/data/she/nmr/H-F/1/pdata/1/auditp.txt
$$ ##AUDIT TRAIL=  $$ (NUMBER, WHEN, WHO, WHERE, WHAT)
(   1,<2022-06-08 12:26:59.43 +0400>,<she>,<DPX200>,
      <created by zg, POWCHK disabled, PULCHK disabled
       configuration hash MD5:
       00 E9 B6 7A A2 85 ED C7 34 08 36 98 17 FE 4E 26
       data hash MD5: 16K
       C5 93 92 19 BB BF B2 B1 11 5B 99 C4 38 B8 C5 B5>)
(   2,<2022-06-08 12:27:01.96 +0400>,<she>,<DPX200>,
      <Start of raw data processing
       efp BC_mod = 2 LB = 0.24 FT_mod = 6 PKNL = 1 PHC0 = -18027.92 PHC1 = 13.40074 SI = 16K 
       data hash MD5: 16K
       0E 4D 37 C1 FE 25 8F 0B DE E5 12 DC 8F DB A9 83>)
(   3,<2022-06-08 12:27:19.23 +0400>,<she>,<DPX200>,
      <pk PHC0 = -1.884467 PHC1 = 3.2 
       data hash MD5: 16K
       DB 1F 89 09 50 C9 71 4A 66 99 B8 26 D3 79 A4 2A>)
(   4,<2022-06-08 12:27:24.32 +0400>,<she>,<DPX200>,
      <abs ABSG = 5 
       data hash MD5: 16K
       EA C8 E8 67 EB 17 1E CB 01 56 FA 0E 1E 3F 0E 11>)
$$ ##END=
$$ 
$$ hash MD5
$$ 0A F6 E5 33 D1 6C A9 DB 0A 20 F7 BE 16 99 A8 9C
##$RELAX= 
##$RELAX= 
##$RELAX= 
##$RELAX= 
##$RELAX= 
##$RELAX= 
$$ Bruker specific parameters
$$ --------------------------
##$DU= <F:/spectra>
##$EXPNO= 1
##$NAME= <H-F>
##$PROCNO= 1
##$TYPE= <nmr>
##$USER= <she>
##$AMP= (0..31)
100 100 100 100 100 100 100 100 100 100 100 100 100 100 100 100 100 100 
100 100 100 100 100 100 100 100 100 100 100 100 100 100 
##$AQSEQ= 0
##$AQ_mod= 1
##$AUNM= <au_zg>
##$AUTOPOS= <>
##$BF1= 200.13
##$BF2= 200.13
##$BF3= 200.13
##$BF4= 200.13
##$BF5= 200.13
##$BF6= 200.13
##$BF7= 200.13
##$BF8= 200.13
##$BYTORDA= 1
##$CFDGTYP= 0
##$CFRGTYP= 5
##$CHEMSTR= <none>
##$CNST= (0..31)
1 1 145 1 1 1 1 1 1 1 1 1 1 1 1 1 1 1 1 1 1 1 1 1 1 1 1 1 1 1 1 1 
##$CPDPRG= <>
##$CPDPRG1= <>
##$CPDPRG2= <>
##$CPDPRG3= <>
##$CPDPRG4= <mlev>
##$CPDPRG5= <mlev>
##$CPDPRG6= <mlev>
##$CPDPRG7= <mlev>
##$CPDPRG8= <mlev>
##$CPDPRGB= <>
##$CPDPRGT= <>
##$D= (0..31)
0 1.2 0 0 0 0 0 0 0 0.06 0 0.03 0 0 0 0 0.0002 0 0 0 0 0 0 0 0 0 0 0 0 
0 0 0 
##$DATE= 1654676818
##$DBL= (0..7)
120 120 120 120 120 120 120 120 
##$DBP= (0..7)
150 150 150 150 150 150 150 150 
##$DBP07= 0
##$DBPNAM0= <>
##$DBPNAM1= <>
##$DBPNAM2= <>
##$DBPNAM3= <>
##$DBPNAM4= <>
##$DBPNAM5= <>
$$ [...]
##$SUBNAM2= <"">
##$SUBNAM3= <"">
##$SUBNAM4= <"">
##$SUBNAM5= <"">
##$SUBNAM6= <"">
##$SUBNAM7= <"">
##$SUBNAM8= <"">
##$SUBNAM9= <"">
##$SW= 18.0517599122864
##$SWIBOX= (0..15)
0 0 2 0 0 0 0 0 0 0 0 0 0 0 0 0 
##$SW_h= 3612.71676300578
##$TD= 16384
##$TD0= 1
##$TE= 0
##$TE2= 300
##$TE3= 300
##$TEG= 300
##$TL= (0..7)
0 120 120 120 120 120 120 120 
##$TP= (0..7)
150 150 150 150 150 150 150 150 
##$TP07= 0
##$TPNAME0= <>
##$TPNAME1= <>
##$TPNAME2= <>
##$TPNAME3= <>
##$TPNAME4= <>
##$TPNAME5= <>
##$TPNAME6= <>
##$TPNAME7= <>
##$TPOAL= (0..7)
0.5 0.5 0.5 0.5 0.5 0.5 0.5 0.5 
##$TPOFFS= (0..7)
0 0 0 0 0 0 0 0 
##$TUNHIN= 0
##$TUNHOUT= 0
##$TUNXOUT= 0
##$USERA1= <user>
##$USERA2= <user>
##$USERA3= <user>
##$USERA4= <user>
##$USERA5= <user>
##$V9= 5
##$VALIST= <valist>
##$VCLIST= <CCCCCCCCCCCCCCC>
##$VD= 0
##$VDLIST= <DDDDDDDDDDDDDDD>
##$VPLIST= <PPPPPPPPPPPPPPP>
##$VTLIST= <TTTTTTTTTTTTTTT>
##$WBST= 1024
##$WBSW= 4
##$XGAIN= (0..3)
0 0 0 0 
##$XL= 0
##$YL= 0
##$YMAX_a= 62758
##$YMIN_a= -55416
##$ZGOPTNS= <>
##$ZL1= 120
##$ZL2= 120
##$ZL3= 120
##$ZL4= 120
##$ABSF1= 16.17883
##$ABSF2= -1.87306
##$ABSG= 5
##$ABSL= 3
##$ALPHA= 0
##$AQORDER= 0
##$ASSFAC= 0
##$ASSFACI= 0
##$ASSFACX= 0
##$ASSWID= 0
##$AUNMP= <proc_1d>
##$AZFE= 0.1
##$AZFW= 0.1
##$BCFW= 0
##$BC_mod= 2
##$BYTORDP= 0
##$COROFFS= 0
##$CY= -3
##$DATMOD= 1
##$DC= 0
##$DFILT= <>
##$DTYPP= 0
##$F1P= 0
##$F2P= 0
##$FCOR= 1
##$FTSIZE= 16384
##$FT_mod= 6
##$GAMMA= 0
##$GB= 0
##$INTBC= 1
##$INTSCL= 0
##$ISEN= 128
##$LB= 0.24
##$LEV0= 0
##$LPBIN= 0
##$MAXI= 10000
##$MC2= 0
##$MEAN= 0
##$ME_mod= 0
##$MI= 1.114404
##$NCOEF= 0
##$NC_proc= -8
##$NLEV= 6
##$NOISF1= 3.799351
##$NOISF2= 2.8
##$NSP= 0
##$NTH_PI= 0
##$NZP= 0
##$OFFSET= 16.17883
##$PC= 1
##$PHC0= -18029.8
##$PHC1= 16.60074
##$PH_mod= 1
##$PKNL= yes
##$PPARMOD= 0
##$PSCAL= 0
##$PSIGN= 0
##$REVERSE= no
##$SF= 200.129568495393
##$SI= 16384
##$SIGF1= 3
##$SIGF2= 2
##$SINO= 5.538805
##$SIOLD= 16384
##$SREGLST= <1H.CDCl3>
##$SSB= 0
##$STSI= 16384
##$STSR= 0
##$SW_p= 3612.71676300579
##$SYMM= 0
##$S_DEV= 0
##$TDeff= 16384
##$TDoff= 0
##$TI= <>
##$TILT= no
##$TM1= 0
##$TM2= 0
##$TOPLEV= 0
##$USERP1= <user>
##$USERP2= <user>
##$USERP3= <user>
##$USERP4= <user>
##$USERP5= <user>
##$WDW= 1
##$XDIM= 16384
##$YMAX_p= 339986021
##$YMIN_p= -1115184
$$ End of Bruker specific parameters
$$ ---------------------------------
##NTUPLES= NMR SPECTRUM
##VAR_NAME=  FREQUENCY,     SPECTRUM/REAL,   SPECTRUM/IMAG
##SYMBOL=    X,             R,               I
##VAR_TYPE=  INDEPENDENT,   DEPENDENT,       DEPENDENT
##VAR_FORM=  AFFN,          ASDF,            ASDF
##VAR_DIM=   16384,         16384,           16384
##UNITS=     HZ,            ARBITRARY UNITS, ARBITRARY UNITS
##FACTOR=    0.220516191357248, 1,           1
##FIRST=     3237.86210517882, 0,            0
##LAST=      -374.854657826971, 0,           0
##MIN=       -374.854657826971, -1115184,    0
##MAX=       3237.86210517882, 339986021,    0
$$ Real data points
##PAGE= N=1
##DATA TABLE= (X++(R..R)), XYDATA
$$ [...]
8437G1437m04555p9015J40968p0249n9057J81942j61087j51435J22289p0585L72947
8426a06400k96638K2430L75087K13092m23004k38250j98283K08540K21666R8874
8416a22886j38031L7590j57363Q9949n4145J467o0402L2187K39766j03024K42702
8405G810r9694J33196j52610j67372J74499J95572l38893K48949L13021l33977
8395a9499m46129O05262N6060j48345r0027k9773K37909M86285n29418k850K62686
8384C82161o8768p5110m75007J62709p4464J76160N93946k39918k4343k55704
8374A01662j07810J64027k44165M25777p604N7253M21063j80473j96357K69179
8364G02552Q8193J03426o19854J34297P5804J66375o8102L6172k16835Q3894M0369
$$ plain form
8437 71437 -333118 -412133 -271165 -341414 -400471 -218529 -379616 -531051 -408762 -479347 -106400
8426 -106400 -403038 -380608 -5521 207571 -215433 -453683 -651966 -443426 -221760 -122886
8416 -122886 -260917 -223327 -380690 -290741 -344886 -343419 -403821 -371634 -131868 -234892 7810
8405 7810 -91884 41312 -111298 -278670 -104171 91401 -247492 1457 314478 -19499
8395 -19499 -465628 139634 195694 47349 -42678 -72451 165458 651743 122325 119475 382161
8384 382161 313393 238283 -236724 -74015 -148479 27681 621627 381709 357366 101662
8374 101662 -6148 157879 -86286 339491 331887 389140 810203 629730 433373 702552
8364 702552 790745 894171 274317 408614 484418 650793 582691 618863 402028 485922 526291
8353E26291k76495k1966L11732j11686j99078k7064L05261l6098L95357M49881
8343A316135k74824k74474k83999N07895L34684K9934o4976Q5809J30504J71190
8333A677878q3630r003O5771j32015j74809j62729k17768L02193P1643J83780
8323A521311J68290q7523M03569N9873j24606l75922L11576K14489J83064O4905
8313B339026K95667L85715J09461M46251J78691L28882j24611l79483k52125m73538
8303B853936m89636k36473k49164P3013M2990Q253M39949k39606j85119P8995
8293B097138m93775J73593L72012K47574N0291K22447L93311J08569J39981J079481
8283D390622k30979Q1652J31877k3535L15486O8853q75106k85055q60736k02528
$$ plain form
8353 526291 249796 227830 539562 427876 228798 201734 506995 470897 866254 1316135
8343 1316135 1041311 766837 482838 990733 1325417 1355351 1290375 1376184 1506688 1677878
8333 1677878 1594248 1585245 1651016 1519001 1344192 1181463 963695 1265888 1337531 1521311
8323 1521311 1689601 1602078 2005647 2065520 1940914 1564992 1876568 2091057 2274121 2339026
8313 2339026 2634693 3020408 3129869 3576120 3754811 4083693 3959082 3579599 3327474 2853936
8303 2853936 2364300 2127827 1878663 1951676 1994666 2002919 2442868 2203262 2018143 2097138
8293 2097138 1603363 1776956 2148968 2396542 2446833 2669280 3062591 3171160 3311141 4390622
8283 4390622 4159643 4241295 4373172 4349637 4665123 4733976 3858870 3573815 2713079 2510551
8273B510551J09284k90202k37155j72807m49884r5457M2148j00745K42125J76917
8263A734775J48331J9244L75664K98802j18037K42478J18716j0484K47726M04613
8253C461828M29312j27169J3522j61336l45649l40439K5063m14347o1026l1555
8243B448204l45111m75552J1993o6632o6423l77782j506M41073J72006j71720
8233A568550L82287L6789k87879k48348J38330m0957M49708k55753p178M44521
8223B180070m42256j38005M25053l76729l23053n8233n75853l12151J49181J7541
8213E45565P6805o7947k53064l43777L43710L30420M1161K13496n1908K5510j70537
8202F89434n08760M0929K59096k8705k37681J20599M00704R0827K21895O95023
$$ plain form
8273 2510551 2619835 2329633 2092478 1919671 1469787 1374330 1416478 1315733 1557858 1734775
8263 1734775 1883106 1902350 2278014 2576816 2458779 2701257 2819973 2809489 3057215 3461828
8253 3461828 3891140 3763971 3777493 3616157 3270508 2930069 2955132 2540785 2479759 2448204
8243 2448204 2103093 1627541 1639534 1572902 1506479 1128697 1127191 1568264 1740270 1568550
8233 1568550 1950837 1987626 1699747 1451399 1589729 1548772 1998480 1742727 1735549 2180070
8223 2180070 1737814 1599809 2024862 1648133 1325080 1266847 690994 378843 528024 545565
8213 545565 622370 554423 301359 -42418 301292 631712 672873 886369 834461 859971 689434
8202 689434 180674 221603 480699 451994 214313 334912 735616 826443 1048338 1743361
8192A743361N9876j501300j91841L31945K21303m96259l0198N0009J08660n7615
8182B37941j86288j4634J56267O4107j21264r9442K04641p5891K74005o8062K821
8171C74201j93511p8468k16216l39697O19635j12160r9054Q8001J80560K79741
8161E03032l72925K7389k85894M8418L39941j88191O5121j83204m4344q1072L28275
8150A56546J02133n56344L43564j23837r0732L95427k06608N2905k34119j78209
8140c39274L8872K54385M10209L25238n43019k26674l92497k79633K10511L95800
8130a46082K58773k59282m85853O3903q0551N15741k7414m8647k69939R6960J46580
8119b35811J56060m0865J23625J67783K29745o296k85976j27787M61817q2599
$$ plain form
8192 1743361 1803237 301937 110096 442041 663344 167085 136887 186896 295556 237941
8182 237941 51653 37019 193286 257393 136129 36687 241328 165437 439442 371380 374201
8171 374201 180690 102222 -113994 -453691 165944 53784 -45270 42731 223291 503032
8161 503032 130107 157496 -128398 -79980 259961 71770 136891 -46313 -90657 -171729 156546
8150 156546 258679 -297665 45899 -77938 -168670 226757 20149 73054 -161065 -339274
8140 -339274 -300402 -46017 364192 689430 146411 -80263 -472760 -752393 -541882 -146082
8130 -146082 112691 -146591 -632444 -568541 -649092 -133351 -160765 -209412 -479351 -382391 -235811
8119 -235811 -79751 -120616 3009 170792 400537 394241 108265 -19522 442295 359696
8109C59696l55222k13369M3295K60239K01843m60371R6423J74264j38426J77349
8099A45721l7115O8895k75331p4852r6332K33459J13794M45446l47562j06657
8089F9466j2748J95706l54640J10784J6883j2968k4793L1598r5412J94663k9858
8078H8681L0063j28931k87256M88432L0975l57262q2820j75666m2998l1560j36555
8067f04897k91387R0608N71881j4539K4162L39721q1859m07214k57869L48263
8057b83130P7184L46512J14656m97658K48675K38426l39617m57125K30814M28077
8047A06814j52015K52023j12713r0244L5008j32925o6741j11809k0506K74719
8037a8389K66827j0969K74022j45450p92159J00871L31888k48310m52948p5374
$$ plain form
8109 359696 4474 -208895 -165600 94639 296482 -163889 -67466 106798 -31628 145721
8099 145721 108606 177501 -97830 -172682 -269014 -35555 78239 523685 176123 69466
8089 69466 56718 252424 -102216 8568 25451 12483 -12310 19288 -76124 118539 88681
8078 88681 118744 -10187 -297443 190989 221964 -135298 -218118 -393784 -436782 -468342 -604897
8067 -604897 -896284 -805676 -233795 -248334 -224172 115549 33690 -373524 -631393 -283130
8057 -283130 -205946 140566 255222 -242436 6239 244665 -94952 -552077 -321263 106814
8047 106814 -45201 206822 94109 3865 38873 -94052 -160793 -272602 -293108 -18389
8037 -18389 248438 237469 511491 366041 -426118 -325247 6641 -241669 -694617 -769991
8027g69991K51965L35550Q7460j0214k19108O3618M25538j96692k92087j54741
8017d78702J67317Q8617K81781m73922K21553K41040l0992k87208l78366L45583
8007c03299r6657K81620K14287k32482M3043J77893k15125q5897J28508k67804
7997c55913K31352J69781q7751j18602m72662J55914K06074p9728J0341j08043
7987d49237K10836K5103J18936Q4464q4016k802j50766J4832R7726l60141J0956
7976d84109R9417O5733n3040k02234J39645L77262j03852R1785J40731K2658M58850
7965E52846l87801L5401m89391j10110L87600o1558r0171J66510N117j94341p0226
7954b56124J5065j03682J14226J14485J5578q1372m9456L12152j58817J6270l58220
$$ plain form
8027 -769991 -518026 -182476 -95016 -105230 -324338 -260720 164818 -31874 -323961 -478702
8017 -478702 -311385 -222768 59013 -414909 -193356 47684 16692 -270516 -648882 -303299
8007 -303299 -399956 -118336 95951 -136531 -93488 84405 -130720 -216617 -88109 -355913
7997 -355913 -124561 45220 -42531 -161133 -633795 -477881 -271807 -351535 -341194 -449237
7987 -449237 -238401 -213298 -94362 -9898 -93914 -96716 -247482 -232650 -134924 -495065 -484109
7976 -484109 -384692 -318959 -371999 -574233 -434588 -57326 -161178 -69393 71338 93996 552846
7965 552846 165045 200446 -288945 -399055 -11455 -73013 -163184 3326 8443 -185898 -256124
7954 -256124 -241059 -344741 -230515 -116030 -100452 -181824 -231280 80872 -77945 -61675 -419895
7943d19895j03424M21407O4893L81849J25002m29402l51506m8288N2033L8670
7933b68661L05563l9801j05586j47758L79156j43939n9318k5636o2015R16J82381
7922A5302m88536K26850j49707J850L50481L15857k03168j47948L11251R4594
7912C26826l31535Q9420k69903N8969M2254k50381K34675m70O2210m8079N98639
7901E12625m11592k73708J96693j68060j53377J90355O5025N7657J62755J31216
7891C09589j82172L22006k16130J79073K9943l52382j3614k1622k99836K44421
7881g24M45743l83079K47131k65061l90723J99703K87111J32814l94763l4835
7871a56683j60804J81059M12188j50371n80233O458M17454R1943K17003P4059
$$ plain form
7943 -419895 -523319 -101912 -37019 344830 469832 40430 -311076 -359364 -307331 -268661
7933 -268661 36902 -2899 -108485 -256243 122913 -21026 -80344 -105980 -167995 -167079 15302
7922 15302 -473234 -246384 -396091 -394241 -43760 272097 68929 -79019 232232 326826
7912 326826 -4709 84711 -185192 -126223 -83969 -334350 -99675 -100145 -37935 -86014 512625
7901 512625 101033 -172675 24018 -144042 -297419 -107064 -42039 15618 178373 309589
7891 309589 127417 449423 233293 412366 442309 89927 76313 54691 -245145 -724
7881 -724 445019 61940 309071 44010 -346713 -147010 140101 272915 -121848 -156683
7871 -156683 -317487 -136428 275760 125389 -454844 -448386 -30932 61011 278014 352073
7861C52073j98664K5981l35401j75351K29116j1731n9378j85204j74318K02729
7851c30148J67146j10121J55145L84056J54577j02408o5958k02643M5760J70453
7841B65859k57706L65241k30477j51477q8017j07709L36083P1664M1033j04047
7831A40447k88619M2666j01589M23624q520l09209J43967K20217j45774p2028
7821D5182l06079o858M491J98698J07802M80821n59709l07866K14410K50044j58158
7810c7222P78113P32981n97497O2602n29875P8064K55088k6021k60798L89853
7800H45288k40463l18791j11175L01012l07190O0044J6301N4271m77536r8505
7790b76744K9967K72227K43014j98212k8161O137j61184K20968P01866k38583
$$ plain form
7861 352073 153409 179390 -156011 -331362 -102246 -113977 -173355 -358559 -532877 -330148
7851 -330148 -163002 -273123 -117978 266078 420655 318247 252289 49646 95406 265859
7841 265859 8153 373394 142917 -8560 -96577 -204286 131797 203461 244494 140447
7831 140447 -148172 -105506 -207095 216529 208009 -101200 42767 262984 117210 45182
7821 45182 -260897 -267755 -263264 -64566 43236 524057 -35652 -343518 -129108 120936 -37222
7810 -37222 740891 1473872 876375 938977 409102 487166 742254 716233 455435 845288
7800 845288 604825 286034 174859 475871 168681 228725 245026 299297 -178239 -276744
7790 -276744 -246777 25450 268464 70252 42091 48228 -112956 108012 809878 571295
7780E71295k36655o2131K0048j0719q4651j1719J70605q655l85783J40085j31674
7769b9954N6660J08711J89577J84100K0568L8738j7379j94785R7481k09207l45962
7758a01452M11874q786k66917J13991k1976j88718L40579L64513m82184q5476
7748G5448J94434m306l8667l49153N11533l1082k36429J06710K38777K96899j63380
7737F00784j36221j43134l5718k84437J95079N79542j86874L3762o5998l60346
7727A96439j00102P8332q5858L58476r0902K82003j16285l54114L87523o3565
7717D91947m01975O3746p1478r7319J70258K43810L21932K27333P9292m24993
7707F02553j69704K5876J58792l3551O4895j65265Q1292R4466k15490J08297k69612
$$ plain form
7780 571295 334640 272509 292557 281838 197187 185468 356073 347418 -38365 101720 -29954
7769 -29954 26706 135417 324994 509094 529662 568400 551021 356236 453717 244510 -101452
7758 -101452 310422 301636 34719 148710 126734 -61984 278595 643108 160924 75448
7748 75448 269882 265576 226909 -122244 389289 358207 121778 228488 467265 764164 600784
7737 600784 464563 321429 285711 1274 196353 775895 589021 622783 556785 196439
7727 196439 96337 174669 88811 447287 356385 638388 522103 167989 555512 491947
7717 491947 89972 153718 82240 -15079 155179 398989 720921 948254 1027546 602553
7707 602553 432849 458725 617517 583966 648861 483596 564888 659354 443864 552161 282549
7696B82549j98496L18069K622l13375L51622K6145j66054j59974N03141J06882
7686G53131j49769K8575J07488N0047L02209J40465j18203m43043J45803J7731
7676H34434k87981k65465n3331P40977j92821J48796l23417K58962J7968O0537
7666I38659m46660j82514m2675M43565j171L51124l0647m49730j56686J14698
7656E37963P7824J78120R4773j10633L60275o07977j6260O39737o6157O7670L29535
7645A484870J51018n57928o5477K00653k34407J23304K05382j09859Q9075O4728
7635A351359n49506L67747J17252J64079K7373j64381K73095J89913k23850n6082
7625A496999k67084O00663J34759j17369r0438l3151k9060K85206J28719l1888
$$ plain form
7696 282549 84053 402122 404744 91369 442991 469136 303082 143108 646249 753131
7686 753131 603362 631937 739425 789472 1091681 1232146 1113943 670900 816703 834434
7676 834434 546453 280988 227657 968634 775813 924609 601192 860154 878122 938659
7666 938659 491999 309485 266810 710375 709204 1060328 1029681 579951 423265 537963
7656 537963 615787 793907 888680 778047 1138322 530345 514085 1153822 1087665 1155335 1484870
7645 1484870 1635888 1077960 1012483 1213136 978729 1102033 1307415 1197556 1286631 1351359
7635 1351359 801853 1169600 1286852 1450931 1478304 1313923 1587018 1776931 1553081 1496999
7625 1496999 1229915 1830578 1965337 1847968 1757530 1724379 1695319 1980525 2109244 2077356
7615B077356L80055K25102m07511k3904m19695K56958K22134J78733K14081l28584
7605B374725L31275M2021j06258J06813j10430J49567J13902M38482N49732l38005
7595C551824k14228m26812K13367K46326K23214j86441K64359j5878J31429m5215
7585C741945K58720K67814M12188K27851l85556K63603J10351K06411J48217K40280
7575E491824J7735J06163n45M8246L56110M29922J57516K23724M6083O89830K18984
7564G785592J56816K35915P94215M08550P8654N16977N87751M23585N28469N85601
7554A2102125Q71544Q88358P59700J286824J419487J281662J431423J843223J971694
7545B3856040K052513K109211K399876K200326J271057O11588j216702k184441
$$ plain form
7615 2077356 2457411 2682513 2275002 2251098 1831403 2088361 2310495 2489228 2703309 2374725
7605 2374725 2706000 2748021 2641763 2748576 2638146 2787713 2901615 3340097 3889829 3551824
7595 3551824 3337596 2910784 3124151 3370477 3593691 3407250 3671609 3655731 3787160 3741945
7585 3741945 4000665 4268479 4680667 4908518 4522962 4786565 4896916 5103327 5251544 5491824
7575 5491824 5509559 5615722 5615177 5663423 6019533 6449455 6606971 6830695 6876778 7566608 7785592
7564 7785592 7942408 8178323 8972538 9381088 9459742 9976719 10564470 10988055 11516524 12102125
7554 12102125 12973669 13862027 14621727 15908551 17328038 18609700 20041123 21884346 23856040
7545 23856040 25908553 28017764 30417640 32617966 33889023 34500611 33283909 31099468
7537C1099468j959172j967911j720742j291182n93190o78827m37196k74284P6389
7528B2253353P19091R43849P57505J266669R53724J409570J771414K148824K054922
7519C4278921K250980K550376L211194L326279M437594N328963N773790O714168
7511F7872265O720095O618204N350347J286149l559377p109969p574999o962248
7503F2640467o407270o247149m746899l711465l092381k127206j332161q86807
7495C4089129q86583j86348K28377N41988O47013J309049J116136J575967J957158
7486D0391886K077275K283718K764194L390983M225916N331458N458412O420214
7478G2344056O652928N658685K083841k913429o757705p948616p400112p502505
$$ plain form
7537 31099468 29140296 27172385 25451643 24160461 23567271 22888444 22451248 22176964 22253353
7528 22253353 22972444 23916293 24673798 25940467 26894191 28303761 30075175 32223999 34278921
7519 34278921 36529901 39080277 42291471 45617750 50055344 55384307 61158097 67872265
7511 67872265 74592360 81210564 86560911 87847060 84287683 77177714 69602715 62640467
7503 62640467 56233197 49986048 45239149 41527684 38435303 36308097 34975936 34089129
7495 34089129 33202546 33016198 33244575 33786563 34433576 35742625 36858761 38434728 40391886
7486 40391886 42469161 44752879 47517073 50908056 55133972 60465430 65923842 72344056
7478 72344056 78996984 84655669 86739510 83826081 77068376 69119760 61719648 54217143
7470E4217143o519621o156653m596907l536598l072750k086571j772333j449264
7462B5026446j198700r00668p13215J34979l77469n73732K25683L82685K18676
7453B2224685N58910M99757J026899P66344J499876J340921J193072K082050K045609
7444C3238123R77867o19050k387616l084592k863454k687446k213197k082714
7436A8277921k001667j651838j389087j093992n32308q91559o35684q36665m42065
7427H803056l71629l04871m91286k28787l54899k76557l07401j819k0296k5398
7417F420113m85806j55896j56844j00379j67891k95773n32130r0660K40703l11289
7407D364148l28812p65446N5947K22836r8121M72937j02185k84652O0971k06833
$$ plain form
7470 54217143 47697522 41540869 36943962 33407364 30334614 28248043 26475710 25026446
7462 25026446 23827746 22927078 22213863 22348842 21971373 21397641 21623324 22006009 22224685
7453 22224685 22783595 23283352 24310251 25076595 26576471 27917392 29110464 31192514 33238123
7444 33238123 34215990 33596940 31209324 28124732 25261278 22573832 20360635 18277921
7436 18277921 16276254 14624416 13235329 12141337 11609029 10717470 10081786 9245121 8803056
7427 8803056 8431427 8126556 7635270 7406483 7051584 6775027 6467626 6465807 6445511 6420113
7417 6420113 5934307 5778411 5621567 5521188 5353297 5057524 4525394 4434734 4675437 4364148
7407 4364148 4035336 3269890 3325837 3548673 3450552 3923489 3821304 3536652 3597623 3390790
7397C390790l15655N6863k5835k93154j01822k48053K53745L97943K23281l54178
7387B983925m14365R5486l39755R1787q6038K912M1915q6918j54658k86843J23295
7376A970743M33518l11471k38429J11623l7965j88863M29166J11486k5243J50303
7366B404868l32854n72484j68048O89820j10325j27735P2201J25738j94170n69871
7356A217140K23389K81274j85968J20881j75036p0097J03946J55972O2035k40634
7346A492902j66671k07321M1045j26627J17824Q6840k72713j50173N4659J75026
7336A044791j49538J72575R7641j17471o12989j09776J27839N2374L61561j04687
7326G62320J70843m76056l24033N01799K62081o3457m80865k00680K41961J30962
$$ plain form
7397 3390790 3075135 3131998 3106163 2813009 2711187 2463134 2716879 3114822 3338103 2983925
7387 2983925 2569560 2665046 2325291 2417078 2331040 2333952 2375867 2288949 2134291 1847448 1970743
7376 1970743 2404261 2092790 1854361 1965984 1928019 1739156 2168322 2279808 2254565 2404868
7366 2404868 2072014 1499530 1331482 2021302 1910977 1783242 1855443 1981181 1787011 1217140
7356 1217140 1440529 1721803 1535835 1656716 1481680 1411583 1515529 1671501 1733536 1492902
7346 1492902 1326231 1118910 1159955 1033328 1151152 1237992 965279 815106 869765 1044791
7336 1044791 895253 1067828 1165469 1047998 435009 325233 453072 505446 867007 762320
7326 762320 933163 457107 133074 634873 896954 833497 352632 151952 393913 524875
7316E24875m9960J01764j76895l0135L8455N04881K63030n31609r8998O84703
7306A230111k64887J31332j41037m00936l392K74064l57331j36389J78705K7611
7296E37851k71399j36522K63553j94062j79586j09218N15087K57570l50486K60334
7286E93122J26788k80325J51776j83644l28689K0178J78658Q3607m31267K99717
7276B29921K89735J304n2518O7594j48704k3269j00057K6944N8357L22550j18560
7265E53297o2473m25093k47483K73864J4977L26387k45865Q1637j66736K00316
7255C02828J46633n5295j40749j98245M47563J23407N2502l40684k78368J53012
7245B12604J08553M6963j40762j91870q5793J79243m25561K43068J62939q3150
$$ plain form
7316 524875 474915 576679 399784 369649 408104 912985 1176015 644406 545408 1230111
7306 1230111 965224 1096556 955519 554583 551191 825255 467924 331535 510240 537851
7296 537851 266452 129930 393483 199421 19835 -89383 425704 683274 332788 593122
7286 593122 719910 439585 591361 407717 79028 99206 277864 361471 -69796 229921
7276 229921 519656 520960 468442 536036 387332 364063 264006 290950 349307 671857 553297
7265 553297 490824 65731 -181752 92112 107089 433476 187611 269248 102512 302828
7255 302828 449461 394166 253417 55172 502735 626142 678644 337960 59592 212604
7245 212604 321157 368120 227358 35488 -50305 128938 -296623 -53555 109384 26234
7235B6234J08297M35268l32059j83271j90919k94565J66637O84394l60J11800
7225E31456l70986N9771k80874K13406N5262o13037O5463K93736L83412p1906
7215B65703k96948j59714J44123J03345l90378J43149K25330M4674r0650M1634
7205C0268P9028K39476K95581K00957j48332l07112J28557j38936p4024k87005
7195A8458j88154M31959M7642j17455J95529k14883L7758K38290j22393l96145
7185f9394L33105J20678k73995n4722L39902K10143K96207J30573l89725l63271
7175B79501R0024J01832M13084p3200o2870m28363m04855k7740L94066L88397
7165F69876O2376n31038O8983N2094K98744K00423k39245k33480Q6858J78944
$$ plain form
7235 26234 134531 569799 237740 54469 -136450 -431015 -264378 420016 419656 531456
7225 531456 160470 220241 -60633 152773 208035 -405002 -339539 -45803 337609 265703
7215 265703 -31245 -190959 -46836 56509 -333869 -190720 34610 79284 -11366 30268
7205 30268 109296 348772 644353 845310 696978 389866 518423 379487 305463 18458
7195 18458 -169696 262263 309905 192450 387979 173096 210854 449144 326751 -69394
7185 -69394 263711 384389 110394 55672 395574 605717 901924 1032497 642772 279501
7175 279501 369525 471357 884441 811241 748371 320008 -84847 -112587 281479 669876
7165 669876 732252 201214 270197 322291 621035 821458 582213 348733 435591 614535
7155F14535q5720q6524O4200l36199n02327q6035J89821O08997J50332J36370
7145F67450n4152j03344N7961K41191k60659J5387j05687j46948l60163k25481
7135b74445N03745Q1277l10945K28546l90k45649J9033J7010k69957L25597o4046
7124I776l62787J82193N40741j45493k66196N8429k92669L86020K2607l83895
7114b51274J6073K13562n9618j07119O86609j32633J4379p3079L9600Q4254l61957
7103F8797L99081R3607m65774k48543M48503l5893j76867j41723J38361J83204
7093B62753J91803j56239n1842j56404J7623M63035j30889k33588j19813L9287
7083A25726l964J70383L65249j48447j47723k45510M62548k37982P0459J88054
$$ plain form
7155 614535 528815 442291 506491 170292 -332035 -418070 -228249 380748 531080 667450
7145 667450 613298 509954 567915 809106 548447 563834 458147 311199 -48964 -274445
7135 -274445 229300 310577 -368 228178 227788 -17861 1172 18182 -251775 73822 9776
7124 9776 -353011 -170818 369923 224430 -41766 16663 -276006 110014 132621 -251274
7114 -251274 -235201 -21639 -81257 -188376 498233 365600 379979 306900 346500 430754 68797
7103 68797 467878 561485 95711 -152832 295671 259778 82911 -58812 79549 262753
7093 262753 454556 298317 246475 90071 107694 570729 439840 206252 86439 125726
7083 125726 121762 292145 657394 508947 361224 115714 578262 340280 410739 598793
7073E98793m05675K35528j61964Q0058L39537Q6634n4039m33989M7990M24396
7063G57269l51635k79502J66446O200M60193l64484r675k51813M39854j17701
7053D55152k35319L30707L89N6950J29591J05395l25905L86160J52072K66763
7043A321955J20502k13978j75530L8710K60170L92503j89172K37768J85103K25080
7033B203111k14076l44855l12799N4517L05998J03333k74914J210l00769k98742
7023I22014J07361m29521L04780l73084k65454K66312N0582N087K0724O19703
7013A228504l9932k24263k70628J4759J66640l39721J07108K67118j80475n6952
7003F72158l49853O38822L9420o9371J64079k67873k85640l0449M2408N50165
$$ plain form
7073 598793 193118 428646 266682 346740 686277 772911 718872 284883 332873 757269
7063 757269 405634 126132 292578 298778 758971 394487 384812 132999 572853 455152
7053 455152 219833 550540 550929 607879 737470 842865 516960 903120 1055192 1321955
7043 1321955 1442457 1228479 1052949 1091659 1351829 1744332 1555160 1792928 1978031 2203111
7033 2203111 1989035 1644180 1331381 1385898 1691896 1795229 1520315 1521525 1220756 922014
7023 922014 1029375 599854 904634 531550 266096 532408 582990 588077 608801 1228504
7013 1228504 1188572 964309 693681 708440 875080 535359 642467 909585 729110 672158
7003 672158 322305 961127 1000547 931176 1095255 827382 541742 511293 553701 1103866
6993A103866P6141k60227O9988k91017M4751O0693m03788J75911l4024k49932
6983B92362K49290p7626K05487L20694l69416k6148k8109q563J63321n4280J28971
6972G95983j49118j2181l84886K92591J74918k11657K37689k31381P5873k04686
6962C83145j67101J68168K53747k81978J40392K50096p4900O7319l56576L99128
6952G81440j53410K43868m4245J77698N6658j35981O2443k3289m52018R5927J25484
6941G34575J26213N00276J4972m50082m67760M7258L86700j13970l2508J15543
6931H61217K86900J19985k5318R8656K008k56710l18700J48528q6769J06623J11656
6920A048076J18033M370k52004J18166j91330q0778M2920q1731K26712L42468
$$ plain form
6993 1103866 1180007 919780 989768 698751 743502 804195 400407 576318 542294 292362
6983 292362 541652 464026 669513 990207 620791 594643 566534 557971 721292 667012 795983
6972 795983 646865 634684 249798 542389 717307 505650 743339 511958 587831 383145
6962 383145 216044 384212 637959 355981 496373 746469 671569 738888 382312 781440
6952 781440 628030 871898 827653 1005351 1062009 926028 988471 965182 513164 609091 734575
6941 734575 860788 1361064 1376036 925954 458194 505452 892152 778182 745674 861217
6931 861217 1148117 1268102 1242784 1341440 1343448 1086738 768038 916566 829797 936420 1048076
6920 1048076 1166109 1170479 918475 1036641 845311 764533 807453 725722 952434 1294902
6910A294902J11665j18327L860m1231p2540K66768l11517J53037L87915j15094
6900A559438k94896L56310N5099n07638O5113J75904k76678k04011J79388L11245
6890A419274O8883m05508J7165J21017K63088J09749N07567m25340k57491k6922
6880A391482J64811N41239j30737r2630M13591j80239l06240J32844K2093l26680
6870A629534o2698L18471M54854k10917K2002r3714k97798J33736l09072N98571
6860B182969L58956l88133n0761o4233K33517j09735o0477K24237k65893J00034
6850B160481L67256L37316M1291J15366J49096m8688L6467j37K08004J79054l34830
6839C210676k61911K91402J55167J90958j49622M82149J03328j15419L26837L87057
$$ plain form
6910 1294902 1406567 1288240 1292100 1250869 1178329 1445097 1133580 1286617 1674532 1559438
6900 1559438 1264542 1620852 1675951 1168313 1233426 1409330 1132652 928641 1108029 1419274
6890 1419274 1488157 1082649 1099814 1220831 1483919 1593668 2101235 1675895 1418404 1391482
6880 1391482 1556293 2097532 1966795 1874165 2287756 2107517 1801277 1934121 1956214 1629534
6870 1629534 1566836 1885307 2340161 2129244 2151246 2057532 1759734 1893470 1584398 2182969
6860 2182969 2541925 2153792 2103031 2038798 2272315 2162580 2102103 2326340 2060447 2160481
6850 2160481 2527737 2865053 2906344 3021710 3170806 3122118 3158585 3158448 3366452 3545506 3210676
6839 3210676 2948765 3240167 3395334 3586292 3436670 3918819 4022147 3906728 4233565 4620622
6829D620622L81680K09906j81831K69559J61785p2160M16915J36583p1910j31553
6819E739596K50338M38588M56040K45391M86398m20601N4606K97940K88246M40556
6809H277098J30290Q1229N18099Q5603j40229M327l9191N36562n547L58892k73395
6798I533738M09134L94010J20159K08711K7077N94053j14013M55138N33281K32767
6788A2394055M01142L10889N42410R56183L60344M5861O31029N58918Q93279M27092
6778A7521202N13291N50730Q28022J029617R49295J246963J096492J150226J053556
6769B5939394J913254J525806J660386J742865K622313K612452K807162K912119
6761D3735751L649313L925342M517026N368297N705282O731309P976887Q910154
$$ plain form
6829 4620622 5002302 5212208 5030377 5299936 5461721 5389561 5806476 5943059 5871149 5739596
6819 5739596 5989934 6428522 6884562 7129953 7616351 7195750 7250356 7548296 7836542 8277098
6809 8277098 8407388 8488617 9006716 9092319 8952090 8956417 8917226 9453788 9448241 9807133 9533738
6798 9533738 9942872 10336882 10457041 10665752 10692829 11286882 11172869 11628007 12161288 12394055
6788 12394055 12795197 13106086 13648496 14604679 14965023 15010884 15641913 16200831 17094110 17521202
6778 17521202 18034493 18585223 19413245 20442862 21392157 22639120 23735612 24885838 25939394
6769 25939394 27852648 29378454 31038840 32781705 35404018 38016470 40823632 43735751
6761 43735751 47385064 51310406 55827432 61195729 66901011 73632320 81609207 90519361
6753I0519361J0546653J2439361J3622795J5671681J7951485J8213929J6581282
6746A95546547J0777346L49155r918830j7229755k0136114j9269786j7972984
6739A22145579j5900135j3819197j1128639q758273o663254m908263m849009l005839
6731E3112970k456025j736921j592919q19403m85694k87609J83878O99109Q32220
6722D7449606J100766R55461O23339j091336k686542l631905l373069l332914
6714C6013406l441527k788078l195406k411618j836855j774063j272503j300798
6706A7992558j068189n45037p99827j106542r05784m06721n66069j03749m67966
6697A2022674o88209m62502k92603k29257o46795m04760m27647k4111m42765l23331
$$ plain form
6753 90519361 101066014 113505375 127128170 142799851 160751336 178965265 195546547
6746 195546547 206323893 206673048 196754218 179524463 159388349 140118563 122145579
6739 122145579 106245444 92426247 81297608 72539335 65876081 60967818 56118809 53112970
6731 53112970 50656945 48920024 47327105 46507702 46022008 45734399 45918277 46617386 47449606
6722 47449606 48550372 49505833 50129172 49037836 46351294 42719389 39346320 36013406
6714 36013406 32571879 29783801 26588395 24176777 22339922 20565859 19293356 17992558
6706 17992558 16924369 16379332 15579505 14472963 13567179 13160458 12594389 12490640 12022674
6697 12022674 11334465 10871963 10579360 10350103 9703308 9298548 8870901 8846790 8404025 8080694
6687H080694k01867l11808k70659K4286j29588k95074l78614n9734J7928r0093
6677F385471j48076m04895l08761J24296k22704m20116J46867k45422k49420O9398
6667D726638l29516k07065m250n630j26283k04435p3256j49073k659k87022J23910
6656C461359J89505q447q5640m64065P0917j19576m34945M5500j68806K07579
6646B693381P3782j86191l24259K41402J05046j75878L644P5418m36409m4931
6636B025005j96356L02827m78465p2273N03362r1943l88494k38646K44723J23834
6626A733574k48216j03967K54197r2399k56907k4887L59101l91521k63716K9670
6616I94929M02508k3732K7189K53944j53502j81896q0933k00324K9960J54921
$$ plain form
6687 8080694 7878827 7567019 7296360 7320646 7191058 6895984 6517370 6457636 6475564 6385471
6677 6385471 6237395 5832500 5523739 5648035 5425331 5005215 5152082 4906660 4657240 4726638
6667 4726638 4397122 4190057 4185807 4180177 4053894 3849459 3776203 3627130 3624471 3337449 3461359
6656 3461359 3650864 3642417 3556777 3092712 3163629 3044053 2609108 2654608 2485802 2693381
6646 2693381 2767163 2580972 2256713 2498115 2603161 2427283 2430927 2506345 2069936 2025005
6636 2025005 1828649 2131476 1653011 1580738 2084100 1992157 1603663 1365017 1609740 1733574
6626 1733574 1485358 1381391 1635588 1543189 1286282 1261395 1620496 1228975 965259 994929
6616 994929 1397437 1373705 1400894 1654838 1501336 1319440 1238507 1038183 1068143 1223064
6606A223064M00404J56486l23746j78109k89114l9819p7846J55581k04102K38590
6596A061389k33470l56394J21416j54682L54022k02498r4887J96596J22852k3131
6586G91213J27885r0507l39339l9764J69272N06j43358r4135K73058j60577R6294
6575E90548L97778M1842r526r1026l49399j39207K37374M40057l39158k07553
6565E71730r0960j87150J65783j09616J32963N23136l07934l09633N0450j8164
6555D20605J09575K18992q1993m83305L18935l11645K4304L09508Q500k55957
6545B77519k87803J65290k94391N2724O8390K62806L03320m1393K10604j33487
6535E83579k07793l97018K02594L2890o7061J16755M20420k88042k65925J00417
$$ plain form
6606 1223064 1623468 1779954 1456208 1278099 988985 949166 871320 1026901 822799 1061389
6596 1061389 827919 471525 592941 438259 792281 589783 494896 691492 814344 791213
6586 791213 919098 828591 489252 449488 618760 619266 475908 381773 654831 494254 590548
6575 590548 988326 1030168 1020642 929616 580217 441010 678384 1118441 779283 571730
6565 571730 480770 293620 459403 349787 482750 1005886 697952 388319 438769 420605
6555 420605 530180 749172 667179 183874 502809 191164 215468 524976 533476 277519
6545 277519 -10284 155006 -139385 -86661 -18271 244535 547855 506462 717066 583579
6535 583579 375786 -21232 181362 214252 147191 263946 684366 396324 130399 230816
6525B30816p6861m74702r6655M16229l43645R2556L79488L08426P3890n7219n70607
6514a18284j92630N45701p7667K87338R2460o2098R5805l86473J0448q0035n815
6503A08750J40584K41982K02483J5630l71531J78272j72136p6123K09894k31379
6493B46426l70377L49955l70443r9047j86207L28139K71082l8234J72805k87593
6483A6506N9093J8381N9854J24445K45321M94863l02640p07999k1842M24138K15575
6472F25695l84132j24739K77864L21139p8232k37305k18408L24913j28377N255
6462C83673l58064j04460O37844N80776j99972j41472J75341J04320n92685K2135
6452E07436K90757O9717k8763m8947K05524Q1251l54597k51227m0017k73687M2045
$$ plain form
6525 230816 153955 -320747 -417402 -1173 -344818 -252262 127226 435652 509542 452323 -118284
6514 -118284 -310914 234787 157120 444458 536918 474820 570625 184152 194600 114565 108750
6503 108750 249334 491316 693799 709429 337898 516170 344034 267911 477805 246426
6493 246426 -123951 226004 -144439 -243486 -429693 -101554 169528 131294 304099 16506
6483 16506 75599 93980 153834 278279 523600 1018463 715823 7824 -14018 410120 625695
6472 625695 241563 116824 394688 715827 637595 400290 181882 506795 378418 383673
6462 383673 25609 -78851 558993 1139769 939797 798325 973666 1077986 485301 507436
6452 507436 798193 867910 839147 790200 995724 1076975 722378 471151 431134 157447 199492
6441A99492M24872Q3964k95851l7353m7077M5819j57729K55971l0430J69033k23650
6430C87061l12904j20090j13346m1043L24789R6714k24882K4581K13779K81728
6420E16387m97771J35283M3376m33440j8077M23291j04697J10417N5614o00032
6410c69649L97447L51456j53217K6137R7361K84010j54248k18468j69076k013
6400H9740K46469L2326m86487J63904L07915k64750j08753j39779p3377M00876
6390A68084k46432m44885O2877M77283L7407J33357j20387j23667P5195j78563
6380a59731k18184K78284j67237j25716N38191L4986J3646j24825R4045j34216
6370B9243m6591m8518K15990k11961K06821J38641j73928o5051J64960l06839
$$ plain form
6441 199492 624364 708328 412477 375124 328047 373866 216137 472108 441678 610711 387061
6430 387061 74157 -45933 -159279 -200322 124467 221181 -3701 20880 234659 516387
6420 516387 18616 153899 197275 -236165 -254242 169049 64352 174769 230383 -369649
6410 -369649 27798 379254 226037 252174 349535 633545 479297 260829 91753 89740
6400 89740 336209 368535 -117952 45952 353867 89117 -19636 -159415 -232792 168084
6390 168084 -78348 -523233 -460356 16927 54334 187691 67304 -56363 18832 -159731
6380 -159731 -377915 -99631 -266868 -392584 145607 180593 194239 69414 163459 29243
6370 29243 -17348 -65866 150124 -61837 144984 283625 109697 44646 209606 -97233
6360i7233J60218L14966m5966K79974k19992j03119l51964k40131m0731J86787
6350a57191m6331j93435j71306K36189J19175l45996N7204L37513L25353n57500
6340c96325J90850J32544R2990j55340J42101n1812j2286M82179j40942L8807
6330C22766k53866j68633K09552r6618M2839k87823k2756K03145k43133N0894
6320b43633K25360m4786j64705J23228J54014l97504k12684K52761L17192J27737
6310A36980l44290o1718Q8574J39396J10808k95888k61743J19314m8009n3394
6300d69970L24008j19590K59696j7784J39003R5j55819J83345k78851q1559j07473
6289c24899J64212J08315M98428K7150m37759j2831O1719N7014j62653m31314
$$ plain form
6360 -97233 62985 377951 331985 611959 391967 288848 -63116 -303247 -343978 -157191
6350 -157191 -203522 -396957 -568263 -332074 -212899 -558895 -501691 -164178 161175 -396325
6340 -396325 -205475 -72931 20059 -135281 6820 -44992 -57278 424901 283959 322766
6330 322766 68900 -99733 109819 13201 56040 -231783 -254539 -51394 -294527 -243633
6320 -243633 -18273 -63059 -227764 -104536 49478 -348026 -560710 -307949 9243 136980
6310 136980 -207310 -269028 -180454 -41058 69750 -226138 -487881 -368567 -416576 -469970
6300 -469970 -145962 -265552 -5856 -23640 115363 115458 -40361 142984 -135867 -217426 -324899
6289 -324899 -160687 -52372 446056 473206 35447 22616 84335 141349 -21304 -452618
6279d52618j36173k7661K318j41208R1041M41r6366j3732j9953N85841M28281
6268B20211k02087m8700K85595j1650n34218m12704Q573K94713K06116K58057
6258F3906k22309m3848j98377J27853K07546N3145Q7589m3565m7678k52426l691
6247b71855l664l6295K84808N04114k01837j56150q5194j46098K89128k88100
6237a11143l15244J05374K5483J23417K05256J46690j77687k36536j66957k3786
6227d25133J35551O6116K39750J3872p014j60910N7431k85969r3162K21468Q3941
6216a54059K92900M70339m97180k25111J90287j029M2829l8461r8336k5181J08361
6205F5359K52192j99769l74528K02344J01975P1463j95065j59184p1122L26734
$$ plain form
6279 -452618 -588791 -616452 -614134 -755342 -664301 -663860 -760226 -773958 -793911 -208070 220211
6268 220211 18124 -30576 255019 243369 -290849 -703553 -694980 -400267 -194151 63906
6258 63906 -158403 -202251 -400628 -272775 -65229 -12084 75505 31940 -15738 -268164 -271855
6247 -271855 -275519 -311814 -27006 477108 275271 119121 33927 -112171 176957 -111143
6237 -111143 -426387 -321013 -295530 -172113 33143 179833 2146 -234390 -401347 -425133
6227 -425133 -289582 -223466 16284 30156 23142 -137768 -80337 -366306 -459468 -238000 -154059
6216 -154059 138841 609180 112000 -113111 77176 76147 118976 80515 -17821 -43002 65359
6205 65359 317551 117782 -256746 -54402 47573 119036 -76029 -235213 -306335 20399
6195B0399k56725l69153M58041J57947l27652r2545L67947J90038J81626j51270
6185A78653j44575K43473n20807K43122k86681K00355k7044k53241L34425J23375
6175I1055K7119k93253J98712K05561l33148J46463k2064N14133O0927m15036
6165A80469k43455Q3886K09611K39471m37182M3981l3869j74604N64428K48711
6155F81447o8524l62434m4645k91192j3833L19785J23576k40891J30831r8656
6145A35464o7547k91139p57L07322J05023j70373k99466J07677K43678j37680
6135f7798j42842l1483n833M8222L03522K5741K07877q8526l60800K29037J39835
6124B56952n9276M7572k93325J84284J94274q4440J42368N5606l6326n8601J92479
$$ plain form
6195 20399 -236326 -605479 -147438 10509 -317143 -409688 -41741 148297 329923 178653
6185 178653 34078 277551 -243256 -134 -286815 -86460 -113504 -366745 -32320 91055
6175 91055 118174 -175079 23633 229194 -103954 42509 20445 534578 595505 180469
6165 180469 -62986 20900 230511 469982 32800 76781 42912 -131692 432736 681447
6155 681447 612923 250489 205844 -85348 -99181 220604 344180 103289 234120 135464
6145 135464 67917 -223222 -223979 83343 188366 17993 -281473 -173796 69882 -67798
6135 -67798 -210640 -242123 -247956 -199734 103788 129529 337406 248880 -111920 117117 256952
6124 256952 197676 245248 -48077 136207 330481 246041 388409 444015 407689 349088 541567
6113E41567L21046K73668J18580j02687j27799k347K14720L9014k02797K50409
6103A323374j45821m13526M2287m1565o0454J48707n60372j39670J51749O1943
6093C66652M32083m49131m80123K68791k20273K0954K45032K57610K13422K77256
6083I32273J09206N4652M8179K2863L8519n3356J60733K00386q8930K77952L04090
6072B006567L5044K28857n32886L0970p4083P5988n87094l90035k12246K42502
6062H23584j39102j47725P1380m96723j7412q168J30341k11895J29573n5116l1334
6051D7403J50329K64013k89443R9407J48865K50368R5420j96654m13102l51359
6041a94753L2399j01753K434N94956K17328k80986l33611k00296o4496o4689M54367
$$ plain form
6113 541567 862613 1136281 1254861 1152174 1024375 1022028 1236748 1275762 1072965 1323374
6103 1323374 1177553 764027 806314 764749 704295 853002 292630 152960 304709 366652
6093 366652 798735 349604 -130519 138272 -82001 -61047 183985 441595 655017 932273
6083 932273 1041479 1096131 1144310 1167173 1205692 1152336 1313069 1513455 1424525 1702477 2006567
6072 2006567 2041611 2270468 1737582 1768552 1694469 1770457 1183363 793328 581082 823584
6062 823584 684482 536757 608137 111414 94002 85834 216175 4280 133853 78737 47403
6051 47403 197732 461745 172302 271709 420574 670942 766362 569708 156606 -194753
6041 -194753 -162354 -264107 -261673 333283 550611 269625 -63986 -264282 -328778 -393467 60900
6030F0900J5912q2048k197J23639Q9638L15574P2422l97301j75077P4711K51918
6019C48091j53835k54568K99720p8880j78277K03817j69170p5564O9507k26627
6009b15786K48687K75641K3369j84571k72917R8091K25888J05234R557m08530
5999i5337k77756M57837J16299M7801J38767K08662k47066l79991K40229K30922
5989D40367k8523J01941j63347p9182m881Q3859m1055P0377k11978j4123K39132
5978C92587n7704J1342l24750N26272L29436m9759l88530l55223l02411J34662
5968h4078n2347n7131k35291M08792L25526J42210j7306p4237Q4346q9215k88454
5957F2815q5563L12797L18975n1686n1402L30373k49579L5019P4214m41116l18379
$$ plain form
6030 60900 76812 -5236 -7433 116206 205844 521418 593840 196539 21462 96173 348091
6019 348091 194256 -60312 239408 160528 -17749 186068 16898 -58666 10841 -215786
6009 -215786 32901 308542 331911 147340 -125577 -27486 198402 303636 313193 -95337
5999 -95337 -373093 84744 201043 248844 387611 596273 349207 -30784 209445 440367
5989 440367 411844 513785 350438 271256 266375 350234 309179 379556 167578 153455 392587
5978 392587 334883 346225 21475 547747 877183 827424 438894 83671 -218740 -84078
5968 -84078 -136425 -193556 -428847 -20055 305471 447681 430375 356138 440484 351269 62815
5957 62815 -22748 290049 609024 557338 505936 836309 586730 621749 695963 254847 -63532
5946f3532N29450L39495J1157J31663k72013J8239N8537m0105J05094p2600N68666
5935A314051n9511j14855M4602M13685j6392j53440r1088m2984N81644K53517
5925B129229K84993J88538K06274L08205J01748N7634L68939K68851O12791P45003
5915E272205N77533M15615m25446P5038l9641m60427m12350j25632k66817n23276
5905D086802j09542J19754l5677n18488j45229k25950k32724K66468N54788J29112
5895C889314k49578L07941M88787M52400J97368O25431l12991n7343J1209K10329
5885E562867p7553k93206J27892l65915r0066J89080o88555l4311j71424n06727
5875C652082j95070J0013l71106k54341J28386n47371j90266j08195n6301j25563
$$ plain form
5946 -63532 465918 805413 816570 948233 676220 694459 752996 712891 817985 745385 1314051
5935 1314051 1254540 1139685 1184287 1597972 1581580 1428140 1337052 1294068 1875712 2129229
5925 2129229 2414222 2602760 2809034 3117239 3218987 3276621 3645560 3914411 4527202 5272205
5915 5272205 5849738 6265353 5839907 5914945 5875304 5414877 5002527 4876895 4610078 4086802
5905 4086802 3977260 4097014 4061337 3542849 3397620 3171670 2938946 3205414 3760202 3889314
5895 3889314 3639736 3947677 4436464 4888864 5086232 5711663 5398672 5341329 5352538 5562867
5885 5562867 5485314 5192108 5320000 4954085 4864019 5053099 4364544 4330233 4158809 3652082
5875 3652082 3457012 3467025 3095919 2841578 2969964 2422593 2232327 2124132 2067831 1942268
5865A942268o8056K8383J87674J28032m0323k67198K81020K20249M69896o5154
5855B816791j34524N5706M89254j01868l21712r7490l7124j60554m59812l55876
5845A692791k31021l53443r8794L88942l17743M95580M3477k80944k08564l13804
5835H16477j84916K70708p9973n2596n42777m0723K26074l16674M15258K17365
5825G28223L33883l93652j26742K93049k43790K88416J04061k58003M4127R1436
5815H61008L0839k21342K17476L66795J27773q25093k10480K97269k1967m1628
5805E80650K53233l50811j07175j55236j18391J24029N71353J0202R2660k19207
5795F81307j89189l02809p4993M20496p873O7951J9123Q8379L667k98898l44624
$$ plain form
5865 1942268 1874212 1902595 2090269 2218301 2177978 1910780 2191800 2412049 2881945 2816791
5855 2816791 2682267 2737973 3227227 3125359 2803647 2706157 2669033 2508479 2048667 1692791
5845 1692791 1461770 1108327 1009533 1398475 1080732 1576312 1619789 1338845 1130281 816477
5835 816477 631561 902269 822296 769700 226923 186200 412274 95600 510858 728223
5825 728223 1062106 668454 541712 834761 590971 879387 983448 725445 769572 861008
5815 861008 891847 670505 887981 1254776 1382549 557456 346976 644245 622278 580650
5805 580650 833883 483072 375897 220661 102270 226299 797652 807854 900514 681307
5795 681307 492118 189309 114316 534812 526939 594890 614013 702392 706059 407161 62537
5784F2537j29696n5744M91113M03954j56182J14439Q8043N8224K50116n49373
5774E77431j13195J3418K57939L86945p75301K05493R9085K68156K83711j80555
5764A023127J43832O42046l255m13463j07548N02642J39290J26475J76586K08941
5754B438673L7191j47825n4045k17294K10728l06486p0325k53453J78796j11603
5744A704357j44864n39096j35282R9086L41216m75332J98075K47314j31916j97988
5734I65570l05805k26895J3847K61084J91555j24258k25871J57248j79559J68915
5724F95831L83262l72533j44198J25890K8610k65607L93234K35327n5305N9530
5714A084041O20785m31355q0712n859k4094K09782k90416l0279O6204J85176k61588
$$ plain form
5784 62537 -67159 -122903 368210 772164 615982 730421 818464 876688 1126804 577431
5774 577431 464236 477654 735593 1122538 347237 552730 651815 919971 1203682 1023127
5764 1023127 1166959 1809005 1805750 1392287 1284739 1787381 1926671 2053146 2229732 2438673
5754 2438673 2475864 2328039 2273994 2056700 2267428 1960942 1890617 1637164 1815960 1704357
5744 1704357 1559493 1020397 885115 984201 1325417 850085 1048160 1295474 1163558 965570
5734 965570 659765 432870 446717 707801 899356 775098 549227 706475 526916 695831
5724 695831 1079093 706560 562362 688252 716862 451255 844489 1079816 1024511 1084041
5714 1084041 1704826 1273471 1192759 1186900 1162806 1372588 1082172 1051893 1118097 1303273 1041685
5703A041685j55946K24831J74767K41230K91991j49156m74977Q2429J95112M79684
5693A951650l4921P0868j18612l94119n0683l80787K88866k19883l66625k10350
5683E35404N75018J41153k75588j38738j07438K7952L9894L93082L24851q2270
5673A433320n60392L27797Q066l04609Q6694K44520k0653J59047L93835M3385
5663A811010m0933n11589O0229j82257R6616P8020J37958K8463J85518K0266K74244
5652A957545j28748j9881J66615K30989l48414j45394k91458j99285M05556P5071
5642A702596l28088j43381P6372J5815K71220N5341L48186N3915L53756J23996
5632B529728j02762N4654q7580J70983K27244k7907K91581K82752k5049l9860
$$ plain form
5703 1041685 885739 1110570 1285337 1526567 1818558 1669402 1194425 1276854 1471966 1951650
5693 1951650 1916729 1987597 1868985 1474866 1424183 1043396 1332262 1112379 745754 535404
5683 535404 1110422 1251575 975987 837249 729811 757763 797657 1190739 1515590 1433320
5673 1433320 872928 1200725 1208791 904182 990876 1235396 1214743 1373790 1767625 1811010
5663 1811010 1770077 1258488 1318717 1136460 1233076 1311096 1449054 1477517 1663035 1683301 1957545
5652 1957545 1828797 1808916 1975531 2206520 1858106 1712712 1421254 1221969 1627525 1702596
5642 1702596 1374508 1231127 1307499 1323314 1594534 1649875 1998061 2051976 2405732 2529728
5632 2529728 2426966 2481620 2394040 2565023 2792267 2764360 3055941 3338693 3313644 3273784
5622C273784j20982N29821N24508M08661Q5949O78958Q32136N04633M27397M68432
5612G613297N2196L84168m8369n7033l46779l06120k71179o73123o33041j019887
5602D694130K66931j26583l82224l87035l55034K47635k50625J7428l9291J60065
5592C845397R1304m04503J44039J28561o7648J22285K64369m1584k9986J83994
5582D236228k19580j12215m9114j51106l229j50469o5428L32424K1936j19598
5572C719849K99321R1648J24205j49524K92950N2713k44137M02422J85420j73364
5562D601503J24415K51933O03769O3742n0428L55301P32260Q97228J74055M55020
5552H208798L80478M51392q6932o549L79425k93450k26968J11860j02360q684
$$ plain form
5622 3273784 3152802 3682623 4207131 4615792 4701741 5380699 6212835 6717468 7144865 7613297
5612 7613297 7665493 8049661 8001292 7944259 7597480 7291360 7020181 6347058 5714017 4694130
5602 4694130 4961061 4834478 4452254 4065219 3710185 3957820 3707195 3724623 3685332 3845397
5592 3845397 3936701 3532198 3676237 3804798 3737150 3859435 4123804 4082220 4052234 4236228
5582 4236228 4016648 3904433 3855319 3704213 3700984 3550515 3485087 3817511 3839447 3719849
5572 3719849 4019170 4110818 4235023 4085499 4378449 4431162 4187025 4589447 4774867 4601503
5562 4601503 4725918 4977851 5581620 5645362 5594934 5950235 6682495 7579723 7753778 8208798
5552 8208798 8589276 9040668 8953736 8947187 9326612 9033162 8806194 8918054 8815694 8807010
5542H807010k16776J92161K21319J51099j02398L23386J08728K8316P67430N60651
5532A0840926J65551p9689P31814O2374L50070M58886N27115K45975M04926k57455
5522A3450493Q1060L46488K03866N27690J82854j9139M55259L99153L81364j08814
5512A5900274J120100L96685N34966O51386N14784P07085L59593R04474O20028
5503B1709375J084212P93563O56251O38168P88769J165994J280902J099873J346841
5494C0563948J402683J496639J845456J668254J915315J827644K642560L648094
5486D7010593L114405L125710L814099M601707N410801O083756O945253P726600
5478H7832924P915990R782291J1413230J2851141J5662633J7743400K0791002
$$ plain form
5542 8807010 8590234 8782395 9003714 9154813 9052415 9375801 9484529 9512845 10280275 10840926
5532 10840926 11006477 10926788 11658602 11720976 12071046 12529932 13057047 13303022 13707948 13450493
5522 13450493 13531553 13878041 14081907 14609597 14792451 14773312 15228571 15627724 16009088 15900274
5512 15900274 17020374 17417059 17952025 18603411 19118195 19825280 20184873 21089347 21709375
5503 21709375 22793587 23587150 24243401 24881569 25670338 26836332 28117234 29217107 30563948
5494 30563948 31966631 33463270 35308726 36976980 38892295 40719939 43362499 47010593
5486 47010593 50124998 53250708 57064807 61666514 67077315 73161071 80106324 87832924
5478 87832924 95748914 105531205 116944435 129795576 145458209 163201609 183992611
5471A83992611K3586405K7046552L0920074L2292154K8258623J3889602p187746
5464C32798275k3223093k7721321k6270721k4419646k3946767k4380087k2385997
5457A60450643j9472936j6895450j3693458j1802958r652591p929791p011767
5450G3991692o223307n274723m501763l736496l605887l131580k626335k060383
5442D2831218k602818j951954k056558j923534j450379j992988j278466p94896
5434B8779625j260607j636584p67018j141981j416015j093313j145378n39270
5426A9779459j009810o06783m63236q04527n45993o12774n36481n30764o47556
5417A4021535n14514j73615o8236k57598m05072k58938l11316o20405j90858r4828
$$ plain form
5471 183992611 207579016 234625568 265545642 297837796 326096419 339986021 332798275
5464 332798275 309575182 281853861 255583140 231163494 207216727 182836640 160450643
5457 160450643 140977707 124082257 110388799 98585841 88933250 81003459 73991692
5450 73991692 67768385 62493662 57991899 54255403 50649516 47517936 44891601 42831218
5442 42831218 40228400 38276446 36219888 34296354 32845975 30852987 29574521 28779625
5434 28779625 27519018 25882434 25115416 23973435 22557420 21464107 20318729 19779459
5426 19779459 18769649 18162866 17699630 16895103 16349110 15736336 15199855 14669091 14021535
5417 14021535 13507021 13333406 13265170 13007572 12602500 12343562 12032246 11411841 11220983 11126155
5407A1126155k47431l68722m2853L5983j94689O741J44364p01715L60409r8164
5397A0020078K3182K99259l20585j34319l72879m39511J36593l30897j046209
5388G834712l04383m46711o37249O249N7660k39912m6916m30913k2031k03600
5378E566906P2126k14172j54539o7713o8157J8266k03971k48136j69337m9602
5368D481671K02745n74140j46182N22669m7872k11174k46972P0398N0991l58258
5358C743876l33619N7191J96467j79021J6570j52320n1570J13665m16648k64532
5348B730059o3180J46666J33793j86913j44219K53973Q822j82043l05294K11264
5338B602928J7218J35162L17670m39821M9016l3418Q1625k18044j44993p5831
$$ plain form
5407 11126155 10878724 10510002 10467149 10503132 10308443 10315184 10459548 9757833 10118242 10020078
5397 10020078 10043260 10342519 10021934 9887615 9514736 9075225 9211818 8880921 7834712
5388 7834712 7530329 7083618 6446369 6452618 6510278 6270366 6223450 5792537 5770506 5566906
5378 5566906 5639032 5424860 5270321 5202608 5134451 5152717 4948746 4700610 4531273 4481671
5368 4481671 4684416 4110276 3964094 4486763 4438891 4227717 3980745 4051143 4102134 3743876
5358 3743876 3410257 3467448 3663915 3484894 3501464 3349144 3297574 3411239 2994591 2730059
5348 2730059 2666879 2813545 2947338 2760425 2616206 2870179 2879001 2696958 2391664 2602928
5338 2602928 2620146 2755308 3072978 2633157 2682173 2648755 2730380 2512336 2367343 2291512
5328B291512o7562M6871l20457j788J49026N8133J00254l45222k09951O18061
5318B318877Q2632k84339L34160j67269m11628n4439j37768J38576J12384K17556
5308B148742L9799l78047j12870K53483j08623o18837L80326j77414k7594j69781
5298A229184k9309k88366K57120N05448k48392l1435K55103N0249J00530N0831
5288A850963j98371j07929j19821M8047J82919p6687o7742K16237k52197K9202
5278A504621m42408J2947R920k71097R8238K57097K08320K9257J06357n75848
5268I37404L5139q5848r6124J94262M15448K51604k28485k24278k61537j67138
5258G70447k3568N84000P183k400k48841J37958p1894n1417K515l1397L50821
$$ plain form
5328 2291512 2223950 2270821 1950364 1948576 2097602 2155735 2255989 1910767 1700816 2318877
5318 2318877 2401509 2117170 2451330 2284061 1872433 1817994 1680226 1818802 1931186 2148742
5308 2148742 2188541 1810494 1697624 1951107 1842484 1223647 1603973 1426559 1398965 1229184
5298 1229184 1199875 911509 1168629 1674077 1425685 1394250 1649353 1699602 1800132 1850963
5288 1850963 1652592 1544663 1424842 1472889 1655808 1579121 1511379 1727616 1475419 1504621
5278 1504621 1062213 1075160 1085080 813983 912221 1169318 1377638 1406895 1513252 937404
5268 937404 972543 886695 790571 984833 1400281 1651885 1423400 1199122 937585 770447
5258 770447 746879 1330879 1338062 1335662 1086821 1224779 1152885 1101468 1103983 1072586 1423407
5247A423407K0618k76210R2088l1294m59390J62848L95316R4289P3983o6353k13209
5236A216093P7517K87824J56322k17986j04096p9224O5323M93694L44061R3559
5226B333087j79637j27263J67142j94953k32490j29964L34883L33431q8641j0820
5216B204775k27676j2594n9521L01189N8621J90338L25784K39k41481M7310j6875
5205B570109p3161m10852O32672R1608k30325L50141L60991j4082p216J34124
5195C404009j15693J97J31642j7635K08552N53366K00598P918l94561K26670M20004
5184D625067L74244n6571L20956L81770L56187M72126L88055K96411N84942M69250
5174H212437n1961M11694J48303o4219L28070M77953L57803K33900L52857M06087
$$ plain form
5247 1423407 1444025 1167815 1259903 1228609 769219 932067 1327383 1421672 1495655 1429302 1216093
5236 1216093 1293610 1581434 1737756 1519770 1415674 1336450 1401773 1895467 2239528 2333087
5226 2333087 2153450 2026187 2193329 1998376 1765886 1635922 1970805 2304236 2215595 2204775
5216 2204775 1977099 1964505 1904984 2206173 2264794 2455132 2780916 2781155 2539674 2586984 2570109
5205 2570109 2496948 2086096 2718768 2810376 2580051 2930192 3291183 3277101 3269885 3404009
5195 3404009 3288316 3288513 3420155 3402520 3611072 4164438 4365036 4372954 3978393 4205063 4625067
5184 4625067 4999311 4942740 5263696 5645466 6001653 6473779 6861834 7158245 7743187 8212437
5174 8212437 8160476 8572170 8720473 8656254 8984324 9462277 9820080 10053980 10406837 10812924
5164A0812924P26841J237769R51692J087083J257551J828159J646707K010422
5156B1559148K302846K611040L305746K562966K576423K721286J906032J948832
5148D1494319J725971R23983n69060k337884l441587m527993l984118l910462
5140B5373169l166594k636135j973098j404314j395179j497452o04311j481091
5132A1214995q48547p49703p29716o72381j01592l50514l23150j17197o22786
5123F699409l07183k93005r8606l57367j54088j72629K03354j62617J23655j61077
5113E319846j15657k23781l05366m25690M0265J50134l1488p27701k78494j64178
5103C237890J56384M6005j89031j67344J86757R9545j77469l52478l61895L95430
$$ plain form
5164 10812924 11539765 12777534 13729226 14816309 16073860 17902019 19548726 21559148
5156 21559148 23861994 26473034 29778780 32341746 34918169 37639455 39545487 41494319
5148 41494319 43220290 44144273 43575213 41237329 37795742 33267749 29283631 25373169
5140 25373169 22206575 19570440 17597342 16193028 14797849 13300397 12696086 11214995
5132 11214995 10366448 9616745 8887029 8214648 8113056 7762542 7439392 7322195 6699409
5123 6699409 6392226 6099221 6000615 5643248 5489160 5316531 5519885 5357268 5480923 5319846
5113 5319846 5204189 4980408 4675042 4249352 4289617 4439751 4408263 3680562 3402068 3237890
5103 3237890 3394274 3440279 3251248 3083904 3270661 3370206 3192737 2840259 2478364 2873794
5093B873794n493k52101k17302k43288j36695L73388J55759M23055l84718n1395
5083B535004P6582o03780m4602P7867j38955M06509j5737J54459k91185o78779
5073A477383K99969K12444j24451j79809J95754K40229k38049k52741K96668J83696
5063B111093m15962M50220j67729j9963m2809p7182K33288q208n52875j67230
5053A342643n3159M8172J21889J66424P0253M7798K84467J4428L96391n8216l53135
5042B027955j68633L50893k26573k90839p1656L87398j17584L0167L02527k39901
5032A983754m2418k973j24158L07131O6198j78086k69604K86330J93372L32909
5022B552455k27246J32177j30510M8816l4609L3620n6944J87813J05067j15631
$$ plain form
5093 2873794 2868301 2616200 2398898 2155610 2018915 2392303 2548062 2971117 2586399 2535004
5083 2535004 2611586 2007806 1963204 2041071 1902116 2308625 2292888 2447347 2156162 1477383
5073 1477383 1777352 1989796 1865345 1685536 1881290 2121519 1883470 1630729 1927397 2111093
5063 2111093 1695131 2145351 1977622 1957659 1914850 1837668 2070956 2062748 1509873 1342643
5053 1342643 1289484 1337656 1459545 1625969 1696222 1744020 2028487 2042915 2439306 2381090 2027955
5042 2027955 1859322 2210215 1983642 1692803 1621147 2008545 1890961 1921128 2223655 1983754
5032 1983754 1941336 1938363 1814205 2121336 2187534 2009448 1739844 2026174 2219546 2552455
5022 2552455 2325209 2457386 2326876 2375692 2341083 2374703 2317759 2505572 2610639 2495008
5012B495008J7835l45229J35612O1519J2174J84753K85733p0377m27483q4972
5002B264573K26578n8360o5637Q1341m2878K75864K90708l69583L53568K04653
4992C160827Q1273M55421j09295m32245J57069K07771K24820l74943m1501K3635
4982C352832K10847K6412j83109L27379l84836L88887M19105l2463J34621K86238
4972D545913l66479n9433K07589J52271N14130l8178J94843l04736j35686J94541
4962D904775N95357n8408K57194n2308K75112J66505j6195J45622k8215J89944
4952F379383M19324K80458P8685K00716k33968M7286L73424J43163J0508M67593
4942H166572r1356L28845N67127J01261J01561k4965N12889M54639J26814O30475
$$ plain form
5012 2495008 2512843 2167614 2303226 2364745 2376919 2561672 2847405 2777028 2349545 2264573
5002 2264573 2491151 2432791 2367154 2448495 2405617 2681481 2972189 2602606 2956174 3160827
4992 3160827 3242100 3697521 3588226 3155981 3313050 3520821 3745641 3370698 3329197 3352832
4982 3352832 3563679 3590091 3406982 3734361 3349525 3738412 4157517 4125054 4259675 4545913
4972 4545913 4179434 4120001 4327590 4479861 4993991 4955813 5150656 4845920 4710234 4904775
4962 4904775 5500132 5441724 5698918 5646610 5921722 6088227 6072032 6217654 6189439 6379383
4952 6379383 6798707 7079165 7157850 7358566 7124598 7171884 7545308 7688471 7698979 8166572
4942 8166572 8075216 8404061 8971188 9072449 9174010 9149045 9661934 10116573 10243387 10873862
4932A0873862M17308N30516O84226R945L512J41636Q00419P48392L77293M29495
4922A5016604L69683L73744N85218R03117N79836K53328J002537R37145N05493
4913B0526705J059952J277989R65599J172285J723966J571647J607683J770204
4905C1676030K260918K620861L234348L165301L744703L845315M442268N624465
4897F0614209N776493O427922P188760P841454Q388545M990841o99534n729869
4889I4798821p607004p057731o374247o075189m972026l527709k626129j950087
4881E4608699j009378M6466J81530N33653J906395J396815K033104L213613L633201
4872F6544098L863333M833683N504521O066312P065446Q403086R672997J1136214
$$ plain form
4932 10873862 11291170 11821686 12505912 12515857 12519369 12661005 13461424 14209816 14587109 15016604
4922 15016604 15386287 15760031 16345249 17248366 17828202 18081530 19084067 20021212 20526705
4913 20526705 21586657 22864646 23830245 25002530 26726496 28298143 29905826 31676030
4905 31676030 33936948 36557809 39792157 42957458 46702161 50547476 54989744 60614209
4897 60614209 66390702 72818624 80007384 87848838 96237383 101228224 100528690 94798821
4889 94798821 87191817 80134086 73759839 67684650 62712624 59184915 56558786 54608699
4881 54608699 53599321 53645787 53827317 54360970 56267365 57664180 59697284 62910897 66544098
4872 66544098 70407431 75241114 80745635 86811947 93877393 102280479 111953476 123089690
4864A23089690J2625042J4673864J6258117J6851005J4011317M421990o913538
4857A95017487j4157492j2418159j1060537j0022244q635626q764525r775036
4850A20183868j0400174r415798p941448o965847n820926m488646k945616k103412
4842G0102001j467387q63498K1858R27532J514486J877520K639487M094553M023871
4833H2870423N073792O336348P121836Q135622Q896399Q744878N772922L83598
4825A33335818l806658o058224q171534j1339321j2145978j0460926r360709p750362
4817F4242106p063802n303743l917555l866883k627402k525062j698234j426621
4809C5812804j539382j042884j881490j859423j513324j294967j577393r87928
$$ plain form
4864 123089690 135714732 150388596 166646713 183497718 197509035 201931025 195017487
4857 195017487 180859995 168441836 157381299 147359055 138723429 129958904 120183868
4850 120183868 109783694 100367896 92426448 85460601 79639675 75151029 72205413 70102001
4842 70102001 68634614 67771116 67792974 68720506 70234992 72112512 74751999 78846552 82870423
4833 82870423 87944215 94280563 101402399 109538021 118434420 127179298 132952220 133335818
4825 133335818 129529160 123470936 115299402 103960081 91814103 81353177 71992468 64242106
4817 64242106 57178304 51874561 47957006 44090123 41462721 38937659 37239425 35812804
4809 35812804 34273422 33230538 31349048 29489625 27976301 26681334 25103941 24116013
4801B4116013j420374p66749j120417o79924q36905r24789p21024n36711N6763
4792A7165883q45249o00651j79290j99488j38477m97009k69780J19296K75983
4783A4831218n7680j10951j56292R7086o24180m24912p58954o05037q78841n64859
4773A0746598m58704j039761k40407Q805O1717n72261m39538l84289j2512M743
4763G674391l63741k45445j18895p4758j44225P8601N3068o27233L5132m04329
4753E862566K19249R7418K156k59512l14779l64337o3120j8479j18704j25971
4743D916487J17020k3747j16839m41326j64267l64922R7938j03454L66437K67940
4733D551267k60202p3936n03809l86945P2402k88289J88884j40298J34883p0505
$$ plain form
4801 24116013 22695639 21928890 20808473 20128549 19291644 18366855 17645831 17109120 17165883
4792 17165883 16320634 15719983 15540693 15341205 15202728 14705719 14435939 14555235 14831218
4783 14831218 14773538 14662587 14506295 14603381 13979201 13554289 12795335 12190298 11311457 10746598
4773 10746598 10287894 9248133 9007726 9016531 9078248 8505987 8066449 7682160 7669648 7674391
4763 7674391 7310650 7065205 6946310 6871552 6727327 6805928 6858996 6231763 6266895 5862566
4753 5862566 6081815 6179233 6181389 5921877 5607098 5242761 5179641 5161162 5042458 4916487
4743 4916487 5033507 5009760 4892921 4451595 4287328 3922406 4020344 3916890 4283327 4551267
4733 4551267 4291065 4217129 3713320 3326375 3398777 3110488 3299372 3159074 3293957 3223452
4723C223452k23343J54987J15194L29993j26010P2421n7374o83431k66362K15571
4713B755098M20K03479n2836k99471j4054q733K09278j71779j55687L1574j50612
4702B346677l60554m42666J60286p7294R0854K9800K8310M98681K22319l61483
4692B134930M5764o279n7535l43769j25707R4213J15709K56672l04013l67767
4682A442218J16627l0865K89399o41773O0143n7991n2274M50289J09917M6038
4672A731728l32122j76902K81138n8611o65806K34227j49879K9652j50511K46618
4662I89532n3820p1753M83276n42687o7125L40316M7656r1630Q0686j07157K51229
4651A258523R1913m27815K94569o40751N7279K88129L3135j83651l6765K59989
$$ plain form
4723 3223452 3000109 3155096 3270290 3600283 3474273 3546694 3489320 2805889 2539527 2755098
4713 2755098 2755518 2958997 2906161 2606690 2592636 2583903 2793181 2621402 2465715 2497289 2346677
4702 2346677 1986123 1543457 1703743 1626449 1717303 1747103 1775413 2274094 2496413 2134930
4692 2134930 2180694 2174415 2116880 1773111 1647404 1741617 1857326 2113998 1809985 1442218
4682 1442218 1558845 1527980 1817379 1175606 1235749 1177758 1125484 1575773 1685690 1731728
4672 1731728 1399606 1222704 1503842 1445231 779425 1013652 863773 893425 742914 989532
4662 989532 935712 863959 1347235 804548 737423 1077739 1125395 1033765 1114451 1007294 1258523
4651 1258523 1350436 922621 1217190 576439 633718 921847 954982 771331 734566 994555
4641I94555j2551j27572j95104k34534o5456K71942k8479M26910n0350P8649j98931
4630H59079j78156m41355N87799K86617m1426l04384K57438o3714j24831m68552
4620C68515K42926L86107k76961l34615L32M34497j12002l05367M47566l4760
4610H16238M20438k53394n02747o8580j94797L25308M4796J8128K16837J56621
4600I78848j49811Q7776J12157K40914o4828j0859m52732j77978j3401M42294
4590I92380K20479m42906j85533J90750K60040L81612m4315k54386p3155P4293
4580A119259J88456K33799K18328m63092p1516J42725j21527J28705K16924j41271
4570A450790q9166m5156k52437K3460l2702K63853L1415k91891j11694L58768
$$ plain form
4641 994555 982004 854432 659328 424794 359338 631280 602801 1029711 979361 1058010 859079
4630 859079 680923 239568 827367 1113984 1072558 768174 1025612 961898 837067 368515
4620 368515 611441 997548 720587 385972 386304 820801 708799 403432 850998 816238
4610 816238 1236676 983282 480535 411955 217158 542466 587262 605390 822227 978848
4600 978848 829037 916813 1028970 1269884 1205056 1194197 741465 563487 550086 992380
4590 992380 1212859 769953 584420 775170 1035210 1416822 1372507 1118121 1044966 1119259
4580 1119259 1307715 1541514 1759842 1296750 1225234 1367959 1246432 1375137 1592061 1450790
4570 1450790 1361624 1316468 1064031 1087491 1054789 1318642 1350057 1058166 946472 1305240
4560A305240J11546j10825k06121k23830J08969j08065l99885Q0072L62040J19161
4550A038302l40538L5532l4639O4556k31178O4433K0020K35090J49567j4731q2952
4539I03462P22783r9704l13430l30086K06870m92816J93275O66341j83206l70205
4529I03284O5994J78071l30269K84262k98012j1804J65644l6067k05088N5236
4519G71251j70638J21563r5927L14288k4436j97657k76677J23691R8328n816J69351
4508H27321J61661j07549j34929Q0535l48723J40827p1657J59067J17591M541
4498H28685n8344m431k41681l43920n762N31171l06603K4386J1689P1916k52898
4487B54208r605k48481m9539J87414j58021M0159l73957O22930k7352m08268L35560
$$ plain form
4560 1305240 1416786 1305961 1099840 876010 984979 876914 477029 557101 919141 1038302
4550 1038302 697764 733296 698657 763213 532035 596468 616488 851578 1001145 986414 903462
4539 903462 1626245 1526541 1213111 883025 1089895 597079 790354 1456695 1273489 903284
4529 903284 969278 1147349 817080 1101342 803330 791526 957170 921103 716015 771251
4519 771251 600613 722176 626249 940537 916101 718444 441767 565458 663786 657970 827321
4508 827321 988982 881433 746504 827039 478316 619143 547486 706553 824144 828685
4498 828685 770341 765910 524229 180309 174547 705718 399115 423501 435190 507106 254208
4487 254208 244603 -3878 -53417 133997 -24024 16135 -357822 265108 237756 -170512 165048
4476A65048J61056q8847j311j91542L99392j3467k38523k6705K92669p2471J38896
4465E24195l06345R031L77201j46705l21640n0244K47850l32978j58110L94073
4455B36328p2934M19327M2242r1734K17601l51906R2772P8012k77147k20409j10084
4444c7932L93143K3328j87615l20322m6133O1387L90718K87639j87316k04405
4434A72492k02229J16705N6886J71398k33521J0265N928j83390M4178K2534K8746
4423I992L89582P4611N7857M34856m713n44514n18120M87667L10007k6010j87562
4412D83653k72551k31268q893N50029K23578p93935O7558k26005K2937j30313
4402c15210j41387K63549M81475P6072l97034P8598J96415j40866n8349j81709
$$ plain form
4476 165048 326104 237257 235946 44404 443796 430329 191806 165101 457770 385299 524195
4465 524195 217850 226881 604082 457377 135737 85493 333343 365 -157745 236328
4455 236328 163394 582721 624963 533229 750830 398924 491696 569708 292561 72152 -37932
4444 -37932 355211 378539 190924 -129398 -175531 -114144 276574 564213 376897 172492
4434 172492 -29737 86968 143854 315252 81731 91996 97924 -85466 -41288 -18754 9992
4423 9992 399574 474185 532042 966898 962185 417671 -100449 387218 697225 671215 483653
4412 483653 211102 -20166 -29059 520970 744548 -49387 18171 -207834 -184897 -315210
4402 -315210 -456597 -193048 288427 364499 -32535 46063 242478 101612 43263 -138446
4392a38446J99188j81779O8457L25910m13506j12436m2846l66417R0539J85306
4382c86030K21328M9596l47938L95100j27646J27643j8107k6199J33420K88253
4372C09420k08571j74786l77555J8271K85268J99426K5652L76865j51018r6522
4362B06450l38055n2668n174l9276j81930o360L58574l6328K9467P9793J45232
4351A59725m30098j02347k71028P9093L74492L57504m9717M4216k80943l82287
4341e01390J45178R04177l395n20237j64833k43096K00336K48895O9268l69195
4331b34292L74871P466m8588j74175r5724K27132r0517k02233K39860k4640J65290
4320A44450J28395J39668k17659l44101q3010K83102m65113J81995Q829O430N48521
$$ plain form
4392 -138446 60742 -121037 -52580 273330 -140176 -252612 -295458 -661875 -571336 -386030
4382 -386030 -164702 -115106 -463044 -67944 -195590 -67947 -86054 -112253 21167 309420
4372 309420 100849 -73937 -451492 -433221 -147953 51473 77125 453990 302972 206450
4362 206450 -131605 -184273 -189447 -228723 -410653 -417013 -58439 -94767 -65300 14493 159725
4351 159725 -270373 -372720 -643748 -564655 -190163 167341 117624 161840 -119103 -501390
4341 -501390 -356212 547965 544570 24333 -140500 -383596 -183260 65635 134903 -234292
4331 -234292 140579 148045 99457 -74718 -170442 56690 -33827 -236060 3800 -20840 144450
4320 144450 272845 412513 194854 -149247 -232257 50845 -414268 -232273 -223444 -217014 331507
4309C31507L6714l622p6157l55629J490J0960j54257m5646j27534o6942j23899
4298e73015O60615m5938j33098J08605l15971k73968L36423J05176J40671K90377
4288B99877n14072j34476k5541K92968L69731j30270R0834o5958K24757k48488
4278A59362N715j89711p3330R3520j31193K35797L99346P416j13713n24760l37394
4267d68945n7533P33112K62780j3582l74892k61822k1042Q6052j15615j17173
4257c48660j68616J33699K13426k15959L51495j90157J69276K84590l98957J7655
4247a52208J44209p418K90391M8726L2617l06620k67391n4596j19999q8964K39482
4236b41771J6296J76831j27969j65061p7299K01080P377l80851L8843M18090j32958
$$ plain form
4309 331507 368221 364599 288442 -67187 -65697 -54737 -208994 -254640 -382174 -449116 -573015
4298 -573015 87600 41662 -91436 17169 -298802 -572770 -236347 -131171 9500 299877
4288 299877 -214195 -348671 -374212 -81244 288487 158217 249051 183093 407850 159362
4278 159362 165077 -24634 -97964 -4444 -135637 100160 499506 506922 393209 -131551 -468945
4267 -468945 -526478 206634 469414 455832 80940 -180882 -201924 -115872 -231487 -348660
4257 -348660 -517276 -383577 -170151 -386110 -34615 -224772 -55496 229094 -169863 -152208
4247 -152208 -7999 -15417 274974 323700 356317 49697 -217694 -272290 -392289 -481253 -241771
4236 -241771 -225475 -48644 -176613 -341674 -418973 -217893 -210516 -591367 -552524 -134434 -267392
4225b67392L9541n2558k24295K66304M7983R2454j33030m1220l30068K10006J57334
4214b34941j2822K23982R9532K0406l04440J45315j25612k38347p0469L84272
4204a13124M532j40035j2070j78815Q7430L9226N5197Q4223k02523l0167K49239
4193a56887R0495J23023m72045R1544j01716J13650M07111N8074k37855Q2137
4183b469J57037K8179N3822k3169M2165j03673J43710k73780L3286Q8306p4617
4172F8797k27683R6762J03653m53766K70105K00410k76348K78421j24573j9654
4162h3876N0368m05420O6232K96968M9890K99351J72234j40509l4198l67088J1484
4151h4564j66134J59072J73976m70398M91644L98515n51052J25191J1580J48495
$$ plain form
4225 -267392 -227851 -280409 -504704 -238400 -190417 -97963 -230993 -272213 -602281 -392275 -234941
4214 -234941 -247763 -23781 75751 96157 -208283 -62968 -188580 -426927 -497396 -113124
4204 -113124 -108592 -248627 -260697 -439512 -352082 -312856 -257659 -173436 -375959 -406126 -156887
4193 -156887 -66392 56631 -415414 -323870 -425586 -311936 95175 153249 -84606 -2469
4183 -2469 154568 182747 236569 213400 255565 151892 295602 21822 55108 143414 68797
4172 68797 -158886 -62124 41529 -412237 -142132 58278 -218070 60351 -64222 -83876
4162 -83876 -33508 -438928 -372696 -75728 -25838 273513 445747 305238 271040 -96048 -84564
4151 -84564 -250698 -91626 82350 -388048 103596 502111 -48941 76250 87830 236325
4141B36325j47887J65439l31694o30558j5233j22966N18536J12300R4330k92176
4131d13584J71854J86979k15218L70236k70664J4687J99541R8091J54055j85991
4121A09986P0331j65490m78402k7027L36805J26780J91150K23885k38198K57816
4111D07636P9047l38798j14583j33124K6022K7984R4379j79090J19330k24956
4101b36153l80041P0168J02604J89929j71741Q3251L92416j94359M44160J98144
4091D98378m27427o653m77274r8935L95151J85461k47295p4373j65325J14163
4081c04129K57904J85475l9423j16246J43217k23183m7366J48879K04862J05950
4071C15940l27403j86907K3970j63414l43J38387N99480k68629l11391J68367
$$ plain form
4141 236325 88438 253877 -77817 -708375 -723608 -846574 -328038 -215738 -121408 -413584
4131 -413584 -241730 -54751 -269969 100267 -170397 -155710 43831 141922 295977 109986
4121 109986 180317 14827 -463575 -490602 -153797 -27017 164133 388018 149820 407636
4111 407636 486683 147885 33302 -99822 -73800 -45816 48563 -130527 -11197 -236153
4101 -236153 -616194 -546026 -443422 -253493 -425234 -341983 50433 -143926 300234 498378
4091 498378 70951 64298 -412976 -511911 -116760 68701 -178594 -252967 -418292 -304129
4081 -304129 -46225 139250 99827 -16419 126798 -96385 -143751 5128 209990 315940
4071 315940 -11463 -198370 -174400 -337814 -338157 -199770 399710 131081 -180310 -11943
4061a1943J27404j04683K29402k21426l22503K49576m4151L11194r6592j92048
4051g5770M03096q986k57737j59356o8202J33855Q7365P1253j28516n81831K56798
4040c28031J78778M1611j41887j46321L16434N30589K6584k82952J47358j17712
4030B24451j04540M505k82970k46254K11783j5832K43199J07730p2262j3002j29211
4019g2403Q6136q3511M34367j68833j19953Q273J87339k63208o4593o2619j73916
4008b92921j70078K81605k62525l03947R4355J64776N27049K70655j30642n9113
3998A19214N00983n66086m4234N4901J25487j04508J39092k06412j03294J78469
3988I3612k01292j61866p2086K97679M1857P804K90557J44691k01067Q0029m01350
$$ plain form
4061 -11943 115461 10778 240180 18754 -303749 -54173 -98324 212870 116278 -75770
4051 -75770 327326 318340 60603 -98753 -166955 -33100 54265 125518 -2998 -584829 -328031
4040 -328031 -149253 -107642 -249529 -395850 -79416 451173 477757 194805 342163 224451
4030 224451 119911 124416 -158554 -404808 -193025 -208857 34342 142072 69810 56808 -72403
4019 -72403 13733 -69778 364589 195756 75803 84076 271415 8207 -56386 -119005 -292921
4008 -292921 -462999 -181394 -443919 -747866 -653511 -488735 38314 308969 178327 119214
3998 119214 620197 54111 9877 64778 190265 85757 224849 18437 -84857 93612
3988 93612 -107680 -269546 -341632 -43953 -2096 5708 296265 440956 239889 319918 -81432
3977h1432K5279M68459l74262J77958j19001j09902j44218L54055n2630n8684
3967H5622K08490K47605o7453K49074M31628J35368p7147K73476k94252l03501
3957H88910k78562J60719J6405q7613l27820m1245j2090K13374M2114N03n9741
3946E14954m61L03644l20048L23462k50162j12952J12616l54008k6181J54361
3936C45225o5063j99690o0738R004J54430L5405j25447j19809j44490L44752j20699
3925E2880J69699k60705M8510K09137k54134Q623K45501m5229k81454k2963K45545
3914A15410j42609J75560N7846l2238L37795M3474l8762l41697J0921Q7726k59650
3903A3776K87168L2657K053m5073p8749m62860R7914K27107J19609K58160J41254
$$ plain form
3977 -81432 -56153 412306 38044 216002 97001 -12901 -157119 196936 144306 85622
3967 85622 294112 541717 474264 723338 1154966 1290334 1213187 1486663 1192411 888910
3957 888910 610348 771067 787472 699859 372039 330794 318704 532078 574192 574695 514954
3946 514954 514493 818137 498089 821551 571389 458437 571053 217045 190864 345225
3936 345225 280162 80472 19734 28738 183168 218573 93126 -26683 -171173 173579 52880
3925 52880 222579 -38126 10384 219521 -34613 -25990 219511 174282 -107172 -130135 115410
3914 115410 -27199 148361 206207 173969 511764 555238 516476 174779 185700 273426 13776
3903 13776 300944 333601 335654 290581 211832 -251028 -153114 73993 193602 451762 593016
3892E93016k13755R4805R9376l08919J74193k46352K46489J02501r038l55348
3882A76968l56456M12037R1310l0356N86531j43383K77270o3155m24609j58024
3872C68133P8833K93681j08167P7078j40695k53411j08993J23390o504L09991
3862F33336k7741K71932k01049k49916j86457J51850L36193J42274l53308N3592
3852E70706j07349l42172K82485M97082J94742N3115j97027L2357l34554j57485
3842D91900j04328J62020L0140N3104k59433k16510P1762K40739L86108k96879
3832E58623K64957K23377q0963n23867J78115J27161l13j53282J26935m9872K25438
3821H96309N55903k08648j26518j59551k10257J72496K49132P1827l8757P7631
$$ plain form
3892 593016 379261 474066 573442 264523 438716 192364 438853 541354 532316 176968
3882 176968 -179488 232549 323859 293503 880034 736651 1013921 950766 526157 368133
3872 368133 446966 740647 632480 709558 568863 315452 206459 329849 323345 633336
3862 633336 605595 877527 676478 426562 240105 391955 728148 870422 517114 570706
3852 570706 463357 121185 403670 900752 1095494 1148609 951582 983939 649385 491900
3842 491900 387572 549592 579732 632836 373403 156893 228655 469394 855502 558623
3832 558623 823580 1046957 965994 442127 620242 747403 747090 593808 720743 670871 896309
3821 896309 1452212 1243564 1117046 957495 747238 919734 1168866 1240693 1201936 1279567
3811A279567m02488K4807K25084k13771n0583L11274K74053N6451K9176J46961
3801A680531l64748p2601k23170L6985P32141M865k54398m42331K37765K97486
3791A632525k35806K3726M7036J0414l54578M73685K05231J95412Q2657l49636
3781A730666q7923M78966L15421j49018q497K27195M90420q8181j12598N46304
3771C342755K6691J21977K71383Q8944M24652k74993n109J69019l8699J41673
3761D268293M11715K3478M61059K63903K15699K02093J27406Q89L02870l75212
3751E902193j34664J18963L02107M56141K15919k71725r2287L66758L53054m497
3741G211962j34335M45636L40152M75650Q2032M71384M21105O33033K90436P16229
$$ plain form
3811 1279567 877079 901886 1126970 913199 862616 1173890 1447943 1504394 1533570 1680531
3801 1680531 1315783 1243182 1020012 1056997 1789138 1794003 1539605 1097274 1335039 1632525
3791 1632525 1396719 1420445 1467481 1477895 1123317 1597002 1802233 1997645 2080302 1730666
3781 1730666 1642743 2121709 2437130 2288112 2279615 2506810 2997230 2909049 2796451 3342755
3771 3342755 3369446 3491423 3762806 3851750 4276402 4001409 3996300 4165319 4126620 4268293
3761 4268293 4680008 4703486 5164545 5428448 5644147 5846240 5973646 5974535 6277405 5902193
3751 5902193 5767529 5886492 6188599 6644740 6860659 6588934 6496647 6863405 7216459 7211962
3741 7211962 7077627 7523263 7863415 8339065 8421097 8892481 9313586 9946619 10237055 10953284
3731A0953284K18619N42096N62197Q4988L83858P80962L48396O52882Q59825Q12292
3721A6199399J072534J008766N95487J034762J587736J701593J821048J721030
3713B6742355K395987L054236K979286K533255L356070K981544L727135M580823
3705E2350691N147637N916234P477262R563544J0674723J1625531J3970192J5895091
3697A32620905J7575318J8035883Q629508m863874j8286427k0389381j7147083
3690A16174849j7151684j5620002j2549038r208742p229795n486665m640207l563357
3682D0725359k809900k126399j942522k053797k161007k045260j982396j714476
3674B3889602j453637j470869j535055r99489r80477o79903m06777j042875q89476
$$ plain form
3731 10953284 11171903 11713999 12276196 12361184 12745042 13526004 13874400 14527282 15387107 16199399
3721 16199399 17271933 18280699 18876186 19910948 21498684 23200277 25021325 26742355
3713 26742355 29138342 32192578 35171864 37705119 41061189 44042733 47769868 52350691
3705 52350691 57498328 63414562 70891824 80455368 91130091 102755622 116725814 132620905
3697 132620905 150196223 168232106 176861614 171997740 153711313 133321932 116174849
3690 116174849 99023165 83403163 70854125 61645383 54415588 48928923 44288716 40725359
3682 40725359 37915459 35789060 33846538 31792741 29631734 27586474 25604078 23889602
3674 23889602 22435965 20965096 19430041 18430552 17450075 16770172 16363395 15320520 14431044
3665A4431044p38590m91019m08202p35445q21713n75954n5949n40241k63656n5738
3655I744537l37473p86995k98886j02111Q7502l72055n34486k27802m30127q1259
3645F660845l8945o74226J71471K10528o54765l54305p1900K5709Q739l14088
3635D969063m09124K25876K9024r0239l19672k6345K89088j85514j11781n4658
3625D315718j10323l74898j43697J75574l07303j32586P5707L16742l7013p48270
3615C029651J31633l40470O5270p4648r8355l0674j43584m8489R1628m16754o7119
3604B098089J36215R2438L3033j70427L50498j2475k81267m8226J9588p2682K2796
3593B167580k06728l28786r5586M61580M46507j37846o2124k13521n71028j94122
$$ plain form
3665 14431044 13692454 13201435 12793233 12057788 11236075 10660121 10604172 10063931 9800275 9744537
3655 9744537 9407064 8620069 8321183 8219072 8306574 7934519 7400033 7172231 6742104 6660845
3645 6660845 6621900 5947674 6119145 6329673 5674908 5320603 5248703 5274412 5283151 4969063
3635 4969063 4559939 4785815 4814839 4724600 4404928 4378583 4667671 4482157 4370376 4315718
3625 4315718 4205395 3830497 3686800 3862374 3555071 3422485 3498192 3814934 3777921 3029651
3615 3029651 3161284 2820814 2886084 2811436 2713081 2682407 2538823 2490334 2581962 2165208 2098089
3604 2098089 2234304 2326742 2359775 2189348 2539846 2527371 2246104 2197878 2217466 2144784 2167580
3593 2167580 1960852 1632066 1536480 1998060 2444567 2306721 2244597 2031076 1460048 1265926
3583A265926L9667J03350q0898j69220N4191l57340N69235L76807m23212l67163
3573A011343m4505J36836j81308j72619L45759R3940p1673J4962j16081N5067
3563A071721K6891M85947l02128k1741j6813m58063R9811K96155j59188J77147
3553A199739n4773L22444m45030k93171J02674J46860j10700L46705J2351k63198
3543I63901L05170l1395k33774m16466J82513L13067j25929N3599j76844N4049
3533H87891O252k80289L37412J07420m87474K20656J19715K9096k60648O2270
3523G42301l02334J76052L67855j77213k42491J83115K2343j98045k70372J67144
3513D68355J5631l10646m7681j79106P64646M01964k63275l56546j05132k11175
$$ plain form
3583 1265926 1305593 1408943 1328045 1158825 1213016 855676 1424911 1801718 1378506 1011343
3573 1011343 966838 1103674 922366 749747 1095506 1189446 1117773 1132735 1016654 1071721
3563 1071721 1098612 1584559 1282431 1260690 1243877 785814 885625 1181780 1022592 1199739
3553 1199739 1144966 1467410 1022380 729209 831883 978743 868043 1214748 1227099 963901
3543 963901 1269071 1237676 1003902 587436 769949 1083016 957087 1010686 833842 887891
3533 887891 894143 613854 951266 1058686 571212 791868 911583 940679 680031 742301
3523 742301 439967 616019 983874 806661 564170 747285 769628 571583 301211 468355
3513 468355 483986 173340 125659 -53447 711199 1113163 849888 493342 388210 177035
3503A77035J27701L70008K36064l36066m67971j50352K97135N6075P8446J74062
3493E62137R6590k74499K68958Q5644j73009l00946K86022k22766k51984M26185
3483E02332J44879l8535j79756K5023K38394l7011O350L909k17485J16363R9998
3472F64461m16856J75186J86912j09003l7339k13617N09227R9114k13714k84232
3462C60139J16215N9281J41364l90538j89915l260p7053j36495M98837k80567
3452I8008k18374L98488L5100k06346j82120M20585N3394J23929n75085K10218
3442A57797K36871K3655k69213L10180L6546m64402J63930J6036L66409m9185
3432E28624k28485J74382K07361q3046L60514O23450m14867P481K56747k68166
$$ plain form
3503 177035 304736 674744 910808 574742 106771 -43581 253554 309629 388075 562137
3493 562137 658727 384228 653186 738830 565821 264875 550897 328131 76147 502332
3483 502332 647211 608676 428920 453943 692337 655326 661676 665585 448100 564463 664461
3472 664461 247605 422791 609703 500700 463361 249744 758971 858085 644371 360139
3462 360139 476354 535635 676999 286461 96546 93286 16233 -120262 378575 98008
3452 98008 -120366 278122 313222 106876 -75244 345341 398735 522664 -52421 157797
3442 157797 394668 418323 149110 459290 495836 31434 195364 211400 577809 528624
3432 528624 300139 474521 681882 598836 959350 1582800 1167933 1175414 1432161 1163995
3422A163995n27134k84764j31248K3115M21282l00457j73874L91608j03075K4516
3412E03964m04386j60703K38800R0116k1788j54060l31137J49801o8688L8485
3402a19596L76819r9447j64439J38381M14369k21274J1533j08329j29550K99217
3392C97684j98360l7989N1837m0730j42969k01572j43817L20035M82471J30637
3382F17227m0085l27095K02975j07756j9671m3478l61497P8827Q718K57484j02556
3371A63093k8141p384o872O9837M11888l67522k98298k9450q9290K39147k48043
3360a91035J1924J00000L20748l7796K82285J95412q6973l47353o73153k4730
3350d50671L76846j97372L50056L06522k28241J69379l97715R2206K69385l80104
$$ plain form
3422 1163995 636861 352097 220849 243964 665246 364789 190915 582523 479448 503964
3412 503964 99578 -61125 177675 267791 246003 91943 -239194 -89393 -158081 -119596
3402 -119596 257223 157776 -6663 131718 546087 324813 336346 228017 98467 397684
3392 397684 199324 161335 213172 172442 29473 -172099 -315916 4119 486590 617227
3382 617227 577142 250047 453022 345266 325595 282117 -79380 -553 8165 265649 163093
3371 163093 134952 127568 120696 190533 602421 234899 -63399 -92849 -182139 57008 -191035
3360 -191035 -179111 -79111 241637 203841 486126 681538 594565 247212 -425941 -450671
3350 -450671 -73825 -271197 78859 385381 157140 326519 -71196 21010 290395 -89709
3340h9709k80108j93592O8529R3937L11798M3295j82663j06967j642L63448l4820
3329h494J51689n6850m42195n7223L20096J94309k46266M89306N2052j92817L7426
3318B41033K85722r4928q4254j24180j09619j71200p8497J18542l48147N1238
3308c14290K20554J90146n7251j24232M809j47575L9208j03443L8733J24371N2222
3297g6748J4437m7988P3357Q6836j38697n0285J59995J65965m15577R8965j79685
3286c09425J71940j2402k9240O2157j2308P6306n79425k6242K86705J16130K50198
3275e606K75961m17210M842K13788k64322l7159M00904J59525n68547k31352M29317
3264c9859P9605o2784R5623l86680k33412L45062J04984k11617k15553O81443
$$ plain form
3340 -89709 -369817 -563409 -494880 -400943 -89145 -45850 -228513 -335480 -337122 26326 -8494
3329 -8494 143195 86345 -355850 -413073 -92977 101332 -144934 344372 396424 203607 241033
3318 241033 526755 431827 347573 223393 113774 -57426 -135923 -17381 -365528 -314290
3308 -314290 -93736 96410 39159 -85073 -80264 -227839 -188631 -292074 -253341 -128970 -76748
3297 -76748 -62311 -110299 -36942 49894 -88803 -139088 20907 186872 -228705 -129740 -309425
3286 -309425 -137485 -149887 -179127 -116970 -129278 -52972 -632397 -658639 -371934 -255804 -5606
3275 -5606 270355 -146855 -142013 71775 -192547 -229706 171198 330723 -237824 -469176 -39859
3264 -39859 39746 -23038 72585 -314095 -547507 -202445 -97461 -309078 -524631 156812
3254A56812J07541p1172K73644j51208j8596J7496m25650l35609J54179L90678
3244I8115l02795K30550m3890r5365n2191j03968P4833l7019k63144J53708K20593
3233a20573K59829p3509o9180J73703l38352j59662J07618j17897J61025K47495
3223G0497J10672r335m722n718N8607p7081K07268r0764l42167j82850k49712
3212e15305L00681J43514L73611p6032K39530k91767m98650J12170J67630J1829
3202c2789o9979p2102k425J02875K5100j60970J05267O8792N9960L07943L24902
3191F56574m82744j0553J82841k73861j64965J27173j75772l04422L37263J74767
3181F6301K53527J32478j59543p4962J81728j67711r9794K93788q4190M5729m81705
$$ plain form
3254 156812 264353 193181 466825 315617 297021 314517 -111133 -446742 -292563 98115
3244 98115 -204680 25870 -18020 -113385 -165576 -269544 -194711 -231730 -494874 -341166 -120573
3233 -120573 139256 65747 -3433 170270 -168082 -327744 -220126 -338023 -176998 70497
3223 70497 181169 171834 167112 161394 220001 142920 350188 259424 -82743 -265593 -515305
3212 -515305 -214624 -71110 302501 226469 465999 174232 -324418 -212248 -44618 -32789
3202 -32789 -102768 -174870 -177295 -74420 -49320 -210290 -105023 -36231 23729 331672 656574
3191 656574 173830 163277 346118 72257 -92708 34465 -141307 -445729 -108466 66301
3181 66301 319828 452306 292763 217801 399529 231818 132024 425812 341622 387351 -94354
3170i4354J53995O1636l00685o7336L02295K87170l3970K22808m15765l76524
3160b60730j32764k5020K6561J83141K14729K59701k09019j23789j055j44172
3150b12417q5820M55606n68539j29669L86225J28617Q3429k03286n6786J42637
3140f0003J61811j07770N9694J2153j89989K67251R3956j21488r3012O5954n2566
3129C5991j38903J59818L93870n8479o46151n06458L66064K19148k14506J91870
3119a97736L8317o517j08006J15188o6128J7103l55564L01440K71236j09455l60029
3108d60151n4292J46702j41841J28285k9598L67584J39374O4629P4563N8327j25939
3097A67643J470j81775L60712l34525k82522J48091r034K73232l14746j7560o6563
$$ plain form
3170 -94354 59641 121277 -179408 -246744 55551 342721 308751 531559 115794 -260730
3160 -260730 -393494 -418514 -391953 -208812 5917 265618 56599 -67190 -68245 -212417
3150 -212417 -298237 157369 -411170 -540839 -154614 -25997 57432 -145854 -202640 -60003
3140 -60003 101808 -5962 53732 65885 -124104 143147 237103 115615 22603 88557 35991
3129 35991 -102912 56906 450776 392297 -253854 -760312 -394248 -175100 -389606 -197736
3119 -197736 -159419 -165936 -273942 -158754 -224882 -207779 -563343 -261903 9333 -100122 -460151
3108 -460151 -514443 -367741 -509582 -381297 -410895 -43311 96063 160692 235255 293582 167643
3097 167643 169113 -12662 348050 13525 -268997 -120906 -129940 143292 -171454 -189014 -255577
3086b55577l50L67174l7276j63930K72332L1808O9641M0752k62241P7441j47393
3075g619j68546K23633j62648M6345K56276j87441J3212L16815R529K15051l14175
3064B40432k16461o70331J64660J62750j39663M33273R2265O6256n67231J47285
3054b86765K38794L46304P385k31827J53593J12029q6290L03628l88067l76139
3044b07355J15085j88274N06016l5106J3802l96002k34465j12838M7094L71731
3034a20312l4006N295J37213j25432k01283J6944K76184J27461K60074k66905
3024G5233k74224o4553q4063N6042J18749k14430J39486M95261J38903J02959
3014D89363n07500l96042K12868K60105K34041j765J85663l20516q6715L59278
$$ plain form
3086 -255577 -255927 111247 73971 -89959 182373 214181 283822 324574 62333 139774 -7619
3075 -7619 -176165 47468 -115180 -68835 187441 0 13212 330027 339556 554607 240432
3064 240432 23971 -646360 -481700 -318950 -458613 -25340 66925 133181 -434050 -286765
3054 -286765 -47971 298333 305718 73891 227484 339513 253223 556851 168784 -207355
3044 -207355 -92270 -280544 225472 190366 204168 -191834 -426299 -539137 -492043 -120312
3034 -120312 -154318 -149023 -11810 -137242 -338525 -321581 -45397 82064 342138 75233
3024 75233 -198991 -263544 -347607 -291565 -172816 -387246 -247760 247501 386404 489363
3014 489363 -18137 -414179 -201311 58794 292835 291070 476733 156217 69502 428780
3004D28780j06365j43999o0299l15308m23845M95771M74163j85369k61964l97833
2994d96268j29796K2807j22881L79950q8035j5966N7907K14551K06495r4670R9155
2983C3249l83449r1929J32990j10155P1517P67805K26100k70937j19510J42890
2973C98571j67826j79757l88870j03603L57691k75957j44880O48306Q8016m98342
2963b66651j28435k52374J99750L61674m3521l98688N69180K19372P1149l73308
2953d1852n092j29359K73197l80169k00868K41897K21648K49334N8567j91877
2943I5426J67888r4032k09982j7030R1954L33662m86714M16507j51002j80133
2933c3456J98711J56354l41741k16903J33522k80209p3019j41051J38445J11513
$$ plain form
3004 428780 322415 178416 118117 -197191 -621036 -125265 348898 163529 -98435 -496268
2994 -496268 -626064 -603257 -726138 -346188 -434223 -450189 -392282 -177731 28764 -65906 33249
2983 33249 -350200 -442129 -309139 -419294 -347777 420028 646128 375191 255681 398571
2973 398571 230745 50988 -337882 -441485 -83794 -359751 -504631 143675 231691 -266651
2963 -266651 -395086 -647460 -447710 -86036 -129557 -528245 40935 260307 331456 -41852
2953 -41852 -46944 -176303 96894 -283275 -484143 -242246 -20598 228736 287303 95426
2943 95426 263314 169282 -40700 -57730 34224 367886 -118828 297679 146677 -33456
2933 -33456 165255 321609 -20132 -237035 -103513 -383722 -456741 -597792 -459347 -347834
2923c47834j14595K3447J16840k6070o32K02368J82987J86654J4454K07995k25232
2912B20382p18486P4978Q4438k9456N0422N25466J87851k39640j93380J7491j39693
2901a59627n5164O37765p3900l36241n6931k63151J78103l15388j32107L1874
2891e44767J86292L35338L0374L86667k52098l4710j32674M69262j00544m36507
2881i3367J21124q7241L21018j80890K01190J88140k92291r3406J86792R890k28755
2870E2204l10152K99350L7546l08883k02367j81772K61138L92158J94094N1723
2860B85039l74419l16703o025M28018K71946K14928O2282j7437j26367p7199n9897
2849B84166k09781K02358k08576L10279k43652j75958N6982M78699l48578l04403
$$ plain form
2923 -347834 -462429 -438982 -322142 -348212 -348844 -146476 36511 223165 237619 445614 220382
2912 220382 -498104 -423126 -338688 -368144 -317722 207744 395595 155955 -37425 -19934 -159627
2901 -159627 -214791 422974 349074 12833 -44098 -307249 -129146 -444534 -576641 -544767
2891 -544767 -358475 -23137 7237 393904 141806 107096 -25578 443684 343140 -93367
2881 -93367 27757 -59484 261534 80644 281834 469974 177683 84277 271069 280959 52204
2870 52204 -257948 41402 78948 -229935 -432302 -614074 -352936 39222 233316 285039
2860 285039 -89380 -406083 -412108 15910 287856 502784 565066 547629 421262 344063 284166
2849 284166 74385 276743 68167 378446 134794 -41164 15818 494517 145939 -158464
2839a58464n9136L8232K20334J68631m56963P0661j4055j77106J36443J30496
2829a00927l1369L55779O3713l76560K23185J19510j70612j43733k73759j95216
2819e29989j54023M27565j96425l69472L23644P5759j060L17897K77202R234K19356
2808C99688N2171o38449m5514k01713L7938M3229O5664L84611L25414K09030n3459
2797E78610k75347m22716l12084K15394J65096R0595l54533J02901L44804j84182
2787e1462L70582k86571J19842M2572L5468j91721J71685k9916l98220k63829
2777d81570K52777L71939k3421k14399J34772l61721j92281L31695L18602j03024
2767C3369j06971m72725q5445K55350J86406q2199k4192N0149j2175L22257J1995
$$ plain form
2839 -158464 -217600 -179368 40966 209597 -247366 -176705 -190760 -367866 -231423 -100927
2829 -100927 -132296 223483 287196 -89364 133821 253331 82719 -61014 -334773 -529989
2819 -529989 -684012 -256447 -452872 -822344 -498700 -422941 -424001 -106104 171098 180332 399688
2808 399688 451859 -186590 -232104 -433817 -395879 -352650 -286986 97625 423039 632069 578610
2797 578610 303263 -119453 -431537 -216143 -51047 39548 -314985 -212084 132720 -51462
2787 -51462 319120 32549 152391 194963 230431 38710 210395 180479 -217741 -481570
2777 -481570 -228793 143146 119725 -94674 40098 -321623 -513904 -182209 136393 33369
2767 33369 -73602 -546327 -631772 -376422 -190016 -272215 -296407 -246258 -258433 63824 75819
2756G5819j24751J3087L08589p6991K47167j23951l75787N9161L32752j9785m3253
2745B72057m558m43741N10169k20742k0813j9290k50952l82415O67601N4434j43465
2734A8285k83156j55969q175K09629L5126j9142J71530j11864l20717n5396L60517
2723a59332k62404k94262p9697K32637J57092P47838k92244m02906r1058L85374
2713e8962l71761j52513L28130N1906K47846m83450J72654N56226l5731j89666
2703F4679n8867J10044J6978o9403j2434l53437Q3292J28600r8900K22056j86475
2692a53867q1322k8993j37048N18447l16248j35682K80938o3466K48082J17318
2682B48159K13420k26575k62195J30830K60718o02170K07433p5856j53846P9767
$$ plain form
2756 75819 -48932 -35845 272744 195753 442920 318969 -56818 2343 335095 315310 272057
2745 272057 267499 -176242 333927 113185 92372 73082 -177870 -560285 107316 161750 18285
2734 18285 -264871 -420840 -429015 -219386 -184260 -203402 -31872 -143736 -464453 -519849 -159332
2723 -159332 -421736 -715998 -795695 -563058 -405966 341872 49628 -353278 -444336 -58962
2713 -58962 -430723 -583236 -255106 -203200 44646 -438804 -266150 290076 254345 64679
2703 64679 5812 115856 132834 63431 50997 -302440 -219148 -90548 -189448 32608 -153867
2692 -153867 -235189 -264182 -401230 117217 -199031 -334713 -53775 -117241 130841 248159
2682 248159 461579 235004 -27191 103639 364357 -237813 -30380 -106236 -260082 -180315
2672a80315L05747L2495j443l7253l00119M74134R6518J17286k16082k61944l95270
2661c66246O9071J67862k26019R5055p3732j79325K07878K46583K51864j49438
2651D3553j97301K38143K1610m9515j92169J48854K08201J69470l90808j98209
2641a98171p6103k94706J64353J00552L00542j57695o9643K46775J17088k05139
2631g2147K17813k20407q9772J77318p2924o0144J55910K0316K7954J64061j09659
2620A38319p2178M6923k92232m36891K94262P3980L93570l3312l67570J79108
2610g6021J58380q7958l47995L07614j43267L5106O39525j19143l48881j64725
2600a47365L70292o5656k18975L0358K35254L4865N300K50045l40988m00446K63047
$$ plain form
2672 -180315 125432 157927 156484 119231 -180888 293246 389764 507050 290968 29024 -366246
2661 -366246 -297175 -129313 -355332 -260277 -334009 -513334 -305456 -58873 192991 43553
2651 43553 -153748 84395 106005 56490 -135679 13175 221376 390846 38 -198171
2641 -198171 -274274 -568980 -404627 -304075 -3533 -161228 -230871 15904 132992 -72147
2631 -72147 145666 -74741 -164513 12805 -60119 -120263 35647 55963 83917 247978 138319
2620 138319 66141 113064 -179168 -616059 -321797 -247817 145753 112441 -255129 -76021
2610 -76021 82359 -5599 -353594 -45980 -189247 -154141 485384 366241 17360 -147365
2600 -147365 222927 157271 -61704 -31346 203908 238773 244073 494118 153130 -247316 15731
2589A5731k24649L25814q1569j58734k8511L1257o6767J07413J73932N5536k23703
2578g4250j78755O4093J10200k32989k24945P2076K40407q8954l1046j69009Q7728
2567d25444k24685J12606M121M9856J6108l0615L08359j73910j56583K7918k6400
2556e18669J76216K47416j93079J4471P4757m1834j03750l0820K99501K60178
2546A84387O182k42943k80858N52317J86008q7352o9119K6401k27136l13582M4974
2535b20721L56427k03948R7744q3190J08283r726j73199l19437J58663r1L17459
2524B8264P3740J20889J30454m93921N6864o2031J97601P1841n58450L75162L7639
2513b1948j57864J49524m65955q0147N7332J27764M22868l82983j7062K7817K30341
$$ plain form
2589 15731 -208918 116896 35327 -123407 -151918 -120661 -187428 -80015 93917 149453 -74250
2578 -74250 -253005 -188912 -78712 -311701 -536646 -464570 -224163 -313117 -344163 -513172 -425444
2567 -425444 -650129 -537523 -533402 -483546 -467438 -498053 -189694 -363604 -520187 -492269 -518669
2556 -518669 -342453 -95037 -288116 -273645 -198888 -240722 -344472 -375292 -75791 184387
2546 184387 190569 -52374 -333232 219085 405093 317741 248622 275023 47887 -265695 -220721
2535 -220721 135706 -68242 29502 -53688 54595 44869 -128330 -447767 -289104 -289195 28264
2524 28264 102004 222893 353347 -140574 -83710 -145741 51860 123701 -434749 -59587 -21948
2513 -21948 -179812 -30288 -496243 -576390 -519058 -391294 31574 -351409 -368471 -340654 -110313
2502a10313j67972o3871r8339J0818J57479L2696J82252j93338K80761n2752n9920
2491h2499J51784l51302m90485M01391M34572m84815K54473Q4837N38964J12632
2481E69552m36803l7201j80240k11519m2861L092N2768j94221P68181o2244J0131
$$ plain form
2502 -110313 -278285 -342156 -440495 -429677 -272198 -239502 -57250 -250588 30173 -22579 -82499
2491 -82499 69285 -282017 -772502 -371111 63461 -421354 -166881 -82044 456920 569552
2481 569552 132749 95548 -84692 -296211 -339072 -335980 -283212 -477433 290748 228504 238635
$$ [...]
##END NTUPLES=NMR SPECTRUM
##END=
