##TITLE=1H_TG-1137-1
 CDCl3, 8 sc, 
 25.11.2020
##JCAMPDX= 6.0         $$ Bruker NMR JCAMP-DX V2.0
##DATA TYPE= NMR SPECTRUM
##DATA CLASS= NTUPLES
##ORIGIN= UXNMR, Bruker Analytische Messtechnik GmbH
##OWNER= root
$$ XWIN-NMR		Version 3.5
$$ Wed Nov 25 12:31:45 2020 Russian Standard Time (UT+4h)  she@DPX200
##.OBSERVE FREQUENCY= 200.1315066352
##.OBSERVE NUCLEUS= ^1H
##.ACQUISITION MODE= SIMULTANEOUS
##.ACQUISITION SCHEME= undefined
##.AVERAGES= 8
##.DIGITISER RES= 18
##SPECTROMETER/DATA SYSTEM= spect
##.PULSE SEQUENCE= zg30
##.SOLVENT NAME= CDCl3
##.SHIFT REFERENCE= (INTERNAL, CDCl3, 0, 16.0155)
##AUDIT TRAIL= $$ (NUMBER, WHEN, WHO, WHERE, WHAT)
$$ ##TITLE= Audit trail, XWIN-NMR		Version 3.5
$$ ##JCAMPDX= 5.01
$$ ##ORIGIN= Bruker BioSpin GmbH
$$ ##OWNER= she
$$ F:/spectra/data/she/nmr/H-F/1/pdata/1/auditp.txt
$$ ##AUDIT TRAIL=  $$ (NUMBER, WHEN, WHO, WHERE, WHAT)
(   1,<2020-11-25 12:28:51.40 +0400>,<she>,<DPX200>,
      <created by zg, POWCHK disabled, PULCHK disabled
       configuration hash MD5:
       00 E9 B6 7A A2 85 ED C7 34 08 36 98 17 FE 4E 26
       data hash MD5: 16K
       F3 2C 6E D6 6D 94 F7 B3 49 69 3C 31 27 22 30 07>)
(   2,<2020-11-25 12:30:05.84 +0400>,<she>,<DPX200>,
      <Start of raw data processing
       efp BC_mod = 2 LB = 0.24 FT_mod = 6 PKNL = 1 PHC0 = -11214.82 PHC1 = 21.80089 SI = 16K 
       data hash MD5: 16K
       F1 37 63 90 76 B1 46 FD B8 32 60 D7 E2 E1 4B FB>)
(   3,<2020-11-25 12:30:25.59 +0400>,<she>,<DPX200>,
      <pk PHC0 = 1.310975 PHC1 = -2.2 
       data hash MD5: 16K
       1F BA 30 62 E6 24 61 15 AD D8 64 57 81 AD A3 8C>)
(   4,<2020-11-25 12:30:29.92 +0400>,<she>,<DPX200>,
      <abs ABSG = 5 
       data hash MD5: 16K
       B5 4B AB 2F 64 42 C0 8D 0E 39 5A FE 5E 62 B2 33>)
$$ ##END=
$$ 
$$ hash MD5
$$ AB 07 AF 16 D1 A1 7F 5B 92 C6 E5 7B 99 9F 70 28
##$RELAX= 
##$RELAX= 
##$RELAX= 
##$RELAX= 
##$RELAX= 
##$RELAX= 
$$ Bruker specific parameters
$$ --------------------------
##$DU= <F:/spectra>
##$EXPNO= 1
##$NAME= <H-F>
##$PROCNO= 1
##$TYPE= <nmr>
##$USER= <she>
##$AMP= (0..31)
100 100 100 100 100 100 100 100 100 100 100 100 100 100 100 100 100 100 
100 100 100 100 100 100 100 100 100 100 100 100 100 100 
##$AQSEQ= 0
##$AQ_mod= 1
##$AUNM= <au_zg>
##$AUTOPOS= <>
##$BF1= 200.13
##$BF2= 200.13
##$BF3= 200.13
##$BF4= 200.13
##$BF5= 200.13
##$BF6= 200.13
##$BF7= 200.13
##$BF8= 200.13
##$BYTORDA= 1
##$CFDGTYP= 0
##$CFRGTYP= 5
##$CHEMSTR= <none>
##$CNST= (0..31)
1 1 145 1 1 1 1 1 1 1 1 1 1 1 1 1 1 1 1 1 1 1 1 1 1 1 1 1 1 1 1 1 
##$CPDPRG= <>
##$CPDPRG1= <>
##$CPDPRG2= <>
##$CPDPRG3= <>
##$CPDPRG4= <mlev>
##$CPDPRG5= <mlev>
##$CPDPRG6= <mlev>
##$CPDPRG7= <mlev>
##$CPDPRG8= <mlev>
##$CPDPRGB= <>
##$CPDPRGT= <>
##$D= (0..31)
0 1.2 0 0 0 0 0 0 0 0.06 0 0.03 0 0 0 0 0.0002 0 0 0 0 0 0 0 0 0 0 0 0 
0 0 0 
##$DATE= 1606292930
##$DBL= (0..7)
120 120 120 120 120 120 120 120 
##$DBP= (0..7)
150 150 150 150 150 150 150 150 
##$DBP07= 0
##$DBPNAM0= <>
##$DBPNAM1= <>
##$DBPNAM2= <>
##$DBPNAM3= <>
##$DBPNAM4= <>
$$ [...]
##$SUBNAM3= <"">
##$SUBNAM4= <"">
##$SUBNAM5= <"">
##$SUBNAM6= <"">
##$SUBNAM7= <"">
##$SUBNAM8= <"">
##$SUBNAM9= <"">
##$SW= 16.9725356469052
##$SWIBOX= (0..15)
0 0 2 0 0 0 0 0 0 0 0 0 0 0 0 0 
##$SW_h= 3396.73913043478
##$TD= 16384
##$TD0= 1
##$TE= 0
##$TE2= 300
##$TE3= 300
##$TEG= 300
##$TL= (0..7)
0 120 120 120 120 120 120 120 
##$TP= (0..7)
150 150 150 150 150 150 150 150 
##$TP07= 0
##$TPNAME0= <>
##$TPNAME1= <>
##$TPNAME2= <>
##$TPNAME3= <>
##$TPNAME4= <>
##$TPNAME5= <>
##$TPNAME6= <>
##$TPNAME7= <>
##$TPOAL= (0..7)
0.5 0.5 0.5 0.5 0.5 0.5 0.5 0.5 
##$TPOFFS= (0..7)
0 0 0 0 0 0 0 0 
##$TUNHIN= 0
##$TUNHOUT= 0
##$TUNXOUT= 0
##$USERA1= <user>
##$USERA2= <user>
##$USERA3= <user>
##$USERA4= <user>
##$USERA5= <user>
##$V9= 5
##$VALIST= <valist>
##$VCLIST= <CCCCCCCCCCCCCCC>
##$VD= 0
##$VDLIST= <DDDDDDDDDDDDDDD>
##$VPLIST= <PPPPPPPPPPPPPPP>
##$VTLIST= <TTTTTTTTTTTTTTT>
##$WBST= 1024
##$WBSW= 4
##$XGAIN= (0..3)
0 0 0 0 
##$XL= 0
##$YL= 0
##$YMAX_a= 246900
##$YMIN_a= -246817
##$ZGOPTNS= <>
##$ZL1= 120
##$ZL2= 120
##$ZL3= 120
##$ZL4= 120
##$ABSF1= 15.9761
##$ABSF2= -0.996562
##$ABSG= 5
##$ABSL= 3
##$ALPHA= 0
##$AQORDER= 0
##$ASSFAC= 0
##$ASSFACI= 0
##$ASSFACX= 0
##$ASSWID= 0
##$AUNMP= <proc_1d>
##$AZFE= 0.1
##$AZFW= 0.1
##$BCFW= 0
##$BC_mod= 2
##$BYTORDP= 0
##$COROFFS= 0
##$CY= -3
##$DATMOD= 1
##$DC= 0
##$DFILT= <>
##$DTYPP= 0
##$F1P= 0
##$F2P= 0
##$FCOR= 1
##$FTSIZE= 16384
##$FT_mod= 6
##$GAMMA= 0
##$GB= 0
##$INTBC= 1
##$INTSCL= 2.992141e-10
##$ISEN= 128
##$LB= 0.24
##$LEV0= 0
##$LPBIN= 0
##$MAXI= 10000
##$MC2= 0
##$MEAN= 0
##$ME_mod= 0
##$MI= 1.114404
##$NCOEF= 0
##$NC_proc= -6
##$NLEV= 6
##$NOISF1= 3.799351
##$NOISF2= 2.8
##$NSP= 0
##$NTH_PI= 0
##$NZP= 0
##$OFFSET= 16.01546
##$PC= 1
##$PHC0= -11213.51
##$PHC1= 19.60089
##$PH_mod= 1
##$PKNL= yes
##$PPARMOD= 0
##$PSCAL= 0
##$PSIGN= 0
##$REVERSE= no
##$SF= 200.129999830131
##$SI= 16384
##$SIGF1= 3
##$SIGF2= 2
##$SINO= 5.538805
##$SIOLD= 16384
##$SREGLST= <1H.CDCl3>
##$SSB= 0
##$STSI= 16384
##$STSR= 0
##$SW_p= 3396.73913043478
##$SYMM= 0
##$S_DEV= 0
##$TDeff= 16384
##$TDoff= 0
##$TI= <>
##$TILT= no
##$TM1= 0
##$TM2= 0
##$TOPLEV= 0
##$USERP1= <user>
##$USERP2= <user>
##$USERP3= <user>
##$USERP4= <user>
##$USERP5= <user>
##$WDW= 1
##$XDIM= 16384
##$YMAX_p= 466237319
##$YMIN_p= -129805
$$ End of Bruker specific parameters
$$ ---------------------------------
##NTUPLES= NMR SPECTRUM
##VAR_NAME=  FREQUENCY,     SPECTRUM/REAL,   SPECTRUM/IMAG
##SYMBOL=    X,             R,               I
##VAR_TYPE=  INDEPENDENT,   DEPENDENT,       DEPENDENT
##VAR_FORM=  AFFN,          ASDF,            ASDF
##VAR_DIM=   16384,         16384,           16384
##UNITS=     HZ,            ARBITRARY UNITS, ARBITRARY UNITS
##FACTOR=    0.207333158178281, 1,           1
##FIRST=     3205.17381909115, 0,            0
##LAST=      -191.565311343634, 0,           0
##MIN=       -191.565311343634, -129805,     0
##MAX=       3205.17381909115, 466237319,    0
$$ Real data points
##PAGE= N=1
##DATA TABLE= (X++(R..R)), XYDATA
$$ [...]
4761E33584M7677k9658q5709M4331M8389J5642k3689O416n651K931M4985n7527
4749E41721l2509J6069J0115p9617m315J9533L5877j05819o3741N2291K3204M3150
4737D55959o270K459k114Q7561M6925q3317o39R2575K308q9203M7126O355p928
4724E51797l0227L1018j7576o1688L3710j1769j7995J6842N1163j3733n4567J4562
4712D91537M8792k3382K9356L4446m0247l6685K1452J6459Q020K2601N111m1722
4700E35738k1784M0390M7256r722j0974j0987L558l8544M5289k6159J362O5258
4688F20681j4696p0311n4114L3661m4660j4213K8557r068k3927K7783J4045n1232
4676D42506q465l219m842p0741R721K6492m7005l6305p96m988k9057K8466p668
$$ plain form
4761 533584 581261 551603 465894 510225 558614 574256 550567 556983 551332 554263 599248 541721
4749 541721 509212 525281 535396 455779 451464 470997 506874 401055 337314 389605 412809 455959
4737 455959 449689 452148 450034 537595 584520 501203 500564 593139 595447 506244 553370 559725 551797
4724 551797 521570 552588 535012 473324 507034 495265 477270 494112 545275 531542 476975 491537
4712 491537 540329 516947 546303 580749 540502 503817 525269 541728 549748 572349 577460 535738
4700 535738 513954 554344 601600 591878 580904 569917 573475 534931 580220 554061 555423 620681
4688 620681 605985 535674 481560 515221 470561 456348 484905 475837 451910 479693 493738 442506
4676 442506 434041 430822 425980 355239 364960 391452 344447 308142 307346 302358 273301 301767 294099
4663B94099k880k0566P6675m1701n1734O6936J4649J456k4038j9195j0710L1559
4651C14550M5247N2228k7097k1440M1382l4576n8025K1312L9199o1990J0461M1868
4639C63119l1073k3827j6990k2914L464r599J2229k7051M5479R6280m4933l8543
4627C05641j468N7061K790m7880M8921J5263J1935J9856l261p2153N0911L4275
4615D21891o2428k2720K5805M1951n2703P877n064K6495j8499k0297L6022N386
4603C83716m525j9538K519k7815K7939k402l5274J7819N8636J1945n4982m027
4591C54011l9381j0072K3601q166k6212K0769m63m4130J8278K0237k0097k3329
4579B65046M344n742M9256k257L0749K2745o3167J7295J1321m1597J175M1908
$$ plain form
4663 294099 291219 270653 347328 305627 253893 320829 335478 336934 312896 293701 282991 314550
4651 314550 359797 412025 384928 363488 404870 370294 312269 333581 372780 310790 321251 363119
4639 363119 332046 308219 291229 268315 271779 262180 274409 247358 292837 389117 344184 305641
4627 305641 304173 361234 364024 316144 365065 380328 392263 412119 408858 336705 387616 421891
4615 421891 359463 336743 362548 404499 351796 359673 354609 381104 362605 342308 378330 383716
4603 383716 379191 359653 362172 334357 362296 359894 324620 342439 401075 413020 358038 354011
4591 354011 314630 304558 328159 319993 293781 314550 314087 269957 288235 308472 288375 265046
4579 265046 269390 263648 312904 310647 341396 364141 300974 318269 329590 287993 289168 331076
4567C31076l1250J0228p475J5555k8818M781K7091j0635M4783J3772p174l3689
4555C28245R043N920o799k1010k2220J4545j9506L1334L7135k0313p5941n158
4543B55275N5011J2838O5878L4052l2879J0503n29k7803k7437k4799j6807K5578
4531C28881Q664K2860m5005J369k2789J664K5264j9411M5306K2795L7151L5436
4519D42185m058k7747J2941k1852J0901o501M2988j2970l0439K324K411N537M4683
4506D60403M246J483J4044l1061L2735J427k0999j5865J6389k2645k3110N3065
4494D70112j8917P266j1334n791K0746L2776J2856l4011K9175J631N857n297K9678
4481E34747l4200j2751j3119j3211N1847L4152K7994j4321o048j4046k523n7246
$$ plain form
4567 331076 299826 310054 302579 318134 289316 294097 321188 310553 355336 369108 361934 328245
4555 328245 337288 343208 336409 315399 293179 307724 288218 319552 356687 336374 260433 255275
4543 255275 310286 323124 389002 423054 390175 400678 400149 372346 344909 320110 303303 328881
4531 328881 337545 360405 315400 316769 293980 295644 320908 301497 346803 369598 406749 442185
4519 442185 438127 410380 423321 401469 412370 405869 448857 435887 405448 407772 410183 415720 460403
4506 460403 464649 466132 480176 449115 481850 483277 462278 446413 462802 440157 417047 470112
4494 470112 451195 458461 447127 441336 462082 494858 507714 473703 502878 504509 510366 505069 534747
4481 534747 500547 487796 474677 461466 513313 547465 575459 561138 555090 541044 538521 481275
4469D81275J2278P6500J4027L2402p810J9371l0216q55j2655K5253N6246J2034
4457F77850J5365K9828K5280K6674M0937j7768k509M703K2772q109j630K3796
4445H37189j0796k6724l9079m2043K9431L0058n415m055K0207J3865l5267L974
4433G71345O3356K9401M7219J3212L8710L0794M7606N813j5842K4384L2467M3831
4421A132296M1874P6877M761Q546L2268K7156j5187K1531K8671J324N5996j375
4409A414738l636j6082n258q89k1441j558p355N7484L440j0610K7314J0200L7568
4396A483915J6306K4323Q7270J47583L8335O0919J7796K0574j3574k9527p0731
4385A783189j08034K069L354k7558m0824p513o4292m5202K105J4904k4588m0757
$$ plain form
4469 481275 493553 570053 584080 616482 608672 628043 597827 596972 584317 609570 665816 677850
4457 677850 693215 723043 748323 774997 815934 798166 795657 800360 823132 815023 813393 837189
4445 837189 826393 799669 760590 718547 747978 778036 772621 768566 788773 802638 767371 771345
4433 771345 834701 864102 911321 924533 963243 994037 1041643 1047456 1031614 1055998 1088465 1132296
4421 1132296 1174170 1251047 1255808 1264354 1296622 1323778 1308591 1330122 1358793 1360117 1416113 1414738
4409 1414738 1411102 1395020 1389762 1388873 1367432 1365874 1358519 1416003 1419443 1408833 1436147 1446347 1483915
4396 1483915 1500221 1524544 1611814 1759397 1797732 1858651 1876447 1897021 1883447 1853920 1783189
4385 1783189 1675155 1677224 1680578 1653020 1612196 1604683 1540391 1495189 1497294 1512198 1487610 1446853
4373A446853p2291k7424m3691m3468p9205j14246l6068l822k7318o2316m3018
4362H93986k3697M285L0805m4145n1310k73L4501m7910k7631O741k2667l0693
4350G21992o0947j2633o704K6254k2785k4696j5964K1281N425r2074J896M1656
4338E82701K4165n673j7194k4254j7923L6302K2549l7212l139J7790O360p49r731
4325E73992L1015k3802l5484k3622K4572K5633n05l4705m8905R122L801o3574
4313D37538l6191K7087J32J4566j1246o100j9371K307M7934M883J5644k543M0385
4300E15025R358j1056J4851L0320m929q0996k375O279k1285n1380n0320n7547
4288B95945J5411K2358m3716J7988J8438J6251J3122l0514O166K0307M0235m9117
$$ plain form
4373 1446853 1374562 1347138 1303447 1259979 1180774 1066528 1030460 1026638 999320 937004 893986
4362 893986 870289 874574 905379 861234 809924 809651 844152 796242 768611 775352 752685 721992
4350 721992 661045 648412 641708 667962 645177 620481 604517 625798 631223 539149 541045 582701
4338 582701 606866 601193 583999 559745 541822 578124 600673 563461 560322 578112 584472 583723 573992
4325 573992 605007 581205 545721 522099 546671 572304 571799 537094 488189 497311 501112 437538
4313 437538 401347 428434 428566 443132 431886 425786 406415 408722 456656 461539 477183 474640 515025
4300 515025 524383 513327 528178 558498 553569 472573 470198 476477 455192 403812 353492 295945
4288 295945 311356 333714 289998 307986 326424 342675 355797 325283 331449 351756 391991 342874
4276C42874j864l9669N149k8931l2397M1911K5891M3247l2199p811N9156J8424
4264C93781l4647R513n6493M225L9158o0306m0216M071L3610l7581n1049J3987
4252B18053N5622p66l3806r641L4711M0623J3952k701j8983N8184K0229k1980
4240C53497q7029L8678J5749m0450l6771m1104j1598J3422K0920j8068L7140K7792
4228B72178K030j3665L732Q638K1705n5993l1945M4225j3759Q637j5721m8238
4216A81824R656L3783k92n4054P9424K6929k9773L556j1722J4693j6616M3173
4204B80581Q576k1361k3873j2840o639K823m0407M9457k2370j0340N0008L200
4192B56815l4198J0115q67N4607K4440M151o8939l462K9405k3362r120n5781j8461
$$ plain form
4276 342874 341010 301341 306490 277559 245162 287073 312964 356211 324012 316201 375357 393781
4264 393781 359134 368647 312154 316379 355537 295231 255015 259086 292696 255115 204066 218053
4252 218053 273675 272909 239103 229462 264173 304796 318748 316047 297064 355248 375477 353497
4240 353497 266468 305146 320895 280445 243674 202570 190972 204394 225314 207246 244386 272178
4228 272178 274208 260543 264275 272913 294618 238625 206680 250905 237146 245783 230062 181824
4216 181824 191480 225263 224971 170917 250341 277270 247497 251053 239331 254024 237408 280581
4204 280581 289157 267796 243923 231083 224444 227267 186860 236317 213947 203607 253615 256815
4192 256815 222617 232732 231865 286472 310912 315063 246124 242662 272067 248705 239585 183804 165343
4179A65343R773L4302K5788J3633J4879J7905Q391K2099l2706M6184k0105n0232
4167B55254L386J0943n7119l8883K7558k3779K0528J2734j67l342L5577k1173
4155B21517j2081j4382k2213M8268L0946J7410k2740l034o861O835J4036o2664
4143A95037K1274L9839l0025J7474j2908j2010K4946J1696k6679L3157N5912L283
4131C20996n2848M7646j7281K2895J1029n3466N0554L5708k3731M2540j2240j2884
4119C58918r608J8798q246o077L1366l1588m1319J5245L0105k4639j1269l7237
4107B84449l432K676j655M4464R290K9613j2573N6306J9435O828M1720L024N3237
4094E33382K8105p966q7860j1521o5492M948L1994p0447k1794l3341L0633j0702
$$ plain form
4179 165343 175116 209418 235206 248839 263718 281623 290014 312113 279407 325591 305486 255254
4167 255254 258640 269583 212464 173581 201139 177360 197888 210622 210455 207113 242690 221517
4155 221517 209436 195054 172841 221109 252055 269465 246725 243691 236830 243665 257701 195037
4143 195037 216311 256150 226125 243599 230691 218681 243627 255323 228644 261801 317713 320996
4131 320996 268148 315794 298513 321408 332437 278971 329525 365233 341502 384042 371802 358918
4119 358918 349310 368108 359862 353785 385151 353563 312244 327489 357594 332955 321686 284449
4107 284449 281017 283693 282038 326502 335792 365405 352832 409138 428573 435401 477121 480145 533382
4094 533382 561487 553521 465661 454140 388648 393596 425590 355143 333349 300008 330641 319939
4082C19939n789K1501m4383J2003J6725L0264L4898L9443k6193m8688k6743K1143
4070C44120K9497m844k1558K9320L1138n2728N4143J3252n9611J5663p665o643
4058C64084K071k4946n781l550R329j5500n2276k2766K0320M0849p576P084L4190
4045C45532j1197o673O265R617j692m062j0666m6055L4011L6006j6975n3446k960
4032B77705k0490J6317r535M600M6190j7556l471k8533n87j263N4376j5248K6254
4019C28759Q732k208O492k8714M6516J9048k213l0238m3402K5872N2017o630j5907
4006C58124r008k7117M8568j9247L1368L363k7450N8759k2277l46k7609J3207
3994C80335J6316k3783L5623L7582k3644k5243j6884Q1925L0288j9205l009J1594
$$ plain form
4082 319939 314150 335651 291268 303271 319996 350260 385158 424601 398408 349720 322977 344120
4070 344120 373617 368773 347215 376535 407673 354945 409088 422340 362729 378392 370727 364084
4058 364084 366155 341209 335428 331878 341207 325707 273431 250665 270985 311834 304258 311342 345532
4045 345532 334335 327662 333927 343544 341852 337790 327124 281069 315080 351086 334111 280665 277705
4032 277705 257215 273532 263997 268597 314787 297231 293760 265227 264640 263377 317753 302505 328759
4019 328759 337491 335283 341775 313061 359577 378625 376412 346174 302772 328644 380661 374031 358124
4006 358124 349116 321999 370567 351320 382688 386051 358601 417360 395083 394737 367128 380335
3994 380335 396651 372868 408491 446073 422429 397186 380302 462227 492515 473310 470301 481895
3982D81895O9638J7394J0794K1812J5743L2796j4453n4053O140k9166o0463k1962
3970D76115k3898L3024j1014j5117l470M9033L2360N401j1863m0715J6414M832
3958E11102j9586j6916M0949N429L4238L2480k9048N5075K3749j6591m5818N5398
3946F30461M6142k8177o4386R420M158q845o245o7071K8518K7739L2378O4344
3934F68436n6912L1931K985j4342o272J2624N9821l2472J3296M7013n2547K4342
3922F97903p65q7162Q7456P1684M7444j3382J727K9047L7695L3558L4658k1859
3910I18004N1385K7551L5901P051k6719P4281j1498k7838J4673M3818O5425L1991
3898A204025j1302j4467M6354q272l0071k7623O7187j6055n2800j7019n4404N1236
$$ plain form
3982 481895 551533 568927 579721 601533 617276 650072 635619 581566 587706 558540 498077 476115
3970 476115 452217 485241 474227 459110 455640 504673 537033 542434 530571 489856 506270 511102
3958 511102 491516 474600 515549 520978 555216 587696 558648 613723 637472 620881 575063 630461
3946 630461 676603 648426 584040 593460 597618 588773 582528 515457 543975 571714 604092 668436
3934 668436 611524 643455 646440 632098 625826 638450 698271 665799 679095 726108 673561 697903
3922 697903 697138 609976 697432 769116 816560 803178 804905 833952 871647 905205 939863 918004
3910 918004 969389 996940 1032841 1039892 1013173 1087454 1075956 1048118 1062791 1106609 1172034 1204025
3898 1204025 1192723 1178256 1224610 1216338 1186267 1158644 1225831 1209776 1156976 1139957 1085553 1136789
3886A136789M133n4007l6378J2260N4150R120k3528J6499N3799J8255k2005m0838
3874A128249M7306O0009M2681R667m6129L4265j0392m1840j6591q22O9589k9181
3862A246811n3593J6487K4174m183o2803r7783N6372j5415j7070k0825j0713J5975
3850A077434l7174m8982n9621m0173K6040K3037o1809j4450R237O2183p7746k7783
3838H30193Q1195M6817k1989o6307q802L1813K2629j12778o899J0187m970J0739
3826H11828J5370j584l2190O9761m1666r035R361l6275O025O614K0468O6036R900
3813H94613q0148m5698J1770J6879J6310L7347J1217j9259Q2674k215l2690l617
3801H87183j3412M5439L2692j3468K0905M501J9472l9927J5551O4202l5054K762
$$ plain form
3886 1136789 1140922 1086915 1050537 1062797 1116947 1126067 1102539 1119038 1172837 1191092 1169087 1128249
3874 1128249 1175555 1235564 1278245 1287912 1241783 1276048 1265656 1223816 1207225 1206403 1275992 1246811
3862 1246811 1193218 1209705 1233879 1229696 1166893 1069110 1125482 1110067 1092997 1072172 1061459 1077434
3850 1077434 1040260 991278 931657 891484 917524 940561 878752 864302 873539 935722 857976 830193
3838 830193 911388 958205 936216 869909 861107 892920 915549 802771 795872 806059 801089 811828
3826 811828 827198 825614 793424 863185 821519 812484 821845 785570 791595 798209 818677 884713 894613
3813 894613 814465 768767 780537 797416 813726 851073 862290 843031 925705 923490 890800 887183
3801 887183 873771 919210 951902 938434 959339 963840 983312 943385 958936 1023138 988084 990846
3789I90846N4289L5998M5677k7862j1879L802n952N6232r758l9631K0134K7146
3777A139042M4798n3075j5104J2739k5961N4974j916J5168N1031K0419J3803J0427
3765A266345L4107K2996L1977K8786J3956M1980Q8918J3414j6846j4097L3113
3754A544649M6530j024j4011J4275L7677n216L1061n200K894n917J8060N2728
3742A716506K8065R8829k4923k0524O1092L8959P685k0721J5601N9428P5647L8018
3730B073662N76o864N1872j989K6020K6606L6622P7128L464N0771O2558J655M1799
3717B443880j9241p838P014J1137n1760j08478n451N4181m654K7027K6930O3169
3705B435916L6996O2969N1179M0556N71J2012M6317L2013N8926K1527J3538L4908
$$ plain form
3789 990846 1045135 1081133 1126810 1098948 1087069 1090871 1084919 1141151 1131393 1091762 1111896 1139042
3777 1139042 1183840 1130765 1115661 1128400 1102439 1157413 1155497 1170665 1221696 1242115 1255918 1266345
3765 1266345 1300452 1323448 1355425 1384211 1398167 1440147 1529065 1542479 1525633 1511536 1544649
3754 1544649 1591179 1590155 1576144 1590419 1628096 1622880 1653941 1648741 1651635 1645718 1663778 1716506
3742 1716506 1744571 1843400 1818477 1797953 1859045 1898004 1905689 1884968 1900569 1959997 2035644 2073662
3730 2073662 2074238 2067374 2119246 2117257 2143277 2169883 2206505 2283633 2287097 2337868 2400426 2402081 2443880
3717 2443880 2424639 2416801 2423815 2434952 2383192 2274714 2269263 2323444 2318790 2345817 2372747 2435916
3705 2435916 2472912 2535881 2587060 2627616 2628187 2640199 2686516 2718529 2777455 2798982 2812520 2847428
3693B847428L5827k5132l0647j8284q027J9563r726l7218o834L7613R3J0129O2018
3680B876803L2951O4499J0302J13387J04647J07509N3974O219M4288M3086j5667
3669C441998L593n0353o4848N466m4853m598K0161P8081M6644J9661J12480P8182
3657C641614Q1822P0672K8081P8076K9597N4667N3295J5494R3335J5737M0205
3646D202595J25985O0847R2279N3510J13533J82155J84263J71694J19024Q6194
3636E392079J09962K19155L00461L78376M90395O18872P57629R29356J172114
3627A0368399J174918P36711n28001j385758j442084j202443r53011o67513n66809
3618E534409l92594k60798k92390j66995j05801l2281p8301r8316o5614j30652
$$ plain form
3693 2847428 2883255 2858123 2827476 2809192 2801165 2820728 2811002 2773784 2766950 2804563 2804656 2814785 2876803
3680 2876803 2909754 2974253 2984555 3097942 3202589 3310098 3364072 3370291 3414579 3457665 3441998
3669 3441998 3445591 3395238 3330390 3335856 3291003 3286405 3306566 3384647 3431291 3450952 3563432 3641614
3657 3641614 3723436 3794108 3822189 3900265 3929862 3984529 4037824 4053318 4146653 4162390 4202595
3646 4202595 4328580 4389427 4481706 4535216 4648749 4830904 5015167 5186861 5305885 5392079
3636 5392079 5502041 5721196 6021657 6400033 6890428 7509300 8266929 9196285 10368399
3627 10368399 11543317 12280028 11752027 10366269 8924185 7721742 6768731 6101218 5534409
3618 5534409 5141815 4881017 4588627 4421632 4315831 4283550 4205249 4106933 4041319 3910667
3608C910667j49331j39983j85191k12572j66081q9363j05711j39068q2934p4166
3598B566267r9625k1215r4275m5631o8447m7586m0627k5576k6439n5037o9462
3587A972347j5016p9441p2320l8575j9341m944j01346J2153N655n7698k2239J3662
3575A592897L7666n69k0684n6266m9234m271M8557o1411m8590J7844l2479m7440
3563A376020l4296M6664m0967k5058j9308k1903l4059o303K0034k6608k578p630
3551A224008L7775j12667j6193L7296k6783K7408k044N717j7675l9157j5007K033
3539A104711K5118j7377o2629j9295M0696L4083k2117n3624M0640j773K661O6852
3527A137946j3511L4264M522o438m3825m1917P2821J9117j7732k4486k7173N3054
$$ plain form
3608 3910667 3761336 3621353 3436162 3223590 3057509 2968146 2862435 2723367 2640433 2566267
3598 2566267 2466642 2445427 2351152 2305521 2237074 2189488 2148861 2123285 2096846 2041809 1972347
3587 1972347 1957331 1877890 1805570 1766995 1747654 1742710 1641364 1653517 1659172 1601474 1579235 1592897
3575 1592897 1630563 1629994 1609310 1553044 1503810 1499539 1548096 1486685 1438095 1455939 1423460 1376020
3563 1376020 1341724 1388388 1347421 1322363 1303055 1281152 1247093 1240790 1260824 1234216 1231638 1224008
3551 1224008 1261783 1149116 1132923 1170219 1143436 1170844 1168800 1174517 1156842 1117685 1102678 1104711
3539 1104711 1129829 1112452 1049823 1030528 1071224 1105307 1083190 1029566 1070206 1068433 1071094 1137946
3527 1137946 1124435 1158699 1163221 1156783 1112958 1071041 1143862 1162979 1145247 1120761 1093588 1146642
3515A146642k2954K407K2437j9211K2241J5549J9374K721N5862M5799j6711J1162
3503A285318P3045J212O131O0532m969K8406k3275j5679j5834K7236M7183k180
3491A467126j1583Q855P6323l9263L5646O0203M8611K3210N3171J08229P4622
3480A905150J37389R8713N9857K9870m220N193l0269n3598l2005p1453p2795m5739
3468A926093o8331n9187o6869J9815j7987p5741M1440R813j406K9523L4883J9755
3456A791801L0079K8881O2747J04196K10451R5093P1418N4899Q5308N0927o0056
3445B525744l7729r2075l6768p4846j08455j48747r0003j9863o1661j09216m0584
3434A705797J0153l0245Q372K3019k2117o3217P974L7090N7397O8133j4930j2435
$$ plain form
3515 1146642 1123688 1126095 1148532 1129321 1151562 1167111 1186485 1189206 1245068 1290867 1274156 1285318
3503 1285318 1358363 1359575 1365706 1426238 1421269 1449675 1426400 1410721 1394887 1422123 1469306 1467126
3491 1467126 1455543 1464398 1540721 1501458 1537104 1597307 1645918 1669128 1722299 1830528 1905150
3480 1905150 2042539 2141252 2201109 2230979 2226759 2231952 2201683 2148085 2116080 2044627 1971832 1926093
3468 1926093 1857762 1798575 1731706 1751521 1733534 1657793 1699233 1709046 1707640 1737163 1772046 1791801
3456 1791801 1821880 1850761 1913508 2017704 2228155 2323248 2394666 2449565 2534873 2585800 2525744
3445 2525744 2488015 2395940 2359172 2284326 2175871 2027124 1937121 1917258 1855597 1746381 1705797
3434 1705797 1715950 1685705 1694077 1717096 1694979 1631762 1639736 1676826 1734223 1802356 1787426 1774991
3422A774991N6015O5760N0542j2227m855P860P9156o3514k4097L7112l5674Q650
3410A939719n112q3028l910O4173j1594J2873M9938Q1659L4019M5508Q4781J04395
3398B313421J19618O5529J02068J31046J66044J55333J21607J11825O3189l9318
3388C310362j15517r9599k7326J9985m6365O2511K8419O7319J38764R2560J03831
3377C534944J45209J35569J66000J68344K37378L19098L09350L83508K54440M9872
3367E703712k65502m84092m03804l59024l48362l30600k72286k23660j08566j29544
3357B778272k09591j16771j00010q7059o3572L350m4029q3020r1408j2575o661
3346A966926l4998j3725j9806K7491l2195L6516k3222k8519n303J1601k4164l9092
$$ plain form
3422 1774991 1831006 1896766 1947308 1935081 1930226 1938086 2017242 1953728 1929631 1966743 1931069 1939719
3410 1939719 1934607 1851579 1847669 1911842 1900248 1913121 1963059 2044718 2078737 2124245 2209026 2313421
3398 2313421 2433039 2498568 2600636 2731682 2897726 3053059 3174666 3286491 3349680 3310362
3388 3310362 3194845 3095246 3067920 3087905 3041540 3104051 3132470 3199789 3338553 3431113 3534944
3377 3534944 3680153 3815722 3981722 4150066 4387444 4706542 5015892 5399400 5653840 5703712
3367 5703712 5438210 4954118 4550314 4191290 3842928 3512328 3240042 3016382 2907816 2778272
3357 2778272 2568681 2451910 2351900 2264841 2201269 2204619 2160590 2077570 1986162 1973587 1966926
3346 1966926 1931928 1918203 1898397 1925888 1893693 1930209 1906987 1878468 1873165 1884766 1860602 1821510
3334A821510J2766l0858j6360O229k9226k3911m4490m7592q296M8299L7754j6959
3322A708866l8506o351J6116M5011m8395k2929J1627R705L8445L3345k4487J590
3310A724037J7215o2989n3576K9054J5253n9884L0593K7272l2776o3863m7279
3299A523057L9162m1971m761M6034n0484l8762n444L0829j3161J6265M7881P909
3287A556554k6598K9426K0950l142j1444n1770j0224k4714K5256k5851l7399j476
3275A439568M0274L1232l9999k423K8234K3936j3711L3727q4291k1521J4007p8842
3263A370191q424M9026l3523o6100K1249M9916L183o7857K8689j6960m0707P235
3251A295918j9441L5426l2424M8380L1186l4291l88L7372k7464k5760K1024K0970
$$ plain form
3334 1821510 1834276 1803418 1787058 1793287 1764061 1740150 1695660 1648068 1639772 1688071 1725825 1708866
3322 1708866 1670360 1664009 1680125 1725136 1676741 1653812 1665439 1675144 1713589 1746934 1722447 1724037
3310 1724037 1741252 1678263 1624687 1653741 1668994 1609110 1639703 1666975 1634199 1570336 1523057
3299 1523057 1562219 1520248 1515487 1561521 1511037 1472275 1466831 1497660 1484499 1500764 1548645 1556554
3287 1556554 1529956 1559382 1580332 1577190 1565746 1513976 1503752 1479038 1504294 1478443 1441044 1439568
3275 1439568 1479842 1511074 1471075 1468652 1496886 1520822 1507111 1540838 1456547 1435026 1449033 1370191
3263 1370191 1361767 1410793 1377270 1311170 1332419 1382335 1385518 1317661 1346350 1329390 1288683 1295918
3251 1295918 1276477 1311903 1279479 1327859 1359045 1324754 1324366 1361738 1334274 1308514 1329538 1350508
3239A350508l1444J8148L8162l9372J19M7096K4915q427L9789K6499r350J6133
3227A472776j1176m2399q877O2263m5730M884J6500N124p182j7368N7165k8775
3215A457205L4132O2663M8853j9550K7397P1463j7070m6876L7391K4435m6746
3204A633297j4086N0009N5897n461j8301P0107K9682P2848N0240K3076k236N2999
3192A998071L2944m2393P945N7935M3873o0241J8600L2895N1366R9937O2381M3716
3180B347029P1812J11126J42711J15505K00037K15673J22098L9756j19058k04982
3170C041707k08529j42763j48475k11211p5606k5054n5495r3145j5634P3655J218
3159B140668p9664N5428R5171L7030Q456l5533m5679m678P4336m0707O364J01635
$$ plain form
3239 1350508 1319064 1337212 1375374 1336002 1336121 1383217 1408132 1399705 1439494 1465993 1456643 1472776
3227 1472776 1461600 1419201 1410324 1472587 1426857 1431741 1448241 1453365 1446183 1428815 1485980 1457205
3215 1457205 1491337 1554000 1602853 1583303 1610700 1682163 1665093 1618217 1655608 1680043 1633297
3204 1633297 1619211 1669220 1725117 1719656 1701355 1771462 1801144 1873992 1924232 1947308 1945072 1998071
3192 1998071 2031015 1988622 1996567 2054502 2098375 2038134 2056734 2089629 2140995 2240932 2303313 2347029
3180 2347029 2418841 2529967 2672678 2788183 2988220 3203893 3325991 3365747 3246689 3041707
3170 3041707 2833178 2690415 2541940 2330729 2255123 2230069 2174574 2081429 2065795 2139450 2140668
3159 2140668 2061004 2116432 2211603 2248633 2257089 2221556 2175877 2171199 2245535 2204828 2211192 2312827
3147B312827M1731J9729K8665J42033Q4423J07483J27032J42076J64334J25084
3137C295417k2571j52573j44220j78511j77308j75679m9415l4181q5349q1778
3127B193832l6990l9988m4324M7864j4546o9147J2932K9867J1853k6559J4423
3116B079217j4263K255O681k9035k9338j4169k0281O0410K9481M283L4973j2806
3104B097408K1745P6341L2848l0813J4208Q2502L9883Q745O7243K5634k6397O3216
3092B472563L6011K5230R863N5606j0921l1501p076J8303K3414j6466M0101l7371
3080B577756l0128N6492M9939m4727L1956R8166J8130N111N867L6139j1035O1823
3068B855489N3738K5144K4216M5212M5303L0739N4265N8937Q7457j5569R7795
$$ plain form
3147 2312827 2354558 2374287 2402952 2544985 2629408 2736891 2863923 3005999 3170333 3295417
3137 3295417 3272846 3120273 2976053 2797542 2620234 2444555 2395140 2360959 2275610 2193832
3127 2193832 2156842 2116854 2072530 2120394 2105848 2036701 2049633 2079500 2091353 2064794 2079217
3116 2079217 2064954 2067209 2073890 2044855 2015517 2001348 1981067 2041477 2070958 2075241 2110214 2097408
3104 2097408 2119153 2195494 2228342 2197529 2211737 2294239 2334122 2342867 2410110 2435744 2409347 2472563
3092 2472563 2508574 2533804 2543667 2599273 2588352 2556851 2549775 2568078 2591492 2575026 2615127 2577756
3080 2577756 2547628 2604120 2654059 2609332 2641288 2739454 2757584 2762695 2768562 2804701 2793666 2855489
3068 2855489 2909227 2934371 2958587 3003799 3049102 3079841 3134106 3193043 3280500 3264931 3362726
3057C362726J07109J7340m221N7040K4575N7768O3174l3635j9102J15643J34536
3046C882953P650M6212P6410P7001O6270J6244Q9189Q9035O7539N4747Q6015J21414
3034D680679J29970J17805N3037R8430J78422J15841Q7394J84212J66596J77665
3024E990051J30619J41502R0108J37388K21632J87615K64232K71141L06713J96010
3014G937011J53730K30243J98560J74261K45319L06816L90886N25364N56620O67469
3004A1386279Q02743J007781J128100J153187J148908Q56635M49130j04732m56722
2995A7371309n26675l96040j43632Q9300M31881O84893R55619J153856J176425
2986B0796936J068928P49797K16182k77401n17989o10219o39945l70452j10566
$$ plain form
3057 3362726 3469835 3487175 3482954 3539994 3564569 3622337 3685511 3651876 3632774 3748417 3882953
3046 3882953 3890603 3936815 4013225 4090226 4156496 4172740 4261929 4350964 4418503 4473250 4559265 4680679
3034 4680679 4810649 4928454 4981491 5079921 5258343 5374184 5461578 5645790 5812386 5990051
3024 5990051 6120670 6262172 6352280 6489668 6711300 6898915 7163147 7434288 7741001 7937011
3014 7937011 8090741 8320984 8519544 8693805 8939124 9245940 9636826 10162190 10718810 11386279
3004 11386279 12189022 13196803 14324903 15478090 16626998 17483633 17932763 17828031 17371309
2995 17371309 16844634 16448594 16304962 16394262 16826143 17511036 18466655 19620511 20796936
2986 20796936 21865864 22615661 22831843 22554442 22036453 21426234 20786289 20415837 20305271
2977B0305271P4231M99577P65950J063752J392191J509059J264175P81074J3336
2968B7668616p69463j301174j581559j505432j195422q35500n95464k51343N0590
2959A9683849L97100P10366Q42620Q05947M45350j41416r06025j361951j621354
2950A8854486j585871j424206j129587q99753o86580l84102k29062o718J32013
2941A2640620J43465N6177j87294m91750p65725q54065r21631p83246o81240n75935
2931G579376m50868l73939k89434k53693j27229j74622j54305j06815j35862j96459
2921E316150k45261k68719k05347k16749j64179j67324q9301j10203j46009r1679
2911C611379r2164q3965n9632q5134p6370n649n4602o5757j581n7355o3692l851
$$ plain form
2977 20305271 20379502 20879079 21645029 22708781 24100972 25610031 26874206 27655280 27668616
2968 27668616 26899153 25597979 24016420 22510988 21315566 20480066 19884602 19633259 19683849
2959 19683849 20080949 20791315 21633935 22439882 22885232 22743816 21837791 20475840 18854486
2950 18854486 17268615 15844409 14714822 13815069 13128489 12744387 12515325 12508607 12640620
2941 12640620 12784085 12840262 12652968 12161218 11395493 10541428 9619797 8836551 8155311 7579376
2931 7579376 7128508 6754569 6465135 6211442 6084213 5909591 5755286 5648471 5512609 5316150
2921 5316150 5070889 4802170 4596823 4380074 4215895 4048571 3959270 3849067 3703058 3611379
2911 3611379 3519215 3435250 3375618 3290484 3214114 3208465 3153863 3088106 3086525 3029170 2965478 2961627
2899B961627m3503r4494r784o5039l3838M828l2797K232k9526k3400k4540O760
2887B618526K1410j442J4253k3807k540K470j9378m6191j8335n2802j0446k004
2875B479714M329j5923m1251l9721m5546K263K2154P181J7343l253K919k4893
2863B365316j0093n56J0106P60j9776J126l6170o074r866q400P228L0030l1462
2850B292169M1039m301l5703j7318L1471J5819n4596l3594R668n088J6943M009
2838B260518k1969K637k7518l9K2035J0260M3935j9061k8114K1763O1319N117
2826B330883n5439m4340l552j1724j9591J3030k9886Q1107m904k6787J664P3504
2814B303965L7589J9500O6745j5230M3828m0661O526J3899l996O240K1113l4492
$$ plain form
2899 2961627 2918124 2823630 2813846 2748807 2714969 2719797 2687000 2689232 2659706 2636306 2611766 2618526
2887 2618526 2639936 2638494 2652747 2628940 2626400 2628870 2609492 2563301 2544966 2492164 2481718 2479714
2875 2479714 2484043 2468120 2426869 2387148 2341602 2343865 2366019 2373200 2390543 2387290 2390209 2365316
2863 2365316 2355223 2354667 2364773 2365533 2345757 2346883 2310713 2304639 2294773 2286373 2293601 2323631 2292169
2850 2292169 2333208 2328907 2293204 2275886 2307357 2323176 2268580 2234986 2244654 2239566 2256509 2260518
2838 2260518 2238549 2241186 2213668 2213629 2235664 2245924 2289859 2270798 2242684 2264447 2325766 2330883
2826 2330883 2275444 2231104 2227552 2215828 2196237 2209267 2179381 2260488 2255584 2228797 2230461 2303965
2814 2303965 2341554 2361054 2427799 2412569 2456397 2415736 2422262 2436161 2432165 2438405 2459518 2425026
2802B425026j8639O8986k6465o8815R025n019J5714J945J4836K7570L8188J8707
2790B501059k7056L2511O2022J9600K610J8858J8207L1086k5516m671K7977J2422
2778B669109K3432J7578L1654L1717O8986L6060L036o077l7081J0002Q6771J7153
2766B952340J3846j5436K1901l96M4962M8789j0360N1620q17O1375N9592Q6382
2754C313798L4536L2266L0307K7316K9401L1900M554N7699Q5196O5085J2058O279
2742C730395O8776O3480R5027R2688K8667O9293M9906Q4204R5776R070L4317P3285
2730D494884M9864M2588P6394K6456J6319N4615O3409N4668R1566N6436Q6897
2719E114096J28577J21997O5991J4011Q0363P8905J10860P4035O4306Q0240N5098
$$ plain form
2802 2425026 2406387 2475373 2448908 2380093 2389118 2384099 2399813 2401758 2416594 2444164 2482352 2501059
2790 2501059 2474003 2506514 2568536 2588136 2590746 2609604 2627811 2658897 2633381 2628710 2656687 2669109
2778 2669109 2692541 2710119 2741773 2773490 2842476 2878536 2881572 2875495 2838414 2848416 2935187 2952340
2766 2952340 2966186 2950750 2972651 2972255 3017217 3066006 3055646 3107266 3106449 3167824 3227416 3313798
2754 3313798 3348334 3380600 3410907 3438223 3467624 3499524 3504078 3561777 3646973 3712058 3724116 3730395
2742 3730395 3799171 3862651 3957678 4050366 4079033 4148326 4198232 4282436 4378212 4387282 4421599 4494884
2730 4494884 4544748 4587336 4663730 4690186 4706505 4761120 4824529 4879197 4970763 5027199 5114096
2719 5114096 5242673 5364670 5430661 5444672 5525035 5603940 5714800 5788835 5853141 5933381 5988479
2708E988479P5619R0311N4821J25609J37828L7953Q8423J23362J35523P5743Q4612
2697G018283N8079J03274J75937J19267R9003J10988J63129J49213J28263J19389
2687H244825J18504K03283J76276K11026K27278J97951J82927K25568K15130K38884
2677A0241652K63826J92263K42859K82754L77070L13367L01569L07007L22081
2668A2844448M37143M22095M10233M18358M36811N23592N10357M98346N14859
2659A7016242O08051O37635O31710O75534P01728P68050Q07259P86885Q50777
2650B3483871R55591R45883R77357J083651J198696J246602J282368J313303J327779
2641C3815101J464770J529357J582911J632904J621913J653023J682979J576449
$$ plain form
2708 5988479 6064098 6154409 6209230 6334839 6472667 6510620 6599043 6722405 6857928 6933671 7018283
2697 7018283 7076362 7179636 7355573 7474840 7573843 7684831 7847960 7997173 8125436 8244825
2687 8244825 8363329 8566612 8742888 8953914 9181192 9379143 9562070 9787638 10002768 10241652
2677 10241652 10505478 10697741 10940600 11223354 11600424 11913791 12215360 12522367 12844448
2668 12844448 13281591 13703686 14113919 14532277 14969088 15492680 16003037 16501383 17016242
2659 17016242 17624293 18261928 18893638 19569172 20270900 21038950 21846209 22633094 23483871
2650 23483871 24439462 25385345 26362702 27446353 28645049 29891651 31174019 32487322 33815101
2641 33815101 35279871 36809228 38392139 40025043 41646956 43299979 44982958 46559407
2633D6559407J480633J447439J315797J043222Q67591O33497L46597M9270k95749
2624E3447704o33847q77325j044647j316022j552437j703059j673507j736542
2616D2910318j823265j860544j778764j625424j641792j550577j514763j410631
2608B9704558j302639j284068j214773j132143j035911j052283r96070r64395
2600B0722276q29391p83163p45622p69754o94911o20885n97610n83193n56466
2591A4541281m45799m22673m52504n00712l68741k67467l75310l50167l55174
2582A1002734l11517k96977k73104l17155k83019k16864j92487k47778k53545
2573H610288k03521j57962j68230k17957j31360j38856j11595j88445j54968j50111
$$ plain form
2633 46559407 48040040 49487479 50803276 51846498 52714089 53347586 53694183 53743453 53447704
2624 53447704 52813857 51936532 50891885 49575863 48023426 46320367 44646860 42910318
2616 42910318 41087053 39226509 37447745 35822321 34180529 32629952 31115189 29704558
2608 29704558 28401919 27117851 25903078 24770935 23735024 22682741 21686671 20722276
2600 20722276 19892885 19109722 18364100 17594346 16899435 16278550 15680940 15097747 14541281
2591 14541281 14095482 13672809 13220305 12719593 12350852 12083385 11708075 11357908 11002734
2582 11002734 10691217 10394240 10121136 9803981 9520962 9304098 9111611 8863833 8610288
2573 8610288 8406767 8248805 8080575 7862618 7731258 7592402 7480807 7292362 7137394 6987283
2563F987283n1956j12552j95250j29467n7489r0611j34458o9051j21950o9060
2553E955439q9736j17388j11179n0712n2981j17195n3978r4149q465n3632r8480
2542E107544o2179r0698p3725o1308o9376o8112j4843N266q3194q7772j5959k5814
2530D459830q4785o5649l8112R607n2258p0670o0743r2316m7430p9689r1201o3149
2518C723435q370K974p9745p456o55o5162n315P151k1948l4570o205J3839l5300
2505C482673j1150j2799J6285m1041j5035K4284M4632K751j635P8338k2046L4259
2493C579516K5746K5215m2381J9219l739n6715o7439O500K1820n4452J6105l8812
2481C430583L1317M4180P1920M5157r730R9104m153k9240O3161Q1639L9939r481
$$ plain form
2563 6987283 6935327 6822775 6627525 6498058 6440569 6349958 6215500 6146449 6024499 5955439
2553 5955439 5865703 5748315 5637136 5586424 5533443 5416248 5362270 5268121 5259656 5206024 5107544
2542 5107544 5045365 4954667 4880942 4819634 4750258 4682146 4667303 4672569 4589375 4501603 4485644 4459830
2530 4459830 4375045 4309396 4271284 4280891 4228633 4157963 4097220 4004904 3957474 3877785 3786584 3723435
2518 3723435 3715065 3718039 3638294 3630838 3630183 3565021 3559706 3566857 3544909 3510339 3504134 3517973 3482673
2505 3482673 3471523 3458724 3475009 3433968 3418933 3443217 3487849 3490600 3488965 3567303 3545257 3579516
2493 3579516 3605262 3630477 3588096 3607315 3603576 3546861 3479422 3485922 3507742 3453290 3469395 3430583
2481 3430583 3461900 3506080 3578000 3623157 3613427 3712531 3708378 3679138 3742299 3823938 3863877 3854396
2469C854396M2209M9734M2371M6698l620N894Q1989N0553j3561J2592k0470j588
2457D147197m9080l791k5957L628l5683m4795K0736j5678m1380P624p0872l0194
2445C861755M3402o727p9718j2152N5900l0808N971j08j8966k725L1917O643K6734
2432C881118L1390K4139M0706L7821O1324Q6770j4729M8218R8527M2198k4542
2421D312940K7066K1055M8198j4342J7756J5855L6601R2230J0192N6652Q6114
2410D710317Q2183O1999N0935M7646Q0713O1642N0916N6082K6745J9306j3205
2399E235279J0848K6896P8141K6385m4993K6718L2041M6988M5010M3303P3093
2388E599709M5668Q1625L7474o444J03290R6365R9599L2853K8741J44255J00725
$$ plain form
2469 3854396 3896605 3946339 3988710 4035408 4031788 4037682 4119671 4170224 4156663 4169255 4148785 4147197
2457 4147197 4098117 4094326 4068369 4071997 4036314 3991519 4012255 3996577 3955197 3962821 3891949 3861755
2445 3861755 3905157 3898430 3818712 3806560 3862460 3831652 3837623 3837515 3818549 3815824 3847741 3854384 3881118
2432 3881118 3912508 3936647 3977353 4015174 4076498 4163268 4148539 4196757 4295284 4337482 4312940
2421 4312940 4340006 4361061 4409259 4394917 4412673 4428528 4465129 4557359 4567551 4624203 4710317
2410 4710317 4792500 4854499 4905434 4953080 5033793 5095435 5146351 5202433 5229178 5248484 5235279
2399 5235279 5246127 5273023 5351164 5377549 5332556 5359274 5391315 5438303 5483313 5526616 5599709
2388 5599709 5645377 5727002 5764476 5758032 5861322 5957687 6057286 6090139 6118880 6263135 6363860
2377F363860O8917J06742J16039P2383O8796J02349R3212O4974J15625J52535
2367G325432J05998J67877K18043J39848J48350K18666K58102K34708K13496K85611
2357I316131L31136K92993L50041L43661L43198M21005M08521L50044L23936M33476
2347A2914142L62405L42693M33448M40778M80909N16260N55182N71784O99059
2338A7316660Q41913Q95800R60217J102685J240870J361360J591801J813762K092178
2329B9217246K367485K738485L209882L606197L985762M242134M296748M106816
2321E7770755L616220K944378K128533J389184P33048J5222n86201j065555j348662
2312F5596922j215527p50142j95851K56478N65709P49712P05891M39221k534o30200
$$ plain form
2377 6363860 6432777 6539519 6655558 6727941 6796737 6899086 6992298 7057272 7172897 7325432
2367 7325432 7431430 7599307 7817350 7957198 8105548 8324214 8582316 8817024 9030520 9316131
2357 9316131 9647267 9940260 10290301 10633962 10977160 11398165 11806686 12156730 12480666 12914142
2347 12914142 13276547 13619240 14052688 14493466 14974375 15490635 16045817 16617601 17316660
2338 17316660 18158573 19054373 20014590 21117275 22358145 23719505 25311306 27125068 29217246
2329 29217246 31584731 34323216 37533098 41139295 45125057 49367191 53663939 57770755
2321 57770755 61386975 64331353 66459886 67849070 68582118 68597340 68011139 66945584 65596922
2312 65596922 64381395 63631253 63435402 63691880 64257589 65007301 65713192 66152413 66149879 65519679
2302F5519679j310364k025192k715688l327692l828315m092731m140473m016079
2294D0063145l666079l301533k964466k504362k060275j699532j476980j276321
2286B1113597j061416r89341q22078o82068o41533n90344n53411m75476l98748
2277A4899182l53562k99982k85096k98056k37630j81118j04950j39638j58713
2268A2840437j24609r6018m6629l4774n7898q0753q193M0936l2890o4820K2167
2257A2356956k9325K3205L2302m914K8563L4077P8272P7548Q7549J21551Q3656
2246A2889440Q3853J01631J60396J02656O4200R6499J03569J08655J56304J52155
2236A4019358J22459J96703K03537J97127J99643K72743K70670K44073K47885
$$ plain form
2302 65519679 64209315 62184123 59468435 56140743 52312428 48219697 44079224 40063145
2294 40063145 36397066 33095533 30131067 27626705 25566430 23866898 22389918 21113597
2286 21113597 20052181 19062840 18240762 17558694 16917161 16326817 15773406 15297930 14899182
2277 14899182 14545620 14245638 13960542 13662486 13424856 13243738 13138788 12999150 12840437
2268 12840437 12715828 12619810 12573181 12538407 12480509 12399756 12391563 12432499 12399609 12334789 12356956
2257 12356956 12327631 12350836 12383138 12378224 12406787 12440864 12519136 12596684 12684233 12805784 12889440
2246 12889440 12973293 13074924 13235320 13337976 13402176 13498675 13602244 13710899 13867203 14019358
2236 14019358 14141817 14338520 14542057 14739184 14938827 15211570 15482240 15726313 15974198
2227A5974198L34415K91017K29250K53886K13362K25908K54054K21231J57942
2218A8155263J49437K88917K86064K58508K31535K79390L01570L09013L02226
2209B0561923K99814K68098L24025K66099K73328L77529L77177L59401L49541
2200B3456935M70843N70351N81693O50932Q09506Q86230J006198J068709J123489
2191C0624886J233369J381977J522980J564840J634110J765826J934330K116014
2183D3778332K222250K251916K278205K259971K244363K321549K454708K767503
2175F2578797K966948L335682L836103M377836N044034N743323O469148P016647
2167A01368518P308660P244540O847880O223807N404981M337311L027999J765531
$$ plain form
2227 15974198 16308613 16599630 16828880 17082766 17296128 17522036 17776090 17997321 18155263
2218 18155263 18304700 18593617 18879681 19138189 19369724 19649114 19950684 20259697 20561923
2209 20561923 20861737 21129835 21453860 21719959 21993287 22370816 22747993 23107394 23456935
2200 23456935 23927778 24498129 25079822 25730754 26540260 27426490 28432688 29501397 30624886
2191 30624886 31858255 33240232 34763212 36328052 37962162 39727988 41662318 43778332
2183 43778332 46000582 48252498 50530703 52790674 55035037 57356586 59811294 62578797
2175 62578797 65545745 68881427 72717530 77095366 82139400 87882723 94351871 101368518
2167 101368518 108677178 115921718 122769598 128993405 134398386 138735697 141763696 143529227
2159A43529227N60123l69409q62723p91173l69207K06457P92939J091486J169756
2150A44957476J088331Q19065L37364n37723j671263k889043m082401n062506
2142A32959300n824236o144097o063684n663625n065313m383648l545657k509700
2134I3759340j403876k29551R92927K083419K998130L639042M091163M219146
2126A10149740M088924L703933L083456K527299J905126J068609J12041q35577
2118A25803551j500554j752156j860791j981830j957172j826163j630394j292773
2110A12001718j032171p43352n58913m43480n86133q70489j288420j819802k440870
2101A02218088l039052l594026m175725m706659n075470n129937n136826m961920
$$ plain form
2159 143529227 144089350 143719941 142857218 142066045 141696838 141903295 142696234 143787720 144957476
2150 144957476 146045807 146864872 147202236 146664513 144993250 142104207 138021806 132959300
2142 132959300 127135064 120990967 114927283 109263658 104198345 99814697 96269040 93759340
2134 93759340 92355464 92125913 93118840 95202259 98200389 101839431 105930594 110149740
2126 110149740 114238664 117942597 121026053 123553352 125458478 126527087 126639128 125803551
2118 125803551 124302997 122550841 120690050 118708220 116751048 114924885 113294491 112001718
2110 112001718 110969547 110226195 109667282 109223802 108637669 107767180 106478760 104658958 102218088
2101 102218088 99179036 95585010 91409285 86702626 81627156 76497219 71360393 66398473
2093F6398473m667248m350155l964772l574133l181393k903896k597988k302510
2085C8856378k124989j953841j700044j522566j359996j216382j111806j010897
2077B6855857r09732p95694p37702o29927n02699m50225m18717l99439l10331
2068B1701391j95206j96272r6656n8443k0099K5913J32236K33975K85589L69666
2058B2182094M57526M38183N25519N93716O40739O80792O72617O50579N81447
2049B7423212L22752M6018j23779k13042k68819m32356n15047o17068o29590p01617
2039B4290664p47095p71981p34052o88487o66446m86488l68213k01760k76310
2030A9349832l50627m43773n66992n38151m84111l14352k16605j28778m8780k0729
$$ plain form
2093 66398473 61731225 57381070 53416298 49842165 46660772 43756876 41158888 38856378
2085 38856378 36731389 34777548 33077504 31554938 30194942 28978560 27866754 26855857
2077 26855857 25946125 25150431 24412729 23782802 23280103 22829878 22411161 22011722 21701391
2068 21701391 21506185 21309913 21213257 21154814 21134715 21160628 21292864 21526839 21812428 22182094
2058 22182094 22639620 23077803 23603322 24197038 24837777 25518569 26191186 26841765 27423212
2049 27423212 27745964 27791982 27668203 27455161 27186342 26753986 26238939 25621871 24992281 24290664
2039 24290664 23543569 22771588 22037536 21349049 20682603 20196115 19827902 19626142 19349832
2030 19349832 18999205 18555432 17988440 17450289 16966178 16651826 16435221 16306443 16257663 16236934
2020A6236934M1880L1137p9366J8100Q8964J38635J84354J74822K72126L40174
2010A7447760L58613M53891M41709N41670O12285O80176P51939Q03972R81669
2001B3073684J094042J160610J445862J640323J921597K237423K568096K975410
1993C8117047L403436L841884M115519M340089M351818M194052L906995L835396
1985G0106236L832724L859013L679778L102626K050569Q08704k03581j147457
1977H6088612j930312k616169l424663m119399m625286n065286n240233n182430
1969E3884834m977887m621969m297350l903144l452314l083840k693652k262054
1961B4592624j890451j630338j461796j262539j094281r55912q39419p64228o70820
$$ plain form
2020 16236934 16278814 16309951 16230585 16248685 16337649 16476284 16660638 16835460 17107586 17447760
2010 17447760 17806373 18260264 18701973 19243643 19855928 20536104 21288043 22092015 23073684
2001 23073684 24167726 25328336 26774198 28414521 30336118 32573541 35141637 38117047
1993 38117047 41520483 45362367 49477886 53817975 58169793 62363845 66270840 70106236
1985 70106236 73938960 77797973 81477751 84580377 86630946 87439650 87236069 86088612
1977 86088612 84158300 81542131 78117468 73998069 69372783 64307497 59067264 53884834
1969 53884834 48906947 44284978 39987628 36084484 32632170 29548330 26854678 24592624
1961 24592624 22702173 21071835 19610039 18347500 17253219 16297307 15457888 14693660 14022840
1952A4022840n98467n43558m75235m85079m27990l61593l58467l33646k85344
1943A0153461k55588k41252k17331j56326k46676k04005j65924j44064j13198
1934H409097j02224m3866m1275m0589j476P707K2336M6114N2555N3846N5553O0258
1922H478036Q0214L3269L8450M9267Q494J1378n1180j1335j17650j91957j85617
1911H141369k12154k11508k31111k32295k46105k03420j64503j60698j85259j12855
1901F181461o5458j29371n9462r1491p3546k6155j1796p6965n6257o8512p9900
1890E442548j04743o6460l3928k503K3148j480P2099L4161K5551J8732n9807m1290
1878E306028J4430k5204o6064J1209J1011l0580n8555m427p552O9378P3540O4166
$$ plain form
1952 14022840 13424373 12880815 12405580 11920501 11492511 11130918 10772451 10438805 10153461
1943 10153461 9897873 9656621 9439290 9282964 9036288 8832283 8666359 8522295 8409097
1934 8409097 8306873 8263007 8221732 8181143 8179667 8187374 8209710 8255824 8308379 8362225 8417778 8478036
1922 8478036 8558250 8591519 8629969 8679236 8687730 8699108 8647928 8636593 8518943 8326986 8141369
1911 8141369 7929215 7717707 7486596 7254301 7008196 6804776 6640273 6479575 6294316 6181461
1901 6181461 6116003 5986632 5927170 5835679 5762133 5735978 5724182 5647217 5590960 5522448 5442548
1890 5442548 5337805 5271345 5237417 5234914 5258062 5256582 5328681 5362842 5388393 5407125 5347318 5306028
1878 5306028 5320458 5295254 5229190 5240399 5251410 5220830 5162275 5157848 5150296 5219674 5293214 5357380
1866E357380N7610Q2929J10909R6982Q0538Q7990R9918N2652M6906P4128R4855
1855F242797O2917N1401M1189K6674M4278N2394O1110R9656R8735L8645k2469
1844F797327K3460P8250P3250Q9868J25380J18153J17469Q7740P3224J06735M4747
1833G735603R3412R1871P4835J34589J33177J95324K03387K58883J81268J57741
1823I260090J54575J04014J27181J48133J23049J34698J17595J40457K06404J82075
1813A0698271K07294K65906K16658J85494J77501J45972J63711J23876R0420J48714
1803A2423817R6189J31447R6896J32672R8421J73610J85179J43800K14430K71858
1793A3968319K29264K34456L23715L03221L19686L10219L62334K80371K36448
$$ plain form
1866 5357380 5414990 5497919 5608828 5705810 5786348 5874338 5974256 6026908 6073814 6147942 6242797
1855 6242797 6305714 6357115 6398304 6424978 6469256 6521650 6582760 6682416 6781151 6819796 6797327
1844 6797327 6820787 6899037 6972287 7062155 7187535 7305688 7423157 7510897 7584121 7690856 7735603
1833 7735603 7829015 7920886 7995721 8130310 8263487 8458811 8662198 8921081 9102349 9260090
1823 9260090 9414665 9518679 9645860 9793993 9917042 10051740 10169335 10309792 10516196 10698271
1813 10698271 10905565 11171471 11388129 11573623 11751124 11897096 12060807 12184683 12275103 12423817
1803 12423817 12520006 12651453 12748349 12881021 12979442 13153052 13338231 13482031 13696461 13968319
1793 13968319 14197583 14432039 14755754 15058975 15378661 15688880 16051214 16331585 16568033
1784A6568033K98872L44771M65631N74939P05679P52740P97409P03022O40158
1775B1851254M81221M67683M95241N25850P23306Q33728R70326J085188J312078
1766B8745875J502028J632798J701519J648161J505525J480192J504706J518039
1758D1238843J567934J662137J840395K143182K424110K635400K731772K984945
1750E9228718L477943M293894N466398O585823P731555Q961847J0133391J1301779
1742A17181348J2538389J4305718J6740754K0189744K5162819L2152660M1781722
1735B80053154N3288386O1411314N3534101J7950364l1543498o2374469o5137360
1728C07181992n4212748m2090244l2437435k4928474j9185004j5024705j2129731
$$ plain form
1784 16568033 16866905 17211676 17677307 18252246 18957925 19710665 20508074 21211096 21851254
1775 21851254 22332475 22800158 23295399 23821249 24544555 25378283 26348609 27433797 28745875
1766 28745875 30247903 31880701 33582220 35230381 36735906 38216098 39720804 41238843
1758 41238843 42806777 44468914 46309309 48452491 50876601 53512001 56243773 59228718
1750 59228718 62706661 67000555 72466953 79052776 86784331 95746178 105879569 117181348
1742 117181348 129719737 144025455 160766209 180955953 206118772 238271432 280053154
1735 280053154 333341540 394752854 448286955 466237319 434693821 372319352 307181992
1728 307181992 252969244 210879000 178441565 153513091 134328087 119303382 107173651
1721A07173651j0252184r142327q101201o854537n591597m819304m393548m150033
1713E3868920l849255l498262k990473k564708k231441k107316j998185j857265
1705C2772015j637626j528023j432051j314144j216719r38074q02610p67258p70988
1696B2364522p16991q31768p65818p28166p50673q42978q54548p63190o33107
1687A5477283m46506k54201j51959j19914r8169j98481k81100l57867l87087m18506
1677A2763493l31124k27740k85530k86442k18162k23132k73200k79613k44157
1668A0394393k98320l16714k65967k33906l15003l41347l29378k60303k77079
1659G756376k04818j81883j85823q8837o6261k1062n6095l7597m5915q0389n8689
$$ plain form
1721 107173651 96921467 87779140 79677939 72823402 67231805 62412501 58018953 53868920
1713 53868920 50019665 46521403 43530930 40966222 38734781 36627465 34629280 32772015
1705 32772015 31134389 29606366 28174315 26860171 25643452 24705378 23902768 23135510 22364522
1696 22364522 21647531 20815763 20049945 19321779 18571106 17728128 16873580 16110390 15477283
1687 15477283 15030777 14776576 14624617 14504703 14406534 14208053 13926953 13569086 13181999 12763493
1677 12763493 12432369 12204629 11919099 11632657 11414495 11191363 10918163 10638550 10394393
1668 10394393 10096073 9779359 9513392 9279486 8964483 8623136 8293758 8033455 7756376
1659 7756376 7551558 7369675 7183852 7095015 7028754 7007692 6951597 6914000 6868085 6787696 6729007
1648F729007q4488j57911j64971j52394j91166k04305k61544j46342j08516j08249
1638E149121m8224o8694p8699j25641j38799j57339j46650j59981j52401j38514
1628C934179p1645n0836p3885n9021l886m2412l5480o3376r5895r9542j31903
1617C206298k8468j2073l1255l9627o1362n2335j05105L547m689n5678p1806p6598
1605B670849p4990o9180K1736k3055J8217K7710O4858n80P433K3597n5353p0228
1593B541014p1308p6533j09483l6708m8750k9308o9711n2046r5231q4265J5280
1582A882951L4015K3578J3529M1092j3762j5043J1135k3765o7018n5268j2147
1571A819297q4331k0178k3570l1926j8361k6777q538k3549k5843J2518L3491n374
$$ plain form
1648 6729007 6644519 6486608 6321637 6169243 5978077 5773772 5512228 5365886 5257370 5149121
1638 5149121 5100897 5032203 4953504 4827863 4689064 4531725 4385075 4225094 4072693 3934179
1628 3934179 3862534 3811698 3737813 3678792 3674906 3632494 3597014 3533638 3437743 3338201 3206298
1617 3206298 3177830 3165757 3134502 3094875 3033513 2981178 2876073 2879620 2874931 2819253 2747447 2670849
1605 2670849 2595859 2526679 2548415 2525360 2543577 2571287 2636145 2635565 2642998 2666595 2611242 2541014
1593 2541014 2469706 2393173 2283690 2246982 2198232 2168924 2099213 2047167 1951936 1867671 1882951
1582 1882951 1916966 1940544 1954073 1995165 1981403 1966360 1977495 1953730 1886712 1831444 1819297
1571 1819297 1734966 1714788 1691218 1659292 1640931 1614154 1605616 1582067 1556224 1568742 1602233 1596859
1559A596859m5363m0749n6325l6063j3825k2347j2106o4861m6163l15j0141L8097
1547A286698L022m7155K8444P835l569Q76m0024p297j6676k3230l3907r014P672
1534A153675j2222l396J6250K6738n65k3434K1264l0077r51j2106j4998m2424
1522A077754k1843N1056j4440m0172p0571J6836K107L7971J4652k8904k6427K5065
1510A023084P0235j1028p773j7408k3664p736k1399O175o453L203m2071n872k4156
1497I35137l496m2392k5674L7526J4252m7628j3868q439L5815O1744K3269L712
1485I69958m911L776K0482J8141k6722l8938l3949l7607o3182j5203J4385j4831
1473G91399k1843j3094J7431k0841k964j8760J8987L3313K8618m4807p3720L8321
$$ plain form
1559 1596859 1551496 1510747 1454422 1418359 1404534 1382187 1370081 1305220 1259057 1258742 1248601 1286698
1547 1286698 1289720 1242565 1271009 1278844 1275275 1276151 1236127 1228830 1212154 1188924 1155017 1146003 1153675
1534 1153675 1141453 1138057 1154307 1181045 1180480 1157046 1178310 1148233 1147282 1135176 1120178 1077754
1522 1077754 1055911 1106967 1092527 1052355 981784 998620 1000727 1038698 1053350 1024446 998019 1023084
1510 1023084 1093319 1082291 1074518 1057110 1033446 1025710 1004311 1010486 1004033 1007236 965165 959293 935137
1497 935137 931641 889249 863575 901101 915353 867725 853857 845418 881233 942977 966246 969958
1485 969958 965047 968823 989305 1007446 980724 941786 907837 870230 807048 791845 806230 791399
1473 791399 769556 756462 773893 753052 750088 731328 750315 783628 812246 767439 693719 732040
1461G32040P0585J882o9765k9550J9089j7596R795R792K9156L6853J1903j5798
1449G88386J7880J15041L9875k289J2856J2490O741L8617N1112M7241J03626J44174
1437A375750J19716J02309J71515L53829L68280K54473J47882p2640l17845l19465
1427B183804l13976k00357j91046j51722j69637j36583k4004j6758q7191q2656
1417H09874l3304j7835j1739j9100N447m5518j1058l1261o1595j2799k932L2655
1405F00835m8105j5549l3687l5576k4487k3282j5103L7899j469j7841J0976k8412
1393D06199J7334R525J4181p522J4100M406m8576p7064L1162J5034l9353m4568
1381B94858P490M8642j359K6742J3162j019J0135K3771Q561p6081m566N932m9128
$$ plain form
1461 732040 802625 804507 734742 705192 724281 706685 716480 726272 755428 792281 804184 788386
1449 788386 806266 921307 961182 958893 971749 984239 990980 1029597 1080709 1127950 1231576 1375750
1437 1375750 1495466 1597775 1769290 2123119 2491399 2745872 2893754 2821114 2503269 2183804
1427 2183804 1869828 1669471 1478425 1326703 1157066 1020483 996479 979721 892530 809874
1417 809874 776570 758735 746996 727896 733343 687825 676767 645506 583911 571112 568180 600835
1405 600835 552730 537181 503494 467918 443431 420149 405046 442945 441476 423635 434611 406199
1393 406199 423533 433058 447239 439717 453817 458223 409647 332583 363745 378779 339426 294858
1381 294858 302348 350990 349631 376373 389535 388516 398651 422422 430983 354902 350336 356268 307140
1368C07140k6905J2017k6555L250K0313m7804o567K2968J7644M582l913K0563
1356B96733J6474n0273j6359K351K1Q786l5092k4721L3277P4067m01k2498K6848
1343C09213M0616o202l2023K771l4388r867J8822n06l0420K5498J0109k7402j9840
1330B46381K252L0773m2856K1470K074O400N3988l4012j8088J4482K7948Q992
1318C19804j6964k6314L9380k8722q5017m699J0821M4809l9928P322L2936L687
1306B57115L5079m3008m7894O934K8045J6991k4964l354J070m4840j988l5438
1294A43748j5747J513J0215L1369q934j3106R218p14l4321J7401m719J3586n0035
1281I9474j2491J6438j6120Q136j79j5056L589M0135K9378Q457j629N2579k2736
$$ plain form
1368 307140 280235 292252 265697 268947 289260 241456 234889 257857 275501 280083 276170 296733
1356 296733 313207 262934 246575 248926 248947 257733 222641 197920 231197 305264 304863 282365 309213
1343 309213 349829 343627 311604 314375 279987 270120 288942 288436 258016 283514 293623 266221 246381
1330 246381 248633 279406 236550 258020 260094 266494 320482 286470 268382 282864 310812 319804
1318 319804 302840 276526 315906 287184 202167 197468 208289 253098 213170 220492 253428 257115
1306 257115 292194 249186 201292 208226 236271 253262 228298 224944 226014 181174 179186 143748
1294 143748 128001 129514 139729 171098 162164 149058 158276 157562 123241 140642 135923 149509 99474
1281 99474 86983 103421 87301 95437 95258 80202 83791 123926 153304 161761 160132 212711 189975
1268A89975k1314L0559j7623K9761K433M2099m6929l0762N2991r909k1815j0127
1256A89339K3443j2084J6388q446K2841k5195l127m1216m4824K9709k8467J8285
1244A36646n0028K8597N5442m3902j2969J6491j4971J5774K3891k7386N794L922
1232A37301K1487o1404m3503Q9980M06l3803R878J4001K0133M218r458m341o975
1219A37920J8589M1442n0963k0105M4148L6497m3105j1611K5011k1201j846N1740
1207B06516N858J5971j0564q5603n524J4599K956m2292J1875L6597K5639k7203
1195A48825l9013L9466N651J0363Q266q008q1285J1790M6823k1471K0172Q081
1183A49660O280p4565K2409M4698n779k0543j2641j7168k4277L5827L6532r384
$$ plain form
1268 189975 168661 199220 181597 211358 213791 255890 208961 178199 231190 221281 199466 189339
1256 189339 212782 200698 217086 208640 231481 206286 203159 161943 117119 146828 118361 136646
1244 136646 86618 115215 170657 126755 113786 130277 115306 131080 154971 127585 133379 137301
1232 137301 158788 97384 53881 143861 144267 110464 120342 134343 154476 158694 149236 144895 137920
1219 137920 156509 197951 146988 126883 171031 207528 164423 152812 177823 156622 154776 206516
1207 206516 212374 228345 217781 132178 126654 141253 144209 101917 113792 150389 176028 148825
1195 148825 109812 149278 154929 165292 173558 165550 84265 96055 142878 121407 141579 149660
1183 149660 155940 81375 103784 148482 142703 122160 109519 92351 68074 103901 140433 131049
1171A31049l0636N0803K8848j661k7442m0059K2695M35j4369P785l0040M1725
1159A39133j2743k5178L3385l9248k9562Q481N7266N590j6060P971J4028r325
1147A33738j4329J3204J3871j5296J1095M6453j0526k0190K3772l6567j7080J4400
1135A42545l962j3161p204N7019m4907l2713L5241j2864l2452O2587J5631J982
1123A67742l5605k4764N3958l4429J7760j291m290q406k580K0265l7052J041L523
1110A15872Q734j774K6602k524o989j864q0j3305m348O355o9030L0115M6428J5061
1096A49253k4334p634M5537L222p603j0015l428j1900L1333K6733p372k5759j3448
1083A44585j2661n0564M7652N2018k9019q671K3058K1051M5338p2504j4354K826
$$ plain form
1171 131049 100413 151216 180064 178403 150961 110902 133597 134032 119663 127448 97408 139133
1159 139133 126390 101212 134597 95349 65787 74268 131534 137124 121064 129035 143063 133738
1147 133738 119409 132613 146484 131188 142283 188736 178210 158020 181792 145225 128145 142545
1135 142545 138583 125422 118218 175237 130330 97617 132858 119994 87542 150129 165760 167742
1123 167742 132137 107373 161331 126902 144662 143371 139081 130675 128095 148360 111308 112349 115872
1110 115872 124606 122832 149434 146910 139921 138057 137977 124672 120324 126679 57649 87764 134192 149253
1096 149253 124919 117285 162822 166044 158441 148426 144998 133098 164431 191164 183792 158033 144585
1083 144585 131924 81360 129012 181030 152011 143340 166398 187449 232787 160283 145929 148755
1071A48755L5527J3114n2401j208J3620M304j8061J7728K7775K0037k9412J8508
1059A98286K7472j4243o032j2598k8175J3282M1696M57q200M7512K1380J7098
1047B97935m2769O418M2414N1609m0538j0286J1606J1122N9676j8295k3577M780
1035C50095N6619o435o1536K1908k844m7401l3730J1173j4648N8079J7379j9710
1023C28949N985K2025M2435n3383l117L3375J0875K6548L5249o2772k5550M274
1011C64893O0791r152l3713O1200m3976j4756M7038N0199K0069l0251j903K2483
999D92922j8239K2707J0469l3886L3215J9750j4065m9398L6559K2672p601j0922
987E04183N1508N2111l1130J7616N170J6240O600L2187k296J420R395k155J3447
$$ plain form
1071 148755 184282 197396 144995 143787 157407 161711 143650 161378 189153 209190 179778 198286
1059 198286 225758 211515 205483 192885 164710 177992 219688 220145 211945 259457 280837 297935
1047 297935 255166 261584 303998 355607 315069 304783 316389 327511 387187 368892 345315 350095
1035 350095 406714 400279 338743 360651 357807 310406 276676 287849 273201 331280 348659 328949
1023 328949 334934 356959 399394 346011 342894 376269 387144 413692 448941 386169 360619 364893
1011 364893 425684 416532 382819 444019 400043 385287 432325 482524 502593 472342 470439 492922
999 492922 474683 497390 507859 473973 507188 526938 512873 463475 500034 522706 515105 504183
987 504183 555691 607802 576672 594288 599458 615698 622298 654485 652189 653609 663004 660849 674296
974F74296l9115L9714M4716O8924O3882P521K0243O0151L4957J9570M933N2110
962A051902M0898L6202P3915Q7568M6905M9179P1001J11430Q9784O3647L9739
951A762170J25708J22128J03546P7125J13510J03977J75194J91742J95331J91223
941C161654K78743K92729K37601J64425K92189L55853N16848N71375Q08979R64928
931G645324J123326J281634J719025K110693L257701M556507N775384K086735
923B9556329n517939n974463l891433k619403j989199j485749j222518r57088
915E898537p15426n73600m24722l46949j42061r7752k8587j05668l43231l60704
905B759837k29931k20615k11697j83405r5355o5557j34198o2030o9927n9714p4588
$$ plain form
974 674296 635181 674895 719611 788535 852417 859938 880181 940332 975289 994859 999792 1051902
962 1051902 1092800 1129002 1202917 1290485 1337390 1386569 1457570 1569000 1658784 1722431 1762170
951 1762170 1887878 2010006 2113552 2190677 2304187 2408164 2583358 2775100 2970431 3161654
941 3161654 3440397 3733126 3970727 4135152 4427341 4783194 5300042 5871417 6680396 7645324
931 7645324 8768650 10050284 11769309 13880002 17137703 21694210 27469594 29556329
923 29556329 24038390 18063927 14172494 11553091 9563892 8078143 6855625 5898537
915 5898537 5183111 4609511 4184789 3837840 3695779 3598027 3569440 3463772 3120541 2759837
905 2759837 2529906 2309291 2097594 1914189 1818834 1753277 1619079 1557049 1487122 1427408 1352820
894A352820n0292l3580o8332k8696k4704o9628n3518P097l2915n0081q5499m3199
882H19473o6709k2572N085m0630Q278O0308j948j8908n0697l4023k948k5610l5142
869E93957n4300l3291J0457J7716J0536l2579K163O937j0586k1159K5595k5788
857D89658j8380l5060r185o408n08J2531l2496j1863m5568l0376M3516j9507k5419
844C10935R117J5849r900M1831R571j0809l5899k0836l5859r00J2456m2270o613
831B36673K0452m345L4688j1797k6968J4328J0786L868l2961l3276k6417m5039
819A39992j1594j8358K4174J9876n3873Q864O2732j9190p116O108n535Q001K0482
806A74563j2141q802J227Q499l0213M171j5138O845L0912k4214J2034j6189O825
$$ plain form
894 1352820 1302528 1268948 1200616 1171920 1147216 1077588 1024070 1031167 998252 948171 862672 819473
882 819473 752764 730192 735277 694647 702925 763233 761285 742377 691680 657657 654709 629099 593957
869 593957 539657 506366 516823 534539 545075 512496 514659 521596 511010 489851 515446 489658
857 489658 471278 436218 427033 420625 420117 432648 400152 388289 342721 312345 355861 336354 310935
844 310935 320052 335901 326001 367832 377403 366594 330695 309859 274000 273100 285556 243286 236673
831 236673 257125 252780 287468 275671 248703 263031 273817 277685 244724 211448 185031 139992
819 139992 128398 110040 134214 154090 100217 109081 171813 152623 145507 151615 146080 154081 174563
806 174563 162422 153620 154847 163346 133133 137304 122166 129011 159923 135709 147743 131554 138379
793A38379j4022p282k8972K5811L9690k8336k8717j0880P563k2515K4922L723
781I9364j0054M9751q4n3401R381M0130m4481j560K8267K8835J1160K3761m3194
768A37875l964R829l1390r552o4207j1486N4787k1784l5153P300K5548J7999J1850
755H7652j2765J8610J0888J1986m9380K6241M2924q6959k7423q45j2904K4768
743C2793M4224l0443K827J4948P461P6r60J116N959M000n2374J6706n98p820N858
728D3773m0740m1778K7364J3087Q235M2096K2046L9429l2508m1937k3663L6233
716E1637K0723n4380k311j2653R950j1140N0723K6104M057k2529n833k956L643
703E5035K0619k9131J4922m0959p927K1893n1829L1490N0259j4852m058o315M922
$$ plain form
793 138379 124357 117075 88103 113914 153604 125268 96551 85671 93234 70719 95641 99364
781 99364 89310 139061 138977 85576 94957 135087 90606 89046 117313 146148 157308 181069 137875
768 137875 133911 143740 112350 102798 38591 27105 81892 60108 24955 32255 57803 75802 87652
755 87652 74887 93497 104385 116371 66991 93232 136156 49197 21774 20929 8025 32793
743 32793 77017 46574 49401 64349 71810 71886 70926 72042 78001 82001 29627 46333 45735 37915 43773
728 43773 3033 -38745 -11381 1706 9941 52037 74083 113512 81004 39067 15404 51637
716 51637 72360 17980 15669 3016 12966 1826 52549 78653 82710 60181 54348 51392 55035
703 55035 75654 46523 61445 20486 12559 34452 -17377 14113 64372 49520 45462 39147 44069
690D4069J8874R829L1262l0542K05K0992m6371J2784J7815N403l2597l5975k1703
677e955K4567J6565j7085l3617K1084J6701M5667j5906J6363N4363l3923l2596
665E6228l093k7328k732K5627n450k1328J2824k526k2264l0815O7307P5164m3081
652G8533o581n8041L7104J9833l0802j5844j2911r134L7013m883L1689K6749N281
639I8006N1893n444K6511K13k2997k1514p4985J6959r420o1145l5339K8400O4224
626E5362m897m3024J399K7178K7737j441o1449M1621k9857p602k6199J0979O0977
613E0784K1954o3092o541q94m909J565k6768L7766Q306J1633k3607K6567K5527
600E8291j084k8920k2640P185p426j7913j9779q302q688K2523j839k0007L9604
$$ plain form
690 44069 62943 72772 104034 73492 73697 94689 48318 61102 78917 84320 51723 15748 -5955
677 -5955 18612 35177 18092 -15525 5559 22260 67927 52021 68384 122747 88824 56228
665 56228 53135 25807 23075 48702 43252 21924 34748 32222 9958 -20857 46450 121614 78533
652 78533 71952 13911 51015 70848 40046 24202 11291 2157 39170 34287 65976 92725 98006
639 98006 149899 144455 170966 171179 148182 126668 51683 68642 59222 -1923 -37262 -8862 55362
626 55362 50465 7441 8840 36018 63755 62314 865 42486 12629 5027 -21172 -10193 50784
613 50784 72738 9646 3105 2211 -2698 -1133 -27901 9865 18171 29804 6197 32764 58291
600 58291 57207 28287 5647 12832 5406 -12507 -32286 -40588 -49276 -26753 -28592 -48599 -8995
587h995K5914L1478j7169m6484J5487L6732r993k8426j1100M0903k3477j4461
575i591J4765k1121J2153j7029p284K7421J4697r94q154Q402J0922l06j8578k7037
561b1734K6285K9005l9246k4041p466k7366N7481m627k4445K0472L341L7298j4694
548A0263k8278J8823J6651J9864o188m5871J1086j0373j2951p215r056j059o1167
535a05471j2140M5541O8507K1087m325p564J1384K3350J0932l5848m1258L1510
523E705j5950l9308k2209J6660L736r87K3772j7957L7022J2495M3138j2443l817
510B9857k7228N8954n8347k5739j476k3177Q104k6699l405M6382L8695j3615o772
497d466l282L2349l3520J8166L9693k3938l5113l7293k8585P7662k7231k2955
$$ plain form
587 -8995 16919 48397 31228 -15256 231 36963 26970 -1456 -12556 28347 4870 -9591
575 -9591 5174 -15947 -3794 -20823 -28107 -686 14011 13017 4863 13265 24187 23881 5303 -21734
561 -21734 4551 33556 -5690 -29731 -37197 -64563 -7082 -11709 -36154 -15682 -12341 24957 10263
548 10263 -18015 808 17459 37323 31135 -14736 -3650 -14023 -26974 -34189 -43245 -44304 -105471
535 -105471 -117611 -72070 -3563 17524 13199 5635 17019 40369 51301 15453 -25805 5705
523 5705 -10245 -49553 -71762 -55102 -51366 -52353 -28581 -46538 -9516 2979 46117 33674 29857
510 29857 2629 61583 3236 -22503 -23979 -47156 -39052 -65751 -69156 -22774 15921 2306 -4466
497 -4466 -7748 24601 -8919 9247 48940 25002 -10111 -47404 -75989 1673 -25558 -48513
485d8513J3085l2149j7391L3995L6126J7854r518R478m2589K5179n447j0766K5909
472d747Q243m8732n585l1701P712K4773J1729L9894o0698P34k9976K5323N4633
459h398m4140J3959O108l4384K5953J0881l4530J8985N401l0224j8912N9855M5167
446A5721n6801J0780K5528N590o638m7763M9981j9250q420J5432J5706m6996j1730
433e8860M0464q439l877M858J8028l3125J5306P863J2201O036o3387j2107J6240
420e8799L6124n404m2966K6187J5653j5099j0995m4585J1339J7590k0537P2476
408a9016l2900K540N3957j3491l8492O8081k2422l3331n132K7954k5640k6679
396f4571K4390n412M3425k4459K0263r044k9708q531J9255k6811l1958O9512K509
$$ plain form
485 -48513 -35428 -67577 -84968 -50973 -14847 3007 -6511 2967 -39622 -14443 -19890 -30656 -4747
472 -4747 3496 -45236 -50821 -82522 -74810 -50037 -38308 1586 -59112 -58378 -88354 -63031 -8398
459 -8398 -52538 -38579 -32471 -66855 -40902 -30021 -64551 -45566 -40165 -70389 -89301 -29446 15721
446 15721 -41080 -30300 -4772 818 -5820 -53583 -3602 -22852 -31272 -15840 -134 -47130 -58860
433 -58860 -18396 -26835 -30712 -25854 -7826 -40951 -25645 -17782 -5581 455 -62932 -75039 -58799
420 -58799 -22675 -28079 -71045 -44858 -29205 -44304 -55299 -99884 -88545 -70955 -91492 -19016
408 -19016 -51916 -49376 4581 -8910 -47402 20679 -1743 -35074 -40206 -12252 -37892 -64571
396 -64571 -40181 -45593 -2168 -26627 -6364 -15408 -45116 -53647 -34392 -61203 -93161 -23649 -21140
383b1140r958n987J0303l4304L406N5271j4895K6902J1667r577k167j9258Q181
370a556j5771o7890J3258K9627j1293j4582K3510P684p4966L9412N4678q820L5471
357H762L369k9044O77N3075k6684o7830J2597M3253o2048J745K6166o552k912
344d5426r270N2583r713l7495K5713O848k8434K5557j262k9420k6382J1611l839
331f8929j0680J6341r485J207M0155K036K2639K1514k2157M682J2555j6020K2916
318A6774l7237R341k3005l8887j4588m0770M9690k7238m944L0576k1836L5258
306f6866N6260M4435o4304L9510J5712k9237m0031p627r523j5726o846j9658M1142
293f2759j4955J9187J8888m390L3477P269j8847j0213l2043N757m6106R790L1014
$$ plain form
383 -21140 -31098 -37085 -26782 -61086 -57680 -2409 -17304 9598 21265 11688 9521 -9737 -1556
370 -1556 -17327 -85217 -71959 -42332 -53625 -68207 -44697 -37013 -111979 -72567 -17889 -26709 8762
357 8762 12131 -16913 -16236 36839 10155 -57675 -45078 -1825 -63873 -62128 -35962 -42514 -45426
344 -45426 -54696 -2113 -11826 -49321 -23608 -16760 -45194 -19637 -20899 -50319 -76701 -65090 -68929
331 -68929 -79609 -63268 -72753 -71546 -31391 -29355 -6716 14798 -7359 -2677 9878 -6142 16774
318 16774 -20463 -11122 -34127 -73014 -87602 -128372 -78682 -105920 -110864 -80288 -102124 -66866
306 -66866 -10606 33829 -30475 9035 24747 -4490 -44521 -52148 -61671 -77397 -84243 -103901 -62759
293 -62759 -77714 -58527 -39639 -44029 -10552 -3283 -22130 -32343 -64386 -58629 -104735 -94945 -63931
280f3931l623j0362K9220j2778j8473K2106J8804P687k447J2675J0003O911n326
267i534J3605j8808j2329J2850l4930m1163j7887q439J0065P448K2066l6400O871
254a06585O6390L608j6956o724P3300l1893k6645m561J4481n26K430K857l3117
241f3941n545R147k8740L037L0070P75j7804L3275K3684p492n9203L1761j4316
228f5292j0104J1110J2173j1858j1493L8670r471p980L7928L2298k7542K131O347
215c083K3l2278l06J4479l8892l4267j358o949k7055K4132L568J5802J4190J2181
201e9813K8921j5334Q421Q920j437k978K2478k5370j2642l357J1809j8918L3185
188b6115Q293o4772o21L848l370K360k1806K2086M873j3121o180Q070K51J9485
$$ plain form
280 -63931 -67554 -77916 -48696 -61474 -79947 -57841 -39037 -31350 -33797 -21122 -11119 -4208 -9534
267 -9534 4071 -14737 -27066 -14216 -49146 -90309 -108196 -116635 -106570 -99122 -77056 -113456 -106585
254 -106585 -40195 -36587 -53543 -60267 13033 -18860 -45505 -50066 -35585 -36111 -33681 -30824 -63941
241 -63941 -69486 -60339 -89079 -86042 -55972 -55197 -73001 -39726 -16042 -23534 -82737 -50976 -65292
228 -65292 -75396 -64286 -52113 -63971 -75464 -36794 -46265 -54245 -16317 15981 -11561 -9430 -3083
215 -3083 -3060 -35338 -35644 -21165 -60057 -94324 -95682 -102631 -129686 -105554 -101986 -86184 -71994 -59813
201 -59813 -30892 -46226 -37805 -28885 -30322 -33300 -10822 -36192 -48834 -52191 -40382 -59300 -26115
188 -26115 -17822 -82594 -83215 -79367 -82737 -80377 -102183 -80097 -75224 -88345 -94525 -86455 -86204 -66719
174f6719M6739l9035k23N4987m1374l8275L9282J6294L0181k2837p5274n343J1135
161i0462N0523m1074k573k3845J0564J0431J4335m718j1282p757l6318j011M9071
148h4116L6864L138l6903n174P6761l8041l2188J9432j7827J8069k518l2792k2702
135a17997L8836o647k5833j6290J2048J8879L1496j3992k7260N0107j4251k825
123g3729k7583N26J4551L8119j8733j9026K5560J419n197r910R018K853J7033
110d5099k9889j1232K7164n844l8272l4191L3216J8946L3110m3982o004M9366
98e2711l566j1337k693j2805k1055O1518J7543l5445R071J567j8427q013k093
85g8446l378k4261j866J6693j0408J6793j1860Q549j6698l263K2401Q43l2406
$$ plain form
174 -66719 -19980 -59015 -59238 -4251 -45625 -83900 -44618 -28324 1857 -20980 -96254 -101597 -90462
161 -90462 -39939 -81013 -83586 -107431 -96867 -86436 -72101 -76819 -88101 -95858 -132176 -133187 -84116
148 -84116 -47252 -44114 -81017 -86191 -9430 -47471 -79659 -60227 -78054 -59985 -62503 -95295 -117997
135 -117997 -79161 -85808 -111641 -127931 -115883 -97004 -65508 -79500 -106760 -56653 -70904 -73729
123 -73729 -101312 -100786 -86235 -48116 -66849 -85875 -60315 -58896 -64093 -74003 -64985 -62132 -45099
110 -45099 -74988 -86220 -59056 -64900 -103172 -137363 -104147 -85201 -52091 -96073 -102077 -52711
98 -52711 -56277 -67614 -70307 -83112 -104167 -42649 -25106 -60551 -51480 -49913 -68340 -76353 -78446
85 -78446 -81824 -106085 -107951 -91258 -101666 -84873 -96733 -88184 -104882 -108145 -85744 -84901 -117307
72a17307M3360j448j8478K1444l45j4774J2378L8619l6227M271L8285l293m7087
59h0602j0894K8744o028m0152r13K4780M495m8685J4922N062j951K0282K3617
46f7323l4294o235O0745j7408n879J1718j0356k2566M396L330K2313M473j4071
33g1157Q76k1680L669M317j6140j6818l082J9431m4921K8608J7980j8945Q209
20a09653Q886k6415J9512N6982J5674m6203O355j877m6904r68L8645J7992j5182
7h3156k030K4403j0985m7350k536n909K2222
0a05341
$$ plain form
72 -117307 -73947 -75395 -93873 -72429 -72774 -87548 -75170 -36551 -72778 -68507 -30222 -33515 -80602
59 -80602 -91496 -62752 -68780 -108932 -109845 -85065 -80570 -129255 -114333 -109271 -111222 -90940 -67323
46 -67323 -101617 -107852 -47107 -64515 -70394 -58676 -69032 -91598 -87202 -83872 -61559 -57086 -71157
33 -71157 -70281 -91961 -88292 -83975 -100115 -116933 -120015 -100584 -145505 -116897 -98917 -117862 -109653
20 -109653 -100767 -127182 -107670 -50688 -35014 -81217 -74862 -76739 -123643 -124611 -85966 -67974 -83156
7 -83156 -85186 -60783 -71768 -119118 -121654 -127563 -105341
0 -105341
$$ Imaginary data points
##PAGE= N=2
##DATA TABLE= (X++(I..I)), XYDATA
16383b273815J3761J3951N9470L1799K2506J9615J3761L0362O946K2312N752J3188
16371b020392J1321J9657J0519K5915L6435J7011J7705K5035O8778j6028j6290
16360a820334M5193L6789J9532L2661K980J4731M6455O216J0539L4546L2837J1565
16348a526290O110L1352J3504J1333J5575k719N3304o033L6233N7139k8903k713
16336a342108M5074L8822j4979K0111N0104J9066L3070O876j316L0864K3602j4263
16324a105077O4692K7836K2095n526k8819M3430K0288J4096l0713O349O2621K6119
16312h82609L9551j4172P47Q4041M2848k0770j1640N7876K4377J3424J6022J804
16300f48501k575K8910L0473L1174L09J0110K6647q778n065N1071L2644l5489
$$ plain form
16383 -2273815 -2260054 -2246103 -2186633 -2154834 -2132328 -2112713 -2098952 -2068590 -2061644 -2039332 -2033580 -2020392
16371 -2020392 -2009071 -1989414 -1978895 -1952980 -1916545 -1899534 -1881829 -1856794 -1788016 -1804044 -1820334
16360 -1820334 -1775141 -1738352 -1718820 -1686159 -1683179 -1668448 -1621993 -1615777 -1605238 -1570692 -1537855 -1526290
16348 -1526290 -1520180 -1488828 -1475324 -1463991 -1448416 -1451135 -1397831 -1403864 -1367631 -1310492 -1339395 -1342108
16336 -1342108 -1297034 -1258212 -1273191 -1253080 -1202976 -1183910 -1150840 -1143964 -1145280 -1114416 -1090814 -1105077
16324 -1105077 -1040385 -1012549 -990454 -995980 -1024799 -981369 -961081 -946985 -977698 -971349 -908728 -882609
16312 -882609 -843058 -857230 -856483 -772442 -729594 -750364 -762004 -704128 -679751 -666327 -650305 -648501
16300 -648501 -651076 -622166 -591693 -560519 -560210 -550100 -523453 -532231 -537296 -486225 -453581 -489070
16288d89070j7523J8468K7505N7661k2131J0390M5891K9392k3358K0322P4210
16277b68243R184K2182L0866J7780j335J614k3554K050J6584R086r370J2873M6484
16264a33799K9325J4779o445j5323J8179L7209O9397p812m5036N3967L8000k2486
16252B9955R575L8856o855K9750J6709l4727J0879L6044K4764k9270J6249K4006
16240A65935J2526K1151K6273M6593m3448m9716P532L1899K661K7000K2970j0477
16228B60899K4347K7302L8269L348J4728K5053j4771M8740L1478M041k8801j5458
16216D19175J1360j2216k8456k6519M0N5980M5594K7869j0047k1278K6071K0568
16204E08141L9912K0542r186O410l4041J4042K0205j8886p011k8256K3901K9383
$$ plain form
16288 -489070 -506593 -488125 -460620 -402959 -425090 -414700 -368809 -339417 -362775 -342453 -268243
16277 -268243 -259059 -236877 -206011 -188231 -189566 -187952 -211506 -209456 -192872 -183786 -193156 -180283 -133799
16264 -133799 -104474 -89695 -96140 -111463 -93284 -56075 13322 5510 -39526 14441 52441 29955
16252 29955 39530 78386 71531 101281 117990 83263 94142 130186 154950 125680 141929 165935
16240 165935 178461 199612 225885 272478 229030 179314 186846 218745 221406 248406 271376 260899
16228 260899 285246 312548 350817 354165 368893 393946 379175 427915 459393 463434 434633 419175
16216 419175 430535 418319 389863 363344 363384 419364 464958 492827 482780 461502 487573 508141
16204 508141 548053 568595 559409 565819 531778 545820 566025 547139 540128 511872 535773 565156
16192E65156L7674R903m1318M5031L2125l4248L599J3933j2672m78k112K8294
16180F44887j5943j9834j2485P165M2584K611k2353K4740N3444M4494J4894l5404
16168G28800J7177K5716J1164j2955k830J3251l3165k0360k5512n3857L4542M3777
16156G25748q879Q460N1006K8069N4348l9230j8081Q589Q004K7326m0503L357
16144H08214J1550J630l0581k9871L4374Q049k1684M6597P412q252M9464j3285
16132H63617p467m580K0997k1521k2928J310J4532M1111K7835j4319l5266j533
16120H61788K6124K3283j3376J3242M3593k2053l5885K868O166o611l1151L2136
16108I00124k8157j0127k2697k5323L7935M6229o564l8055J5505M1772O9803k7187
$$ plain form
16192 565156 602830 612733 571415 616446 648571 614323 617922 631855 619183 618705 616593 644887
16180 644887 628944 609110 596625 603790 646374 648985 626632 651372 704816 749310 764204 728800
16168 728800 745977 771693 782857 769902 767072 780323 747158 726798 701286 647429 681971 725748
16156 725748 716869 725329 776335 804404 858752 819522 801441 810030 818034 845360 804857 808214
16144 808214 819764 821394 790813 760942 795316 803365 781681 828278 835690 827438 876902 863617
16132 863617 856150 851570 872567 851046 828118 829428 843960 885071 912906 898587 863321 861788
16120 861788 887912 911195 897819 911061 954654 932601 896716 899584 905750 899139 867988 900124
16108 900124 871967 861840 839143 813820 851755 897984 891420 853365 868870 910642 980445 953258
16096I53258k908O590m755J155j3933l3736j909L4826R658k8600m500j4979k0123
16083H80044K7247j7102O345L2427k2018l6760J1668P7663O762n7007j0257q077
16071H90935P306N6040k6004Q358J677L4087m398n1956M1558M8688n4808n6437
16059H95046J3183K4223j4307j6053K5479J7330J8487k8788l6244R534M780K5198
16047I37868K5668p1879M7121N7056J1581m4105J6502j57j6377r413Q53K451N0271
16034A007440l7012m7741j1300K821k4675K457K4578o874L2508o990k7498K5593
16022I33307L4328k2q824j1410j217K1726K1386k170J5795O400o0448k5902l287
16009I19662L5867Q708n043K2559k8190j4588k1961J5719J3707l682J7676o891
$$ plain form
16096 953258 950350 956940 952185 953340 939407 905671 903762 938588 948246 919646 915146 900167 880044
16083 880044 907291 890189 896534 928961 906943 870183 881851 959514 966276 909269 899012 890935
16071 890935 898241 954281 928277 936635 938312 972399 968001 916045 957603 1006291 951483 895046
16059 895046 908229 932452 918145 902092 927571 944901 963388 934600 898356 907890 912670 937868
16047 937868 963536 891657 938778 995834 1007415 963310 979812 979655 963278 953865 954718 957169 1007440
16034 1007440 970428 922687 911387 914208 889533 891990 916568 909694 942202 935212 907714 933307
16022 933307 967635 967613 958789 947379 946162 967888 989274 987104 1002899 1009299 948851 922949 919662
16009 919662 955529 964237 959194 981753 953563 938975 917014 932733 946440 942758 960434 953543
15997I53543p103L6114K2339R540k1578m8602o650K7194J3475J5457k424R520
15985A000825l4897m5433J3261K7114p023J0883l3689K668K2194J9625J0152l6049
15973I49631q065K1706Q247k5374J9253N3315k3342j6106L073m0847p46M8212
15961I88957j5843j553n740N285J5039j9553J0952q257J4601j9739p444K9126
15949I85831J5718j7783k4898k7203J4328J7880J8731L6841q538p14k2189l4028
15937I53976j0604j0468K8127j1078l5182M0523o170M06J7583j8114p995k444
15925I38560j4781j304K5954M4362j0366K536R091m6861Q389j208k410N2397M701
15912A009060l1601N449L080j2770L3580n4295l9934O0685K2361j3637J1100j6672
$$ plain form
15997 953543 946440 982554 1004893 1014433 992855 944253 937603 964797 978272 993729 991305 1000825
15985 1000825 965928 920495 933756 960870 953847 964730 931041 933709 955903 975528 985680 949631
15973 949631 941566 963272 971519 946145 965398 1018713 995371 979265 982338 941491 940745 988957
15961 988957 973114 971561 965821 971106 986145 966592 977544 969287 983888 964149 956705 985831
15949 985831 1001549 983766 958868 931665 945993 963873 982604 1019445 1010907 1010193 988004 953976
15937 953976 943372 932904 961031 949953 914771 955294 949124 949530 967113 948999 941004 938560
15925 938560 923779 922475 948429 992791 982425 984961 994052 947191 955580 954372 951962 1004359 1009060
15912 1009060 977459 982908 985988 973218 1006798 952503 912569 973254 995615 981978 993078 976406
15900I76406j6869k6741j6805J6202J3562l332L3220K9400m7769j4876l771J7659
15888I56286K6674J094J7002j989k393j2615j5833O539m812j7806n102j4383j4544
15875I18118O0562O0936l8368O27j5915m5916J4337M1909r477J758J4889k9660
15863I73800k9859j6080J1028L7653J2805o486P954N791j6978j1680N8798j6747
15851A009999j7855k1467k2214M5276K8548m2087n0608J8166k3233m669K7498
15840I47354j4165L1879J7642J2410l0589n262M2238J337m4496J0017K6410M6987
15828A041762n0101j8852j1014j1429q233M748K5256k1627M0799N95K893J751
15816I96548j69o2618O40J9944K8971N0288m0678K1431J3205k2134k3403m8567
$$ plain form
15900 976406 959537 932796 915991 932193 945755 942423 975643 1005043 957274 942398 938627 956286
15888 956286 982960 984054 1001056 999067 996674 984059 968226 974765 969953 952147 947045 932662 918118
15875 918118 978680 1039616 1001248 1001875 985960 940044 954381 996290 986813 988571 1003460 973800
15863 973800 943941 927861 938889 976542 989347 982861 990815 996606 979628 967948 1026746 1009999
15851 1009999 992144 970677 948463 993739 1022287 980200 929592 947758 924525 919856 947354
15840 947354 933189 965068 982710 995120 964531 959269 1001507 1002844 958348 968365 994775 1041762
15828 1041762 991661 972809 961795 950366 942133 946881 972137 950510 991309 991904 994797 996548
15816 996548 996379 933761 934401 954345 983316 1033604 992926 1014357 1027562 1005428 982025 933458
15804I33458J4007l418J1628R582m0115K0083j3140l883K0611j4282K250L5507
15792I72288p008J7272Q395k180q143M103k7601k1127K7306j2934j448L8676j3400
15779I74199m810R863j4631J4023J6125P213K020j7638J4386J7721k2556j3483
15767I82432r317R318p580l6693K3127J0757j6370L2577Q023j0780J5948J5774
15755A017216n8100K4497K240R505j366o7033j0838L2932n086k1106L2380K0293
15743I75534J0114l1118j3074M3143M984L0119m854l2815l627M3668p76k9966
15731I91332n9918L758M2550k1283j0340k280L1850K9336j8591j1417l3124Q44
15719I42717K2025L1193M0366k7994k4148l7153K1818N2502l7199j0442K2115
$$ plain form
15804 933458 947465 944047 955675 965257 925142 945225 932085 928202 948813 934531 936781 972288
15792 972288 965280 982552 990947 988767 980624 984727 957126 935999 963305 950371 948923 987599 974199
15779 974199 969389 979252 964621 978644 994769 1001982 1004002 986364 1000750 1018471 995915 982432
15767 982432 973115 982433 974853 938160 961287 972044 955674 988251 996274 985494 1001442 1017216
15755 1017216 959116 983613 985853 995358 993992 926959 916121 949053 943967 922861 955241 975534
15743 975534 985648 954530 941456 984599 989583 1019702 1014848 982033 978406 1022074 1021298 991332
15731 991332 931414 935172 977722 956439 946099 943819 975669 1005005 986414 974997 941873 942717
15719 942717 964742 995935 1036301 1008307 984159 947006 968824 1021326 984127 973685 995800
15708I95800J1159l0694L799j2732p211M6507l6598m497Q701K7824j3626m0801
15696I47631P195J2409j8104l5731K4977l287J8749K9226p250q804k7879L4028
15684I73160J3238J9605O98R060k7633o628L4275j8047j9135p6740J2880O2333
15672I77066J2110k0011j1805L365L1056k2646n432J7884j0454M2148L112k6421
15660I89972L0596r103k0141r742m62K726k085k8958j5716L4312L7553M643m6550
15647I67045q977R455J3007j3971R021O009J5652k2463k1072J6286J9911O55q08
15634I89750n376M3178M2523l5835j7795j3231L7890j0054l9379J7288j1818j4440
15622I82701J9646j6308m9290K8387L4995j0470r889k4258K7036l527k2094J0613
$$ plain form
15708 995800 1006959 976265 980064 967332 960121 1006628 970030 965533 974234 1002058 988432 947631
15696 947631 954826 967235 949131 913400 938377 935090 953839 983065 975815 967011 939132 973160
15684 973160 986398 1006003 1006701 1015761 988128 981500 1015775 997728 978593 901853 914733 977066
15672 977066 989176 969165 957360 960725 991781 969135 963703 981587 971133 1013281 1016393 989972
15660 989972 1020568 1011465 991324 981582 981120 983846 981761 952803 937087 971399 1008952 1013595 967045
15647 967045 958068 967523 980530 966559 975580 981589 997241 974778 953706 969992 989903 990558 989750
15634 989750 984374 1027552 1070075 1034240 1016445 1003214 1041104 1031050 991671 1008959 997141 982701
15622 982701 1002347 986039 936749 965136 1000131 989661 979772 955514 982550 979023 956929 967542
15610I67542L6664J5830m6786n87L0748K6916j0125k0974j9756n757Q212j845
15598I80082k9100p113L9938K2700K4051l5000m806K8785l4185l762j783L6491
15586A016298k4072j2092j5645P888J4421l1634r413K2196J6172O0495j1542l3871
15574I99201J0811O794J042n2978q712K6491L1909j3280r56M958j0324q275k113
15561I84568L8302K7955j4498m091k6824l0753M4046J0461l1239m4600J637J00912
15549A055876l7459q5220j1749N8341K1866n3793M883L4842L7296j5926l4530
15538I74427j2144N5009l1447n547j639M5236M0501n0599n0365p769R0527o164
15526A040026n9609j9266L4571K2478K140m3609M014K3765J1644m8019m914M6950
$$ plain form
15610 967542 1004206 1020036 973250 972663 1003411 1030327 1020202 999228 979472 973715 981927 980082
15598 980082 950982 943869 983807 1006507 1030558 995558 990752 1019537 985352 981590 979807 1016298
15586 1016298 992226 980134 964489 972377 986798 955164 945751 967947 984119 1044614 1033072 999201
15574 999201 1010012 1016806 1017848 964870 956158 982649 1014558 1001278 1000322 1005280 994956 986681 984568
15561 984568 1022870 1050825 1036327 1032236 1005412 974659 1018705 1029166 997927 953327 954964 1055876
15549 1055876 1018417 933197 921448 979789 1001655 947862 952745 987587 1024883 1008957 974427
15538 974427 962283 1017292 985845 980298 978659 1023895 1064396 1013797 963432 955663 1046190 1040026
15526 1040026 980417 961151 995722 1018200 1020340 976731 980745 1004510 1016154 968135 963221 1010171
15514A010171L6540k0953n5633k7024P5733J2055m6586j3354O630N7024k0215
15503A014388p2416l90P5270K9417m6296k3419L0573L4908K4195l9236j9920J2307
15491A019381j4567l0127o1787P3685M4891Mk6690j2988P7930K898o9742l6219
15479I66669N0676K1536j623j6441j5839M0159j4180m5653l6986J4795J1516L0929
15467A005558j5783K5545o707j722j8215k3938N8615j7527j4815n59j8875M9607
15455A021184L5944p6691l9501J3479K4257M0069L2717j5380j7677K9697R94m3475
15443A005617R316j5684K3640L265l2229j4460R981j6525j685J357Q898n6168
15431I25323O0319K2873k579N0854k8m5281j8674n682n045O5699k5911m5151N712
$$ plain form
15514 1010171 1046711 1025758 970125 943101 1018834 1030889 984303 970949 977579 1034603 1014388
15503 1014388 941972 941582 1016852 1046269 999973 976554 1007127 1042035 1066230 1026994 1007074 1019381
15491 1019381 1004814 974687 912900 986585 1031476 1031480 1004790 991802 1069732 1072630 1002888 966669
15479 966669 1017345 1038881 1037258 1020817 1004978 1045137 1030957 985304 948318 963113 974629 1005558
15467 1005558 989775 1015320 1008613 1006891 988676 964738 1023353 1005826 991011 990452 971577 1021184
15455 1021184 1057128 980437 940936 954415 978672 1018741 1051458 1036078 1018401 1048098 1049092 1005617
15443 1005617 1014933 999249 1022889 1026154 993925 979465 989446 972921 971236 972593 981491 925323
15431 925323 985642 1008515 1005936 1056790 1056762 1011481 992807 987125 982080 1047779 1021868 976717 982429
15418I82429K1453K633l6511L86L7684Q830J4426n092K1955J2705m4953n677J068
15405A011336J9276K9050o0136J7855L1485M6835k5944p4082J4256l114K6343
15394A033160j1622q537j7389J6167q882p742m1208N6062J1142m3937r648K2705
15382I90271N3447j8348k2390J8668O844J8495k9954k3568M4007K5035j2716m3138
15370A006653J948k8785l44m951j906K227L998L821K6502N908J8957p714n091
15357A021223l9035L9475L4293k9193l328k9842J0027K7383K1018j4980k6922
15346A010119J8851K4959j4984j3149l0454J3421K8051Q102j0372k7860q052k9383
15334I69249j125O0421o0353j3763j5809K1039O7911J7057Q181k1097m4052K4451
$$ plain form
15418 982429 1003882 1006515 970004 970390 1008074 1016904 1031330 1026238 1048193 1060898 1015945 1010268 1011336
15405 1011336 1030612 1059662 999526 1017381 1048866 1095701 1069757 995675 1009931 1006817 1033160
15394 1033160 1021538 1013001 995612 1011779 1002897 995155 953947 1010009 1021151 977214 967566 990271
15382 990271 1043718 1025370 1002980 1021648 1028492 1046987 1017033 993465 1037472 1062507 1049791 1006653
15370 1006653 1008601 979816 979472 974521 972615 974842 978840 982661 1009163 1015071 1034028 1026314 1021223
15357 1021223 982188 1021663 1055956 1026763 1023435 993593 1003620 1031003 1052021 1037041 1010119
15346 1010119 1028970 1053929 1038945 1025796 995342 1008763 1036814 1044916 1034544 1006684 998632 969249
15334 969249 968124 1028545 968192 954429 938620 959659 1027570 1044627 1052808 1031711 987659 1012110
15322A012110O0621j9370L96k9593L835k1359j6996Q660k7087l0257L4715N732
15310I81407M3345k5576k1510J2279p420K8831L7490j7022n0447m917N7353J1420
15298A045233j6009m4801j6689P2686M0938k7900N498k9632l1282L5776K487N822
15286A042127j1865k0006N906K810m950R934m8212k4430L4814L5198J1290m3412
15274I89204N328O9511L3814k3663M834k3415p22M0148k9745n7494J34r395k9202
15261I69337L4810L0690j0726k4085l7448J7411M1823L5040m9469l0004N7035
15250A034414J7025L5845n3843n8152J5947L5357K9146k2823l8122L247J8000
15239A016041Q329j7078L7000K368k1591j3686L4222J0833j7231m8938m8790O1139
$$ plain form
15322 1012110 1072731 1053361 1053757 1024164 1027999 1006640 989644 998304 971217 940960 975675 981407
15310 981407 1024752 999176 977666 989945 982525 1011356 1048846 1031824 981377 976460 1033813 1045233
15298 1045233 1029224 984423 967734 1040420 1081358 1053458 1058956 1029324 998042 1033818 1036305 1042127
15286 1042127 1030262 1010256 1016162 1018972 1014022 1023956 975744 951314 986128 1021326 1032616 989204
15274 989204 994532 1064043 1097857 1074194 1079028 1055613 1054891 1095039 1065294 1007800 1007934 998539 969337
15261 969337 1004147 1034837 1024111 1000026 962578 979989 1021812 1056852 1007383 977379 1034414
15250 1034414 1051439 1087284 1033441 975289 991236 1026593 1055739 1032916 994794 998041 1016041
15239 1016041 1024370 1007292 1044292 1046660 1025069 1011383 1045605 1056438 1039207 990269 941479 1002618
15227A002618K1102l7370K654j6732P864k701K1715K2349Q306P255R956J2205
15215A059221K2131k6364k9286k397o860K5267q666n0142l1935R511K4272J3582
15203I98334J6745l3622m490N4041K3960j0873j6064k763M1250k1570k0614J7484
15191A041818j9408j5526M5878J0189k971l6256P724N4884l6928J2476j7375q724
15179A035781K1030k3250K2970k4596p8933Q619J4776M1691j9441j1466m518K5765
15167A008428R5692K6816o8420l586J6596l8748j6073N182o650l896L081O781
15155A025203M547L4519o3251n7260K9296K6845J0821J626j7534L827k257K8726
15143A025108j1893K008L9785N162L2893n7035O85L5171Q24j6303j3815J1134
$$ plain form
15227 1002618 1023720 986350 989004 972272 980136 977435 999150 1021499 1029805 1037060 1047016 1059221
15215 1059221 1081352 1054988 1025702 1023305 1016445 1041712 1033046 982904 950969 960480 984752 998334
15203 998334 1015079 981457 976967 1031008 1054968 1044095 1028031 1025268 1066518 1044948 1024334 1041818
15191 1041818 1022410 1006884 1052762 1062951 1059980 1023724 1031448 1086332 1049404 1061880 1044505 1035781
15179 1035781 1056811 1033561 1056531 1031935 953002 961621 976397 1018088 998647 987181 982663 1008428
15167 1008428 1104120 1130936 1062516 1058930 1075526 1036778 1020705 1025887 1019237 1015341 1018422 1025203
15155 1025203 1029750 1064269 1001018 943758 973054 999899 1010720 1012346 994812 998639 996382 1025108
15143 1025108 1013215 1015223 1055008 1060170 1093063 1036028 1036713 1071884 1072708 1056405 1042590 1053724
15131A053724K631q351n7260r28L2587K7079o5923n261P3486j3262l4367J3428
15119A017583J9875j9844N516J3321j9783j1714M9041n253j0406N2344k6958o9661
15107I94061k4531O8155M8386k6087J9885L2874n9995J4456N540l2337m6770m847
15095I88790O9634r613k1395l2561q720n770M0611J7026j7074K4861J5776j7170
15083A044395L5335o606k7502n1152L6272N523L773l8944M65j5075J363M7688
15071A035535p488j302J2011N4375R422J8278j2245m7366n0041K9010K0514m9176
15059A011527q450P621Q011J868k3609N158J991J4403K2394J2290L0044k1869
15047A061379j1414L4381k8069L0446l7363q5857J1773J4436L4336j475k1845
$$ plain form
15131 1053724 1056355 1048004 990744 989816 1022403 1049482 983559 978298 1051784 1038522 1004155 1017583
15119 1017583 1037458 1017614 1023130 1036451 1016668 1004954 1053995 1048742 1038336 1090680 1063722 994061
15107 994061 969530 1037685 1086071 1059984 1079869 1112743 1052748 1067204 1072744 1040407 993637 988790
15095 988790 1058424 1048811 1027416 994855 986135 980365 1020976 1038002 1020928 1045789 1061565 1044395
15083 1044395 1079730 1073124 1045622 994470 1030742 1036265 1040038 1001094 1001559 986484 987847 1035535
15071 1035535 1028047 1026745 1038756 1093131 1102553 1120831 1108586 1061220 1011179 1040189 1060703 1011527
15059 1011527 1003077 1010698 1018709 1020577 996968 1002126 1004117 1018520 1040914 1053204 1083248 1061379
15047 1061379 1049965 1084346 1056277 1086723 1049360 963503 975276 989712 1024048 1022573 1000728
15036A000728J346j045M8655L0885R653K3382l4410m7480K29L491L4803m0686
15024A029551n1653L107M5114r218m4421n918L9230L9974N5966l9803j9697O7543
15012A109775m504j1897k501P954k2469p3095L1206R319k2456k3248o659k389
15000I89036K8609R9346K697r5489l8636R3212J6175r887q695m684l126j2611
14988A055947l5987o0136J738Q2450J674l2133M6568L0217o8489l0943Q1182M41
14976A072529m7118J9833l5737l21M2546M2853k5770n0765QK4068k8206J4531
14964A028451K2852l4509J6796l067M3211j01l1866K7085N283j7192K1631k3995
14952A054579l8602k0735K7076L9221l9310J125m2440L7056J24576m9171q6648
$$ plain form
15036 1000728 1002074 1001029 1049684 1080569 1090222 1113604 1079194 1031714 1031943 1035434 1070237 1029551
15024 1029551 977898 981005 1026119 1016901 972480 966562 1005792 1045766 1101732 1061929 1042232 1109775
15012 1109775 1105271 1093374 1090873 1098827 1076358 1003263 1034469 1043788 1021332 998084 991425 989036
15000 989036 1017645 1116991 1119688 1024199 985563 1078775 1094950 1085063 1076368 1071684 1068558 1055947
14988 1055947 1019960 959824 961562 1044012 1045686 1013553 1060121 1090338 1021849 990906 1072088 1072529
14976 1072529 1025411 1045244 1009507 1009186 1051732 1094585 1068815 1018050 1018058 1042126 1013920 1028451
14964 1028451 1051303 1016794 1033590 1030523 1073734 1073633 1041767 1068852 1074135 1056943 1078574 1054579
14952 1054579 1015977 995242 1022318 1061539 1022229 1023354 980914 1017970 1142546 1093375 1006727
14941A006727P227O659M1770K4885l5n2453k1043L1322K8252l0193l132j2135
14929A027851o55l5855K5042M6464k426Q877l911K1168j667j3067m1469j0599
14917A019753K0544O1240m8417m5550K8666o100K382l3595J1407L8215l9107M4755
14905A054193J920O642k156K106l3247j5541N2184K8648q5545M2903K4076l0836
14893A045347j9219k3255J2299J2750K6045K1892j7104k3229O8037j0040j2243
14882A081280L9759Q863o0863n6591K8394N2380j0194j0291m3197m9553O994O4344
14870A051325K8334k9679K4552J5657l4163L7238R260l6969j0869K037K8205k3725
14858A061203k2161M6860n2628k6651L0170p253l2479M6935P9557j0012k7198
$$ plain form
14941 1006727 1013954 1020613 1062383 1087268 1087233 1034780 1013737 1045059 1073311 1043118 1039986 1027851
14929 1027851 1027196 991341 1016383 1062847 1060421 1069298 1065387 1086555 1084888 1071821 1030352 1019753
14917 1019753 1040297 1101537 1053120 1007570 1036236 1030136 1032518 998923 1010330 1048545 1009438 1054193
14905 1054193 1056113 1062755 1060599 1062705 1029458 1013917 1066101 1094749 1009204 1052107 1076183 1045347
14893 1045347 1026128 1002873 1015172 1027922 1053967 1075859 1058755 1035526 1103563 1093523 1081280
14882 1081280 1121039 1129902 1069039 1012448 1040842 1093222 1083028 1072737 1029540 979987 986981 1051325
14870 1051325 1079659 1049980 1074532 1090189 1056026 1093264 1102524 1065555 1054686 1056723 1084928 1061203
14858 1061203 1039042 1085902 1033274 1006623 1036793 1029540 997061 1043996 1123553 1113541 1086343
14847A086343M4158o4401N55M9823l1976J818j8012r108j2942o856k275j0509
14835A026618k4707j1338L2798P7275j6064m0730L9317j4344N190J9235q3144
14824A010106N954P0563k3064k9362l601l1303m0864J4761P1845J9757K6478k3528
14812A067742m8645M3078J7298L6881j03r6292L5785o561m4527J8431J0333j4376
14800A019044n2891K2937J9131j1968N6243J8128l8060L2698M0256O356k5471
14789A086403j5524M6265q220q2138j2856J6459q278K5248K7537p5204j9469R7268
$$ plain form
14847 1086343 1130501 1066100 1066655 1116478 1084502 1086320 1068308 1059200 1046258 1039402 1037127 1026618
14835 1026618 1001911 990573 1023371 1100646 1084582 1043852 1083169 1068825 1074015 1093250 1010106
14824 1010106 1016060 1086623 1063559 1034197 1030596 999293 958429 973190 1045035 1064792 1091270 1067742
14812 1067742 1019097 1062175 1079473 1116354 1116251 1019959 1055744 1049183 1004656 1023087 1033420 1019044
14800 1019044 966153 989090 1008221 996253 1052496 1070624 1032564 1065262 1105518 1111874 1086403
14789 1086403 1070879 1117144 1108924 1026786 1013930 1030389 1022111 1047359 1074896 999692 980223 1077491
$$ [...]
##END NTUPLES=NMR SPECTRUM
##END=
