##TITLE=1H_TG-1124-13
 CDCl3, 8 sc, 
 21.11.2019
##JCAMPDX= 6.0         $$ Bruker NMR JCAMP-DX V2.0
##DATA TYPE= NMR FID
##DATA CLASS= NTUPLES
##ORIGIN= UXNMR, Bruker Analytische Messtechnik GmbH
##OWNER= root
$$ XWIN-NMR		Version 3.5
$$ Thu Nov 21 14:04:21 2019 Russian Standard Time (UT+4h)  she@DPX200
##.OBSERVE FREQUENCY= 200.1315
##.OBSERVE NUCLEUS= ^1H
##.DELAY= (6, 6)
##.ACQUISITION MODE= SIMULTANEOUS
##.ACQUISITION SCHEME= undefined
##.AVERAGES= 8
##.DIGITISER RES= 18
##SPECTROMETER/DATA SYSTEM= spect
##.PULSE SEQUENCE= zg30
##.SOLVENT NAME= CDCl3
##.SHIFT REFERENCE= (INTERNAL, CDCl3, 0, 15.7039)
##AUDIT TRAIL= $$ (NUMBER, WHEN, WHO, WHERE, WHAT)
$$ ##TITLE= Audit trail, XWIN-NMR		Version 3.5
$$ ##JCAMPDX= 5.01
$$ ##ORIGIN= Bruker BioSpin GmbH
$$ ##OWNER= she
$$ F:/spectra/data/she/nmr/H-F/1/audita.txt
$$ ##AUDIT TRAIL=  $$ (NUMBER, WHEN, WHO, WHERE, WHAT)
(   1,<2019-11-21 14:03:03.79 +0400>,<she>,<DPX200>,
      <created by zg, POWCHK disabled, PULCHK disabled
       configuration hash MD5:
       00 E9 B6 7A A2 85 ED C7 34 08 36 98 17 FE 4E 26
       data hash MD5: 16K
       E2 0D B0 60 89 AE 1C B1 F9 5C 32 A5 3D FD 10 5D>)
$$ ##END=
$$ 
$$ hash MD5
$$ D9 21 A6 77 94 96 AD 01 C9 E4 24 EA 33 DB 9A F3
##$RELAX= 
##$RELAX= 
##$RELAX= 
##$RELAX= 
##$RELAX= 
##$RELAX= 
$$ Bruker specific parameters
$$ --------------------------
##$DU= <F:/spectra>
##$EXPNO= 1
##$NAME= <H-F>
##$PROCNO= 1
##$TYPE= <nmr>
##$USER= <she>
##$AMP= (0..31)
100 100 100 100 100 100 100 100 100 100 100 100 100 100 100 100 100 100 
100 100 100 100 100 100 100 100 100 100 100 100 100 100 
##$AQSEQ= 0
##$AQ_mod= 1
##$AUNM= <au_zg>
##$AUTOPOS= <>
##$BF1= 200.13
##$BF2= 200.13
##$BF3= 200.13
##$BF4= 200.13
##$BF5= 200.13
##$BF6= 200.13
##$BF7= 200.13
##$BF8= 200.13
##$BYTORDA= 1
##$CFDGTYP= 0
##$CFRGTYP= 5
##$CHEMSTR= <none>
##$CNST= (0..31)
1 1 145 1 1 1 1 1 1 1 1 1 1 1 1 1 1 1 1 1 1 1 1 1 1 1 1 1 1 1 1 1 
##$CPDPRG= <>
##$CPDPRG1= <>
##$CPDPRG2= <>
##$CPDPRG3= <>
##$CPDPRG4= <mlev>
##$CPDPRG5= <mlev>
##$CPDPRG6= <mlev>
##$CPDPRG7= <mlev>
##$CPDPRG8= <mlev>
##$CPDPRGB= <>
##$CPDPRGT= <>
##$D= (0..31)
0 1.2 0 0 0 0 0 0 0 0.06 0 0.03 0 0 0 0 0.0002 0 0 0 0 0 0 0 0 0 0 0 0 
0 0 0 
##$DATE= 1574330583
##$DBL= (0..7)
120 120 120 120 120 120 120 120 
##$DBP= (0..7)
150 150 150 150 150 150 150 150 
##$DBP07= 0
##$DBPNAM0= <>
##$DBPNAM1= <>
##$DBPNAM2= <>
##$DBPNAM3= <>
##$DBPNAM4= <>
##$DBPNAM5= <>
##$DBPNAM6= <>
##$DBPNAM7= <>
##$DBPOAL= (0..7)
0.5 0.5 0.5 0.5 0.5 0.5 0.5 0.5 
##$DBPOFFS= (0..7)
0 0 0 0 0 0 0 0 
##$DE= 6
##$DECBNUC= <off>
##$DECIM= 24
##$DECNUC= <off>
##$DECSTAT= 4
##$DIGMOD= 1
##$DIGTYP= 9
##$DL= (0..7)
0 120 120 120 120 120 120 120 
##$DP= (0..7)
150 150 150 150 150 150 150 150 
##$DP07= 0
##$DPNAME0= <>
##$DPNAME1= <>
##$DPNAME2= <>
##$DPNAME3= <>
##$DPNAME4= <>
##$DPNAME5= <>
##$DPNAME6= <>
##$DPNAME7= <>
##$DPOAL= (0..7)
0.5 0.5 0.5 0.5 0.5 0.5 0.5 0.5 
##$DPOFFS= (0..7)
0 0 0 0 0 0 0 0 
##$DQDMODE= 0
##$DR= 18
##$DS= 0
##$DSLIST= <SSSSSSSSSSSSSSS>
$$ [...]
##$SUBNAM2= <"">
##$SUBNAM3= <"">
##$SUBNAM4= <"">
##$SUBNAM5= <"">
##$SUBNAM6= <"">
##$SUBNAM7= <"">
##$SUBNAM8= <"">
##$SUBNAM9= <"">
##$SW= 24.9337058887773
##$SWIBOX= (0..15)
0 0 2 0 0 0 0 0 0 0 0 0 0 0 0 0 
##$SW_h= 4990.01996007984
##$TD= 16384
##$TD0= 1
##$TE= 0
##$TE2= 300
##$TE3= 300
##$TEG= 300
##$TL= (0..7)
0 120 120 120 120 120 120 120 
##$TP= (0..7)
150 150 150 150 150 150 150 150 
##$TP07= 0
##$TPNAME0= <>
##$TPNAME1= <>
##$TPNAME2= <>
##$TPNAME3= <>
##$TPNAME4= <>
##$TPNAME5= <>
##$TPNAME6= <>
##$TPNAME7= <>
##$TPOAL= (0..7)
0.5 0.5 0.5 0.5 0.5 0.5 0.5 0.5 
##$TPOFFS= (0..7)
0 0 0 0 0 0 0 0 
##$TUNHIN= 0
##$TUNHOUT= 0
##$TUNXOUT= 0
##$USERA1= <user>
##$USERA2= <user>
##$USERA3= <user>
##$USERA4= <user>
##$USERA5= <user>
##$V9= 5
##$VALIST= <valist>
##$VCLIST= <CCCCCCCCCCCCCCC>
##$VD= 0
##$VDLIST= <DDDDDDDDDDDDDDD>
##$VPLIST= <PPPPPPPPPPPPPPP>
##$VTLIST= <TTTTTTTTTTTTTTT>
##$WBST= 1024
##$WBSW= 4
##$XGAIN= (0..3)
0 0 0 0 
##$XL= 0
##$YL= 0
##$YMAX_a= 850068
##$YMIN_a= -245844
##$ZGOPTNS= <>
##$ZL1= 120
##$ZL2= 120
##$ZL3= 120
##$ZL4= 120
##$ABSF1= 10
##$ABSF2= 0
##$ABSG= 5
##$ABSL= 3
##$ALPHA= 0
##$AQORDER= 0
##$ASSFAC= 0
##$ASSFACI= 0
##$ASSFACX= 0
##$ASSWID= 0
##$AUNMP= <proc_1d>
##$AZFE= 0.1
##$AZFW= 0.1
##$BCFW= 1
##$BC_mod= 2
##$BYTORDP= 1
##$COROFFS= 0
##$CY= 11.3945322036743
##$DATMOD= 1
##$DC= 2
##$DFILT= <>
##$DTYPP= 0
##$F1P= 16.9975609425685
##$F2P= -3.02152046262296
##$FCOR= 0.5
##$FTSIZE= 0
##$FT_mod= 4
##$GAMMA= 1
##$GB= 0.15
##$INTBC= 1
##$INTSCL= 1
##$ISEN= 128
##$LB= 0.24
##$LEV0= 0
##$LPBIN= 0
##$MAXI= 10000
##$MC2= 0
##$MEAN= 0
##$ME_mod= 0
##$MI= 1.114404
##$NCOEF= 0
##$NC_proc= 0
##$NLEV= 6
##$NOISF1= 3.799351
##$NOISF2= 2.8
##$NSP= 1
##$NTH_PI= 0
##$NZP= 0
##$OFFSET= 15.70392
##$PC= 1
##$PHC0= -9801.801
##$PHC1= 35.00086
##$PH_mod= 1
##$PKNL= yes
##$PPARMOD= 0
##$PSCAL= 0
##$PSIGN= 0
##$REVERSE= no
##$SF= 200.130013532006
##$SI= 16384
##$SIGF1= 3
##$SIGF2= 2
##$SINO= 400
##$SIOLD= 16384
##$SREGLST= <1H.CDCl3>
##$SSB= 0
##$STSI= 0
##$STSR= 0
##$SW_p= 3612.71676300578
##$SYMM= 0
##$S_DEV= 0
##$TDeff= 0
##$TDoff= 0
##$TI= <>
##$TILT= no
##$TM1= 0
##$TM2= 0
##$TOPLEV= 0
##$USERP1= <user>
##$USERP2= <user>
##$USERP3= <user>
##$USERP4= <user>
##$USERP5= <user>
##$WDW= 1
##$XDIM= 8192
##$YMAX_p= 0
##$YMIN_p= 0
$$ End of Bruker specific parameters
$$ ---------------------------------
##NTUPLES= NMR FID
##VAR_NAME=  TIME,          FID/REAL,        FID/IMAG
##SYMBOL=    X,             R,               I
##VAR_TYPE=  INDEPENDENT,   DEPENDENT,       DEPENDENT
##VAR_FORM=  AFFN,          ASDF,            ASDF
##VAR_DIM=   8192,          8192,            8192
##UNITS=     SECONDS,       ARBITRARY UNITS, ARBITRARY UNITS
##FACTOR=    0.0002004,     1,               1
##FIRST=     0,             0,               0
##LAST=      1.6414764,     0,               0
##MIN=       0,             -245844,         0
##MAX=       1.6414764,     850068,          0
$$ Real data points
##PAGE= N=1
##DATA TABLE= (X++(R..R)), XYDATA
0 0 0 0 0 0 -8 8 -8 8 -16 16 -24 32 -40 41 -56 67 -79 95 -113 134 -155 183 -211 242 -280 322 -366 417
28 417 -473 537 -601 678 -760 851 -949 1059 -1179 1309 -1452 1611 -1785 1975 -2188 2423
44 2423 -2684 2976 -3306 3680 -4107 4604 -5189 5885 -6736 7802 -9180 11046 -13727 17930
58 17930 -25521 43623 -178050 -7980 299676 -39640 -184328 -64063 89899 -42754 -233546
69 -233546 -245844 51535 292439 216600 -33108 -80547 41596 137534 60038 -92722 -87648
80 -87648 177148 316517 84631 -146305 10751 246780 179059 -50370 -98073 65843 221240
91 221240 149484 -50554 -57434 132630 152616 -53938 -157299 -40798 96691 128730 46539
102 46539 -80694 -95477 -4405 -35133 -186110 -184804 6316 125109 37455 -137553 -206893
113 -206893 -107740 -37171 -152659 -220975 -29353 140574 13837 -173904 -172118 -101193 -90718
124 -90718 -93862 -88440 -60910 13745 36111 -62271 -141956 -99302 -25221 -6751 -43644 -86787
136 -86787 -38645 68157 32700 -117328 -104230 47137 40353 -94839 -95008 28511 89636 49765
148 49765 -26508 -60180 -8317 21294 -55976 -85372 39338 140157 91899 1583 -52207 -65219
160 -65219 -12546 33281 -5279 823 131337 182633 37387 -106152 -88546 14195 71041
171 71041 31796 -14037 66582 169509 68507 -119904 -99585 56309 83038 6643 -14711
182 -14711 15859 48799 49290 -29530 -106149 -45956 59450 33432 -68813 -89041 -11333 66634
194 66634 30753 -110993 -150760 -7311 57360 -87283 -160280 -13088 102783 17810 -120145
205 -120145 -157494 -84456 7428 -2985 -76904 -36401 89572 79861 -70355 -162674 -117039 2425
217 2425 91113 48644 -40152 16581 131440 51259 -131879 -121578 61605 162001 97967
228 97967 -5421 -1656 105394 121624 -25662 -95754 49613 173999 107573 5203 5229 64419
240 64419 113414 83245 -25326 -48724 80554 149366 40396 -52760 12251 115499 101802
251 101802 -29612 -118810 -20127 135710 95466 -54674 -32047 101063 79666 -69487 -133681
262 -133681 -61485 59171 113712 37803 -54578 -14892 56212 -9127 -119995 -101664 27255
273 27255 129598 99189 -41357 -100805 8524 70841 -52197 -131253 -2815 131629 87205
284 87205 -35958 -78473 -9207 72594 32946 -77164 -59971 68404 92317 -4632 -53456
295 -53456 -14238 40789 55170 -12498 -92886 -32207 106088 94736 -33312 -52263 36901 58680
307 58680 -22996 -93805 -45733 93347 140649 16640 -77650 -7189 51308 -20102 -72035 -7860
319 -7860 84427 123229 75357 -38600 -82985 470 53050 -6898 -34966 47258 121556 92123
331 92123 -14490 -86146 -21710 91483 62806 -44818 -10280 110113 95600 -21060 -58053
342 -58053 980 62068 59737 -9208 -45728 28724 98360 42046 -38881 -25108 26840 39474
354 39474 3947 -51957 -39913 68919 106679 -16533 -104934 -28498 46321 -4083 -65909 -30238
366 -30238 61623 95293 1513 -120612 -99601 13309 22955 -45968 -32726 40975 59358 10239
378 10239 -69807 -117320 -49600 58634 43821 -42735 -28342 51950 46303 -39564 -92931 -46942
390 -46942 55751 78860 -18355 -60986 38791 95603 6574 -62471 -13190 48230 50672 13743
402 13743 -21687 5733 82193 79311 -15634 -51570 10936 57332 41782 8685 4434 55837
414 55837 96162 15438 -98180 -57076 68719 72557 -9323 -12573 47823 58254 -7615 -89538
426 -89538 -85807 20739 84535 18952 -43607 -9135 22704 -16347 -68245 -83627 -38926 47324
438 47324 58227 -42520 -88062 -4558 42011 -32940 -95352 -52859 28346 47031 -26373 -89854
450 -89854 -28369 65837 21526 -87191 -73108 19967 43147 957 -30780 -20411 32190 55013
462 55013 -23168 -98508 -36662 68601 66325 -4364 -27875 13565 55574 14665 -84035 -74753
474 -74753 72083 135628 26783 -57285 -5753 50095 15185 -47715 -54405 25730 115307 82830
486 82830 -33120 -56588 21688 52996 4542 -32711 -9457 62050 98696 18269 -79866 -28641
498 -28641 86905 64468 -44289 -49162 42699 89966 38519 -42389 -41212 49185 78196 -19980
510 -19980 -80830 -4262 75034 52434 -10527 -42064 -21147 28990 19592 -61526 -69961 39950
522 39950 94449 7934 -83530 -70675 -4569 16597 -38569 -80817 -6443 89228 35744 -93786
534 -93786 -100487 -10196 22710 -13439 -40267 -24020 29078 50601 -20626 -91497 -43397 44088
546 44088 41064 -15560 -29286 13009 63799 49964 -31306 -51345 42073 90090 9176 -44948
558 -44948 19978 86907 66979 7621 -21160 12684 64195 44414 -16502 2015 76921 79275
570 79275 13775 -27728 -24256 10172 43988 19274 -24702 13377 76310 28129 -72251 -74994
582 -74994 -16 38258 10951 -32070 -25576 27765 23138 -67299 -102951 -23301 35734 4091
594 4091 -34116 -30177 -10133 6349 -12237 -62610 -56459 19255 40430 -22311 -53617 -10698 31892
607 31892 23024 -24946 -50799 1694 61760 20410 -49030 -9982 67734 49831 -22244 -40189
619 -40189 -3460 37831 40966 -1069 -14613 40305 65037 -1048 -56189 -26384 30911 54500
631 54500 30173 -18177 -16868 41577 35898 -57251 -79664 16195 78020 30618 -33700 -32286 16763
644 16763 37585 -18624 -73793 -21344 64362 44882 -32946 -43527 1014 28176 16049 -28807
656 -28807 -50875 8938 69236 20317 -55955 -28316 46034 45256 -21884 -64229 -25087 52804
668 52804 53839 -32652 -58159 22406 55720 -18244 -71695 -33588 28353 45963 3741 -53976
680 -53976 -42759 19145 12531 -61042 -70902 2226 50549 20557 -47633 -76777 -22150 36045
692 36045 -11456 -84852 -40311 53230 39924 -46167 -72929 -24062 27526 18946 -38956 -52044
704 -52044 17541 58214 2376 -49672 -22121 26168 33939 2348 -38389 -24845 47817 64779
716 64779 -13041 -48202 16518 59228 13704 -37735 -22854 37569 67897 15483 -50510 -24938
728 -24938 40097 22163 -37673 -28345 25638 43893 17401 -32008 -57553 -14893 32530 -679
740 -679 -50126 -17853 37284 22626 -38444 -69054 -37323 23783 28413 -36509 -52310 18344 44566
753 44566 -23209 -65045 -25400 21577 21983 -12897 -40929 -13442 39012 25681 -35335 -36902 16093
766 16093 33918 5618 -23648 -22307 22804 55529 6249 -56718 -21498 47211 27358 -32098
778 -32098 -24635 28510 48324 10496 -44224 -41977 20879 41924 -12432 -38288 7088 35872
790 35872 6437 -33254 -47868 -18671 34257 32375 -30302 -41850 20843 39491 -18753 -57319
802 -57319 -26357 27421 39358 -10286 -51980 -9243 49694 16325 -48560 -31289 27939 35511
814 35511 1723 -25410 -18122 24757 42673 -8014 -49160 -7904 42265 24328 -17898 -23403
826 -23403 8780 41302 19871 -43982 -47164 29120 54387 -11561 -45782 -530 33079 6272
838 6272 -37990 -46448 -826 45160 17793 -41139 -32576 17314 16880 -23712 -41004 -21067 20594
851 20594 37599 -11135 -58957 -18167 42549 14372 -45720 -32378 24753 42219 4843 -38940
863 -38940 -26186 33535 43058 -20105 -44520 10315 45643 17362 -15413 -14322 13821 42027
875 42027 22935 -30256 -25217 37924 52268 -795 -27792 873 34063 28946 -15046 -38186
887 -38186 12423 65239 24646 -42163 -22817 33423 27868 -15793 -31053 -5409 35564 35671 -19567
900 -19567 -49695 -4090 35700 7089 -31418 -23244 11958 33281 8066 -45007 -40467 26923
912 26923 39925 -27980 -52460 3496 39467 9292 -32967 -34393 7645 38633 3228 -46311
924 -46311 -21915 34574 27794 -18119 -30845 -7871 19603 22906 -14426 -39991 5292 51818
936 51818 15043 -40944 -24648 24004 30468 -4450 -32673 -11715 38766 35041 -29912 -46079
948 -46079 14059 43491 3306 -27870 -12575 18444 30743 2435 -38670 -24142 31128 31717
960 31717 -19704 -34398 691 28189 16472 -22254 -39154 5054 46257 5570 -49918 -19971
972 -19971 36336 23773 -24045 -34350 -5655 24650 17504 -24742 -35030 12760 37444 -2056
984 -2056 -34506 -15910 14625 22069 182 -31528 -18914 32250 30513 -31370 -42855 13794 40491
997 40491 4108 -29841 -20075 19269 35098 -6798 -46301 -10847 41263 20411 -29082 -26877
1009 -26877 7860 24349 11066 -21090 -31353 10771 40974 497 -41370 -14897 28088 22624
1021 22624 -14169 -33795 -9454 34220 25777 -31784 -37271 23602 42393 -6798 -33632 -6894
1033 -6894 23875 24835 -3756 -29303 -7167 35389 23082 -23478 -23219 16271 31323 10798 -18007
1046 -18007 -21220 16921 41622 -927 -43689 -7392 41903 18786 -28670 -27316 7474 28469
1058 28469 9456 -30677 -29723 18544 31329 -16676 -40700 -9558 17348 8260 -17484 -35759
1070 -35759 -16964 23649 14127 -38497 -40162 13001 27751 -12047 -38220 -20220 16133 23486
1082 23486 -16716 -46215 -6104 39388 10331 -35967 -20317 19311 24077 2181 -19733 -14265
1094 -14265 22644 37283 -3959 -31499 2914 36519 18562 -13502 -17414 11533 41833 22828
1106 22828 -28819 -24343 34734 42368 -12352 -31571 5800 32557 18388 -14985 -29473 793
1118 793 35741 11581 -32774 -20631 20730 23718 -6078 -26521 -18847 14076 27716 -13415 -45240
1131 -45240 -4650 38711 10400 -33402 -23877 14236 27437 2860 -30301 -18330 30984 34202
1143 34202 -17472 -33001 8422 30606 10795 -10836 -12463 10896 36980 17727 -27113 -18830
1155 -18830 31192 36791 -4402 -21242 2546 30663 26105 -15457 -35851 7520 46808 11327
1167 11327 -33412 -11454 27929 22081 -8890 -25154 -11471 21685 25201 -16324 -34116 4736
1179 4736 30619 5704 -23536 -19274 7248 27844 9701 -29461 -19077 32638 33204 -19104 -31283
1192 -31283 8038 30340 13180 -11423 -13070 16656 37464 6366 -29296 -5841 33629 25885
1204 25885 -3463 -10457 2929 22200 21074 -13642 -29739 11956 43591 9708 -28313 -12143
1216 -12143 19481 19751 -8669 -32441 -12959 29575 22514 -28638 -34919 9872 22661 -8282 -27105
1229 -27105 -16500 6945 20631 -974 -32725 -14936 26503 18044 -23884 -28454 2767 25337
1241 25337 17817 -13110 -22424 17213 42073 1517 -33493 305 41635 28159 -3828 -10197
1253 -10197 8574 29697 20960 -14244 -13689 31044 45800 9328 -15132 -1476 20058 25257 4447
1266 4447 -20738 -1309 41897 29070 -24815 -29553 13685 28436 1028 -23117 -15124 18092
1278 18092 29730 -8118 -39276 -8338 28314 7249 -26875 -22422 2369 18236 10108 -19514
1290 -19514 -27202 9892 29566 -7236 -35320 -7024 27930 22847 -7767 -26881 -6067 29165
1302 29165 16793 -27024 -19309 31834 38438 -3588 -23621 -6022 17322 21978 -836 -20722
1314 -20722 4493 38538 17010 -27382 -25103 9157 24718 9938 -15726 -17475 17893 32394
1326 32394 -11650 -43596 -7632 29996 10045 -23230 -22098 3592 22371 7013 -29238 -26641
1338 -26641 15777 23576 -13353 -26878 -1382 19111 15304 -7957 -28540 -11290 25304 16383
1350 16383 -23468 -17786 23317 29753 -3778 -25688 -14460 16790 27415 -3495 -23923 7673
1362 7673 33836 2215 -31078 -16595 12916 21102 8914 -12835 -14138 14495 20973 -16480 -35167
1375 -35167 -3032 24632 11894 -14917 -23559 -2917 22445 5040 -34481 -24274 21833 22621
1387 22621 -16994 -25682 74 18265 10571 -15220 -28633 -2311 26665 7517 -22273 -7760
1399 -7760 21588 19840 -3311 -20789 -13682 18557 32136 -1591 -22403 9691 32201 2538
1411 2538 -26384 -12680 18545 32483 13106 -16986 -10590 22440 16763 -20941 -21849 13700 27652
1424 27652 11181 -10932 -20445 -3867 19482 4218 -27932 -14444 24006 20872 -12964 -26237
1436 -26237 -9301 13961 11924 -20378 -33033 4218 28931 -2656 -29951 -8964 16228 9279
1448 9279 -11928 -25121 -12554 18596 21282 -13188 -24500 4979 17717 -4438 -22528 -13707
1460 -13707 12211 29463 8128 -26845 -16008 21626 14224 -22229 -19212 15318 28490 8629
1472 8629 -19047 -24462 3875 23086 -2120 -24708 552 28531 13856 -13510 -21805 -8779
1484 -8779 13913 15357 -16007 -26450 10786 30725 -1359 -28174 -11329 14731 15440 -8338 -27142
1497 -27142 -6692 29853 19006 -22964 -23640 9918 15434 -6028 -17409 -8293 14513 27568 2533
1510 2533 -29311 -13996 19685 12798 -14153 -12224 11744 25307 9924 -23737 -29293 10386 31986
1523 31986 402 -22033 5401 28480 10090 -18162 -24497 -2856 24689 18542 -16089 -18784
1535 -18784 15314 23016 -7058 -23416 -9165 13226 20725 -1486 -26844 -7971 29550 16503
1547 16503 -25791 -25719 8206 18617 -1321 -20095 -12394 18967 27805 -9273 -35849 -9002 20384
1560 20384 7756 -12799 -9915 5803 17526 6646 -25809 -30240 10030 31469 2774 -19013
1572 -19013 -1498 17454 8902 -16886 -29175 -2489 33484 20948 -19917 -18432 15055 16533
1584 16533 -10687 -20942 -6346 16905 24337 -717 -25034 -6045 23065 8740 -22210 -19740
1596 -19740 4784 17780 7353 -16889 -19371 12495 24909 -12063 -36521 -8565 19613 9355
1608 9355 -12185 -15578 -742 14342 769 -29968 -24533 13074 22485 -2855 -15509 -5925 3796
1621 3796 3360 -11292 -24643 -3022 29723 16882 -20136 -19781 6956 11573 -5613 -14981 -3517
1634 -3517 20805 24501 -7424 -26120 -859 19956 2695 -14126 -4835 9639 15235 7112 -12156
1647 -12156 -13016 12284 17701 -10619 -21308 1976 18165 9582 -6408 -13739 -622 14864 -1581
1660 -1581 -27783 -12167 23093 19768 -7956 -14505 -3055 3284 -178 -13351 -14674 11643 27284
1673 27284 1844 -23102 -12307 5746 5130 -3344 -7857 1830 22706 17758 -18666 -28845 5083
1686 5083 22360 344 -14984 -1777 17278 17440 -5575 -25718 -7906 23235 13234 -18749
1698 -18749 -16028 10058 16691 2040 -15210 -18055 2751 18141 -5697 -30964 -9015 25265
1710 25265 16724 -15009 -24792 -8183 11679 5383 -22386 -22201 16369 29695 -8135 -33825 -14717
1723 -14717 10084 10910 -3955 -13969 753 25257 13512 -26362 -29665 7131 25430 8836
1735 8836 -10454 -8314 12955 23343 -3624 -32496 -9069 32887 24189 -12773 -17125 8122 21595
1748 21595 7996 -18451 -21290 10397 27892 -531 -24733 -5059 21502 15455 -8550 -23993
1760 -23993 -13422 15143 17341 -15186 -23506 10459 25931 -4518 -30918 -19401 8994 21351
1772 21351 4146 -18601 -7224 20054 9207 -24897 -23152 8390 23456 13168 -5573 -13268
1784 -13268 2569 17748 -334 -21879 -2508 29478 24232 -3199 -14265 -2613 15849 14539
1796 14539 -9981 -16084 14498 29861 3151 -16604 -1547 15650 11789 -3540 -14566 -5536
1808 -5536 16760 15547 -8875 -11993 8335 12575 -4723 -16417 -12528 5013 19406 7027 -15726
1821 -15726 -7548 12900 1492 -21514 -13999 9201 17545 7844 -8311 -13637 1255 8215 -8333
1834 -8333 -13544 9192 22374 8097 -7154 -10281 -4734 7068 7228 -7876 -5301 18530 19542
1847 19542 -7248 -16824 -748 11796 7976 -5000 -11175 4675 20331 3305 -19449 -7108
1859 -7108 14609 6873 -12588 -13821 -1032 12817 13226 -6250 -17345 476 13010 -5554 -20796
1872 -20796 -6941 13556 17572 2283 -18441 -15161 10221 12291 -14019 -14920 15989 26292 2598
1885 2598 -18824 -15717 4548 17656 4289 -13296 489 25663 15349 -14198 -17684 1935
1897 1935 17875 15208 -4504 -14495 8720 27392 3149 -24210 -9918 18613 16410 -5711 -17006
1910 -17006 -2677 22570 19151 -14092 -24288 4462 19271 -1867 -18265 -6443 13460 19777
1922 19777 950 -25071 -18488 13618 17667 -8499 -14624 7885 20334 6031 -18866 -24470 2003
1935 2003 26623 10013 -16789 -5064 20427 11342 -15145 -18951 -265 20599 20338 -3792 -16542
1948 -16542 4291 19097 278 -18572 -7576 13167 18576 3728 -15405 -10284 16105 18190
1960 18190 -13104 -22300 3737 17918 1927 -13997 -9407 8080 16569 -1996 -24963 -14156
1972 -14156 13229 12222 -8236 -10220 3085 9799 2261 -16097 -22707 781 22881 7401 -15532
1985 -15532 -7491 9901 4451 -12104 -16583 -1482 20326 18302 -9767 -18890 3969 12842 -6050
1998 -6050 -14910 -531 14750 15541 1021 -15763 -8745 13333 11441 -11474 -13063 7164 15633
2011 15633 4472 -9818 -11582 5148 16799 -2203 -22803 -6011 19707 12095 -8733 -10140
2023 -10140 2791 8955 1068 -15139 -14923 9741 21143 1580 -14364 -4930 6049 2992 -6127
2036 -6127 -10461 534 20344 14924 -13253 -19223 3692 12337 -2214 -9044 1540 14883 15203
2049 15203 -4165 -19545 -4721 17044 9202 -9845 -4733 10988 11694 1145 -9749 -10268 5977
2062 5977 15779 -1322 -15809 188 17330 9268 -7088 -9990 -296 9966 3292 -15377 -11868
2075 -11868 15384 20018 -4767 -16008 -3730 5676 1644 -6469 -8143 4751 18200 6134 -17783
2088 -17783 -15905 3388 7432 -1402 -5252 47 10386 10137 -10456 -23748 -3251 18617 7181
2101 7181 -10840 -4572 8768 7445 -5435 -16704 -9104 12660 15691 -6591 -13971 4255 13051
2114 13051 1207 -10105 -9739 1542 12359 3444 -15222 -8679 15794 15063 -8487 -16631 -2581
2127 -2581 9852 6940 -6939 -11162 7734 21072 108 -23116 -11992 10157 10093 -1870 -6670
2140 -6670 -260 10745 8097 -13600 -20694 2912 20053 6812 -9832 -6790 4974 9083 -3518
2153 -3518 -19513 -8806 19882 19503 -9095 -16240 4349 13825 997 -12575 -10555 7270 19442
2166 19442 3709 -16913 -6666 15888 12186 -8772 -14376 -2302 13594 14019 -5043 -14353 6359
2179 6359 21319 147 -22455 -11250 12404 17182 1969 -11602 -5303 13526 10426 -15799 -19893
2192 -19893 6991 21797 7271 -9811 -11082 95 9229 102 -16787 -7245 19032 18327 -8415
2205 -8415 -18910 -4300 10267 7919 -7960 -13984 5523 20854 2457 -20541 -10160 12186
2217 12186 11450 -4150 -11765 -4206 11296 13493 -5622 -14901 1853 14495 1024 -14975 -10161
2230 -10161 5791 15240 6778 -12275 -11173 8258 9479 -11475 -15161 5167 15686 6229 -8772
2243 -8772 -13775 -4215 7276 297 -12252 -3108 13488 7940 -8800 -13217 -6654 2707 6503 -1803
2257 -1803 -8806 3109 12022 -2500 -16453 -7098 7027 7296 -403 -6157 -1702 9287 6985 -9744
2271 -9744 -10128 6620 9788 -3276 -6909 164 6395 7944 978 -8888 -3713 8803 3837 -9021
2285 -9021 -4282 9412 11410 1663 -8743 -9636 2305 9811 -2948 -10797 4623 15893 1311
2298 1311 -13438 -9692 1362 7877 3510 -6901 -4521 9160 7795 -11221 -15347 653 10990
2311 10990 6818 -2852 -7942 373 11886 2600 -15953 -9165 12975 13584 -4345 -11525 -1011 11753
2325 11753 10523 -6661 -14905 2355 17196 3688 -12757 -3737 12128 11884 -855 -13976 -10900
2338 -10900 8360 14674 -3399 -13572 3273 16108 3165 -15127 -15593 1497 16469 7481 -13870
2351 -13870 -11292 10352 9252 -13100 -18045 -538 13734 10203 -5547 -15592 -3492 12112 2179
2364 2179 -16751 -9801 10916 13427 -1098 -13711 -10177 7710 13556 -5394 -17894 579 17890
2377 17890 6118 -11636 -8780 5971 12201 1996 -14512 -11512 10524 15957 -3078 -11848 1482
2390 1482 10713 3693 -8809 -13403 -786 16675 10386 -11749 -12325 6453 8746 -6342 -13247 -2909
2404 -2909 11785 13089 -3495 -16654 -3506 11473 2217 -11771 -5102 8829 9812 267 -10727
2417 -10727 -9771 5506 12281 -2292 -11269 2178 13494 5220 -6990 -7995 1943 11519 5461 -10678
2431 -10678 -7383 12191 13544 -3647 -8364 1663 7903 3966 -4592 -7587 3697 15160 5764
2444 5764 -9855 -6612 5335 4365 -3282 -5007 -221 9212 10128 -5148 -14976 -1073 10674 984
2458 984 -8419 -1890 7328 6267 -3130 -12004 -6220 8833 8952 -6113 -7847 5675 7662 -2067 -7288
2473 -7288 -5286 2624 9713 2504 -10714 -4292 11024 7063 -7034 -7768 2348 7635 3490 -6689
2487 -6689 -7713 7155 14443 -1784 -14281 -3317 8017 2848 -5185 -5210 1885 10318 5856 -10906
2501 -10906 -13590 3296 9677 -1477 -7730 -1805 5589 5682 -5291 -15367 -5700 12970 8464 -9163
2515 -9163 -8842 5388 7532 -3402 -10632 -6384 6909 12594 -1529 -13356 -2013 11063 3836
2528 3836 -8014 -6697 2426 9543 6269 -6806 -9681 6802 14429 -2011 -13093 -2863 9462
2541 9462 7647 -3083 -7768 1064 13170 6151 -12532 -10989 7754 11796 -129 -6612 -2149 5057
2555 5057 7294 -3627 -13272 -2363 14411 8531 -7600 -7988 2944 7146 891 -8519 -7445 8429
2569 8429 14308 -2689 -14370 -1050 11380 3532 -6632 -5939 2922 10361 5248 -9239 -8591 7628
2583 7628 10918 -3494 -9549 -1038 7438 7606 -1174 -9099 -1343 12468 5124 -12318 -8841 8412
2597 8412 10957 -14 -7983 -4803 5262 7448 -5529 -13066 1347 13890 4249 -8688 -7172
2610 -7172 831 4870 1447 -7792 -7157 7491 11208 -5254 -13887 -2056 7959 3865 -4989 -7167
2624 -7167 1209 10540 2675 -13306 -8729 8779 8780 -4791 -8262 -613 6147 5617 -3937 -10280 -130
2639 -130 11151 2573 -10409 -5783 6157 8272 415 -7268 -6540 5325 8768 -5463 -12268 3418
2653 3418 13499 2898 -8365 -6838 1420 6821 1646 -8263 -4569 9683 8589 -6733 -10277 -279
2667 -279 6223 4406 -1868 -6177 668 10337 2313 -11891 -6611 8883 8335 -2692 -6828 -1481 6578
2682 6578 6701 -5114 -10137 3303 12107 960 -8707 -2390 5820 5951 466 -6781 -4778 6976
2696 6976 8508 -4598 -8290 4336 10050 1672 -6418 -6092 1906 9135 2507 -9209 -2961 10726
2710 10726 6379 -7852 -8434 1853 7257 3973 -3381 -6237 2631 8968 -1049 -10745 -2739 7759
2724 7759 5510 -2424 -5973 -3115 5523 6047 -6514 -9545 4903 10948 -1388 -9394 -3087 5173
2738 5173 5407 -1816 -9767 -3449 9405 5747 -8381 -6962 5215 6668 -728 -6223 -6097 1957 8934
2753 8934 258 -10421 -2550 9607 3856 -8084 -7802 1392 8056 5227 -6055 -8611 4622 9538
2767 9538 -4227 -11133 -365 8397 4305 -3284 -7176 -2515 6911 4858 -8084 -7594 6362 8985
2781 8985 -2096 -8381 -4402 3874 7368 -1051 -10643 -2543 11390 4983 -9589 -7322 5089 7499
2795 7499 509 -6784 -5895 5109 9812 -2329 -10294 -96 9215 3126 -5703 -5414 1188 8753 6410
2810 6410 -6721 -8263 6190 10455 -2685 -9323 -429 8254 6656 -2453 -8659 -1528 10196 5126
2824 5126 -8330 -5618 7264 7977 -1805 -6432 -3675 4004 8183 -1032 -9948 -980 9947 3636
2838 3636 -7461 -5885 2607 7045 2907 -6621 -7584 5738 9923 -3659 -10264 353 8032 2481
2852 2481 -4553 -5309 817 7850 4143 -7810 -6827 5638 7068 -2755 -6098 -954 4452 5347 -2045
2867 -2045 -9468 -1495 9945 3665 -8296 -4520 5767 5422 -2068 -6612 -4298 4347 7242 -3698
2881 -3698 -9153 667 7767 -39 -6489 -3730 1606 5008 1367 -7122 -6466 5242 6965 -5092 -8850
2896 -8850 493 5484 1897 -4360 -6415 774 8676 1321 -9515 -4622 7193 4574 -4583 -5166 30
2911 30 4783 4258 -3651 -8296 1856 9473 1343 -7047 -2371 4951 4919 -481 -6295 -3984 6802 8141
2927 8141 -5070 -8635 3464 8549 -285 -6015 -2970 3446 6939 765 -8232 -3833 7610 5305
2941 5305 -5855 -6259 2067 5327 3055 -3033 -6772 1923 9844 1030 -9780 -2924 7688 5196
2955 5196 -3344 -5725 -786 6273 6116 -5162 -8090 4448 9932 -732 -6890 -1314 4739 5048 129
2970 129 -6296 -3240 7924 6764 -5810 -7140 3397 7358 1067 -4544 -4811 2447 8463 235 -9870
2985 -9870 -3331 8665 4095 -6442 -5758 787 5063 2824 -5103 -7253 2890 8531 -1549 -9278
2999 -9278 -2308 5192 3216 -2494 -6417 -3211 5776 5524 -6700 -8601 4225 7878 -1491 -6607 -2455
3014 -2455 3325 5135 -1111 -7956 -2278 8294 4075 -7284 -5501 3278 5084 820 -4366 -5252 2165
3029 2165 7978 -586 -9397 -1949 7744 3116 -4826 -5236 -179 5726 3761 -6200 -7503 4535 8078
3044 8078 -2960 -7720 -336 4883 3003 -2072 -5865 -1873 7056 4345 -6447 -5814 4626 6076
3058 6076 -672 -4872 -3077 3278 7051 -595 -8349 -831 9018 3434 -6313 -3707 4009 5549 1990
3073 1990 -4274 -4394 4628 7558 -1898 -7010 1055 6626 2465 -3050 -3778 -40 6620 4431 -5382
3088 -5382 -5900 5581 7180 -2795 -6069 -44 4431 4220 -1939 -6883 -383 8392 2659 -7540 -3507
3103 -3507 5425 4509 -1259 -3926 -2791 3424 6193 -1826 -8289 69 7354 1582 -5793 -3167 2214
3118 2214 4866 1672 -6074 -5259 5791 7091 -3932 -6901 1597 5760 805 -3678 -4899 289 6548
3133 6548 2404 -7046 -4451 5142 4412 -3632 -5048 -1155 3461 4343 -2862 -8285 -107 7973 848
3148 848 -7610 -3179 4490 3591 -1934 -5659 -3345 4486 5286 -4584 -7779 2160 6565 -78 -4923 -2829
3164 -2829 1539 4950 1325 -6960 -4555 6355 5789 -4406 -6133 1160 4677 1968 -3764 -5374 1860
3179 1860 8692 1294 -7992 -2263 6585 3669 -3433 -3986 -111 4378 4763 -3254 -6919 1911 7745
3194 7745 322 -5581 -1753 4110 4443 2 -5778 -2884 6482 6161 -5019 -6127 3465 6475 109
3209 109 -4272 -2548 2100 6045 733 -6823 -2205 7272 4362 -4317 -4162 1149 3916 2911 -2984
3224 -2984 -5429 2592 8735 423 -7664 -1979 5558 3294 -2151 -4267 -757 5913 4486 -5628 -6777
3239 -6777 3579 6764 -779 -5139 -1034 2936 3784 -323 -6258 -2412 6384 4748 -5443 -5362 2377
3254 2377 4857 354 -4347 -4411 2138 6909 -1073 -8431 -1513 6918 2481 -4627 -3984 221 3526 2148
3270 2148 -4077 -5573 2944 6840 -1802 -7093 -1797 3249 2597 -1162 -4505 -2054 5553 3434 -6530
3285 -6530 -6567 4105 5972 -1088 -4347 -1771 2154 3923 -1294 -6880 -1207 7369 2958 -5265 -3456
3300 -3456 1960 2906 856 -3084 -3905 2850 6752 -1207 -7134 -383 5674 2024 -3174 -3485 33 4981
3316 4981 3136 -5017 -4592 4780 5578 -2954 -5246 120 3307 2804 -947 -4077 -560 5851 2011 -6035
3332 -6035 -3439 4337 4667 149 -2767 -1865 2635 4831 -1898 -6782 1036 7639 1434 -4609 -2280
3347 -2280 2218 3242 903 -3513 -2915 4733 5211 -2976 -5507 1149 4461 1391 -2062 -2889 215 5023
3363 5023 2202 -5698 -3539 5239 4707 -2842 -4616 -151 3620 2965 -2304 -5254 612 5995 -248
3378 -248 -6629 -1540 4695 3374 -1368 -3820 -2549 2393 3554 -3625 -6435 1984 6539 -121 -5217
3393 -5217 -3476 1260 3722 302 -5764 -3005 6263 4338 -5700 -5960 1790 4456 1060 -3436 -3987
3408 -3987 1001 5867 247 -7502 -2696 5666 3830 -3268 -4292 -1011 3663 3964 -3392 -6973 1560
3423 1560 6784 -647 -6894 -1845 4319 4212 -806 -5306 -3050 4665 4443 -4622 -5411 3001 6088 241
3439 241 -4425 -3606 805 5827 2153 -5622 -2884 6085 4695 -4270 -5379 445 4848 3698 -2185
3454 -2185 -4907 1346 6837 256 -6293 -1296 5519 3836 -868 -3352 -1571 3660 4625 -2587 -5459
3469 -5459 1980 6321 426 -3791 -1720 2375 4176 1204 -4963 -3133 4532 4706 -3606 -3605 3019 4098
3485 4098 290 -2563 -3508 917 5267 1451 -4484 -1136 4707 1734 -3430 -2867 -34 2851 3684 -1566
3501 -1566 -4825 1243 4876 -664 -5103 39 4041 2176 -1050 -3541 -1648 3265 2484 -4217 -3665
3516 -3665 3364 3515 -2175 -3202 -599 1438 2817 -297 -4933 -1238 4300 1959 -4265 -2744 2207
3531 2207 2223 -698 -3403 -3183 2204 4875 -1423 -5654 533 4571 -658 -4746 -2356 1275 3662 1700
3547 1700 -4025 -4121 2813 3579 -3072 -4577 1193 4091 1887 -1521 -4628 -884 4856 1896 -5176 -2843
3563 -2843 4208 3762 -2264 -4100 -789 3465 4353 -2001 -5557 749 5874 679 -4974 -1947 2522
3578 2522 3101 253 -3891 -3032 4095 6053 -1736 -5244 853 4719 699 -3205 -2716 1792 6068 2352
3594 2352 -5559 -3978 4447 4198 -2631 -3334 1364 4379 2991 -1962 -5341 -265 6221 2319 -4576
3609 -4576 -2207 4096 3646 -983 -4099 -2104 3691 5463 -1958 -6026 796 5981 421 -4228 -2116
3624 -2116 2006 3921 958 -4421 -3186 4229 4744 -2515 -5024 507 3270 1112 -2441 -3693 362
3639 362 5259 1807 -6104 -4028 3586 3329 -1911 -3311 -342 3133 2695 -3366 -6298 356 5615 919
3655 919 -4213 -1864 2190 1901 -942 -4086 -2762 3317 4497 -2425 -5720 336 3913 -57 -3180
3670 -3180 -2494 905 4031 1102 -5007 -3032 4236 3706 -3193 -3896 436 2484 1193 -1524 -3121 757
3686 757 4853 186 -5149 -2136 3329 2676 -507 -1812 -844 2557 2654 -2953 -5220 1659 5433 563
3702 563 -2937 -912 1514 1754 -341 -3246 -1071 4487 3783 -2925 -3083 1425 2291 -194 -1431 -1117
3718 -1117 1368 4049 148 -4348 -1386 4912 2562 -2574 -2182 570 2797 1496 -1984 -3002 2071
3733 2071 5073 -965 -4579 73 3357 1755 -530 -1589 -173 2845 2182 -3658 -3409 3003 4760
3748 4760 -17 -2421 -837 1517 2078 -599 -3678 -479 5550 2606 -4151 -3265 1670 2294 -66 -2246
3764 -2246 -1253 2077 4007 -1016 -5109 -568 4084 1259 -2191 -2117 300 2128 1369 -3383 -3782 2598
3780 2598 4514 -1565 -4144 22 2976 1558 -1518 -2980 -431 3858 1169 -4864 -2768 3351 3542
3795 3542 -1603 -2756 -1473 918 2197 -1378 -4100 223 5119 888 -4736 -2756 1407 2227 547
3810 547 -1979 -2243 2717 3870 -2740 -5085 547 4182 801 -2410 -1790 552 2853 784 -4159 -2481
3826 -2481 4039 3708 -2373 -3293 450 2800 1953 -996 -3513 593 4890 1174 -5129 -1915 4345 3507
3842 3507 -993 -3095 -1159 2759 3216 -1615 -4177 1807 5913 401 -4153 -1855 1889 3339 1729
3857 1729 -2890 -2051 4070 4337 -2931 -5282 1004 4811 2254 -1676 -3118 434 4584 959 -4845
3872 -4845 -2187 4929 4014 -1660 -3202 -636 2510 2988 -988 -4445 299 5140 690 -4630 -2526
3887 -2526 2728 3116 512 -3455 -3351 2823 4398 -1820 -4734 833 4225 488 -3157 -2802 85 3422
3903 3422 2041 -2907 -2885 2841 2434 -2748 -3541 236 2673 2273 -830 -3941 -1640 3359 1008 -3964
3919 -3964 -2037 3134 2266 -1285 -2618 -1922 1212 2663 -988 -4043 347 3067 -358 -3050 -1048
3934 -1048 1124 1399 806 -1960 -2246 2021 2487 -1544 -2728 852 2067 -282 -1880 -1780 140 3218
3950 3218 1087 -3133 -1066 2851 861 -2562 -1451 1771 1832 1154 -922 -2655 123 2573 -593 -2567
3966 -2567 952 3236 635 -1358 -1665 -749 1923 1760 -1799 -2229 2534 3043 -1671 -3025 316 2186
3982 2186 1781 -630 -2318 -314 3764 962 -3625 -1021 2870 2011 -909 -2055 -1107 1892 3486 -523
3998 -523 -3892 298 3828 283 -3157 -1032 2299 3289 810 -3119 -2860 2574 3307 -2335 -3372 1914
4014 1914 4084 845 -2691 -3343 -202 3928 1869 -3274 -2581 3012 2892 -2303 -4014 -782 2589 3183
4030 3183 -1451 -4755 -421 4896 1092 -4772 -2441 2563 2872 -438 -3983 -2959 2503 4189 -2008
4045 -2008 -5027 -141 4146 1038 -2856 -2695 253 3644 1726 -4548 -4619 2536 4008 -1451 -4178 -184
4061 -184 3046 1947 -1971 -4575 -802 4995 2446 -3827 -3143 2133 2705 -568 -2936 -2172 1794 4686
4077 4686 -239 -4948 -1063 4029 1628 -2398 -2233 646 2948 1583 -2721 -3689 2078 4456 -996
4092 -996 -3705 132 2852 1376 -485 -1976 -522 3124 2145 -2766 -3162 1845 2888 185 -1144 -250
4108 -250 702 2121 -139 -3125 -260 4070 1904 -2052 -1237 892 711 -180 -1056 -986 2217 3165 -616
4125 -616 -2701 298 2008 -311 -1156 -67 421 1573 701 -2400 -2332 2069 2559 -1304 -1772 818 1221
4142 1221 7 -932 -1325 544 2604 478 -3228 -904 2671 924 -1814 -813 362 1012 1082 -1377
4158 -1377 -2754 1327 3429 -304 -2794 -628 1346 520 -676 -1869 -634 3069 2429 -2899 -3432 1818
4174 1818 2557 -904 -2237 3 1308 1618 -792 -3779 -1260 3240 1271 -2753 -1803 1237 1459 57
4190 57 -2226 -2673 1052 3556 -940 -4697 -486 2969 602 -1708 -1937 -45 2309 1439 -2653 -3092
4206 -3092 2482 3638 -1090 -3216 -759 1266 1451 28 -2278 -432 3843 2224 -3289 -2966 2020
4221 2020 2880 375 -1488 -1128 1580 3380 -543 -4482 -305 4470 1589 -2343 -1209 1135 1914 1021
4237 1021 -1754 -2183 2277 3780 -891 -3494 -328 2579 1314 -490 -2048 -458 3013 1649 -3050
4252 -3050 -2637 2744 3085 -866 -2445 -762 1200 2188 -202 -3018 182 3968 1162 -3073 -2220 1646
4268 1646 1796 785 -1125 -1803 1136 2970 -1136 -3977 25 4021 1753 -1266 -1668 -143 2203 973
4284 973 -2424 -2588 2317 3732 -1392 -3410 -188 1734 1391 -511 -2169 -811 2993 1430 -3176 -2235
4300 -2235 2091 1983 -900 -1888 -1783 746 2348 -609 -3700 -272 3078 424 -3086 -1618 867 1497
4316 1497 391 -1680 -2390 1124 2551 -1656 -3244 675 2422 673 -1387 -1596 -600 1805 1119 -2712
4332 -2712 -2058 2689 2478 -1480 -2518 -407 1267 1460 -501 -2230 -127 3161 490 -2647 -958 2069
4348 2069 1414 58 -1189 -1301 890 2213 -580 -2799 833 2854 278 -1773 -867 784 2093 1162
4364 1162 -1954 -1643 2474 2117 -1705 -1889 1643 2403 522 -721 -1368 -156 2233 861 -2123 -395
4380 -395 3034 1345 -1407 -1580 -189 1246 1879 -241 -2211 848 3081 -73 -2590 -33 1841 1040
4396 1040 -39 -1246 -993 1486 1868 -2010 -1844 1786 2211 -1016 -1537 -576 472 1686 589 -2342
4412 -2342 -1392 2621 1254 -2332 -1618 1264 1611 214 -1392 -2007 456 2323 -572 -2772 62 3074
4428 3074 -102 -2073 -1521 71 1545 1576 -1582 -2145 1413 2208 -1604 -2788 94 1391 947 -919
4444 -919 -2245 -1089 2508 1245 -3247 -2094 2110 1679 -1214 -1919 -1304 981 1778 -426 -3240 -403
4460 -403 3169 515 -2397 -1487 900 1394 565 -1925 -2565 1485 3449 -851 -3239 0 2788 1043
4476 1043 -1696 -1626 53 2829 2116 -2431 -2296 2116 2527 -1508 -2241 -3 1634 1886 -292 -2989 -827
4493 -827 3082 1992 -2215 -1885 1718 2218 229 -1650 -1520 1232 3312 -509 -3035 -14 3222 1015
4509 1015 -1626 -821 568 1971 1491 -1777 -2498 1543 2999 -98 -2374 78 1695 1043 -311 -2115
4525 -2115 -549 2756 2110 -2046 -1888 1236 1768 -715 -1467 -505 921 2074 -150 -2820 -549 2470
4541 2470 929 -1555 -820 719 943 312 -1186 -2198 715 2717 -832 -2456 6 1616 317 -1090
4557 -1090 -908 -66 1566 1139 -2261 -1927 1795 1649 -1255 -1769 261 544 294 -364 -1858 -490 2035
4574 2035 487 -2287 -1051 1150 552 -857 -892 -710 923 1498 -919 -2560 373 2222 -525 -1418
4590 -1418 -112 699 558 175 -1126 -970 1689 1614 -1801 -1520 1183 1276 -523 -822 -522 501 2090 409
4608 409 -2260 -887 2594 1290 -1415 -1160 503 1228 775 -895 -1736 943 2627 21 -2289 -92
4624 -92 1780 888 -507 -917 -101 1662 1433 -1516 -2460 1343 2497 -259 -1580 -286 1061 1416 -306
4641 -306 -2639 -712 2921 1801 -1944 -1436 1262 1600 132 -1240 -1567 936 2916 172 -2836 -875
4657 -875 2254 1086 -1343 -1304 -35 1431 1267 -1845 -2254 1056 3015 -680 -2825 -358 1239 1006
4673 1006 -268 -1927 -1018 2199 1577 -2383 -2648 989 1989 -355 -1215 -1107 151 1575 -52 -2992
4689 -2992 -1057 2778 1443 -1984 -1759 213 730 655 -1155 -1981 1015 2466 -713 -2819 -616 1963
4705 1963 647 -730 -1010 -629 1417 1723 -1782 -2270 1106 1974 -754 -1572 -513 689 1199 125 -1558
4722 -1558 -873 2274 1296 -2026 -1762 1197 1142 45 -841 -1286 523 1489 -452 -2126 -423 2207 215
4739 215 -1101 -597 157 938 1055 -996 -1756 1462 2249 -760 -1864 513 1628 683 -451 -844 91
4756 91 1791 913 -1609 -1131 2236 1568 -535 -866 184 944 1276 184 -1701 186 2701 657 -1748
4773 -1748 -497 1359 1352 324 -809 -909 947 2100 -809 -2119 563 2046 41 -1242 -619 65
4789 65 1256 803 -1562 -776 1713 1560 -1225 -1614 536 1024 726 -701 -1142 -217 1929 534 -2292
4806 -2292 -891 1524 1083 -969 -1219 -189 714 1340 -870 -2108 545 2108 -398 -1614 -536 831
4822 831 582 102 -1429 -1424 1227 1496 -1411 -2283 731 1471 -100 -916 -998 -38 1149 194 -2161 -955
4840 -955 1633 848 -1542 -1260 341 735 655 -628 -1744 100 1657 14 -2215 -509 1477 960 -465
4857 -465 -1152 -508 1001 1498 -1151 -1824 1023 2235 -432 -1491 -118 686 1280 118 -1440 -731 1970
4874 1970 1465 -1315 -1235 1045 1044 28 -487 -952 499 2064 290 -2229 -422 1849 942 -1267 -962
4891 -962 -63 1273 894 -987 -1371 1010 2103 -65 -1691 -20 1383 579 -87 -1053 -385 1671 1418
4908 1418 -1375 -1756 840 1766 -473 -959 -269 559 1465 44 -1857 -648 2227 1110 -1491 -1014 567
4925 567 1022 363 -905 -1323 528 1921 -170 -2048 -488 1553 683 -961 -1212 -484 967 693 -1121
4942 -1121 -2216 891 1534 -650 -1745 21 855 520 -177 -1588 -578 1634 684 -1887 -1285 954
4958 954 921 -444 -913 -682 242 1287 -229 -2123 -521 1823 419 -1314 -947 448 985 494 -1012
4975 -1012 -1360 1030 1259 -847 -1811 235 1241 34 -698 -964 -268 1397 952 -1440 -1262 932 1453
4992 1453 -723 -911 -194 740 1035 16 -1569 79 2124 713 -1643 -536 1023 991 -442 -420 -384
5009 -384 890 1674 -467 -1591 437 1847 216 -1035 -135 560 1182 950 -941 -1298 1508 1541 -847
5026 -847 -1582 582 1425 442 -436 -905 178 1777 585 -1662 -589 1621 931 -734 -995 -261 647
5043 647 1060 -688 -1843 325 1975 -15 -1378 -431 984 730 116 -848 -1108 1212 1519 -1243 -1954
5060 -1954 749 1306 -210 -1279 -835 245 1005 433 -1833 -868 1656 868 -1252 -1252 209 641 207 -615
5078 -615 -1244 158 2064 19 -1963 -333 1291 565 -902 -1102 -363 1050 1247 -1196 -1817 802 1725
5095 1725 -325 -1630 -440 930 835 -187 -1393 -936 1423 1354 -1360 -1593 643 1112 46 -1227 -1304
5112 -1304 59 1645 -103 -2023 -582 1602 853 -1032 -1031 235 771 834 -607 -1489 394 1811 8
5129 8 -1710 -193 1310 700 -394 -806 -638 885 1513 -1010 -1450 769 1632 -130 -881 -407 795 1198
5147 1198 351 -1497 -780 1732 1025 -1104 -937 818 1143 396 -470 -1106 99 1872 -23 -1737 -261
5164 -261 1299 523 -961 -880 106 836 664 -686 -1260 471 1646 -407 -1099 -98 662 564 74 -1230
5182 -1230 -491 1327 814 -1373 -879 1065 825 -219 -819 -477 505 1105 -158 -1681 -24 1393 264
5199 264 -1481 -536 492 224 21 -957 -769 571 1258 -627 -1504 290 887 21 -765 -579 -474 873
5217 873 242 -1456 -1309 1006 847 -1156 -1282 43 510 370 -535 -1169 6 1350 70 -1614 -654
5234 -654 834 430 -611 -522 -434 534 1221 -380 -1632 265 1512 115 -1115 -196 626 909 48 -961
5252 -961 -931 1181 949 -894 -1199 527 1001 77 -441 -912 228 1424 655 -1548 -561 1541 820 -892
5270 -892 -1021 -181 938 860 -545 -1576 232 1565 267 -1602 -117 1073 837 -393 -903 -492 1212
5287 1212 1317 -777 -1352 633 1287 406 -830 -518 346 987 684 -1223 -688 1475 1219 -930 -977 243
5305 243 1007 391 -685 -1110 254 1728 287 -1714 -568 1375 824 -404 -497 -344 534 1180 -874
5322 -874 -1690 134 1291 -358 -1247 -357 293 581 -338 -1281 -919 1188 1153 -1128 -1353 279 576 -100
5340 -100 -492 -375 123 907 292 -1400 -523 1036 618 -1047 -620 -129 380 564 -621 -1220 -81 1398
5358 1398 -295 -1697 -108 1073 -36 -146 -592 -331 689 712 -959 -870 554 663 -559 -807 -255
5375 -255 308 585 168 -941 -150 1142 559 -1120 -826 972 651 277 -441 -442 160 1050 10 -1142 51
5394 51 1397 367 -589 -143 415 751 823 -563 -860 766 1541 -645 -1218 95 899 357 -48 -688 -165
5413 -165 1225 751 -1184 -904 910 820 -144 -464 -179 405 852 -105 -1090 -83 1368 552 -1057 -878
5431 -878 516 721 39 -582 -534 452 1192 -348 -1436 442 1219 191 -775 -380 -183 780 395 -831
5449 -831 -653 940 835 -503 -668 41 444 335 -191 -1184 -146 1200 137 -1440 -878 697 859 -313
5467 -313 -772 -258 285 969 -448 -1171 413 1307 -109 -1196 -380 180 367 -28 -1064 -573 882 864
5485 864 -519 -1444 183 922 -159 -881 -695 -156 1247 -105 -1311 -506 1156 690 -1039 -885 70
5502 70 552 718 -200 -1174 286 1231 -126 -1266 -220 1265 833 -167 -433 -505 652 1111 -816 -1152
5520 -1152 500 1472 54 -617 -469 308 1073 205 -1045 -353 1398 908 -822 -591 400 695 716 -582
5538 -582 -389 -144 1373 510 -1179 -178 1277 830 -670 -832 -47 987 1120 -498 -1149 603 1523
5555 1523 20 -1312 -338 511 338 -18 -803 -595 1076 911 -525 -1077 522 1123 93 -860 -645 -148
5573 -148 1077 578 -1223 -513 880 612 -787 -712 287 582 413 -261 -1077 157 1034 -395 -1129 -394
5591 -394 747 253 -361 -603 -248 485 942 -741 -1211 380 916 -334 -644 -232 399 677 2 -707 -634
5610 -634 917 768 -1057 -626 215 588 -207 -602 -560 -28 1023 45 -771 -116 1082 25 -527 -273 97
5629 97 354 328 -615 -591 417 635 -165 -952 325 809 130 -647 -463 -102 789 393 -560 -351 997 298
5649 298 -493 -401 -66 363 493 -99 -836 123 1278 212 -729 -117 829 174 -186 -455 -214 817 1343
5668 1343 -278 -882 447 966 -281 -793 -140 485 520 150 -438 -733 1113 783 -680 -853 534 797
5686 797 419 -645 -939 143 1180 201 -1103 -489 1133 718 -875 -740 -350 831 794 -473 -1481
5703 -1481 194 1474 -254 -1393 -445 714 627 -282 -944 -628 992 1294 -796 -1243 297 653 75
5720 75 -1154 -794 321 1136 355 -1348 -993 788 946 -854 -912 -102 927 696 -356 -835 -189 1143
5738 1143 280 -1117 -695 613 714 20 -915 -722 691 1026 -607 -1470 218 933 150 -887 -110 93
5756 93 443 444 -878 -871 840 1127 -566 -1245 253 615 310 -240 -735 -231 969 164 -1191 -429 589
5775 589 817 -619 -244 214 151 383 -505 -938 112 1183 -13 -442 -273 598 121 226 -210 -289 725
5794 725 1226 -385 -701 856 594 -135 -352 -503 299 645 244 -515 -394 1057 736 -681 -318 448 59
5813 59 57 -12 -340 285 1007 -60 -779 75 819 27 -198 -42 202 251 335 -791 -815 373 863 -64 -584
5834 -584 218 536 -102 -65 -422 -266 689 308 -914 -679 621 276 -692 -698 -296 259 803 -34 -1048 -52
5854 -52 1301 170 -808 -524 409 199 -39 -835 -448 623 662 -680 -1436 154 632 69 -365 -125 221
5873 221 586 176 -1007 -511 730 1055 -540 -965 107 273 241 -474 -849 76 1233 164 -1123 -353
5891 -353 865 756 20 -638 -401 265 844 -292 -1086 117 732 186 -712 -250 361 288 357 -747 -610
5910 -610 609 1422 -505 -1164 372 621 330 -269 -709 46 1254 582 -848 -709 1003 873 -240 -812
5928 -812 -87 351 747 32 -1042 216 1096 339 -763 -532 491 1033 81 -484 -425 539 985 -643 -1200
5947 -1200 169 789 176 -346 -192 276 680 393 -416 -649 946 647 -385 -749 -105 466 88 -110 -782
5966 -782 -238 986 -49 -761 -516 888 316 -511 -907 -265 2 582 -244 -670 203 949 -190 -756 -430
5985 -430 286 365 354 -556 -688 893 914 -543 -905 135 241 162 -126 -350 -92 723 91 -750 -350 476
6005 476 517 -371 -391 185 270 467 -290 -733 -24 754 64 -943 -45 611 417 88 -770 -719 368 673 -432
6026 -432 -703 242 753 -196 -432 -121 66 772 162 -552 -266 759 416 -674 -408 614 877 160 147
6045 147 -220 293 703 140 -720 -251 949 454 -469 -383 -26 356 467 -488 -464 680 869 -592 -557 -12
6065 -12 144 162 177 -379 -247 867 513 -495 -443 470 815 -61 -448 -252 156 584 323 -896 305 556
6085 556 -110 -791 -327 519 63 -31 -290 -552 388 646 -243 -537 179 471 165 -506 -376 -43 521 287
6105 287 -704 -539 618 466 -839 -853 196 442 44 -495 -706 -236 666 185 -1054 -365 420 469 -197
6124 -197 -693 -432 504 572 -208 -1197 91 769 181 -722 -560 479 501 319 -1051 -622 766 948 -312
6143 -312 -957 348 580 144 -592 -937 34 777 687 -902 -589 738 770 -182 -816 94 488 739 -12 -894
6163 -894 -49 800 196 -389 -651 435 579 -71 -371 -707 286 893 -201 -743 235 508 161 -54 -774
6182 -774 94 525 708 -637 -549 526 954 -50 -371 281 403 302 -357 -532 8 954 507 -734 -181
6201 -181 732 303 -304 -300 -353 353 739 -3 -831 53 757 160 -529 13 114 91 305 -350 -568 412 608
6222 608 -342 -539 -97 208 35 142 -243 -20 388 162 -825 -470 685 299 -508 -452 5 -116 97 -492
6242 -492 -834 -235 471 73 -594 -72 75 25 -56 -354 -239 166 620 -152 -596 238 188 -75 -337 -72 2
6263 2 79 -176 -461 -269 656 270 -658 -392 395 269 52 -240 -423 83 431 -335 -675 159 681 267 -541
6284 -541 -142 63 458 15 -394 -373 437 643 -422 -810 251 279 69 -276 -305 9 880 630 -603 -254
6304 -254 564 311 -252 -503 -38 538 671 -65 -856 -218 875 523 -755 62 382 705 18 -422 -410 490
6324 490 942 -434 -878 326 807 121 -518 -563 30 413 428 -447 -747 366 868 -333 -549 122 396
6343 396 672 -213 -612 25 625 465 -709 -552 332 277 110 -227 -643 203 641 -224 -758 -238 680 109
6363 109 -403 -221 -122 398 216 -568 -562 223 709 -149 -953 -66 362 21 -173 -538 28 384 446 -493 -538 588
6385 588 254 -47 -564 -175 20 216 -96 -636 -125 604 293 -798 -267 264 583 100 8 -568 228 700
6405 700 -173 -679 255 622 209 -671 -359 -286 171 497 -235 -324 332 545 -571 -459 221 440 468 290 -378
6426 -378 -286 474 167 -489 -283 478 202 -99 -361 -225 375 594 -116 -366 15 734 184 -517 -44 334
6446 334 268 16 -138 -408 432 315 -128 -225 129 541 226 -242 -198 -86 449 110 -544 4 365 442 -625
6467 -625 -307 474 198 158 -116 -270 37 819 -89 -497 -85 423 339 -154 -292 -323 354 389 -747 -530 104
6488 104 182 -217 -534 -37 -25 263 64 -840 -360 237 442 -745 -653 342 433 -360 -630 -502 -355 539 88
6509 88 -883 -241 530 247 -153 -576 203 126 96 -683 -422 331 590 -150 -735 74 573 115 -23 -203 -256
6530 -256 616 444 -501 -342 112 539 -75 -342 -368 -205 562 260 -350 -174 718 526 -431 30 186 443
6550 443 231 -231 -415 328 846 113 -786 -62 386 378 -380 -368 -178 99 449 -402 -166 129 697 258 -407
6571 -407 -89 492 273 233 -320 -71 406 174 -424 -430 63 499 -63 -238 -163 306 484 -61 -352 -57 600
6592 600 209 -354 -209 121 265 282 -202 -479 143 484 -233 -628 74 379 -88 -294 -337 -119 242 258 -139
6613 -139 -601 90 334 -190 -775 -232 41 446 236 -738 -28 805 439 -227 -297 436 198 -83 -303 -475
6633 -475 176 490 -157 -748 5 140 40 -376 -187 -233 176 169 -466 -609 244 34 -26 -370 -113 202 29
6654 29 -422 -388 -90 465 334 -763 -280 394 255 -86 -126 -35 132 559 -23 -457 -67 332 283 -299 -197
6675 -197 271 107 156 -353 -334 237 402 -174 -504 149 427 246 -152 -258 308 352 12 -30 45 446 582 -159
6697 -159 -187 203 342 402 192 -163 23 344 35 -177 -104 393 429 -38 -441 -216 201 309 -173 -427 283
6718 283 558 169 -193 84 202 237 222 -163 -426 316 437 -184 -343 236 179 -29 -242 -378 93 267 126
6739 126 -433 -444 203 482 -530 -291 -166 229 142 -242 -415 -282 741 -160 -756 -403 222 304 -40 -282
6759 -282 -201 241 403 -254 -427 172 473 -21 -504 -230 -21 -15 79 -707 -338 515 311 -317 -696 180 205 177
6781 177 -294 -353 5 768 188 -646 153 180 337 -17 -161 -134 201 540 -263 -391 125 458 92 -539 160
6802 160 512 17 165 -169 -597 388 408 -508 -697 84 310 275 -203 -367 -382 589 220 -772 -92 278 396
6823 396 -453 -110 -243 366 87 -160 -407 135 853 227 -290 -295 407 199 -153 -262 -57 281 449 -121 -612
6844 -612 208 442 139 -188 -50 227 422 74 -684 -250 606 434 -173 -426 6 409 269 -80 -478 -45
6864 -45 542 38 -391 -109 447 211 -160 -92 -9 188 324 -185 -422 -57 130 -333 -395 178 71 94 -126 -413
6886 -413 -175 69 334 -772 -405 239 207 25 -71 -326 -58 225 -441 -529 47 322 154 -321 -359 -123 205
6907 205 39 -550 -208 156 717 -169 -522 6 331 199 -221 -105 131 486 305 -346 -239 323 123 -405
6927 -405 -516 -68 215 84 100 -267 -208 259 247 -314 -286 351 96 -109 -160 -243 340 479 -73 -457 43 616
6949 616 192 -490 130 61 90 131 -242 -272 356 355 -209 -460 98 412 132 -209 -388 72 567 147 -159 -170
6971 -170 142 529 -283 -474 -11 245 57 20 -574 -1 733 94 -374 -83 267 391 -41 -375 -332 333 20
6992 20 -248 -560 240 552 91 -150 -210 -26 83 77 -497 -266 305 296 -316 -534 14 327 305 -50 -559 10
7014 10 311 212 -420 -281 263 299 -73 -178 54 60 180 -124 -532 28 555 234 -182 -128 330 279 -113 -105 -296
7037 -296 119 735 -178 -519 -240 72 150 -42 -225 119 205 -99 -428 -515 453 374 -398 -92 254 474 299
7058 299 -129 -435 -29 628 159 -188 -309 378 -5 74 170 65 304 446 -194 -191 77 408 -168 -141 -17 216
7080 216 293 -22 -360 -47 441 338 -261 -306 109 188 -30 116 -181 -36 718 134 -218 -37 391 204 -143
7101 -143 -98 -71 241 224 -129 -371 18 645 -135 -114 -72 269 294 200 -10 7 165 554 -150 -279 149 277 -229
7124 -229 -261 23 81 481 -118 -172 136 286 271 -243 -4 59 210 91 -354 -423 -109 616 23 -404 -35 337
7146 337 82 -257 -232 -264 324 109 -233 -723 86 366 -213 -265 -296 -60 365 132 -587 -217 226 329 -385
7167 -385 -103 277 36 -8 -430 -252 319 279 -10 23 -160 706 153 -272 -202 -18 -176 204 -108 -207 122 104
7189 104 -321 -309 -128 -68 -62 -146 -308 -223 265 275 -65 -663 -53 201 100 -266 92 -59 67 -218 -549 -67
7211 -67 181 -15 -357 -358 115 331 197 31 -73 93 120 -170 -254 -72 368 64 -300 -168 -85 213 234 59
7233 59 -298 175 71 -176 -331 314 -140 125 -392 -59 89 648 295 -193 -280 134 194 -95 -87 -279 69 478
7255 478 55 -474 -449 408 144 -226 76 -164 134 237 -340 -237 254 376 -91 -127 -133 361 -32 133 -336
7276 -336 75 629 24 -236 -398 228 393 110 -563 -282 -188 286 -173 -740 -4 24 147 -370 5 -57 269
7297 269 -57 80 -319 97 267 64 -195 -32 415 -213 -148 181 -107 447 89 -228 -293 -20 351 -32 -197
7318 -197 -181 59 -77 81 -304 89 431 20 -232 -178 272 131 -425 -295 -2 44 447 -65 -534 -235 452
7339 452 -40 -100 26 118 -48 193 -230 -87 67 475 84 -312 133 340 -132 2 90 -54 368 251 -312
7360 -312 -266 128 246 -236 -241 -1 366 345 -89 69 -143 295 120 -168 -159 349 259 -19 -234 -52 173 308
7382 308 -376 -544 138 238 36 -314 -342 -67 196 89 -252 -481 285 -67 -340 -238 55 5 264 -123 -252
7403 -252 156 289 -43 -308 -67 357 -23 -415 -306 203 278 131 -213 -627 75 281 41 -528 -144 207
7423 207 -128 9 -244 -179 367 -116 -180 -338 171 445 102 -234 -60 141 538 272 -462 -178 355 440 -186
7444 -186 -238 -294 127 302 24 -627 -210 421 -208 -238 -77 97 256 37 -258 27 73 289 58 -327 -157
7465 -157 361 -217 -53 11 -11 163 344 -289 104 240 478 39 -169 255 303 2 -250 -252 -322 529 40 -277
7487 -277 4 165 111 -104 -225 -71 -19 216 -94 -457 37 536 85 -327 -226 232 19 247 -97 -191 681
7508 681 346 -226 -567 19 224 20 -25 -202 -84 187 17 -527 -254 -26 234 -132 -116 -492 -24 70 -169
7529 -169 -239 -95 182 21 -442 114 435 129 -317 -52 -21 355 443 -35 -294 57 320 -97 -121 -102 192 295
7551 295 91 -237 -183 599 64 -625 -96 136 209 135 -310 -99 -55 359 -66 -434 -150 383 -78 -100 69 6
7573 6 71 -190 -127 -310 -103 94 -211 -309 -50 6 193 -128 -274 6 280 383 -444 -213 486 2 166 -287
7595 -287 -320 -67 268 149 -107 -72 120 171 -75 -211 339 452 183 -191 -209 156 314 177 -117 -81 930
7616 930 323 -32 16 -145 82 22 -368 -548 151 370 -44 -104 304 301 18 -270 -393 -328 225 73 -205 -283
7638 -283 135 190 6 -215 157 -173 415 -331 -376 -240 480 138 -464 -195 221 235 329 -393 -166 40 608
7659 608 163 -365 -348 150 -100 20 -35 59 97 100 -343 -592 283 279 -55 -456 225 -51 202 -235 -450 -80 351
7682 351 136 -232 -301 47 278 -227 -105 -228 79 380 -198 -393 -268 286 -88 -253 -303 -6 328 26 -117
7703 -117 -310 537 327 139 -328 -53 157 348 -54 99 134 383 398 -224 -117 387 384 -34 170 157 370 235
7725 235 -307 -542 -109 241 6 -133 -248 116 16 28 29 -241 -44 274 -205 -433 197 191 -114 -151 72 -124
7747 -124 140 -196 -269 -40 334 377 -331 -213 166 186 431 7 -216 1 213 124 -281 11 81 603 -187 -15
7769 -15 153 28 423 243 -232 100 432 40 -86 -63 135 -16 -127 -248 -86 85 335 -241 -236 299 5
7790 5 -68 -249 -257 189 226 385 -471 -103 435 141 -100 -290 -92 299 212 -266 -171 104 603 -146 -496 -231 466
7813 466 252 213 -251 -432 213 187 -224 -245 288 66 -66 -230 -112 386 -19 65 -457 -297 614 304 -55
7834 -55 83 -331 -87 371 -371 -57 -105 221 76 -590 -116 13 392 28 -247 185 336 49 -85 -433 135
7855 135 437 -62 -88 -129 192 420 187 -313 -220 217 318 -98 -261 209 552 8 -50 -192 106 423 17
7876 17 -256 -52 239 254 -224 -109 -167 -73 107 -271 -323 33 492 -63 -238 15 216 78 -150 -225 -363 496
7898 496 408 -245 -594 51 291 -313 -546 -315 -70 529 -185 -262 -94 133 115 -327 -401 166 472 340 -329
7919 -329 -140 82 446 249 -447 -101 316 75 -107 -155 105 189 346 -211 -202 241 475 -140 -348 -26 154
7940 154 270 -179 -416 53 326 448 -155 -458 136 200 -66 -52 -259 -20 242 140 -330 -455 296 173 -45
7961 -45 94 -35 54 -52 -216 25 95 133 -221 -466 -15 518 440 27 -500 -277 156 21 -218 -440 361 299
7983 299 -30 -10 -233 105 157 -125 -299 167 245 160 -144 11 -206 420 -256 -45 -308 258 390 -306 -386 13
8005 13 226 137 -231 -120 468 213 29 -470 -37 269 546 -75 -232 -189 555 325 -213 -432 219 393 267
8026 267 -3 -87 255 224 -134 -207 137 359 521 -350 -101 -19 526 26 -376 -276 331 48 -74 -308 -104
8047 -104 -103 138 -437 -379 13 350 -215 -236 -347 -237 295 121 -294 -169 411 332 -172 -410 -138 399 160 -463
8069 -463 -671 125 405 371 -196 -471 448 653 -60 -179 -71 191 214 -410 -495 197 299 245 -164 44 302
8090 302 402 88 -390 -196 144 221 -239 -390 -16 234 158 -429 -152 13 94 -4 -677 -427 -87 301 -33
8111 -33 -529 193 120 346 -136 -346 90 675 10 -137 -276 425 188 -370 196 -59 508 255 -60 -192 -81
8132 -81 589 -346 -239 -276 -133 237 166 -269 -284 390 168 -120 -590 -121 -16 723 -325 -138 -60 353 -220
8153 -220 -56 -278 158 372 -66 -83 -317 356 138 -216 -495 64 172 139 -357 -93 384 243 -195 -525 -77
8174 -77 393 152 -92 -246 -95 215 -239 -221 -338 97 504 229 -390 99 304 -99 -383
8191c83
$$ Imaginary data points
##PAGE= N=2
##DATA TABLE= (X++(I..I)), XYDATA
0 0 0 0 0 -8 8 -8 16 -16 24 -24 33 -41 56 -64 81 -96 115 -137 163 -193 225 -262 302 -348 404 -461 523
27 523 -595 676 -762 858 -964 1081 -1207 1349 -1502 1668 -1852 2058 -2279 2525 -2796 3094
43 3094 -3426 3797 -4214 4683 -5218 5834 -6554 7400 -8422 9683 -11277 13373 -16269
56 -16269 20536 -27489 40795 -75574 357669 850068 270103 80922 209802 374004 207932
67 207932 72849 131617 417575 532389 333127 31362 25270 185528 259654 147955 30713
78 30713 65542 278091 327370 57871 -156080 34177 260297 139784 -106241 -97854 96381
89 96381 198156 68761 -125966 -112198 74615 77976 -130435 -193415 -20496 106827 61544
100 61544 -63337 -161045 -138672 -25649 -21911 -127487 -91318 95462 150892 -7376 -174975
111 -174975 -176242 -32859 57443 -25869 -74967 92935 212504 38233 -158269 -97631 41619
122 41619 62642 43835 51872 67929 97643 85297 -13495 -69146 9830 98401 93718 44483
134 44483 16266 56348 127591 79396 -56293 -35021 118240 109775 -33237 -25896 108336 136684
146 136684 47335 -30793 -36746 26688 66762 11617 -9292 98563 159053 54021 -62471
157 -62471 -77391 -39716 24741 70367 35499 17154 95890 100359 -60659 -169571 -82801 53883
169 53883 86053 21840 -34421 11626 68888 -38509 -194951 -129510 57174 70763 -43772
180 -43772 -70402 -23389 -4956 -26080 -86683 -126327 -51465 46891 3382 -103056 -97540 -4830
192 -4830 43461 -15973 -127534 -126504 25558 88751 -48952 -112047 39677 131856 5797
203 5797 -128732 -102460 15059 97391 70832 -6830 18269 114250 77519 -71208 -108325 6888
215 6888 132586 166690 85361 -14837 20402 110126 32880 -116884 -57238 144048 197374
226 197374 69306 -44379 -24538 71385 72641 -57239 -98609 54474 155235 41307 -83639
237 -83639 -58116 18198 39552 -7801 -88628 -84187 40094 86996 -38206 -124876 -40640 52840
249 52840 5707 -115832 -151331 -28628 104366 37831 -121119 -95961 41953 15125 -128067
260 -128067 -140897 -14470 91091 86189 -20896 -109461 -61470 18658 -31628 -113260 -53368
271 -53368 82976 128460 40179 -94789 -119564 5908 73732 -35686 -98468 37000 144594
282 144594 49541 -89331 -93918 3191 71079 21970 -71473 -39305 85330 87989 -31307 -72722
294 -72722 -5255 45533 32289 -29020 -74566 -4348 111485 74282 -66700 -75710 32666 52717
306 52717 -29704 -67786 5732 115149 111072 -33431 -117909 -24753 56544 -5999 -51034 28610
318 28610 105078 85080 1239 -88708 -91506 15075 75833 10951 -24993 46112 88518 18637
330 18637 -82397 -105450 -13723 89573 50064 -60845 -31052 79742 46729 -79919 -93612
341 -93612 -3954 47361 17930 -48509 -67911 4515 58367 -11853 -92112 -56947 11656 11849
353 11849 -30360 -61529 -35492 46601 54284 -71551 -140921 -38199 50558 -6086 -67228 -18812
365 -18812 56312 48930 -52864 -137004 -74954 55661 61107 -25430 -23476 44095 37272 -33401
377 -33401 -85262 -78121 9170 101301 65671 -35415 -25278 53456 36817 -49602 -69195 3514
389 3514 88138 79042 -24802 -62347 34046 83121 -14630 -78458 -5879 62655 40289 -10088
401 -10088 -31456 -2734 49833 28915 -65514 -84959 -2091 43438 6015 -33614 -31048 4542
413 4542 19354 -53481 -132380 -66036 62934 47134 -60617 -70498 -8077 -10093 -76859 -119675
425 -119675 -75887 30288 68141 -20844 -92679 -48947 -5556 -43637 -81881 -61004 -4315 51148
437 51148 32597 -67192 -99861 -5792 43179 -33809 -82806 -16750 59268 47772 -31380 -75318
449 -75318 -8194 71998 17725 -85776 -53202 54366 62575 -4487 -32265 -8158 31882 35964
461 35964 -32002 -79805 -2062 95032 61688 -32799 -49848 747 29628 -11424 -76929 -42861
473 -42861 88194 116423 -21003 -105764 -30060 38838 -3218 -57280 -36918 39482 86433 21675
485 21675 -91979 -92753 7924 40603 -18501 -48312 -9911 42769 44027 -39233 -112219 -45819
497 -45819 64978 28393 -85588 -75607 26413 51365 -23299 -90549 -65980 21434 36210 -59479
509 -59479 -105218 -13749 58730 5166 -72584 -81457 -40262 2844 -7415 -69322 -63645 37291
521 37291 66796 -39550 -118212 -67393 16662 27986 -25728 -53517 12646 79460 8994 -109886
533 -109886 -83612 36380 66095 9941 -16838 9523 47284 46875 -19593 -66319 -927 86074
545 86074 62980 -10270 -16086 32734 63298 33584 -34200 -37368 53275 89203 -590 -54624
557 -54624 18183 76310 28055 -40935 -49479 -3735 38402 13706 -43072 -24547 41760 27468
569 27468 -50725 -77068 -41224 609 20035 -7903 -49923 -22546 26325 -23039 -107300 -79434
581 -79434 17906 45865 -1781 -43211 -30084 15114 7489 -64958 -75901 17946 73032 18380
593 18380 -31768 -14738 13933 21246 5282 -24181 -6985 61563 71385 -828 -28499 24584
605 24584 61193 33702 -11739 -19305 32960 78707 31994 -33954 5751 79496 47041 -32415
617 -32415 -32993 22900 55166 39465 -4562 -17370 27268 42598 -22140 -62687 -8920 54091
629 54091 52386 9455 -30970 -23509 26962 22490 -53281 -57191 44218 88798 12969 -54672 -33031
642 -33031 22722 34666 -14745 -49677 9485 83656 45705 -41554 -40465 20987 40090 12052
654 12052 -23183 -26785 28184 70993 14409 -56995 -18407 58255 41657 -31180 -51347 3478
666 3478 65254 45015 -41680 -58893 24508 53975 -24898 -65922 -5595 56009 45521 -9848
678 -9848 -52055 -28153 34017 27128 -39363 -37149 41134 70061 13938 -48255 -48510 16890 66610
691 66610 19616 -44079 5074 90601 58025 -36208 -44377 25380 67969 41782 -12771 -14839
703 -14839 50159 78113 12666 -35481 7732 59045 48263 6856 -18132 3344 60539 59860
715 59860 -20433 -49740 21596 60857 4083 -42397 -10373 45694 50986 -9934 -63051 -25795
727 -25795 41561 20586 -42172 -27483 29634 31267 -13238 -50486 -49476 1415 43479 8042
739 8042 -40284 -7253 43965 15884 -44985 -51647 -1372 49494 38821 -24682 -35622 32553
751 32553 53736 -16758 -49863 8008 55121 35940 -5655 -21562 8863 49009 26531 -32372
763 -32372 -26342 32538 43138 2252 -21793 -6425 30803 45107 -5320 -55948 -13661 53863
775 53863 26274 -39467 -26206 29115 33279 -15214 -53744 -32366 30200 43461 -15462 -40942
787 -40942 8251 33224 -7647 -43520 -33814 4807 41805 26966 -33503 -39429 24359 39152
799 39152 -22298 -49057 -272 48274 38764 -15169 -44324 1424 52475 12997 -49963 -22603
811 -22603 41723 37270 -10407 -28178 -7843 27458 32337 -16346 -47836 -522 46699 15778
823 15778 -33292 -27806 8821 26773 -762 -49299 -38823 35343 50890 -22400 -54524 53
835 53 32974 -4603 -42913 -31880 16245 45567 8163 -47635 -30425 26314 23274 -20841 -26431
848 -26431 6648 37096 34491 -13197 -47822 -1777 54601 20255 -39442 -16708 43866 46047
860 46047 -2430 -34040 -8943 44438 43731 -19970 -37989 22196 52791 9148 -26724 -12589
872 -12589 17446 30905 6580 -35315 -22411 37917 42246 -18793 -41549 -1392 27986 9659
884 9659 -29378 -37639 10063 48558 103 -62812 -32360 31940 20089 -29850 -33379 2201 29863
897 29863 15039 -35816 -52944 -851 36812 193 -38754 -18697 19349 25565 -5763 -43350
909 -43350 -27500 35630 40664 -28260 -47416 15697 46156 1820 -38027 -23049 20377 38107
921 38107 -124 -40991 -9613 45232 29124 -24170 -27820 6966 27421 17534 -15744 -30709
933 -30709 12021 48350 5422 -47254 -19609 35051 30608 -11654 -28700 -1529 37526 23777
945 23777 -36901 -44241 20805 44684 -6464 -37067 -8803 22534 20525 -9953 -37213 -14768
957 -14768 35426 28470 -26999 -35730 8176 28846 4594 -28853 -31237 12031 42387 -533 -49597
970 -49597 -13146 44482 22553 -31201 -30152 8915 29669 11367 -25579 -27848 18854 37157
982 37157 -8072 -37182 -6358 26721 21204 -5084 -25943 -8723 33287 25195 -33849 -38133 23193
995 23193 42794 -5176 -35983 -12280 24532 27896 -13007 -41462 -1787 46018 16251 -37395
1007 -37395 -25781 16776 24349 -79 -25285 -23104 15893 37100 -5500 -41985 -7137 36577
1019 36577 19585 -21507 -28516 2107 34432 17153 -34987 -33563 27842 40447 -15689 -38851
1031 -38851 419 30041 16804 -13743 -28430 -3391 31639 13195 -33685 -27044 16896 23599
1043 23599 -7368 -29450 -21100 12535 27476 -14172 -49417 -9270 37697 5825 -44566 -32335
1055 -32335 9759 19372 -7889 -39400 -29051 17290 24064 -25400 -43792 -2253 24117 3419
1067 3419 -22989 -27665 -4910 25880 11548 -35748 -30846 24748 33699 -12926 -32855 -2490 30065
1080 30065 25525 -12902 -32635 8796 47750 11803 -35664 -12655 31535 26186 -5261 -18322
1092 -18322 -4506 25651 30450 -11129 -33288 4884 35541 7842 -26739 -19964 10699 27342
1104 27342 1847 -40870 -29532 27621 29304 -28915 -43469 3652 26600 -565 -31844 -32923
1116 -32923 -189 25344 -2309 -42727 -23830 20955 16551 -19414 -30122 -10705 17466 21117
1128 21117 -16192 -39250 2775 41176 6002 -38727 -18533 23911 26493 -4575 -27385 -8074
1140 -8074 34078 29621 -22549 -32536 14761 34182 2327 -20344 -11320 10577 24344 1648 -34921
1153 -34921 -20164 29227 27749 -19147 -31334 1250 22291 7087 -28760 -37654 6432 38083
1165 38083 -2635 -46572 -17056 26108 11912 -23105 -27647 -4749 21361 17198 -21421 -32570
1177 -32570 8530 31177 -1916 -30038 -13957 15304 24749 2802 -27023 -11816 34553 29165
1189 29165 -24393 -31003 15810 33691 4760 -19560 -12990 14065 25421 -6015 -35033 -6696
1201 -6696 33137 16874 -19292 -19738 698 12349 4604 -22939 -30288 9053 33318 -6290 -42653
1214 -42653 -17187 18280 10968 -18889 -29794 -4500 29602 16084 -32372 -32024 17605 27330 -10868
1227 -10868 -25507 -3053 19872 22404 527 -22040 -1507 36722 23571 -18630 -15878 21877
1239 21877 36684 16521 -11445 -12879 22897 40032 -283 -30596 8719 47712 22800 -15767
1251 -15767 -13705 10436 23924 9732 -19151 -15055 25391 31896 -11899 -33890 -8339 15185
1263 15185 11174 -9766 -25043 -4424 29257 11416 -40338 -36676 13553 23836 -11536 -30700
1275 -30700 -11959 17348 19419 -16659 -38364 -1910 34131 7628 -28071 -14951 16254 22262
1287 22262 5369 -17938 -17602 16898 31982 -5581 -28511 6725 39179 21305 -13160 -21030
1299 -21030 4663 32245 16361 -23649 -13729 34913 32536 -16638 -31175 -236 22701 17501
1311 17501 -5874 -18591 4534 30684 4776 -36348 -24140 17059 24513 -242 -21040 -15457
1323 -15457 15059 23091 -17467 -40507 1918 38439 10003 -26153 -16217 13749 22843 1414
1335 1414 -26512 -17011 24525 28497 -11410 -21929 10790 28400 12385 -10706 -19748 798 31462
1348 31462 18289 -20891 -13455 27224 25685 -13307 -27416 -3756 24533 25137 -6334 -24101 6374
1361 6374 28317 -4710 -35581 -11084 21891 19420 -2039 -18527 -14408 11113 15372 -18476 -29855
1374 -29855 7507 31707 7664 -20452 -18962 4169 21611 2978 -29377 -14747 30542 26374
1386 26374 -16987 -21823 11843 25889 8533 -14328 -17370 9889 32674 9590 -20999 -4289
1398 -4289 25673 16181 -11189 -18490 -2045 24632 28574 -6139 -25604 6417 27095 -5198 -30981
1411 -30981 -7618 23535 22934 -3950 -28541 -16740 15513 10009 -25399 -21878 16726 23427 -4646
1424 -4646 -25056 -23185 -3681 14408 -1136 -28490 -12498 23793 14842 -23097 -27843 -1334 17490
1437 17490 8476 -19310 -24600 11348 30355 -4416 -31444 -4911 22381 8293 -14549 -16793
1449 -16793 1391 25179 20385 -14387 -22706 9143 21371 -4724 -19611 -2487 20064 23588
1461 23588 -1414 -29737 -14018 24085 16184 -20449 -14125 22146 25250 -4521 -26737 -20083 9130
1474 9130 23272 -2917 -23613 1832 27220 5764 -23564 -20354 1150 18042 12987 -14592
1486 -14592 -20807 13742 28819 -7429 -31683 -6407 21406 13741 -10664 -19866 3232 31685
1498 31685 15479 -26120 -22162 16620 20363 -6994 -15139 1384 18630 19728 -5724 -30054 -9008
1511 -9008 26492 16387 -14018 -9287 16000 19545 -2769 -26974 -21231 17696 33175 -3107 -26073
1524 -26073 2616 24358 210 -26012 -18542 7860 26497 12500 -20639 -20343 13833 18498 -14593
1537 -14593 -26191 -2809 17911 15228 -7793 -24729 -3232 28417 11214 -30337 -23300 16261
1549 16261 21993 -4937 -19421 -5015 19864 19645 -15647 -34146 -58 30348 11391 -13883
1561 -13883 -6928 10432 13448 -1037 -23508 -18959 20137 34659 -1251 -24366 -1760 17556
1573 17556 4222 -17955 -17776 10341 35426 14374 -26928 -21784 15178 14954 -15103 -19990 2786
1586 2786 20093 16157 -9369 -27032 -4524 22963 5530 -25095 -15529 12712 17936 113 -19485
1599 -19485 -15975 12787 20307 -14703 -33233 1668 30028 10430 -14885 -12417 4762 13903 -490
1612 -490 -22845 -12114 24725 27517 -5571 -17920 -793 10279 6048 -5321 -10260 9492 32760
1625 32760 13630 -24134 -18570 14680 17196 -3828 -9117 5233 22259 16657 -13036 -25759 3703
1638 3703 24424 3498 -15597 -2207 13317 9908 -2462 -15745 -12347 11142 14404 -13059 -20422
1651 -20422 7188 20876 3933 -13191 -13870 48 11280 -2514 -23211 -5145 27110 17040
1663 17040 -16780 -19235 500 7785 1607 -6736 -4318 15353 22616 -5725 -28237 -9730 13886
1676 13886 9257 -2695 -3629 4955 16000 7337 -23173 -25805 11498 26795 -1339 -18354 -1156
1689 -1156 14670 6827 -14922 -25808 -4108 22932 9440 -22681 -16787 12892 14930 -6875 -19639
1702 -19639 -14219 5506 15297 -6930 -27469 -2784 28002 11105 -23063 -23619 1718 17734 7398
1715 7398 -15387 -11849 21595 26914 -13619 -33993 -4342 23304 15809 -3191 -9253 5072 21200
1728 21200 6390 -26750 -20921 20130 32614 4370 -16036 -7961 11286 14472 -9884 -29325
1740 -29325 -2383 34589 18257 -22624 -21934 8752 17012 -2996 -23041 -17416 12490 23272 -7813
1753 -7813 -29470 -5144 20663 6874 -18990 -23424 -4216 19470 16143 -15184 -21072 12244 23965
1766 23965 -10304 -31031 -8224 21847 23614 595 -18657 -4744 20547 8815 -21478 -13252
1778 -13252 21858 28592 6422 -12526 -13048 3928 16490 -30 -17355 2831 30394 16521
1790 16521 -15820 -20014 -571 14404 8887 -12814 -15533 12395 22901 -7630 -26399 -5608
1802 -5608 13525 3680 -12424 -15794 -3265 14928 10220 -14893 -17230 5300 8439 -11044 -18263
1815 -18263 -5845 10084 16453 994 -19490 -9910 12358 2881 -17237 -6026 18388 18088 17
1828 17 -13713 -12593 3071 10928 -3195 -7840 12571 21336 347 -15395 -10500 931 9684 7997
1842 7997 -4999 -4352 14147 11700 -14997 -20541 2101 14042 4701 -7432 -9193 5027 15983
1855 15983 -1243 -21760 -7469 15754 5603 -15260 -11329 6018 14320 7784 -10266 -16607 2420
1868 2420 15314 -2564 -15092 2192 20877 14747 -4891 -18219 -9007 15511 16341 -8507 -9147
1881 -9147 19598 24185 -5238 -21869 -7790 13926 20760 4423 -12336 503 21035 7096
1893 7096 -21406 -17334 9138 20139 8773 -9732 -14008 6966 20724 -4027 -27794 -7626
1905 -7626 21122 12478 -12878 -17959 972 19260 9742 -20603 -24235 8072 21982 -2808 -18262
1918 -18262 -1151 16327 13119 -7854 -25068 -11791 19929 20454 -8695 -14251 9925 18125 -1320
1931 -1320 -20009 -14682 12869 29404 7523 -20348 -7264 18437 7059 -18712 -14980 9325
1943 9325 23266 12736 -11754 -19513 2881 17221 -3191 -20375 -4030 16953 13228 -6171
1955 -6171 -19371 -9595 14093 12438 -16995 -22191 7921 20156 -1378 -16729 -6553 9296 11268
1968 11268 -7513 -24045 -8107 19662 14434 -10106 -10693 5828 9297 -1835 -13660 -12094 10861
1981 10861 25948 5713 -18849 -8057 11594 5814 -10409 -8566 8592 22359 12706 -14174
1993 -14174 -19237 6551 16731 -3853 -12214 5073 17485 8930 -7412 -17086 -6167 14505 11069
2006 11069 -11877 -11088 10824 15734 -901 -13174 -9003 6491 13472 -4293 -20672 -1750 22511
2019 22511 10157 -14319 -11213 5284 8902 -841 -11739 -6709 14705 20643 -3714 -18634 -4543
2032 -4543 9558 3914 -4547 -4733 6125 17848 8071 -17248 -18314 8666 16979 -1321 -8735 3576
2046 3576 12990 6264 -11207 -19041 -787 19271 8317 -12326 -5924 11228 8222 -6290 -12860
2059 -12860 -7281 7185 12936 -4552 -16765 251 16340 3707 -13939 -11422 1590 8660 1186
2072 1186 -12841 -7421 15728 15486 -12310 -21768 -2283 9110 1478 -5867 -4476 6046 13690 -525
2086 -525 -20977 -13739 9977 12252 -1332 -5447 665 6382 2908 -12427 -18270 4144 22959 7284
2100 7284 -13236 -5302 9277 4762 -8442 -12684 -1308 16163 14004 -9364 -15191 4896 13371
2113 13371 -2165 -11894 -4810 6939 12482 2072 -13277 -5886 16007 11735 -13892 -17256 2379
2126 2379 13632 5779 -7087 -7949 8426 16560 -4779 -23739 -6333 17913 12474 -4550 -7678
2139 -7678 471 8108 3188 -13216 -14746 10073 23808 4431 -14123 -6334 7394 7836 -4360
2152 -4360 -13580 -729 22235 16162 -14117 -18415 6384 15660 -998 -12308 -4403 11876 16958
2165 16958 -701 -18188 -5454 16777 8927 -12974 -13627 3653 15208 9454 -8582 -14296 5484
2178 5484 17613 -4209 -23405 -6017 18708 15601 -4958 -15243 -5880 10700 6034 -16237 -15613
2191 -15613 12641 22573 205 -16877 -11090 2970 9234 -310 -12724 -2568 18874 12583 -15561
2204 -15561 -20647 967 14895 7161 -7798 -9789 7651 18013 -2083 -22341 -7069 16532
2216 16532 10699 -8510 -11772 342 11867 9299 -8229 -15137 2979 14553 -1356 -15439 -5256
2229 -5256 11195 13021 26 -15205 -11408 8740 9460 -10847 -11871 9524 16576 372 -13618
2242 -13618 -11879 483 10176 2758 -9038 -785 13171 4712 -12565 -11835 1111 9352 8944 373
2256 373 -5818 3570 10839 -3023 -14726 -1335 13745 9774 -1949 -5061 441 8849 5411 -8739
2270 -8739 -7660 9754 11793 -3368 -6907 2933 7834 4113 -3132 -8726 -3012 8589 4364 -8288
2284 -8288 -3475 10426 8311 -4894 -11265 -7226 4857 9828 -1807 -9772 4022 12760 -3396
2297 -3396 -16963 -6676 7516 9900 2578 -6023 -3604 7179 5498 -11364 -12107 6439 14991 4261
2311 4261 -6686 -7270 1476 9869 1090 -13990 -4899 16021 12766 -8245 -12691 1594 11273 5383
2325 5383 -10039 -14030 4247 16501 686 -15472 -3735 12145 6643 -8424 -15134 -6510 10661
2338 10661 12674 -6447 -15494 2162 12570 -3185 -18185 -10767 8047 16482 3505 -15755 -11109
2351 -11109 10065 8036 -13504 -14613 6708 16753 5357 -10436 -13997 -140 13635 3364
2363 3364 -13658 -4824 15529 12926 -5866 -13905 -4616 10926 12477 -6008 -15784 3794 19190
2376 19190 3905 -14976 -7367 9107 10589 -2304 -14078 -7035 13175 14607 -6949 -14740 930
2389 930 10030 -240 -10934 -8773 4850 16352 6385 -15056 -12826 8073 9746 -6701 -10893
2402 -10893 2647 13091 8363 -8359 -16289 -463 14641 3960 -10041 -1830 11923 8239 -4254
2415 -4254 -9981 -5174 8907 12477 -2326 -10840 3626 13608 2119 -9842 -6049 4985 10641
2428 10641 2958 -10520 -6055 11890 10628 -8453 -11949 1886 7415 -70 -6577 -5582 4594 11730
2442 11730 655 -14578 -8265 6288 4163 -5350 -4915 1073 6263 3794 -9155 -14481 864 12761
2456 12761 1446 -9348 -1434 7652 2947 -6362 -10255 -2224 10379 8246 -7463 -8460 5629 7612
2470 7612 -4141 -7662 -1206 6067 8138 269 -9907 -2977 10746 5480 -9912 -8419 4172 7752
2484 7752 560 -6982 -5489 7342 11187 -5595 -16083 -1848 10631 2537 -7065 -4589 3243 7062
2498 7062 879 -12304 -11109 7004 12295 -1598 -8594 104 6523 2904 -6054 -11075 90 15363
2512 15363 8329 -10667 -8685 7508 8588 -3998 -8134 -133 10814 11436 -3264 -12412 247
2525 247 13426 3836 -8791 -4496 6468 9840 3046 -7660 -7244 8207 12941 -4223 -13700 325
2539 325 12112 5717 -5702 -7842 1746 10239 2191 -13925 -9045 11101 12593 -3303 -8706 -1422
2553 -1422 5351 4123 -5130 -10679 864 14866 6084 -11570 -8815 5010 7491 -981 -7544 -3117
2567 -3117 9032 11559 -5791 -15051 291 12490 2723 -8744 -4450 5261 8363 1146 -10054
2580 -10054 -7250 8690 9776 -6151 -10259 1289 8555 4278 -5005 -9608 -932 10165 2093 -13081
2594 -13081 -7298 10743 10158 -4601 -10341 -3403 5147 4761 -6247 -10943 3663 13532 474 -12711
2608 -12711 -6919 4028 5714 406 -6280 -4021 8006 9213 -7328 -13874 1050 10969 3182 -6153
2622 -6153 -5127 3321 9219 507 -12222 -5807 11895 9724 -6452 -8266 2255 7233 3491 -5023
2636 -5023 -8036 1873 11404 2055 -10697 -3345 9198 7480 -2475 -7418 -3552 6362 8247 -5052
2650 -5052 -10016 5425 13608 -217 -11249 -5265 5194 7553 1100 -6699 -2563 9505 7135 -8952
2664 -8952 -10158 3211 9212 3049 -3225 -4823 1797 8890 997 -10855 -3667 11456 8318 -5350
2678 -5350 -7097 761 6701 4313 -5554 -8526 4701 11965 -528 -10306 -1108 7818 4431 -2286
2692 -2286 -6456 -2928 7062 7018 -6193 -8551 4736 9309 -2201 -8711 -4449 3987 7925 473 -9288
2707 -9288 -3316 9452 4155 -10694 -8430 4664 7419 1083 -5371 -5908 2395 7243 -2532 -10579
2721 -10579 -1020 9521 3945 -5913 -6372 -1348 5255 3704 -6974 -8722 5473 10380 -3450 -10756
2735 -10756 -1222 7023 4226 -3868 -8120 -878 9131 4134 -9141 -6624 6564 6655 -3369 -6799
2749 -6799 -2879 4456 7827 -611 -9688 -1513 10028 3018 -9573 -5968 5093 8391 2248 -6999
2763 -6999 -7196 5033 9320 -3792 -10247 2433 10544 2801 -6254 -6552 194 6947 3860 -7677
2777 -7677 -6219 7767 8859 -4139 -8622 -570 6406 6406 -2001 -8781 -677 11309 4041 -10546 -5948
2792 -5948 7912 8048 -1568 -6633 -2457 6749 9032 -2785 -9867 1476 10563 1888 -7207 -3880
2806 -3880 4062 8060 3219 -7398 -7344 6176 9979 -4307 -9962 1716 9259 3587 -5972 -8291
2820 -8291 -74 9355 3306 -9597 -5470 8040 6707 -4853 -7688 -1505 5358 6085 -3007 -9406
2834 -9406 -569 9785 1579 -9696 -4863 5132 6121 50 -6851 -5521 6126 8591 -5086 -10784
2848 -10784 1790 9305 640 -6675 -4052 2241 6483 1620 -8584 -6217 6622 6815 -4501 -6726
2862 -6726 1085 5232 2636 -4061 -8170 -383 9506 2598 -9826 -4399 6652 4293 -4247 -6791
2876 -6791 -1387 5366 5649 -4621 -9112 1731 7836 -1196 -7802 -2040 4229 4480 360 -6099 -4192
2891 -4192 6539 7083 -5440 -8079 3462 7422 455 -4984 -4067 2696 7988 1276 -8692 -2186 9202
2906 9202 5719 -5272 -4175 3230 5522 2801 -3981 -6052 2986 9934 517 -7948 -1589 6877 3905
2921 3905 -2587 -5047 -1284 7317 6607 -5754 -8593 4373 8688 -1928 -7127 -1042 5025 5015 -1231
2936 -1231 -7753 -2434 8201 4595 -7071 -5594 4068 6017 228 -4752 -5073 2819 8803 157 -9771
2951 -9771 -1852 9484 4527 -5559 -5169 1836 6552 3397 -5970 -7040 4978 9026 -2910 -8667
2965 -8667 -188 6106 3254 -2419 -6076 -1947 7079 4931 -7557 -8293 4045 6961 -1790 -6831 -3245
2980 -3245 3074 6169 -1582 -9903 -2502 9125 2937 -8156 -6009 3205 4797 -85 -5525 -5871 3428
2995 3428 7726 -1955 -9308 -539 7088 2655 -4144 -5319 -462 6185 4585 -6582 -7276 5250 8688
3010 8688 -2844 -7435 -398 5495 4234 -2059 -6763 -603 8394 3135 -7842 -4943 5165 5206 -1137
3025 -1137 -4742 -3018 3235 7061 -1498 -8797 -632 8860 2486 -6303 -4536 2543 5454 2250 -5971
3040 -5971 -5608 5858 8066 -3642 -8259 1620 6977 2100 -3199 -4458 406 6569 3311 -6626 -4934
3055 -4934 5993 6962 -2093 -5144 -200 4659 5332 -1343 -7485 119 9401 2406 -7977 -3496 5295
3070 5295 4660 -1202 -4930 -3257 4606 6699 -3281 -7657 1730 7187 598 -5457 -3390 1127 5084
3085 5084 1888 -6321 -5760 5632 6427 -4605 -7045 1250 5208 1960 -3848 -5933 348 7252 1385
3100 1385 -8472 -3424 6367 3864 -3642 -4508 -919 3529 4564 -2920 -7492 849 7728 467 -7112
3115 -7112 -2638 3589 3653 -623 -5920 -3642 6174 6246 -5206 -7395 2844 6170 -492 -5197 -3260
3130 -3260 1770 5619 883 -7212 -3953 5891 4435 -4700 -4932 1274 4395 2466 -3536 -6848 1179
3145 1179 8218 148 -7960 -1811 6257 3435 -2480 -4560 -522 5276 4530 -4462 -6577 3605 7644
3160 7644 -1121 -5654 -1381 3465 4151 406 -5491 -2365 7235 6079 -4785 -5912 3298 5989 824
3175 824 -3896 -3476 3076 7726 -24 -8304 -1890 7554 3431 -4451 -2976 2038 4538 2718 -3837
3190 -3837 -5797 2580 7702 -975 -6776 -496 5214 3232 -1598 -4913 -1646 6194 5024 -6000 -6660
3205 -6660 4275 6276 -1735 -5272 -1574 3362 4614 -729 -6634 -1199 7418 3391 -5938 -4702 2418
3220 2418 3699 724 -3605 -4030 2935 7137 -1427 -8673 -1527 7006 2490 -4162 -3939 668 4742
3235 4742 2556 -6318 -6757 4198 6622 -2450 -6243 -206 3625 2098 -1814 -5357 -1363 6210 3419
3250 3419 -6509 -5194 3702 4636 -1406 -5015 -2716 3148 5823 -1675 -8214 -393 7747 2128 -6552
3265 -6552 -3268 2356 3735 1017 -3681 -4054 3680 6353 -2648 -7032 469 6024 2224 -2132 -3227
3280 -3227 -270 5556 2835 -6573 -5070 5652 6676 -2092 -4697 -149 3990 3194 -1376 -5381 514
3295 514 7381 2465 -5819 -3051 3992 3565 -402 -2709 -1842 3325 5760 -1750 -6855 783 6825 1954
3311 1954 -4175 -2500 1779 4375 1958 -4807 -3778 5384 5278 -3836 -5054 1773 4820 1636 -1529
3326 -1529 -3172 -186 5067 1368 -5989 -2736 5543 4678 -2164 -3793 -925 2790 3545 -1805 -5837
3341 -5837 1863 7468 430 -6807 -2314 3509 2328 -529 -3479 -1839 4479 3804 -4300 -5844 2025
3356 2025 5078 -92 -3706 -2257 877 3308 248 -6001 -3217 5042 3775 -5240 -4908 1792 3983
3371 3983 1206 -3059 -4781 932 5272 -921 -7195 -1055 5735 2526 -3445 -3863 -1064 2846 3002
3386 3002 -3462 -5059 2909 6666 -1550 -6470 -2294 3048 3247 -443 -4903 -1496 5956 3749 -6330
3401 -6330 -5623 3771 5101 -615 -3772 -2509 2341 4906 -609 -6667 -1359 6907 3243 -4362 -4155
3416 -4155 1258 4423 2922 -3560 -5576 2474 7148 -1124 -7266 -205 6415 3301 -2348 -4980 -1160
3431 -1160 5328 4537 -4068 -4677 4445 6064 -1563 -5454 -2196 2974 5433 1259 -5144 -2035 6266
3446 6266 3928 -4979 -4760 3062 5759 2037 -3530 -4370 2011 5869 -777 -6747 -746 6390 2766
3461 2766 -3006 -3430 -172 3626 3420 -2973 -5218 2104 5803 -1153 -5276 -1139 3072 2785 -825 -5004
3477 -5004 -2335 5295 4080 -4140 -4103 2930 3576 -2144 -3944 -2363 1773 4024 406 -5001 -1562 4372
3493 4372 995 -4533 -2492 1496 3208 1450 -2509 -4814 662 4496 -1589 -5252 338 4475 1001
3508 1001 -2613 -3076 -898 2994 1869 -4292 -3185 3486 3200 -3245 -3623 596 2490 1666 -1012 -3878
3524 -3878 -555 4833 1720 -4842 -2545 3312 2285 -1755 -3027 -1301 3133 4314 -1829 -5267 992
3539 992 5079 -314 -4432 -470 3313 3662 532 -3849 -3021 3074 4026 -2784 -3579 2739 4566 613
3555 613 -2905 -3124 903 5198 1749 -4797 -2223 5180 3443 -3632 -3447 1130 4076 3014 -2285 -4732
3571 -4732 1563 6464 413 -5031 -1124 4465 2830 -1096 -3394 -1663 4256 5399 -2809 -5673 1436
3586 1436 5627 19 -3758 -1741 3235 4782 -30 -5871 -3361 5058 4262 -3441 -3852 2619 3715
3601 3715 607 -3377 -4336 478 6014 1619 -5225 -2020 4258 2498 -3025 -4131 -648 3848 4086
3616 4086 -3093 -5981 1346 5481 -438 -5445 -1587 2934 2499 -1128 -4592 -2480 4173 3777 -3801
3631 -3801 -5497 1498 4062 229 -2778 -2680 1000 4296 -34 -6466 -3631 4925 3891 -3301 -3784 675
3647 675 3092 1193 -3550 -4968 1275 6330 428 -5387 -1279 3259 1717 -1918 -3092 -790 3998
3662 3998 4382 -2815 -5272 1614 4990 -280 -3664 -1076 2426 3485 299 -4686 -1889 4954 3624
3677 3624 -3777 -3448 1902 3367 796 -1783 -2498 1342 4423 79 -5136 -1040 4767 2764 -1397
3692 -1397 -2128 280 2242 1874 -2857 -3939 2749 5841 76 -4421 -774 2401 1369 -942 -2323
3707 -2323 -103 4791 2969 -3792 -3319 2204 3371 -804 -1849 -372 1499 2821 -321 -4364 -992
3722 -992 5039 2318 -3391 -2236 2256 2503 247 -2508 -2594 2261 4114 -1932 -4878 316 4112 907
3738 907 -2078 -1832 -105 2258 998 -3455 -3011 3270 4080 -1877 -4167 -816 1577 945 -1334 -2850
3754 -2850 -215 4989 1359 -5452 -3540 2610 2610 -1250 -2344 -649 1708 2306 -2482 -5326 133 4544
3770 4544 795 -3548 -1652 1169 1855 321 -3127 -2888 2719 4345 -2805 -4905 797 3823 1057
3785 1057 -2375 -2580 27 3467 633 -4026 -1944 4139 3293 -2299 -3100 -401 1684 2007 -831 -2839
3801 -2839 1085 5072 296 -5054 -1945 3159 3025 -130 -1986 -714 2801 3009 -3155 -4257 2101
3816 2101 5313 228 -3041 -739 1753 2446 165 -3205 -1440 4159 3377 -3252 -3307 1888 3910 1341
3832 1341 -1765 -2609 1170 4917 389 -4982 -1219 4910 2940 -2927 -3302 62 2915 2904 -1918 -3434
3848 -3434 2231 5078 -735 -5419 -1292 3020 3039 -84 -3122 -2044 3069 3112 -3946 -5039 2287 5609
3864 5609 799 -3230 -3107 1016 3594 263 -4889 -2119 4800 3499 -3795 -4234 509 2818 1734
3879 1734 -2176 -4029 763 4867 503 -5399 -2232 3252 2787 -1364 -3492 -1975 2646 3655 -2229
3894 -2229 -5012 1132 4634 -288 -4106 -1952 1494 2963 769 -3549 -2772 2767 2494 -3019 -3133 1542
3910 1542 2980 1323 -1653 -3448 -200 3396 1255 -3890 -1425 3841 2128 -2368 -2809 -296 1881
3925 1881 2239 -960 -3040 848 3631 -299 -3165 -284 2277 1070 223 -1411 -1169 2374 2788 -1650
3941 -1650 -2383 1807 2461 -725 -1457 -316 1498 2882 439 -3096 -1196 2622 962 -2490 -554 2616
3957 2616 1830 157 -1242 -1835 677 2670 -204 -2433 790 3123 -174 -1990 -1449 310 2076 1711
3973 1711 -1344 -1840 2492 2644 -2524 -3105 1118 2554 613 -1496 -2128 269 2977 800 -3642 -1179
3989 -1179 3510 1801 -2072 -2217 13 2387 2302 -1428 -3784 9 3859 -16 -3799 -854 3066 2145
4005 2145 -906 -3483 -2162 2670 3487 -2419 -3800 1751 3510 -899 -3852 -2452 787 3614 837
4020 837 -4036 -2282 3268 2264 -3444 -3919 521 2729 1950 -2405 -4542 255 4604 489 -5205 -2161
4036 -2161 3397 2398 -1894 -3470 -1401 3011 3370 -2342 -5149 611 4502 360 -3494 -1745 1647
4051 1647 3289 492 -3941 -3342 3740 4988 -1948 -4102 631 3673 1106 -2505 -3204 650 5293
4066 5293 2149 -4213 -2939 3625 2988 -1518 -2691 -478 2715 3642 -813 -4654 -465 4575 2114
4081 2114 -2929 -1536 2027 2592 541 -2872 -2472 2637 4227 -1626 -4172 635 3171 662 -1749
4096 -1749 -1356 143 2860 1502 -3062 -2667 2389 3149 -892 -1822 -362 794 1123 -729 -2937 51
4112 51 3940 1660 -3283 -2082 1531 1072 -872 -796 -442 1552 1929 -1645 -3280 182 2651 7 -1643
4129 -1643 108 921 375 162 -2341 -1676 2241 2010 -2176 -2361 1095 1620 -647 -1071 -1201 556 1920
4146 1920 -539 -3534 -652 2811 589 -2450 -1116 907 857 -21 -1635 -1839 1237 3052 -891 -3425
4162 -3425 -129 1754 159 -1270 -1347 -138 2322 769 -3344 -2985 2029 2827 -1561 -2092 640 1719
4178 1719 766 -1287 -3040 -255 3557 1355 -2905 -1553 2170 1793 -350 -1591 -963 1885 3661 -888
4194 -888 -3834 173 3789 1106 -2577 -1282 1307 2314 1113 -2254 -1912 3231 3692 -1686 -2816 669
4210 669 2786 1285 -442 -1200 345 3338 1836 -3170 -2174 2935 3338 -308 -1964 -393 1937 2564
4226 2564 -1504 -3708 433 4558 1239 -3318 -1396 1380 1748 0 -1723 -1797 2029 3340 -1871 -3772
4242 -3772 564 2976 481 -2018 -1808 -46 2483 1177 -3051 -2287 2659 3208 -2022 -3392 4 1819
4258 1819 1347 -919 -2894 140 3460 935 -3864 -1830 2127 2269 -550 -2005 -1349 1408 2114 -1331
4274 -1331 -3803 556 3989 598 -3138 -2058 838 1749 540 -2351 -1994 2544 3160 -2569 -3530 219
4290 219 2411 300 -1319 -1782 -196 2325 720 -2971 -2014 2472 2156 -1324 -2026 -409 1546 2012
4306 2012 -695 -3105 272 3668 469 -3336 -1160 2066 1813 218 -1649 -1678 1531 2412 -1071 -2654
4322 -2654 1267 3346 -142 -1904 -1369 301 1813 1160 -2146 -1204 2829 2547 -1969 -2437 777 1920
4338 1920 806 -603 -1654 359 3098 463 -2962 -535 2857 1349 -996 -1250 -325 1438 2340 -471
4354 -471 -2293 1264 3259 -79 -2361 -195 1675 1403 320 -2049 -1179 2104 2146 -1751 -1868 1668
4370 1668 1869 -666 -1772 -1126 245 1903 754 -2025 -899 2290 500 -2334 -1576 575 1555 1097
4386 1097 -873 -2157 354 2291 -938 -3087 120 2391 543 -1188 -1645 -719 1478 1164 -2055 -2157
4402 -2157 1653 1679 -1615 -2015 -55 1147 931 -313 -2270 -939 2163 902 -2696 -1401 1591 1413
4418 1413 -597 -1778 -1177 996 2379 -186 -2751 330 2609 -325 -2727 -754 1203 1279 835 -1843
4434 -1843 -1780 1348 2424 -1463 -2624 859 2539 806 -1056 -1806 -509 2562 831 -2448 -1480 2761
4450 2761 2109 -1378 -2260 148 1638 1704 -582 -2551 111 3025 688 -2645 -1018 1833 1904 -54
4466 -54 -1810 -1363 2089 3342 -684 -2622 674 3265 603 -2091 -1310 973 2710 1614 -2900 -2027
4482 -2027 2471 2481 -1573 -2080 606 2296 1428 -928 -2500 -567 2970 1317 -2843 -1799 2316 1627
4498 1627 -736 -1962 -956 1585 2690 -510 -3591 -19 2929 354 -2120 -1093 888 1076 245
4513 245 -2051 -2204 1465 2704 -1232 -3055 129 1595 413 -900 -1763 -196 2248 1431 -2616 -2545
4529 -2545 1551 1853 -1109 -1549 87 905 1256 -659 -2761 -578 2606 774 -2378 -715 1472 673
4545 673 -220 -1121 -934 1158 2413 -1035 -2869 57 1679 -14 -1377 -827 278 1196 288 -1888 -1445
4562 -1445 2038 1880 -1576 -1546 946 986 215 -638 -1087 25 1830 751 -2193 -698 1738 693 -792
4579 -792 -796 133 1108 986 -919 -2035 736 2514 -189 -1969 243 1514 504 -320 -1035 -223 1923
4596 1923 1790 -1359 -1285 1337 1712 -448 -890 266 948 1778 302 -2031 -550 2647 1160 -1776 -759
4613 -759 1432 1372 144 -904 -966 1010 2447 -681 -2667 307 2407 421 -1381 -1060 101 1447
4629 1447 981 -1794 -1930 1444 2408 -1175 -2056 -168 1020 706 -953 -1974 -490 2599 1267 -2910
4645 -2910 -2109 1396 1361 -679 -1330 -888 709 2086 -564 -2730 -390 2589 841 -1841 -1323 495
4661 495 847 492 -1815 -2065 1066 2550 -982 -3099 -77 1943 990 -1093 -1379 -218 2272 1053
4677 1053 -2228 -2174 1690 1943 -1058 -1619 -399 580 1444 -223 -2425 -493 2601 1185 -2603 -1438
4693 -1438 941 1528 257 -749 -1253 1238 2363 -686 -2820 -284 2361 443 -1032 -722 198 1367
4709 1367 985 -1074 -1441 1289 2134 -646 -1623 247 1071 694 -193 -1426 -422 2206 1301 -1942 -1282
4726 -1282 1901 1411 -459 -806 -215 629 1775 191 -1790 347 2575 278 -1451 -248 1050 975
4742 975 614 -932 -1062 1122 2104 -1180 -2210 723 2031 157 -1047 -582 319 1491 990 -1753 -1179
4759 -1179 1559 1155 -1513 -1356 338 913 591 -542 -1492 94 2038 269 -2607 -1029 1624 732
4775 732 -760 -1260 -1256 1068 1320 -989 -2555 467 2149 -294 -1840 -467 625 1196 244 -1333 -1306
4792 -1306 1644 1370 -1912 -1696 821 1387 -192 -860 -1331 21 1552 181 -2432 -730 1792 884
4808 884 -1272 -1582 5 736 926 -773 -1709 564 2181 -318 -2136 -230 1180 667 -547 -1115 -613
4825 -613 1253 1564 -1117 -1728 952 1771 -280 -1497 -525 799 1454 235 -1876 -661 1969 1082 -1536
4842 -1536 -932 1139 1212 554 -674 -662 770 2181 -94 -2206 -106 2020 795 -939 -687 115 1377
4859 1377 1155 -1012 -1858 1389 2479 -745 -1431 246 1558 806 194 -1492 -276 1851 1449 -1757
4875 -1757 -1225 1292 1378 -380 -832 -464 354 1740 -207 -2260 -277 2151 633 -1477 -923 756 1193
4892 1193 501 -1502 -1602 903 1906 -744 -2076 384 1513 408 -645 -960 -394 1460 1223 -1521
4908 -1521 -1983 1088 1508 -807 -1313 -308 893 739 -102 -1861 -452 1991 709 -2103 -1054 1222
4924 1222 1167 -444 -925 -975 408 1281 -525 -2387 -135 1669 344 -1173 -1077 289 996 715 -1369
4941 -1369 -1768 917 1543 -1014 -1986 13 1210 270 -673 -1226 -412 1521 1075 -1620 -1162 1384 1284
4958 1284 -658 -885 -153 879 1207 -448 -2070 -138 2089 628 -1793 -330 800 1071 28 -666
4974 -666 -705 1075 1565 -775 -1783 729 1556 279 -797 -369 378 1042 465 -1367 -840 1354 1374 -860
4992 -860 -945 580 840 677 -458 -1345 166 1990 593 -1810 -633 1465 946 -591 -736 -199 780
5009 780 1334 -405 -1769 558 1783 -117 -1353 -493 532 941 368 -1240 -786 1147 1542 -1221 -1578
5026 -1578 564 1144 108 -1009 -641 -174 1038 418 -1829 -898 1717 447 -1155 -642 279 696 357
5043 357 -700 -1603 114 1377 -202 -1941 -532 886 189 -391 -1166 -401 1133 1049 -1424 -1656 1177
5060 1177 1581 -569 -1647 -448 471 763 -189 -1181 -448 1798 840 -1360 -1169 694 859 289 -902
5077 -902 -794 447 1594 107 -2107 -234 1948 734 -961 -540 109 1054 674 -1077 -1415 1326 1969
5094 1969 -566 -1728 -55 826 566 -313 -1202 -468 1549 1189 -1399 -1367 1177 1460 -531 -1037 -376 711
5112 711 1323 64 -1793 -158 1925 1263 -1375 -1152 786 1334 298 -737 -1151 541 1518 -68 -1781
5129 -1781 -28 1626 890 -509 -491 148 1023 1099 -733 -1364 1103 1572 -395 -1346 -191 956 789 -72
5147 -72 -1119 -383 1605 575 -1285 -994 689 819 -460 -707 -983 118 1220 -300 -1886 -386 1488
5164 1488 172 -1248 -294 203 851 572 -857 -1333 641 1207 -708 -1588 -136 988 33 -880 -899 -294
5182 -294 1112 523 -1485 -1071 1028 490 -807 -938 -313 315 455 -129 -1410 36 1204 54 -1642
5199 -1642 -318 453 630 -207 -408 -753 984 1506 -807 -1520 654 1300 -283 -1033 -231 645 1114 593
5217 593 -1323 -1063 1112 1042 -977 -819 572 1083 509 -582 -632 121 1449 390 -1656 -285 1463
5234 1463 869 -667 -472 82 970 1004 -316 -1509 487 1494 40 -1150 -48 1180 234 -120 -916
5251 -916 -570 1375 1108 -1145 -1568 542 1295 13 -944 -142 526 904 141 -1331 -379 1372 822 -1297
5269 -1297 -879 53 829 550 -717 -1228 488 1622 156 -1747 -37 1674 609 -732 -744 -251 942
5286 942 909 -1033 -1516 681 1459 -243 -1022 -182 429 759 0 -1222 -539 1539 808 -1767 -1323 592
5304 592 593 -228 -970 -867 406 1412 -103 -1654 -547 975 381 -1082 -878 -243 521 290 -924 -1587
5322 -1587 315 1610 -92 -1606 -334 639 739 -361 -1057 -561 880 717 -1081 -989 943 1415 -439
5339 -439 -640 -142 180 870 237 -1386 -622 1336 734 -1129 -582 474 721 326 -505 -1008 634 1429
5357 1429 -198 -1297 -315 1220 169 -676 -372 208 916 498 -1080 -813 1049 1294 -433 -581 315
5374 315 527 844 -305 -937 66 1173 591 -895 -624 890 1056 -80 -542 -556 501 919 -69 -1103
5392 -1103 330 1495 415 -870 -234 625 435 438 -383 -467 636 1295 -762 -1444 492 1154 128 -718
5410 -718 -834 -145 989 257 -1359 -1072 1088 789 -751 -880 273 472 433 -288 -1057 75 1237 171
5428 171 -1641 -418 458 538 -94 -775 -572 815 1092 -719 -1535 180 1475 -136 -1030 -538 412 449
5446 449 62 -1084 -476 1045 890 -1063 -1222 748 812 140 -356 -658 87 1077 113 -1238 -562 1198
5464 1198 884 -878 -739 164 464 531 -839 -1003 553 1489 -239 -1098 -522 752 450 -121 -587 -219
5482 -219 689 881 -803 -1214 535 1040 188 -604 -325 286 1123 625 -997 -320 1463 991 -1056 -799
5500 -799 660 1025 116 -274 -642 386 1486 43 -1385 -40 1205 805 -434 -1024 -440 698 1230
5517 1230 -359 -1234 738 1353 -128 -1203 -302 840 864 65 -862 -386 1028 982 -1183 -858 515 910
5535 910 -172 -442 -662 206 1226 308 -1420 -204 1267 785 -560 -762 83 504 703 -602 -1000 179
5553 179 1437 -76 -1486 -189 1035 230 -504 -939 -346 762 784 -1171 -1197 408 927 -452 -1125 -398
5571 -398 124 1014 256 -1226 -766 1069 270 -1043 -797 436 657 -83 -665 -624 -42 1144 -79 -1159
5589 -1159 174 796 543 -579 -273 166 346 647 -491 -1218 339 965 -342 -899 -57 494 555 -41
5607 -41 -633 -363 716 1037 -1071 -434 835 524 -489 -140 -258 305 812 529 -879 21 846 229 -731
5626 -731 -21 677 707 174 -329 -519 413 1043 -680 -582 598 1155 -213 -500 -190 -73 858 513 -625
5645 -625 -208 1117 644 -428 -228 295 568 110 -188 -753 -63 886 330 -1004 -593 997 177 -474 -333
5664 -333 113 935 544 -480 -1061 647 872 -217 -1001 -121 527 425 -237 -773 -525 642 522 -992
5682 -992 -1012 725 740 -281 -1008 -424 627 800 4 -1323 -323 1001 331 -854 -1052 208 665 415
5700 415 -1081 -1113 85 1099 -203 -1475 -335 955 499 -282 -613 -350 770 978 -799 -1333 395
5717 395 1077 -129 -991 -428 599 614 -17 -1410 -658 1455 928 -838 -794 234 825 359 -568 -993 344
5736 344 1516 431 -1063 -533 1107 774 -609 -841 -141 622 599 -267 -1383 253 958 -62 -849 -422
5754 -422 406 143 257 -455 -434 816 1307 -608 -977 322 973 272 -381 -440 307 926 274 -935 -906 1302
5774 1302 857 -356 -1 415 445 375 -140 -807 245 883 93 -939 -204 490 221 -28 -347 -176 682
5793 682 770 -707 -676 185 608 -328 -435 37 -29 171 293 -899 -319 801 591 -804 -380 392 48 78
5813 78 -375 -335 431 730 -253 -1022 -36 871 -246 -545 -395 -137 -59 209 -744 -374 557 353 -557 -841 70
5834 70 72 -328 -332 -514 73 516 185 -1130 -484 603 235 -498 -371 252 215 450 -445 -758 216 1100 -130
5855 -130 -986 -185 544 538 -298 -606 -434 489 897 -535 -956 345 890 86 -300 -308 123 497 63 -1055
5875 -1055 -411 1223 909 -622 -642 95 487 92 37 -258 288 1152 268 -1114 -70 985 493 -488 -250
5894 -250 31 248 542 -712 -732 304 1151 172 -738 32 712 651 -92 -511 -647 1082 849 -680 -944
5913 -944 241 903 258 -394 -562 343 684 294 -958 -270 1072 500 -717 -382 -187 435 331 -221 -1030
5932 -1030 -94 983 85 -1177 -707 823 483 -85 -671 -456 676 568 -476 -1336 240 704 -185 -666
5950 -666 -368 252 307 316 -817 -668 827 412 -568 -962 -28 469 13 -276 -839 -128 591 374 -1117 -168
5970 -168 1107 504 -366 -524 -281 463 430 -486 -865 405 699 -47 -793 -158 500 440 186 -515 -376 471
5990 471 645 -848 -440 622 1101 -371 -382 -397 -180 753 97 -801 -386 1021 469 -820 -386 493 440
6009 440 363 54 -590 316 1065 163 -748 -42 889 93 -11 -78 -98 811 421 -258 -485 794 611 -294 -586
6030 -586 430 424 265 261 -641 -187 915 451 -766 -474 468 379 -80 -206 -440 64 881 -28 -640 155 661
6051 661 -18 -698 -231 147 333 94 -361 -355 81 270 -143 -835 120 411 -131 -109 -176 -146 418 -62 -1008 -791
6073 -791 487 88 -797 -566 138 169 424 -273 -587 5 739 -326 -557 71 564 108 -503 -551 -490 -141
6093 -141 523 -60 -782 282 731 -208 -294 -422 350 252 237 -697 -369 457 533 -402 -843 404 879 240 -508
6114 -508 -582 67 667 74 -529 -253 874 -27 -370 -491 46 575 613 -265 -912 -203 929 -167 -1220
6133 -1220 -268 414 418 -161 -747 -153 883 937 -406 -773 499 667 96 -620 -727 390 807 764 -1056
6152 -1056 -323 815 802 -351 -593 192 401 713 -388 -725 209 951 171 -719 -701 568 660 -163 -580
6171 -580 -302 504 958 -608 -1063 -269 929 316 -412 -158 90 648 513 -595 -574 736 817 -273 -686
6190 -686 349 442 63 -333 -422 123 688 67 -660 -669 662 516 -233 0 -285 108 227 -281 -919 70 677
6211 677 -203 -573 -319 -2 347 -204 -451 -372 527 282 -790 -739 274 414 -287 -325 -366 -13 398 213 -760
6232 -760 -298 426 476 -332 -226 32 348 226 -191 -602 5 836 -155 -647 42 765 -174 -249 -156 -299 498
6253 498 210 -289 -445 377 480 97 -340 297 531 456 -164 -168 -92 540 461 -292 -191 364 257 -64 -89 84
6275 84 365 546 131 -427 82 864 175 -420 14 487 160 139 -341 -117 632 813 -697 -468 278 504
6295 504 100 -386 60 162 534 174 -558 -442 550 829 -476 -484 287 435 270 -161 -554 329 949 90
6315 90 -737 -403 684 244 -443 -483 -232 407 586 -142 -643 315 967 141 -881 -497 169 582 142 -832
6335 -832 -731 781 368 -585 -882 61 336 252 -150 -434 23 767 398 -761 -480 479 491 -66 -527 -60
6355 -60 464 361 -254 -843 -141 837 322 -817 -201 318 397 308 -550 -417 361 667 -191 -706 48 513 308
6376 308 -60 -124 -190 675 465 -612 -665 584 612 -383 -450 71 447 644 -17 -393 60 635 367 -570 -430
6397 -430 539 523 12 -328 -67 -55 386 -298 -692 302 838 175 -282 -26 305 564 301 -19 -36 560 335
6418 335 -336 -381 495 346 270 -131 -384 236 872 36 -428 -458 316 250 -503 -504 -174 239 454 -289 -29 -10
6440 -10 668 304 -673 -84 68 231 -287 -84 -483 225 214 -495 -546 404 418 -72 -353 -118 -111 371 132 -299
6462 -299 -324 352 -68 -734 -607 244 369 -403 -605 -32 281 494 -148 -653 -78 310 179 -342 -585 -441
6482 -441 382 72 -417 -747 338 566 -116 -466 -42 65 31 -43 -500 -289 107 169 -471 -567 228 551 -107
6503 -107 -269 -400 253 754 72 -586 -54 695 275 -370 -272 60 602 301 -47 -623 587 764 -7 -296
6523 -296 2 632 82 -140 -418 5 548 671 -487 -355 387 678 -177 -643 20 476 -104 -89 -657 -153
6543 -153 527 274 -370 -585 306 689 -47 -320 -447 264 495 286 -431 -115 582 187 -511 -173 259 543
6563 543 481 -142 -706 335 364 23 -859 2 331 226 -69 -533 -84 213 229 -539 -486 396 578 -280 -345
6584 -345 -173 -111 353 -108 -683 -110 573 230 -690 -422 107 69 -186 -421 -666 154 592 -452 -715 -76
6604 -76 436 -118 -320 -49 -151 354 236 -531 -579 495 323 -423 -303 29 242 160 299 -555 34 353 171
6625 171 -463 -391 237 419 -324 -344 -198 329 275 -188 -275 -55 676 -28 -316 -125 96 38 238 -332 -367 414
6647 414 653 -276 -604 -95 564 -76 -105 -368 -302 785 408 -264 -151 522 518 -175 -188 -64 359 237 253 -391
6669 -391 137 636 243 -522 55 422 126 -44 -20 155 274 758 0 -519 299 565 152 -189 -34 82
6689 82 371 29 -94 -296 469 433 -180 -311 205 267 -182 -332 -398 30 407 18 -668 -420 541 388 47
6710 47 -238 -2 122 277 -491 -655 135 314 -234 -346 -147 562 88 111 -188 -203 487 101 -185 -477 162
6731 162 440 88 -325 -100 32 551 306 -374 -437 298 478 -442 -221 -17 374 134 -147 -367 130 576
6751 576 -225 -526 -160 432 221 -184 -219 -439 249 432 -166 -504 331 567 -261 -498 -146 431 209 93
6771 93 -496 -350 666 205 -667 -356 182 253 66 -50 -280 -2 284 108 -711 -219 404 525 -218 -511
6791 -511 101 353 324 -13 -368 251 832 -24 -313 -39 255 480 -169 -392 -302 153 199 -208 -431 115 365
6812 365 -200 -339 -87 276 387 -44 -426 -22 564 82 -132 -319 167 302 -76 -314 -154 152 686 -23
6832 -23 -689 163 183 -62 -182 -280 -99 -167 432 -451 -647 279 354 -218 -444 -447 91 463 -191 -486 -311 347
6854 347 207 -433 -258 156 111 97 -96 -214 63 408 -131 -634 56 581 -175 -102 -297 -102 142 -46 -62
6875 -62 -283 348 616 -72 -513 23 242 -17 -552 -181 -161 -28 411 -213 -398 324 311 -139 -397 271 189
6896 189 253 -89 -215 155 576 216 -399 -25 -20 422 108 -120 -145 -29 344 248 -292 453 353 -126 -71 -171
6918 -171 77 -22 257 -398 -357 162 732 -290 -576 15 168 155 -70 -44 -192 520 327 -225 -184 537 313
6939 313 -368 -458 160 -47 79 119 -342 370 555 325 -143 -239 262 169 -11 -199 -294 353 458 -151 -370 86
6961 86 441 119 -339 -97 -79 367 43 -311 -471 628 249 -458 -173 88 146 101 -93 -661 -54 741 159
6982 159 -469 -175 284 298 -115 -193 -357 -142 513 -203 -429 -174 184 -50 -590 -9 237 291 55 -530 -145
7003 -145 210 410 -148 -379 179 368 -307 6 -223 -135 138 -249 -383 -25 368 463 -439 -276 -32 79 -2
7024 -2 -259 -517 154 772 298 -299 -265 200 137 -28 -125 -24 243 233 -261 -590 118 230 -263 -39 62 -39
7046 -39 120 401 -297 -170 302 310 130 -113 261 567 11 64 -513 160 389 189 -464 -61 299 210 -18 -245
7068 -245 136 411 632 -38 -255 253 491 -28 -301 -214 362 9 256 -64 -326 407 -139 -202 -268 134 87
7089 87 -161 -356 -120 -45 -26 -200 -621 -170 422 121 -158 -404 -93 -75 -24 -77 -77 486 606 -372 -287 8 116
7112 116 90 -192 -184 -320 434 217 -142 -500 217 361 23 -379 188 65 -142 -60 -483 -31 488 60 -392
7133 -392 -730 268 379 -167 -148 -361 125 -76 -518 -830 7 342 -66 -168 -60 -349 112 -51 -184 -570
7153 -570 490 237 -154 -575 -162 348 10 -245 -237 -148 668 185 -246 -161 358 293 111 -266 -498 195 265 -99
7175 -99 -232 -163 464 136 -379 -201 11 -85 -52 -380 -170 246 319 -19 -446 -112 442 49 -199 -280 -239 288
7197 288 92 -114 46 239 149 -108 -199 183 151 237 -37 -378 -66 379 376 -123 -248 314 301 119 -125 -70 343
7220 343 174 -170 -330 -112 329 -70 -161 -333 90 262 -6 -494 -385 -69 482 -180 -411 145 375 -54
7240 -54 -447 -320 -183 336 100 -479 -404 149 43 -147 -385 -252 168 383 102 -240 -293 204 -3 -666 -350
7261 -350 114 77 -88 -215 -248 34 417 56 -282 -192 428 64 83 -19 -272 219 174 -226 -356 7 276 -143
7283 -143 -295 156 79 277 -172 -367 -138 325 231 -470 -266 351 123 56 -63 -187 506 196 93 49 -67
7304 -67 437 106 -283 -443 27 -148 209 -174 -114 67 245 -140 -316 200 256 220 -349 -37 148 260 204 -505
7326 -505 -78 198 120 -247 -27 87 79 249 20 -195 -116 344 -162 4 -131 -287 41 221 -76 -77 72 -17
7348 -17 -123 -661 103 292 -14 17 120 330 -47 -188 33 -364 278 784 42 -467 79 394 -212 49 -639
7369 -639 -98 530 -370 -426 -204 18 408 -261 -44 -87 12 513 -304 -385 -265 325 -29 -307 -55 199 190 -234
7391 -234 -308 -276 52 -106 -526 -256 -167 332 17 28 -109 284 619 79 -389 -395 306 124 -418 -576 67 630
7413 630 220 -75 -336 -24 514 183 -253 114 426 345 188 26 -208 330 328 -290 -481 -6 514 83 -368
7434 -368 -41 120 483 289 -254 111 203 133 -367 -236 439 226 23 -89 -444 203 570 328 -587 38 360
7455 360 -9 -208 -390 -55 290 435 -170 -367 215 498 72 -445 73 182 79 -59 -225 -341 344 244
7475 244 -342 -166 -89 421 182 74 -358 -3 104 109 -273 -459 177 -25 -237 -623 -119 52 57 -122 -467 -130
7497 -130 137 113 -464 -313 206 -115 -497 -193 56 -72 285 -494 -150 119 118 -297 -233 -267 67 41 183 -563
7519 -563 -228 247 436 -201 -189 -65 -58 177 -192 -190 122 196 57 -183 -16 235 141 -43 -196 -7 47 373 -458
7542 -458 -142 19 319 -52 -517 198 330 -188 -112 -185 -46 298 386 -339 -133 296 600 -276 -300 156 169 366
7564 366 -59 -318 297 382 -57 -155 -294 269 59 93 -277 -163 306 156 -128 -346 69 149 277 163 -23
7585 -23 121 307 297 -243 22 174 487 -119 -298 -129 99 268 -225 -51 -74 70 324 -210 -243 240 -258
7606 -258 89 -171 55 154 294 -56 -447 -157 568 -23 -409 -640 189 270 -161 -242 -271 245 256 -187 -248 -365
7628 -365 330 -97 -266 -106 -74 84 227 -326 -257 90 346 -126 -353 -15 393 437 3 -421 -144 442 187
7649 187 -515 -297 121 18 -16 -279 -136 97 541 12 -474 50 294 -56 -58 -180 -184 240 110 -337 -236 227
7671 227 480 -84 -283 88 240 -29 12 -114 -345 454 157 -625 -197 427 -23 -214 33 110 228 422 -155
7692 -155 -243 -100 661 261 -82 2 119 385 73 -218 -335 68 402 -132 -320 258 333 245 -239 -11 94
7713 94 330 34 -330 -77 258 621 -172 -233 65 128 130 -197 -245 -246 318 233 -235 -278 191 112 -89 -231 -27 314
$$ [...]
8191f9
##END NTUPLES=NMR FID
##END=
