##TITLE=1H_EC-3265(1-11)
 CDcL3
 8 sc, 
 13.12.2021
##JCAMPDX= 6.0         $$ Bruker NMR JCAMP-DX V2.0
##DATA TYPE= NMR SPECTRUM
##DATA CLASS= NTUPLES
##ORIGIN= UXNMR, Bruker Analytische Messtechnik GmbH
##OWNER= root
$$ XWIN-NMR		Version 3.5
$$ Mon Dec 13 10:37:39 2021 Russian Standard Time (UT+4h)  she@DPX200
##.OBSERVE FREQUENCY= 200.131346
##.OBSERVE NUCLEUS= ^1H
##.ACQUISITION MODE= SIMULTANEOUS
##.ACQUISITION SCHEME= undefined
##.AVERAGES= 8
##.DIGITISER RES= 18
##SPECTROMETER/DATA SYSTEM= spect
##.PULSE SEQUENCE= zg30
##.SOLVENT NAME= CDCl3
##.SHIFT REFERENCE= (INTERNAL, CDCl3, 0, 15.7193)
##AUDIT TRAIL= $$ (NUMBER, WHEN, WHO, WHERE, WHAT)
$$ ##TITLE= Audit trail, XWIN-NMR		Version 3.5
$$ ##JCAMPDX= 5.01
$$ ##ORIGIN= Bruker BioSpin GmbH
$$ ##OWNER= she
$$ F:/spectra/data/she/nmr/H-F/1/pdata/1/auditp.txt
$$ ##AUDIT TRAIL=  $$ (NUMBER, WHEN, WHO, WHERE, WHAT)
(   1,<2021-12-13 10:36:09.18 +0400>,<she>,<DPX200>,
      <created by zg, POWCHK disabled, PULCHK disabled
       configuration hash MD5:
       00 E9 B6 7A A2 85 ED C7 34 08 36 98 17 FE 4E 26
       data hash MD5: 16K
       0A 88 BE A8 38 0D CE 7D 31 D2 F8 D0 BC D2 4A 71>)
(   2,<2021-12-13 10:36:11.71 +0400>,<she>,<DPX200>,
      <Start of raw data processing
       efp BC_mod = 2 LB = 0.24 FT_mod = 6 PKNL = 1 PHC0 = -15877.59 PHC1 = 18.6008 SI = 16K 
       data hash MD5: 16K
       D0 E2 53 D5 F2 B7 79 FF F3 83 2D 28 CB B6 58 37>)
(   3,<2021-12-13 10:36:30.07 +0400>,<she>,<DPX200>,
      <pk PHC0 = 6.804712 PHC1 = -7.4 
       data hash MD5: 16K
       01 AE 7B 4B 2A 2A 5E 71 83 52 C8 E5 11 A2 BB C7>)
(   4,<2021-12-13 10:36:33.37 +0400>,<she>,<DPX200>,
      <abs ABSG = 5 
       data hash MD5: 16K
       21 E4 5F 18 CA BB 09 6D 00 34 9C 16 B9 1A 03 BD>)
$$ ##END=
$$ 
$$ hash MD5
$$ 5B CD FB FA C4 56 5B 30 D1 70 74 A6 8D C8 05 CA
##$RELAX= 
##$RELAX= 
##$RELAX= 
##$RELAX= 
##$RELAX= 
##$RELAX= 
$$ Bruker specific parameters
$$ --------------------------
##$DU= <F:/spectra>
##$EXPNO= 1
##$NAME= <H-F>
##$PROCNO= 1
##$TYPE= <nmr>
##$USER= <she>
##$AMP= (0..31)
100 100 100 100 100 100 100 100 100 100 100 100 100 100 100 100 100 100 
100 100 100 100 100 100 100 100 100 100 100 100 100 100 
##$AQSEQ= 0
##$AQ_mod= 1
##$AUNM= <au_zg>
##$AUTOPOS= <>
##$BF1= 200.13
##$BF2= 200.13
##$BF3= 200.13
##$BF4= 200.13
##$BF5= 200.13
##$BF6= 200.13
##$BF7= 200.13
##$BF8= 200.13
##$BYTORDA= 1
##$CFDGTYP= 0
##$CFRGTYP= 5
##$CHEMSTR= <none>
##$CNST= (0..31)
1 1 145 1 1 1 1 1 1 1 1 1 1 1 1 1 1 1 1 1 1 1 1 1 1 1 1 1 1 1 1 1 
##$CPDPRG= <>
##$CPDPRG1= <>
##$CPDPRG2= <>
##$CPDPRG3= <>
##$CPDPRG4= <mlev>
##$CPDPRG5= <mlev>
##$CPDPRG6= <mlev>
##$CPDPRG7= <mlev>
##$CPDPRG8= <mlev>
##$CPDPRGB= <>
##$CPDPRGT= <>
##$D= (0..31)
0 1.2 0 0 0 0 0 0 0 0.06 0 0.03 0 0 0 0 0.0002 0 0 0 0 0 0 0 0 0 0 0 0 
0 0 0 
##$DATE= 1639377368
##$DBL= (0..7)
120 120 120 120 120 120 120 120 
##$DBP= (0..7)
150 150 150 150 150 150 150 150 
##$DBP07= 0
##$DBPNAM0= <>
##$DBPNAM1= <>
##$DBPNAM2= <>
##$DBPNAM3= <>
##$DBPNAM4= <>
$$ [...]
##$SUBNAM2= <"">
##$SUBNAM3= <"">
##$SUBNAM4= <"">
##$SUBNAM5= <"">
##$SUBNAM6= <"">
##$SUBNAM7= <"">
##$SUBNAM8= <"">
##$SUBNAM9= <"">
##$SW= 18.0517287032376
##$SWIBOX= (0..15)
0 0 2 0 0 0 0 0 0 0 0 0 0 0 0 0 
##$SW_h= 3612.71676300578
##$TD= 16384
##$TD0= 1
##$TE= 0
##$TE2= 300
##$TE3= 300
##$TEG= 300
##$TL= (0..7)
0 120 120 120 120 120 120 120 
##$TP= (0..7)
150 150 150 150 150 150 150 150 
##$TP07= 0
##$TPNAME0= <>
##$TPNAME1= <>
##$TPNAME2= <>
##$TPNAME3= <>
##$TPNAME4= <>
##$TPNAME5= <>
##$TPNAME6= <>
##$TPNAME7= <>
##$TPOAL= (0..7)
0.5 0.5 0.5 0.5 0.5 0.5 0.5 0.5 
##$TPOFFS= (0..7)
0 0 0 0 0 0 0 0 
##$TUNHIN= 0
##$TUNHOUT= 0
##$TUNXOUT= 0
##$USERA1= <user>
##$USERA2= <user>
##$USERA3= <user>
##$USERA4= <user>
##$USERA5= <user>
##$V9= 5
##$VALIST= <valist>
##$VCLIST= <CCCCCCCCCCCCCCC>
##$VD= 0
##$VDLIST= <DDDDDDDDDDDDDDD>
##$VPLIST= <PPPPPPPPPPPPPPP>
##$VTLIST= <TTTTTTTTTTTTTTT>
##$WBST= 1024
##$WBSW= 4
##$XGAIN= (0..3)
0 0 0 0 
##$XL= 0
##$YL= 0
##$YMAX_a= 180272
##$YMIN_a= -292873
##$ZGOPTNS= <>
##$ZL1= 120
##$ZL2= 120
##$ZL3= 120
##$ZL4= 120
##$ABSF1= 15.71163
##$ABSF2= -2.340219
##$ABSG= 5
##$ABSL= 3
##$ALPHA= 0
##$AQORDER= 0
##$ASSFAC= 0
##$ASSFACI= 0
##$ASSFACX= 0
##$ASSWID= 0
##$AUNMP= <proc_1d>
##$AZFE= 0.1
##$AZFW= 0.1
##$BCFW= 0
##$BC_mod= 2
##$BYTORDP= 0
##$COROFFS= 0
##$CY= -3
##$DATMOD= 1
##$DC= 0
##$DFILT= <>
##$DTYPP= 0
##$F1P= 0
##$F2P= 0
##$FCOR= 1
##$FTSIZE= 16384
##$FT_mod= 6
##$GAMMA= 0
##$GB= 0
##$INTBC= 1
##$INTSCL= 0
##$ISEN= 128
##$LB= 0.24
##$LEV0= 0
##$LPBIN= 0
##$MAXI= 10000
##$MC2= 0
##$MEAN= 0
##$ME_mod= 0
##$MI= 1.114404
##$NCOEF= 0
##$NC_proc= -7
##$NLEV= 6
##$NOISF1= 3.799351
##$NOISF2= 2.8
##$NSP= 0
##$NTH_PI= 0
##$NZP= 0
##$OFFSET= 15.71934
##$PC= 1
##$PHC0= -15870.79
##$PHC1= 11.2008
##$PH_mod= 1
##$PKNL= yes
##$PPARMOD= 0
##$PSCAL= 0
##$PSIGN= 0
##$REVERSE= no
##$SF= 200.130006446371
##$SI= 16384
##$SIGF1= 3
##$SIGF2= 2
##$SINO= 5.538805
##$SIOLD= 16384
##$SREGLST= <1H.CDCl3>
##$SSB= 0
##$STSI= 16384
##$STSR= 0
##$SW_p= 3612.71676300578
##$SYMM= 0
##$S_DEV= 0
##$TDeff= 16384
##$TDoff= 0
##$TI= <>
##$TILT= no
##$TM1= 0
##$TM2= 0
##$TOPLEV= 0
##$USERP1= <user>
##$USERP2= <user>
##$USERP3= <user>
##$USERP4= <user>
##$USERP5= <user>
##$WDW= 1
##$XDIM= 16384
##$YMAX_p= 388832300
##$YMIN_p= -2404010
$$ End of Bruker specific parameters
$$ ---------------------------------
##NTUPLES= NMR SPECTRUM
##VAR_NAME=  FREQUENCY,     SPECTRUM/REAL,   SPECTRUM/IMAG
##SYMBOL=    X,             R,               I
##VAR_TYPE=  INDEPENDENT,   DEPENDENT,       DEPENDENT
##VAR_FORM=  AFFN,          ASDF,            ASDF
##VAR_DIM=   16384,         16384,           16384
##UNITS=     HZ,            ARBITRARY UNITS, ARBITRARY UNITS
##FACTOR=    0.220516191357247, 1,           1
##FIRST=     3145.91168045524, 0,            0
##LAST=      -466.805082550537, 0,           0
##MIN=       -466.805082550537, -2404010,    0
##MAX=       3145.91168045524, 388832300,    0
$$ Real data points
##PAGE= N=1
##DATA TABLE= (X++(R..R)), XYDATA
$$ [...]
9302 15856607 16884473 17965813 18979430 20492053 21843867 23156910 23842710 23835610 23843383
9293 23843383 24314109 25254214 25840446 25645898 24381862 22725753 20864976 19219331 17832414
9284 17832414 16981101 16415870 15867022 15451723 14732714 14165309 13482661 13131159 12789276
9275 12789276 12589102 12513362 12739784 13029523 13742307 14388427 15189952 16001419 16889475 18098255
9265 18098255 19130857 20417657 21514334 22390969 23093245 24116746 25251842 26636257
9257 26636257 27690704 27842672 27871265 27262886 26610407 25713269 24023750 21587627 19225897
9248 19225897 17242192 15689074 14849221 14099056 13490563 13158945 13045155 13038202 13051609 12953353
9238 12953353 12693039 12184101 11793744 11644740 11416596 11317697 11139805 10696911 10032034 9576501
9228 9576501 9226360 8696286 8499735 8257029 8030091 8077122 7944616 7847947 7544245 7404381
9218 7404381 7264401 6991240 7114934 7265630 7322908 7471359 7555060 7706493 7828754 8133859
9208 8133859 8496560 8706802 9078455 9222839 9451145 9751226 9845550 10112087 10199382 10136361
9198 10136361 10280522 10120711 10143555 10082162 9768077 9233238 8631629 8138500 7741912 7298129
9188 7298129 7132221 6840686 6690583 6511516 6312684 6152193 5973726 5884834 5679702 5483591
9178 5483591 5534297 5465431 5456669 5481873 5398275 5229025 5193237 5249375 5296849 5318351 5393626
9167 5393626 5258472 5217619 5288114 5236214 5312014 5405831 5431249 5449101 5675521 5622653 5624868
9156 5624868 5698869 5705491 5764177 5773466 5775711 5827889 5753143 5868925 6215018 6302742 6359967 6573381
9144 6573381 6600402 6531982 6551278 6868558 7004833 6956810 7151756 7571610 7667363 7704349 7679175
9133 7679175 8127699 8522800 8787207 9072612 9232616 9555809 9647655 9955455 10287775 10837839
9123 10837839 11231238 11681791 12094541 12509617 13168867 13777582 14574833 15132208 15790956
9114 15790956 16298922 16832413 17675659 18615235 19532483 20375677 21650196 22787599 23754043
9105 23754043 25022595 26390589 28090524 29965238 31933356 34037107 36536043 39345788
9097 39345788 42371656 45997467 49563401 52823475 56400153 60666741 65467507 69187787
9089 69187787 70381265 70787796 72010756 73963490 77104701 79704172 79087149 75657520
9081 75657520 70031218 63840666 58541452 54531200 52236827 51208454 50635987 49936604
9073 49936604 48522796 47038275 45901800 45348040 45510706 45889793 46934741 48210382 49947765
9064 49947765 52128197 54974866 58363669 61733572 65690537 70185063 74449753 78490010
9056 78490010 81934990 84468442 86625922 89553689 93393455 98172269 100657766 100618579
9048 100618579 99868951 98064597 94862268 89781872 81461879 71424757 62232802 54498387
9040 54498387 48745718 44244854 40954961 38658628 36981854 35453081 34074312 32592774
9032 32592774 30710756 29070580 28003417 26927007 26042784 25311959 24756695 24250138 23827074
9023 23827074 23420208 23338578 23098921 22829691 22755768 22774110 22792682 23003673 23231938 23541408
9013 23541408 23824388 24292858 24652189 24789797 24562625 24168665 23849437 23695762 23610155 23858919
9003 23858919 24112922 24360776 24557430 24204259 23461610 23003994 22674789 21897369 21277487
8994 21277487 20832679 20843813 20706580 20760717 20879045 21138765 21451905 21653162 22144386 22633403
8984 22633403 23257727 24192996 25471552 26951714 28358434 29816518 31365881 32727246
8976 32727246 33867494 35379061 36768437 37752389 38780369 39204460 39703019 40650065 41404681
8967 41404681 42300641 42764009 42935794 42845876 42100366 41034377 39303950 37598932 36338944
8958 36338944 35476215 35100431 34347515 33765228 33369419 33107363 33091850 32972090 32308819 31184847
8948 31184847 29818472 28312894 27082049 26260002 25788049 25811388 25756935 25688353 25901629
8939 25901629 26134775 26377504 26504980 26480009 26957355 27404095 28143014 29129027 30165703
8930 30165703 31042241 31744248 32733644 33847798 35228342 36933712 38791185 40450718 41854397
8921 41854397 42902751 43413761 42833532 41376980 39209250 37075116 35259454 33789952
8913 33789952 32759881 32376894 32010545 31452370 31011763 30893189 30762246 30575400 30631189
8904 30631189 30666098 30697962 30974759 31416628 31970127 32851898 33937803 35083285 36103253
8895 36103253 37498477 38952957 40506422 41653799 42575335 43581113 44848403 46852955
8887 46852955 49146957 51523537 53380795 55080960 56853218 58991054 61433186 64103137
8879 64103137 66808756 69870695 73163138 76759095 80167265 83027917 84609076 85713980
8871 85713980 86496759 86414662 84675369 81667432 78185420 74356925 71194880 68726741 67085771
8862 67085771 66328491 65901473 64855345 63858817 62948412 62443522 62793733 64038299 65584592
8853 65584592 67804188 70788371 73957716 77170842 80749566 84827830 89050126 93895334
8845 93895334 99201429 105338442 112178754 118898175 125126680 130753568 134792679 137186206
8837 137186206 137207662 133800498 127926828 119992571 111773350 104671304 99053328 94258531
8829 94258531 88880362 83057684 77159352 72011873 67816448 64235496 61593892 59410291
8821 59410291 57875094 56674762 56026838 55824141 56088794 56896726 57862577 59513061 61438306
8812 61438306 63472908 65723110 68252588 70745521 73164145 75154747 76605927 78197023
8804 78197023 79930391 81531962 82192721 82238483 80082617 76023929 70757554 64426278 58325214
8795 58325214 52764695 48163094 44571141 41751717 39480875 37529682 35748328 33823500
8787 33823500 31976670 30278801 28815572 27422154 26224557 25331510 24410482 23792885 23059713
8778 23059713 22361706 21632815 20928035 20415413 19934967 19567737 19232270 18993853 18777105
8769 18777105 18304891 17879124 17486724 17179166 17055162 16739968 16678625 16543489 16199674 16085613
8759 16085613 15821145 15784252 15809284 15781221 15695304 15683368 15780091 15916466 15969091 16034081 16167855
8748 16167855 16413337 16616888 16913416 17167517 17457940 17737147 18013229 18293264 18610444
8739 18610444 18896525 19339210 19980537 20591320 21298369 22076773 22993312 24217528 25523077
8730 25523077 26966971 28415191 30376348 32847812 35515019 38868388 42690062 47161049
8722 47161049 52420850 58522470 65590454 73950780 83994114 95599350 108173893 117905358
8714 117905358 115364525 106340352 96024110 84697693 75577425 68530220 63376390 59378905
8706 59378905 56199430 52694861 49091879 46045126 44014167 42390889 41366464 40601995
8698 40601995 40063262 39776727 39790111 40040142 40451904 40621737 41170908 41649929 42532920 43808867
8688 43808867 44968588 45625495 46233998 47067084 48547948 50687536 53587172 56904925 59237586
8679 59237586 60673991 60212174 58030175 54618198 50381141 46849081 44079228 41892393
8671 41892393 40599514 39694276 38742391 37540191 36170513 35017978 34048740 33674366 33662323
8662 33662323 33538264 33094926 32348755 31369470 30030842 28502455 27537717 26969977 26892738
8653 26892738 27141844 27564095 27869342 27637166 27395096 27142565 27435464 27678213 27736129 26877424
8643 26877424 25731273 24555023 23608510 22958329 21877776 20558200 19469968 18427664
8635 18427664 17619023 17116118 16859593 16451713 15878972 15294947 14737120 14480047 14056453
8626 14056453 13480301 12887991 12300288 11526103 11019362 10548891 9925568 9461287 8994351
8617 8994351 8544104 8303495 7805438 7382503 7156363 7119292 6964601 6600418 6539075 6344039
8607 6344039 6184596 6018386 5852886 5700378 5578980 5432044 5120483 5079242 5052728 4735132
8597 4735132 4526577 4520511 4368820 4372070 4428342 4114785 4077020 4031314 3995502 3737810 3579958
8586 3579958 3558596 3374242 3321852 3327695 3166685 2916412 3090685 3098471 2900507 2834602 2708542
8575 2708542 2645968 2676910 2744365 2616368 2588820 2637687 2735259 2733512 2612438 2362918 2260063
8564 2260063 2193816 2149022 2223801 2248670 2200753 2088955 2136683 2069849 1997929 1986095 1728857
8553 1728857 1617819 1612401 1665828 1815910 1839499 1761865 1584656 1614259 1694355 1680187 1452625
8542 1452625 1526417 1604810 1706489 1631667 1607930 1455795 1344262 1408705 1413395 1570895 1408624
8531 1408624 1303041 1283864 1094823 1269496 1280352 1337389 1211578 1254113 1262260 970959 1178710
8520 1178710 1240662 1124176 1145127 1202108 1270542 1302490 1292299 1346815 1434396 1340459 1251999
8509 1251999 1167230 1233673 1353788 1352557 1371451 1270414 1193017 1129810 1145933 1088089 1080780
8498 1080780 1131903 1081638 1229435 855635 975609 1127557 829052 1055976 969435 684704
8488 684704 576523 559212 721183 1074555 981667 885668 914066 1054618 1123041 1036675 914438
8477 914438 982602 974581 1344759 1233442 1258790 1266263 1307707 1217776 1067581 1139450 960533
8466 960533 884683 861884 813174 807016 874573 919369 908109 1010976 955675 737860 685512
8455 685512 523422 656826 589508 597550 592446 586549 568913 646124 647630 449988 488588 609887
8443 609887 627191 831422 931298 951991 778645 730207 669259 641057 710570 572384 545746
8432 545746 807852 752653 670919 590060 667056 574872 529914 640417 473026 414566 591704
8421 591704 618482 618797 390966 316760 450153 305560 239691 263057 296233 150913 90827
8410 90827 63594 78898 40271 86718 159879 234143 75842 9880 49898 40498 300436 222078
8398 222078 103575 155489 86780 249738 420987 485812 437445 93839 12067 340937 203988
8387 203988 220971 223258 293784 136796 132750 181587 115471 -8060 -65249 104246 200242
8376 200242 190355 233109 54271 -43249 108305 14949 28690 69450 156790 110878 65812
8365 65812 74526 102684 128530 296977 146859 89576 245177 266863 170157 239126 144871
8354 144871 134456 192054 66286 141684 257580 303528 324808 318695 274796 352890 158441
8343 158441 -174590 21182 238809 397365 375526 298422 257127 173431 301579 205974 96172
8332 96172 97567 -39972 29451 124462 193803 366856 275676 190381 213700 300642 318647 409058
8320 409058 441204 416954 206453 209176 272556 230644 181218 109087 30036 120383 342903
8309 342903 347960 231565 94348 115710 219115 452365 355043 192521 204986 190242 154190
8298 154190 137876 261512 27931 45916 57030 92056 172056 145747 69087 103203 362546
8287 362546 93867 -32869 -47301 168914 226853 167509 137628 73948 238442 185518 290949
8276 290949 114636 53534 129606 54878 60014 107581 -152697 -160508 28431 22187 16469 177888
8264 177888 93112 43593 129022 46925 48286 -1437 103448 141651 -25417 -71850 2394
8253 2394 -160647 -205217 -164912 -144552 21903 -73785 36478 19204 -138668 6767 75484
8242 75484 116585 -158913 56330 79680 328523 447932 366798 222042 128667 256074 36204
8231 36204 -91379 -123716 -85128 -17047 -198978 -292547 -163653 10277 37615 46737 22189
8220 22189 -959 -149288 107629 128347 154871 -42643 88511 -37754 79488 95078 174139
8209 174139 49784 -166239 -88987 -210565 -265542 -118815 -78011 -268746 -585088 -701099
8199 -701099 -513178 -401248 -137887 -33539 -104184 -42664 -408920 -2404010 -1123092 -507614
8189 -507614 -449195 -205985 -221329 -265026 -392265 -429124 -218451 -13900 -271223 -26897
8179 -26897 -32705 -32374 72090 -118248 -16917 -7922 121321 248885 98374 93532 -120834
8168 -120834 -110131 -113338 -100969 42946 33027 -178277 -144465 -151730 -312368 -387657 -306494 -156035
8156 -156035 -116131 -202536 -42946 -258802 -172622 -345749 -232418 -264533 -164978 -219483 -70600
8145 -70600 -22130 -125215 6226 -121737 -190845 -10012 -181611 -211109 -56894 71671
8135 71671 151742 164512 -57499 -80016 -98973 -228123 -296500 -333162 -132294 -48101 -95098
8124 -95098 -129889 -5619 69145 176213 32439 -65610 -229630 -235703 -182764 -495015 -467178
8113 -467178 -188080 -61657 108316 19170 -21826 -112304 -105956 -134911 -110357 -358277 -379212
8102 -379212 -194207 -272591 -308081 -205293 -155489 -155539 -49518 191320 -10981 -58564 -127696
8091 -127696 -94629 -108069 -93854 23411 -100039 -217498 -86447 -100857 -112722 -73168 29989
8080 29989 38502 -94461 -162077 -78206 -147285 -229382 -134295 -42625 -88198 -214330 -179903 -311522
8068 -311522 -354069 -237590 -176468 57818 -69720 -162874 -230723 -164294 20405 152483 203626
8057 203626 6901 -7510 11085 -226466 -335346 -174160 -98358 -167711 -328914 -133720
8047 -133720 -61035 -40450 -109907 -143216 -254223 -322348 -208987 -88947 -84883 51021 48128
8036 48128 80008 27955 201262 34147 -170049 -173615 60202 -116669 -266722 -423639 -385361
8025 -385361 -271764 -16054 -24495 -140501 -4143 -117134 584 -141857 -265923 -175716
8015 -175716 -27352 -98685 -105151 -212374 -228057 -190209 -223341 -37041 76842 93337 -129607
8004 -129607 -100898 -83328 -18318 131516 -12861 -134106 -89265 -192210 -220630 -298049 -164205
7993 -164205 -242894 -157118 -69087 -197722 -255277 -144672 48449 -135859 -106573 -137951 -2035
7982 -2035 -240972 -253376 -288494 -170091 -130909 -255229 -179987 -148870 -123464 -164504 -72277
7971 -72277 28657 -21814 1283 -2540 -75833 -80314 -84813 -124263 -99588 -54038 95299 38557
7959 38557 34668 -5666 -275809 -341407 -251725 -364870 -352829 -273787 -220819 -222675 160052 351665
7947 351665 277537 267695 192452 329620 232704 164486 -27722 -27559 -44065 -203208 -173796 -85373
7935 -85373 -291116 -304220 -91268 -188106 -188749 -212625 -85364 -208234 -245100 -224292 -338092
7924 -338092 -363622 -300778 -5906 50067 19733 8392 -168354 -133055 10336 36585 -51373
7913 -51373 -108126 -169474 -112521 -76665 -95547 -139021 -164539 -111918 -114539 -45257 -67268 -64461
7901 -64461 146983 46939 42477 -12544 -97185 -237716 -350271 -149244 54048 162411 38144
7890 38144 -165541 -355327 -440216 -212029 -107986 -67897 -146510 -154938 -74603 -185941 -81903
7879 -81903 -58593 -91100 -233634 -365743 -264843 -53951 -11048 -112239 -423277 -368825 -271507
7868 -271507 -200200 -54402 119185 10809 -50441 -124610 -231524 -227124 -52569 25595 -157187
7857 -157187 -325762 -48986 -150866 -284265 -255617 -243648 -15896 186245 260604 10594
7847 10594 -252428 -310022 -137181 5349 -36610 -123943 -82155 -189096 -214584 -120198 -180815
7836 -180815 -67683 -102522 -217903 -99741 -263129 -371798 -242879 -150251 -275672 -270228
7826 -270228 -128517 -15883 -84226 -112181 -86076 23362 -63262 -72900 -88361 -85247 134815
7815 134815 -119760 -240727 -146913 -307670 -264682 -85699 -120300 56024 230911 159923
7805 159923 -19474 -256134 46462 -37985 -368052 -9832 -41340 -75377 -48916 -166933
7795 -166933 -308713 -136157 138326 160794 94708 15673 -18463 -105890 -101876 -27612 -238122
7784 -238122 -282735 -261610 -165519 -175081 -159342 41314 -321780 -224524 -75127 -265441 -229488
7773 -229488 -250860 -167825 -60180 -82612 -40952 -70372 74187 81876 34364 2549 70136
7762 70136 -118291 -171055 -212018 -179512 -219390 12117 27669 -150980 -5440 43157 108932
7751 108932 -44983 -39774 100994 119205 -105070 -327930 -197928 -277663 -283658 -212138 -267894
7740 -267894 -125741 -80832 -308529 -157997 -123437 -217283 -101982 -190296 -22959 -174466
7730 -174466 -22438 7150 -215131 -187229 -132106 56151 54084 40784 224843 -3334 -11159
7719 -11159 -221 -196845 -168248 -117893 -97335 -250890 -171759 -105395 -318980 -286686 -117676
7708 -117676 62216 112273 -86438 -119325 39989 -32339 -19471 -77339 -134805 -39718 -84528
7697 -84528 -203531 153887 166987 122028 -15183 -260023 -137465 -123723 -80936 -47441 -104904
7686 -104904 -142011 -306540 -144353 -213998 -239204 -246016 -224784 -112406 -119239 -92125 -128264
7675 -128264 -207825 -343501 -172847 -126925 -177506 -210578 52343 57727 -459 120793 237029
7664 237029 -41329 -15479 147462 213253 -49001 -13961 139172 -23380 -145290 -62088
7654 -62088 -74594 -17667 77585 64644 173113 -43924 -133596 11642 -44064 90803 -124979
7643 -124979 -309296 -251441 -291204 -219685 -130131 15014 3066 -179374 -180344 -17019 -61747
7632 -61747 -34868 -181667 -203601 -171992 1557 -107096 37274 97405 -238245 -161091 -146792
7621 -146792 -117373 -119764 -114570 -189562 -266370 -198448 -43694 -124834 -87671 101278 -169812
7610 -169812 -118102 -96735 34236 -159025 -171375 32353 80005 111214 183102 189612 -138346
7599 -138346 -119566 18806 -17482 22464 -39462 -78162 -82160 -271340 16820 197660 123637
7588 123637 110750 86671 -101681 59935 184586 176477 72270 33498 123822 -164817 -266156
7577 -266156 -59975 -145154 -191427 -92664 -182598 -143587 -4255 614 -62199 -284754 -271547
7566 -271547 -279683 -205865 -122799 -34981 -64076 -290083 -291269 -71413 -26094 -72645 41729
7555 41729 -70653 -78258 -87254 -52404 -174622 -328247 -251847 -71653 -142584 -100551 40443
7544 40443 79433 185875 98665 56822 -65553 -120382 -142171 -37280 -72446 1929 35114
7533 35114 29515 -101449 -30831 75918 -88881 -46174 -89984 -124677 14511 48236 -138299
7522 -138299 -133170 -43055 23264 -52233 -64128 -152272 -143772 -82053 84378 47403 118649 -35813
7510 -35813 -94254 -5405 196347 110935 232960 331862 375914 516998 371614 413285 605930
7499 605930 780753 598846 493235 478250 305370 336026 257474 305936 492003 347631
7489 347631 294624 258430 211225 339426 217479 136684 143182 256084 28018 33721 304860
7478 304860 83494 -73264 -156458 -111461 63108 150706 37960 -201911 -141520 64594
7468 64594 154864 197692 -5425 23524 81917 69240 52062 -118100 -137423 -175 15829
7457 15829 120375 146860 217891 264685 173356 107556 356836 217107 244735 290930 228928
7446 228928 174828 -50596 -105674 -43792 97660 63198 146105 222030 24121 41018 179274
7435 179274 185879 -31737 122184 -5251 -106410 -40663 7509 -97288 -65878 59182 64965
7424 64965 40491 -89605 -89356 -204763 48140 28498 35290 -22607 -94228 -32271 -68472 -66200
7412 -66200 -1510 175537 228506 227855 117330 100276 116581 40461 -188951 -2707 -56439
7401 -56439 -151589 -189765 -124017 -85178 -105541 -117597 132411 231659 -46079 -48518 45875 35459
7389 35459 -298273 -205626 -240103 -227897 -108594 -114442 -135301 -23949 -9697 -10939 -56867 -96662
7377 -96662 89130 54997 31934 70321 -100918 -140844 -147071 -87014 193863 280144 126723
7366 126723 191392 -3029 -58765 202438 46494 97302 -132601 -88325 119266 2860
7356 2860 71575 233562 220135 80983 45086 173241 227997 198229 61427 49503 -6855
7345 -6855 -90125 113058 55967 52257 29314 53120 -18165 234816 206783 118696 131745 127842
7333 127842 161069 28811 15567 54125 55222 6764 -50846 365 -3636 75856 56790 167493
7321 167493 120638 124371 64364 -351 14318 -51257 87073 176365 -70869 47856 116457
7310 116457 73737 334093 133890 61888 79406 93432 81188 124506 -17937 11298 96329
7299 96329 232592 507081 322309 287426 456011 608553 489587 408358 98808 121663
7289 121663 173168 144104 140767 120084 5890 224481 378689 155390 96249 178559 239060
7278 239060 81405 107516 59672 162357 291395 271006 161579 171816 138297 130765 234855
7267 234855 132855 48162 112458 186245 247980 216966 258359 334475 430297 215188 47462
7256 47462 87511 169061 321688 209460 77740 253439 121418 254753 395567 450310
7246 450310 439424 481603 539627 507390 489417 584041 560266 506907 324796 485534 350458
7235 350458 220880 421924 575393 577110 660751 729831 655174 502890 531865 531737 760724
7224 760724 568628 582014 488230 448474 548071 386004 489703 686226 679469 500725 685708
7213 685708 666225 804628 606699 571489 678369 866446 830594 712284 671712 716100 893686
7202 893686 950614 710247 956730 1165646 1123227 980657 1006969 1058550 887320 1010900
7192 1010900 956782 1037101 1334218 1237875 1193751 941939 1064216 1121684 1191548 1367164 1534716
7181 1534716 1591347 1518752 1529363 1663861 1853733 1936800 1928456 1978217 2150073 2203385 2449345
7170 2449345 2692170 2545011 2509139 2629310 2769455 2685151 2568619 2600477 2660064 3061068
7160 3061068 3030438 2990042 3398556 3687824 3628712 3629153 3836227 4009711 4124864 4215850 4362047
7149 4362047 4450371 4426288 4589623 4690341 4802315 4886177 5115071 5065922 5300137 5541266
7139 5541266 5747126 5887545 6109053 6438649 6791208 6974235 7053862 7298918 7877541 8315915
7129 8315915 8555455 9078111 9488200 9891229 10530679 11207239 11876747 12598527 13529515 14576749
7119 14576749 15599352 16808736 18421256 20064037 22249628 24707917 27591644 30843160
7111 30843160 34525650 39126938 44258272 50143434 57161537 65756832 75855884 87260125
7103 87260125 98695275 108030090 111736383 109083457 100187081 88157281 75366070 64116547
7095 64116547 55212009 48328676 42984647 38795834 34823889 31159980 27819447 25028860
7087 25028860 22703419 20675850 18846991 17444504 16334111 15317537 14314385 13381479
7079 13381479 12619750 11921334 11514517 11188424 10851774 10230656 9716248 9311980 8941838
7070 8941838 8924456 8703480 8485886 8285788 7800294 7533952 7147045 6863220 6538917 6253212
7060 6253212 5990779 5888391 5630971 5380881 5113284 5089936 4738322 4739355 4619706 4280086
7050 4280086 4194682 4141054 4087460 4131587 4130537 4060574 3998156 3989630 3949414 4050019 4161023
7039 4161023 4228210 4107552 4135966 3941858 3474457 3292770 3043932 2933220 2909168 2899316
7029 2899316 2688827 2203090 2245079 2303958 2246676 2246698 2242550 2191464 2022170 1794638 1972934
7018 1972934 2084424 1921700 1717313 1744846 1792877 1671643 1691789 1665526 1656489 1645925 1587903
7007 1587903 1549452 1480978 1333292 1512988 1298321 1259881 1326279 1352739 1296004 1097149 1144114
6996 1144114 1032299 966534 1042940 956363 1003176 1055083 1040829 977470 952923 936688 829327
6985 829327 1038771 816220 811198 892359 731259 723317 898552 896701 829818 897931 933183
6974 933183 732993 597522 608654 559825 716772 745061 610621 618715 709354 442609 420278
6963 420278 455494 385749 354974 537977 593480 626046 602797 555020 598506 551505 404438
6952 404438 584485 630185 541739 377502 404141 355712 312888 478446 575254 615983 482027
6941 482027 283470 315044 288547 379439 490883 382720 327749 189075 334954 452883
6931 452883 391743 235268 224888 454595 578692 435102 345768 371039 217049 -35427
6921 -35427 183883 260692 166813 56257 204208 356863 359974 242146 245260 124999 378384
6910 378384 313301 206172 434410 295218 506591 454111 395660 322886 172088 333185
6900 333185 467145 248991 151223 318782 242916 342496 314692 363930 224204 65892 236248
6889 236248 210029 276133 270071 300298 394696 331456 216680 196281 -93838 100213 -27623
6878 -27623 11767 50375 -28051 48932 53540 114425 282218 206995 38282 12184 -4032 211234
6866 211234 354140 283083 303107 162107 39111 -86298 -26516 150494 194677 120117 97805
6855 97805 177217 53928 239909 205478 10868 114979 150304 201644 172296 146259 173204
6844 173204 154760 179599 186397 115957 277480 167441 6425 84378 158139 80488 15139
6833 15139 -78436 -82308 97913 201683 179428 122180 138461 139079 166197 -11767 3024 116651
6821 116651 213000 141840 172967 167113 152332 290957 148609 -20487 33610 81149 68885
6810 68885 -135467 54645 213412 182011 64497 -78328 60301 244996 249604 298103 113566
6799 113566 235830 8431 -21826 57940 -37056 20724 359756 305023 159755 207396 52072
6788 52072 41259 101458 178449 282262 192545 132237 177376 191439 345723 331794 227971
6777 227971 209379 212318 257886 237491 395034 183227 109214 74424 -42342 168262 6587
6766 6587 142824 186688 87187 146228 98352 34936 89096 45236 150531 313637 151676
6755 151676 198162 137888 204406 202042 86080 -71876 -76690 -175391 -175774 -186754 -162288 -104682
6743 -104682 -146122 226132 407188 342831 157018 136167 -76323 87933 169769 91387 -52864
6732 -52864 -149530 26548 44490 18170 192111 134830 237410 130481 82069 311908 443734
6721 443734 163819 -23608 113112 106069 27468 301994 149882 180239 236081 222084 110662
6710 110662 254242 623427 671961 341402 317429 197233 325055 550642 573031 618530
6700 618530 647516 657553 512248 406023 388523 314632 229161 377744 281828 223872 298469
6689 298469 160625 103171 162043 222545 262155 71055 91231 125741 182374 276626 373923
6678 373923 304199 170503 128662 100132 -26577 314255 346038 228568 151002 209792 106123
6667 106123 146372 126819 222594 178621 165333 276528 109494 101004 184018 131977 104473
6656 104473 130793 2230 26608 260888 208587 131498 149356 202187 382975 133796 -36205
6645 -36205 95226 119103 22094 168619 160994 136873 192844 207830 138771 46196 -21550 107796
6633 107796 159494 95579 -16096 -77644 9004 -194419 129836 309942 160434 4594
6623 4594 121510 309165 154371 -52310 -82875 24013 -86020 -132771 -51079 58151 115147
6612 115147 203999 302863 274649 128100 47285 105513 236051 242232 294350 249298 230910
6601 230910 304462 80954 23622 75301 70269 -208945 -96113 -3997 -57055 4753 -79116
6590 -79116 -14116 -128402 38610 87933 150424 382332 183244 7717 -133058 -163913 -45729
6579 -45729 166757 58115 69924 181839 173378 45632 -153098 -274632 -85468 7657 91556
6568 91556 273881 108419 173022 209885 242099 262117 365229 265326 101186 55944 45743
6557 45743 66689 7962 -68392 -121223 42879 -54806 76886 -67280 60268 152592 173169
6546 173169 235609 186827 229264 60368 277658 151823 302379 65835 59891 -12829 53614
6535 53614 181142 296886 25280 147076 205796 130297 40200 -4011 82925 -19423 132054
6524 132054 304273 137663 62622 106309 -95027 156679 185699 264851 233401 142903 3297
6513 3297 -15770 -67305 -59949 46712 84601 -117518 -83510 -6726 80090 160317 240302 327901
6501 327901 513300 408271 222458 291888 365343 237298 84554 116437 199537 158294 179790
6490 179790 271866 153971 166869 74025 141491 156166 125797 77515 24857 156824 242288
6479 242288 312606 122401 -12627 67314 183917 132023 172977 115733 69931 -35914 -57936
6468 -57936 139395 274604 208523 110022 77994 51847 -11837 -108911 235325 175274 194248
6457 194248 226484 97418 113716 101451 -44897 -25794 157060 200739 324843 322865 221154
6446 221154 -27264 87019 365795 362833 265951 181874 266041 151011 340918 486094 260492
6435 260492 335640 294845 241393 378254 444826 140954 2766 121324 188196 384835 181472
6424 181472 -12284 72922 179802 33550 -16991 -39015 522 222056 307201 388110 327742
6413 327742 146480 293527 205040 -7180 2800 159483 70524 120114 258923 195040 141627
6402 141627 153668 191481 13 -61302 -109955 -113853 18360 148916 121296 210099 246223
6391 246223 396377 261226 157610 253908 389729 361780 393644 508617 227138 251652
6381 251652 418942 376553 408675 391946 394281 411295 620549 680637 731564 537976 567130
6370 567130 661183 787939 755002 696140 818897 662911 635298 409655 307047 358690 359770
6359 359770 397376 341540 333906 416304 287455 366524 446637 476970 279293 391441 432518
6348 432518 643571 596291 500652 564142 500518 548021 433388 678739 790355 771585 729796
6337 729796 784960 657031 615456 594978 523444 605348 578181 673438 779948 702125 738713
6326 738713 752400 632524 748719 825666 837605 857640 679140 663543 817778 835002 828981
6315 828981 767324 677142 745316 817825 809332 613048 665457 873349 812680 1015601 975998
6304 975998 838907 713733 747255 758111 738807 841187 830950 763987 811825 803137 580424
6293 580424 541314 724163 818831 596265 427904 383738 377862 254068 432843 521841 551954
6282 551954 461827 374658 444510 637838 490371 428943 470376 424698 489628 483905 458605
6271 458605 444192 629679 536891 387184 250033 204014 315990 333124 284995 469385 520264
6260 520264 559550 465169 467667 396849 432152 415927 502222 465401 387257 524215 532013 406612
6248 406612 423213 493254 815871 862757 638415 684205 517159 684551 549362 539195 445091
6237 445091 528370 641886 700698 836244 765349 956825 892368 674762 742016 721370 746455
6226 746455 668885 641339 595410 683461 684702 625986 747745 811939 811413 764060 844405 710934
6214 710934 917880 795597 870633 1028777 995323 1013064 825520 952548 948483 1027239 1057917
6203 1057917 1150457 1375084 1312406 1345082 1241409 992771 1110313 1150291 998234 958966
6193 958966 1130197 1117858 1271327 1529994 1496623 1299718 1421147 1373511 1403821 1507628
6183 1507628 1533481 1494308 1538871 1665471 1563123 1414739 1361162 1577631 1765437 1806862
6173 1806862 1753357 1730172 1611516 1715496 1767203 1668034 1775599 1907838 1679657 1632317
6163 1632317 1541263 1687345 1769764 1689193 1757236 1772340 1771009 1705646 1586536 1799134 1923218
6152 1923218 1983669 1875282 1865488 1808955 1786694 1930404 2183103 2148062 2035526 2099180 2070321
6141 2070321 2087877 1997075 1935405 2215889 2253679 2229797 2322112 2245632 2274912 2496667 2531070
6130 2531070 2458979 2500650 2570992 2585460 2609938 2599329 2478529 2678745 2675530 2793761 2888037
6119 2888037 2996880 3199782 3199802 3030664 3328388 3409472 3382380 3480645 3640835 3575542 3756493
6108 3756493 4017379 4022651 3972696 3956438 4325710 4341792 4298815 4617515 4576873 4634769 4855417
6097 4855417 4984335 5020964 5199713 5347599 5407454 5583797 5584326 5794116 5884702 6016942 6170500
6086 6170500 6535476 6941547 7136161 7557220 7985663 8288105 8603635 8966508 9287677 9725801
6076 9725801 10160275 11101125 12093614 12877587 14056436 15356368 16575426 18203332 20195247
6067 20195247 22372726 24691133 27160052 27943560 26540048 24349165 21631167 19691795
6059 19691795 18536754 17591685 17191778 16765616 16810375 16802353 17065954 17493852 17858413 18446377
6049 18446377 19001980 19596168 20633263 21639614 22870396 24554284 26455779 28603403
6041 28603403 31154418 34004443 37233066 41094619 45427666 50653017 57521607 64579913
6033 64579913 71053879 75145365 71999848 64031189 55362210 48763146 44188328 41071401
6025 41071401 39015257 37487681 36580139 36326364 36340014 36711022 37555370 38561742 39807508
6016 39807508 41349198 43204715 45459308 48523292 52253443 56061644 60767001 66110612
6008 66110612 71222357 76097970 80297661 84211611 88561963 94405674 101371947 107268029
6000 107268029 111776061 109695683 101946170 92985467 85407894 80290227 77357390 75972288
5992 75972288 75434911 75912076 76472277 77480035 78632299 80396702 82566753 85505436 89156919
5983 89156919 93775403 98501641 102419984 104032826 102120080 97980044 93066031 89296515
5975 89296515 86761588 84946105 83745757 83240441 83590416 84253043 84407786 84128738 81803810
5966 81803810 77215764 72334836 67993518 64475504 61917540 59875843 58237177 56807918
5958 56807918 55697747 54837750 53954116 53003163 51529301 49472688 46728794 43444741 39800454
5949 39800454 36574160 34104760 32443614 30695879 29382557 28250024 27380100 26816631
5941 26816631 25995206 25067985 24331388 23580450 23142318 22388876 21646563 21073903 20742038
5932 20742038 20339606 19907047 19677373 19596793 19375091 19083819 18864542 18550942 18450026 18313278
5922 18313278 18167451 17899020 17572364 17482441 17238888 17048494 17146680 17001257 16929905 17099493
5912 17099493 17225885 17290468 17360175 17436104 17513710 17724606 17818140 18161178 18342167 18537022
5902 18537022 18982068 19371458 19798817 20069179 20313874 20633806 21061850 21458536 22000304
5893 22000304 22704942 23254694 23961294 24657964 25473269 26388907 27351151 28512018 29500944
5884 29500944 30647702 32302170 34087056 35943093 38410496 41246606 44215064 47425095
5876 47425095 50138165 52282211 53535028 54331371 55075531 55485831 56073935 56959096 58079544
5867 58079544 59325414 60930277 62330129 64012703 65957771 68133190 70449915 72731209
5859 72731209 75015137 77060152 79345844 81721145 83865678 86446901 89365721 92897548
5851 92897548 96645982 99743674 101101796 99811561 96268558 91524656 86662174 82482380
5843 82482380 79123063 76522981 74277873 72189941 70298366 68334848 66394919 65076923
5835 65076923 63700525 62779524 61922808 61338808 60583979 59719020 59242479 58820471 58441993
5826 58441993 58034632 57607372 56914735 55559794 53716282 51059106 47623119 44594459 41679683
5817 41679683 39121463 37180515 35478719 34017868 32463425 31119616 30030802 28707170
5809 28707170 27631114 26592458 25719107 24713603 23837207 22956184 21787258 20690309 19739244
5800 19739244 18802260 18066067 17365483 16828411 16623233 16238422 15930641 15749459 15531628
5791 15531628 15372388 15166748 15033200 15027690 14713739 14555460 14477977 14523549 14777273 14813685
5781 14813685 14617723 14399513 14141520 13602471 13164448 12520802 11953755 11569962 11269292
5772 11269292 10968201 10755542 10627708 10624178 10425787 10238813 10149281 9904141 9701010 9843181
5762 9843181 9866249 9813673 9721670 9702871 9632260 9705185 9901099 9590931 9474883 9464801 9197479
5751 9197479 9000345 8972251 8658143 8247286 7858770 7439820 7251422 6869720 6634094 6685183
5741 6685183 6473929 6105344 5847693 6058630 6026013 5953061 6088333 5843143 5634801 5779802
5731 5779802 5940179 5895742 5900530 5853322 5912048 5868511 5548652 4927827 4773001 4731686 4491016
5720 4491016 4498786 4058256 3991450 3785314 3744722 3747834 3749062 3697095 3580952 3569695 3546569
5709 3546569 3487945 3349318 3416621 3547407 3490220 3570441 3500209 3463885 3777379 3729137 3691173
5698 3691173 3534517 3544200 3571036 3590993 3322513 3066069 2933942 2799188 2605862 2668827
5688 2668827 2872902 2674254 2621309 2555999 2576691 2473163 2322864 2242071 2125266 2372637
5678 2372637 2484833 2425174 2430316 2355157 2212578 2171164 2221407 2083541 1923325 1986275 2112771
5667 2112771 2377261 2133221 2250153 2165689 2388184 2577271 2544062 2614424 2779878 2933526
5657 2933526 2800224 2935877 3025826 2847131 2694347 2708093 2882633 2819061 2863369 2877791
5647 2877791 2754829 3005278 2953382 3019230 2876770 2792294 2885260 2926115 2943964 3040818 2982488
5636 2982488 2947336 2983979 2938051 2946217 2956325 3027078 3136851 2793875 2903253 3404204 3412508
5625 3412508 3412037 3692911 3706612 3636932 3849716 3901781 3898172 3803789 3859954 3865363 3766175 3626463
5613 3626463 3529978 3690009 3663462 3662156 3604958 3461186 3465497 3756775 3456620 3380815 3413227
5602 3413227 3259953 2858090 2766410 2641540 2642932 2894300 2915992 2875199 2773068 2776386 2629154
5591 2629154 2560687 2589543 2452709 2347257 2305131 2398467 2423080 2317936 2172999 2093239 2213780
5580 2213780 2182521 2022905 2025913 2122128 2073920 1845880 1856459 1892131 1776821 1768410 1951447
5569 1951447 1865085 1904809 1941676 1961345 2117725 2277466 2482073 2601463 2698138 2530605
5559 2530605 2507961 2330420 2061263 1864918 1774428 1530440 1807729 1897418 1637036 1601654
5549 1601654 1498011 1485746 1374682 1345316 1525923 1646194 1673222 1604866 1307794 1392150
5539 1392150 1568048 1484508 1383036 1249828 1144281 1268030 1431615 1325649 1452531 1440775
5529 1440775 1276999 1181492 1182752 1134217 1317216 1394167 1340303 1158503 1181685 1266568 1352952
5518 1352952 1378913 1508099 1431413 1562228 1578934 1369176 1478696 1282234 1018765 1115974
5508 1115974 1103587 925830 895055 1078158 1023497 1061600 1112148 1050704 1076846 1012333 979147
5497 979147 931106 1007559 946029 872091 1027788 1142892 974777 1129727 1074832 1032248 887249
5486 887249 975469 1170569 872628 984473 969283 694987 577866 560146 675225 681156 841176
5475 841176 1004845 894926 872429 743031 672735 765169 733080 598203 622893 738211 769734
5464 769734 943662 896780 874853 1032953 960825 1151966 1119771 1104697 1100685 1050291 1081431
5453 1081431 1041310 818570 670131 1049115 935376 863961 860336 897304 1041147 659585
5443 659585 633460 992376 1022499 943669 1005282 972227 1136115 916175 1066159 1359562 1197444
5432 1197444 904041 946601 1091523 1098567 1216142 1411531 1422514 1468887 1420379 1365646 1486884
5421 1486884 1547111 1535845 1321453 1308222 1305882 1293693 1293657 1438712 1510087 1642448 1695968 1715511
5409 1715511 1660126 1857351 2193568 2375284 2031429 2075046 1994330 1892706 2270096 2373576
5399 2373576 2628249 2947455 3263122 3703540 3841221 3966885 3898236 3803734 3636589 3683992
5389 3683992 3686444 3636649 3496319 3723826 3876001 4000336 3873898 3710996 3790315 3892392
5379 3892392 4122940 4316539 4485615 4624461 4657639 4686323 4901601 5084037 5463667 5806827
5369 5806827 6147168 6637916 6683348 6384270 6179503 5850710 5641689 5470686 5311676 5074082
5359 5074082 4819016 4899520 4723909 4683628 4643711 4585706 4564289 4463164 4404829 4600728 4609303
5348 4609303 4538636 4593829 4419656 4396360 4308529 4308433 4298182 4291060 4213827 4125662 3912583 3627316
5336 3627316 3283961 3038866 2778606 2698442 2763858 2617329 2488823 2457786 2345856 2319155
5326 2319155 2365594 2297188 2381212 2403216 2294076 2384579 2201067 2104643 2133020 2145790 2255649
5315 2255649 2372739 2078267 2025877 1932953 1822944 1866774 1632442 1792274 1855584 1710817
5305 1710817 1736092 1693896 1568227 1597582 1867421 1840720 1950960 1691150 1792129 1816297
5295 1816297 2083582 1982463 1673221 1679324 1746343 1838058 1996173 2011597 1973598 2154412 2107191
5284 2107191 2089542 2190779 2129228 2138953 2278140 2333629 2498639 2641866 2733424 2758883 2626191
5273 2626191 2819563 3027601 3212360 3214983 3379269 3335514 3305973 3169517 2974979 3044523
5263 3044523 2910422 3092883 3192243 3352519 3321824 3292104 3241839 3392874 3577729 3877357
5253 3877357 4085071 4061027 4430266 4594894 4599679 4872193 4929320 4775851 4901962 5299367
5243 5299367 5257548 5313346 5684144 5473504 5157736 5111137 4914974 4549380 4469867 4541458
5233 4541458 4697757 4664618 4464390 4663919 4656083 4772866 4855390 5138712 5062998 5240992
5223 5240992 5311163 5348340 5317049 5168505 5126360 4897974 4855724 4756646 4490233 4474388 4433893
5212 4433893 4271282 4025585 3991061 3912120 3788761 3744209 3902625 3820803 3624453 3664141
5202 3664141 3691308 3609936 3669001 3682475 3498633 3530040 3546153 3631349 3485887 3278240 3271128
5191 3271128 3076385 2883450 2894610 3049652 2773402 2687392 2564909 2611992 2585053 2563803
5181 2563803 2378572 2233126 2539005 2401181 2224763 2208071 2196019 2125672 2320593 2291954
5171 2291954 2332150 2406665 2275647 2400958 2360730 2283902 2270553 2263542 2334535 2561186 2509869
5160 2509869 2331652 2366085 2618540 2780419 2676932 2684054 2771942 3069465 3178884 3125997
5150 3125997 3065846 3200459 3258632 3414222 3409917 3320336 2989075 2793062 2679594 2814531
5140 2814531 2731188 2534872 2493454 2562808 2642813 2846621 2949649 2917747 2977064 2950012 2959693
5129 2959693 2858597 2944028 3024847 2990958 3088009 3173773 3090984 3275130 3525042 3579812 3650471
5118 3650471 3928866 4154846 4374155 4314170 4003763 3779609 3563774 3454565 3357731 3389004
5108 3389004 3203666 3172756 3236265 3325384 3605112 3761101 3881959 4084847 4014657 3911761
5098 3911761 3902090 3818766 3619517 3686059 3648311 3531727 3356146 3206487 3328648 3504254
5088 3504254 3565563 3439166 3348361 3263233 3414939 3515389 3492015 3341985 3460407 3859267
5078 3859267 3981931 4345951 4409309 4618924 4881552 5070594 5495808 6030853 6314758 6641225
5068 6641225 7061771 7404516 7758073 8075488 8582969 8942279 9791633 10474558 11452917 12770402
5058 12770402 14092455 15737239 17720244 20091274 22238596 23544606 23073919 20965712
5050 20965712 18215309 15651385 13390165 11777696 10518571 9432097 8543795 7876645
5042 7876645 7520450 7071557 6500074 6448876 6387081 6241894 6097400 5752630 5575081 5591177
5032 5591177 5519254 5505473 5398659 5401059 5475170 5387396 5495692 5715305 5826843 5890547 5887519
5021 5887519 5715563 5350668 4901179 4707292 4358357 4002919 3862018 3827739 3774782 3677316
5011 3677316 3381181 3346722 3315314 3237238 3133877 3271701 3073618 2917751 2870564 3049055
5001 3049055 2944363 2780193 2874853 2971453 2761266 2859418 2975856 3143238 3126917 3007570
4991 3007570 2977065 2937083 3024325 3083123 2861742 2667168 2830183 2928147 3072217 2948412
4981 2948412 2944762 2799921 2657889 2848480 3013012 2931148 3099634 3203512 3232597 3238049 3223149
4970 3223149 3179606 3179653 3223731 3061293 3205734 3072313 3058495 3166108 3149633 3220212 3199284
4959 3199284 3317178 3531776 3546324 3579591 3844239 3799497 3710794 4036798 4126751 4075374 4296305
4948 4296305 4331998 4433537 4499655 4339247 4365817 4278456 4256038 4236194 4037971 4075467 4321147
4937 4321147 4402666 4160391 4126410 4094485 4187237 4245067 4354933 4223430 4276265 4395344 4465588
4926 4465588 4676789 4666104 4790947 4883898 4846362 4906376 5099512 5227563 5335468 5337173 5386286
4915 5386286 5707461 5788048 5873941 6033394 6213719 6442972 6516662 6855949 7265628 7613197
4905 7613197 7975738 8097565 8175708 8477331 8572374 8601345 8712153 8766458 8776071 9200822 9479440
4894 9479440 9674092 9930490 10123627 10540450 10830182 11145458 11506549 11774665 12039716 12498154
4884 12498154 12700915 13189865 13465087 13892876 14368746 14800950 15397567 16119294 16694016
4875 16694016 17205845 17790885 18117864 18589276 19267643 19790323 20739994 21330760 21811797
4866 21811797 22225219 23155033 23863600 24929527 25938953 27119701 28408857 29585733 30898853
4857 30898853 32514897 34110463 35993079 37915407 40135811 42798825 45658096 48802283
4849 48802283 52411617 56853976 62176350 68519555 75835054 84147861 93621419 105139669
4841 105139669 119184658 134681257 150979490 170683413 196469955 227296170 253731650
4834 253731650 278514894 275957152 243637619 202101705 165937283 140490888 122154326
4827 122154326 110189731 101155905 95163328 90642758 87956288 86210497 86459370 87252516
4819 87252516 89480252 91807637 94879855 98484259 103830333 110830997 120225164 130806960
4811 130806960 144362972 160929690 180781759 201794113 227033215 257676028 297283602
4804 297283602 334268855 368368009 378683541 344894102 289543634 233621045 190587301
4797 190587301 158441697 135289770 117833551 104556676 93470946 84916809 77280619
4790 77280619 71347943 66545420 62722537 59597586 57138155 54612231 52489884 50745963
4782 50745963 48784204 46374825 43717650 41220581 39200757 37319077 35766240 34240091
4774 34240091 33146792 31999723 30950786 29890229 28690090 27984177 26804871 25994797
4766 25994797 25073862 24336916 23594309 22513402 21625582 21246578 20718034 20147512 19615449
4757 19615449 19298017 19078417 18604894 18340683 17843624 17778961 17844071 17931439 17788290 18017102
4747 18017102 17765340 17250244 16761011 16224118 15620882 14987415 14320412 13624543 13080874
4738 13080874 12626052 12087636 11611592 11365185 11051359 10946675 10825842 10753853 10546378 10563395
4728 10563395 10256381 9842902 9615806 9326461 9234443 8948168 8845521 8738710 8223553 8096063
4718 8096063 7736558 7721426 7514272 7545092 7608213 7321150 7137806 7047887 6941319 6849922
4708 6849922 6763242 6673117 6343218 6197357 5995244 5833966 5895575 5921433 5853612 5850196 5928126
4697 5928126 5887978 5814584 5807088 5860706 5646232 5622889 5752023 5694543 5611331 5577178 5534270
4686 5534270 5578433 5647119 5636031 5871601 5748321 6047380 6320182 6510499 6843993 7346683
4676 7346683 8016541 8615885 8990515 8807931 8438356 7706448 6918499 6307591 6010222 5350184
4666 5350184 5102631 5009418 4848458 4812283 4826049 4594967 4435464 4501922 4464974 4388210 4214382
4655 4214382 4238745 4196539 4209948 4210586 4091167 4168302 4276980 4207717 4278878 4357754 4289921
4644 4289921 4159558 3920993 4145558 4002238 4072352 4343191 4288108 4327297 4334093 4233923
4634 4233923 4184765 4337519 4434250 4629090 4665507 4951536 5214990 5446529 5515631 5136142
4624 5136142 4926417 4646672 4421679 4238176 3964017 3860383 3853070 3780541 3810202 3815074 3733776
4613 3733776 3690045 3567705 3843291 3952969 4101092 4034985 3938520 3984070 4008426 4068254 4368406
4602 4368406 4439052 4466931 4700544 4958478 5121159 5316976 5500163 5679371 5992097 6325960
4592 6325960 6649192 6735324 6610104 6335029 6063898 5957233 5919205 5628399 5546021 5412759
4582 5412759 5402325 5329928 5348587 5439663 5625616 5838984 5803891 5740441 5622096 5545949 5786778
4571 5786778 5846265 6013304 6098645 6209753 6378003 6186614 6384282 6342674 6744359 6987350
4561 6987350 6858284 6959040 7308474 7543063 7739040 7965875 8039797 8274456 8367540 8597559
4551 8597559 8824673 9013909 9144859 9464548 9853660 10245821 10522242 11129928 11613943 12036661
4541 12036661 12660789 13376183 14197812 15189749 16262535 17179650 18567735 20312225 22212791
4532 22212791 24433686 27138932 30215705 33817362 38147823 43216608 48655594 55006340
4524 55006340 62623574 71565427 81099215 89326368 94115876 91811315 82852908 70688225
4516 70688225 59250704 49695058 42396072 36875260 32563469 29230737 26557580 24396041
4508 24396041 22542664 20808925 19532036 18544281 17782841 17109269 16376854 15719960 15208777
4499 15208777 14926456 14607999 14320851 14126551 13849010 13690136 13670083 13607091 13722611 13717075
4489 13717075 13574661 13792091 14052311 13945864 13888336 13612302 13392748 13038019 12693798 12433402
4479 12433402 12495813 12526854 12714023 12687809 12849058 13012230 13121805 13348187 13681048 14141063
4469 14141063 14553806 15224894 15684439 16289028 16890645 17522919 18143768 18721999 19549177
4460 19549177 20373460 21367362 22524685 23854128 24972694 26063922 27127485 28153214
4452 28153214 29439072 31288836 33593751 36060501 39407697 43335753 48182869 53530703
4444 53530703 59700817 67315396 76282766 85683401 93293455 94951350 88847216 78923506
4436 78923506 68177711 58657049 51189435 45472241 40845667 37118707 33806518 31236317
4428 31236317 29432675 27628050 25895225 24366359 23163699 21567181 19971340 18897321
4420 18897321 17672288 16744615 15794660 15024986 14411863 14010352 13636739 13306141 12867038
4411 12867038 12516316 12035427 11663775 11324556 10927279 10844870 10634650 10296496 9946921 9733745
4401 9733745 9379844 8917136 8806217 8805784 8666636 8315820 8065801 8074197 8170962 8184217 8033844
4390 8033844 7608287 7485057 7288589 7129120 7268761 6898803 6960837 7057386 6957663 6722296
4380 6722296 6728973 6816489 6795884 6623227 6217977 6221203 6195375 6270393 6132900 6255804 6351824
4369 6351824 6215599 6296582 6133121 5923143 6033128 6181153 6161260 6197128 5995693 6053106
4359 6053106 6241631 6359569 6325499 6157407 6174984 6178988 6010152 6094510 5975252 5979257 5977082
4348 5977082 6323345 6409760 6240824 6273944 6206746 6167751 6370997 6596543 6949265 7026527
4338 7026527 7273458 7245401 7264281 7559060 7494384 7648444 7643787 7805436 7849461 8043230 8042121
4327 8042121 8052116 8230938 8338614 8644951 8656718 8688259 8543840 8559457 8557194 8815844 9006892
4316 9006892 9156025 9202788 9299438 9486640 9692993 9811080 10036860 10185262 10504490 10687268
4306 10687268 10767891 10962059 10994797 11293393 11538816 11840097 11930378 12179079 12554423 12834221
4296 12834221 13302597 13635380 13841821 14218604 14638959 15050824 15291956 15781562 16317386
4287 16317386 16807571 17518196 18245548 19023117 19894441 20878939 21872423 22899417 24244665
4278 24244665 25698595 27318250 29225802 31440879 33847534 36886125 40119216 44134065
4270 44134065 48728781 54086208 59999617 66737831 75095777 85208907 95438367 104080247
4262 104080247 105229291 97173581 85031755 72597532 62689429 54995645 49356964 44468015
4254 44468015 40726267 37805725 35524069 33940144 32650917 31680244 30918558 30591107 30381139
4245 30381139 30137208 29993003 29603161 28587163 27406474 26316379 25589476 24881110 24201390
4236 24201390 23979061 23891722 23621595 23588693 23650516 23580387 23758514 23971530 24160568 24527996
4226 24527996 24846340 24883270 25158118 25199117 25165545 25698559 26136495 26455943 26861548 27111702
4216 27111702 27496903 28181995 28672383 29329535 29908595 30428617 31166621 32015065 33039338
4207 33039338 34039617 35424970 36776131 38288682 39771157 41450079 43564811 45657329
4199 45657329 48482517 51562675 54812963 58525700 62919287 67612664 73426877 80003795
4191 80003795 87509691 96354194 106487307 118273865 131306766 146642061 164644479
4184 164644479 185086569 209403732 238397988 274046853 315240405 357203188 385843710
4177 385843710 388832300 362829288 317105999 268709199 227000215 195258602 170833350
4170 170833350 150874131 133739265 119262272 106771410 96543798 88403865 82008814
4163 82008814 76624053 71697482 67204330 63246408 59761468 56586581 53868458 51799427
4155 51799427 50110216 48583846 47028417 45787153 44482495 43545602 42635045 41638457 41239799
4146 41239799 40939847 40786817 40881971 41115776 41182006 40625237 38921050 36683766 34054925
4137 34054925 31582510 29674125 27996273 26701690 25545098 24640926 23852438 23066498 22316606
4128 22316606 22047371 21683319 21354010 21014740 20886364 20645125 19911693 19255135 18769727
4119 18769727 18128522 17629937 17043634 16641045 16518995 16197174 16102335 15780523 15829860 15966794
4109 15966794 16061518 16272400 16479528 16818615 17124220 17348764 17020317 16658229 16442012 16014755
4099 16014755 15520846 14935885 14333683 13961453 13943858 13888816 13755087 13863446 13596105 13384965
4089 13384965 12828654 11949982 11263544 10928818 10567222 10184919 9730709 9364480 9354831 9208996
4079 9208996 9126346 8841383 8823784 8566741 8503126 8551866 8495580 8127945 8286662 8351402 8162610
4068 8162610 8163900 7929330 7727049 7595581 7560312 7522792 7490963 7322949 7284614 7272277 7201891
4057 7201891 7256185 7117620 7043872 7088603 7232510 7405279 7443972 7395188 7346455 7400379 7371283
4046 7371283 7355276 7405048 7400989 7160888 7291084 7359431 7461163 7436874 7301997 7224800 7217300
4035 7217300 7514880 7857248 7822235 8162268 8337888 8320957 8056871 8102966 8245489 8401454
4025 8401454 8144981 8037894 8383248 8428671 8603675 8620459 9060993 9444893 9715611 9822112
4015 9822112 10474797 10999432 11498461 11910148 12280608 12288495 11977581 11454960 11213361 10919875
4005 10919875 10910599 10787583 10607523 10582858 10784037 10925885 10893264 11016421 10979255 11213293
3995 11213293 11367224 11395674 11432961 11682733 12144671 12545422 13058867 13946603 14789535 15505736
3985 15505736 16429732 17607488 18876975 19981456 20466280 20321140 20064013 19740463 19580533
3976 19580533 19739101 20234399 21047999 22045528 23443258 24595081 24410043 23140733 21752636
3967 21752636 20837816 20082115 19365013 18934885 18857862 19179631 19458770 19865496 20270433 21070264
3957 21070264 22311426 23670212 25112721 26306159 27202599 27565865 27820557 28459617 29507403
3948 29507403 31146880 32931547 34056227 33882887 32250804 29984004 27875788 26447946
3940 26447946 25520816 24921777 24727419 25063009 25520823 25878331 26409525 26692187 27057928
3931 27057928 27536825 28141619 28857666 29913813 31046471 31956528 32154860 31721040 30898379
3922 30898379 30465530 30230870 30539063 30813453 31313401 31901660 32671849 33573692 34752468
3913 34752468 35825482 36842590 37894433 38630502 39293426 40105452 41047970 42243157 43581908
3904 43581908 44923932 46804118 48389926 50008695 51676700 52956541 54486771 56484020
3896 56484020 58868634 61462244 64034320 66493277 68948633 71862113 75075198 78714724
3888 78714724 82200516 85465532 88612642 91559652 94213356 96906320 99575098 102949129
3880 102949129 106506512 110987984 116439761 122363518 128481055 134018178 137404191 138065660
3872 138065660 136977124 135363742 134560823 134847446 135991957 137213718 138613136 140008884
3864 140008884 141145221 142550646 144112187 145186082 145597824 144806772 142870109 140614775
3856 140614775 138364062 136480967 134652413 132565984 130938336 130003681 129547742 129315496
3848 129315496 128610357 125966635 121180024 114799789 108144406 102368038 97874597 93985112
3840 93985112 90624411 87617536 84774418 82144990 79434960 76515341 73309336 69995550
3832 69995550 66908273 64066156 61293625 59110052 57093559 55327062 53520320 51888972
3824 51888972 49845477 47759727 46072666 44601592 43373037 42485433 41563530 40415559
3816 40415559 39548601 38684194 37692373 36634259 35628885 34761519 33908488 33350737 32650190
3807 32650190 31773904 30821625 29912672 28885261 28164646 27706379 27430417 27364600 27187994
3798 27187994 26923018 26717191 26682365 26547954 26549888 26302437 26166850 26053093 25974996 25919367
3788 25919367 25856986 25486652 25234858 24605049 24114525 23901869 23759736 23571253 23399650 23360089
3778 23360089 23242713 23336908 23625319 24162571 24526185 24964388 25787813 26555867 27399047 28136071
3768 28136071 29167950 30420855 31718867 33244481 34472782 34946808 34463715 33361979
3760 33361979 31865694 30257251 28732541 27208742 25223062 23607488 22218151 20955403
3752 20955403 20062275 19273879 18881218 18388712 18031018 17821264 17366725 17002379 16886125
3743 16886125 16561080 16402667 16219191 16150526 16019517 15847764 15623612 15500613 15446653 15111609
3733 15111609 14907871 14598411 14298117 14171247 13810438 13452856 13310932 13251557 13142823 12962788
3723 12962788 12944587 12721818 12742781 12682581 12501626 12366435 12279111 12205519 12346146 12270106
3713 12270106 12207332 12131239 12100334 12117730 11921054 11953095 12000537 11905677 11820136 11866375 12136364
3702 12136364 12322733 12309367 12351407 12475216 12428094 12384628 12350524 12360279 12289876 12425740 12453502
3691 12453502 12296889 12184861 12250872 12445483 12313693 12279910 12346532 12301918 12064353 12279038
3681 12279038 12316392 12393850 12481331 12487207 12671073 12904336 13097186 13307936 13354334 13474771
3671 13474771 13577628 13796801 14182996 14442026 14749285 14940269 15028376 15108010 15301788 15421951
3661 15421951 15470121 15436003 15435812 15681186 15749161 15444031 15235284 15176713 15032104 15052864 14915991
3650 14915991 14619582 14813388 14741894 14449268 14250428 14211352 13795614 13578312 13736152 13901769
3640 13901769 14000148 13968024 14121057 14310672 14517518 14465560 14458400 14648515 14474682 14578037
3630 14578037 14749350 14827694 14625704 14468467 14413812 14362985 14116649 13869722 13795160 13430730
3620 13430730 13111341 12833606 12422058 12425734 12177289 11858534 11604701 11266006 11090333 11089044
3610 11089044 11059209 10948243 10836456 10701629 10908919 10990810 10834409 10975661 11239939 11242407
3600 11242407 11124205 11324381 11376679 11144036 11162277 11132219 11005059 11039854 10998633 10951616
3590 10951616 10822780 10549648 10232847 9833383 9649728 9522209 9255666 9033248 9065102 8819342
3580 8819342 8786317 8518601 8629017 8596311 8476518 8176154 8109551 8246055 8379647 8338001
3570 8338001 8571705 8631068 8551551 8671180 8587173 8415111 8487602 8324538 8371778 8145047
3560 8145047 7960000 7699510 7865116 7856318 7647473 7455881 7512960 7732125 7434610 7432238
3550 7432238 7397894 7527545 7279621 7006259 7139420 7146139 6822026 6760499 6906809 6716634
3540 6716634 6675674 6725391 6635500 6614287 6514980 6584248 6490046 6531217 6482644 6706507 6597542
3529 6597542 6476134 6351323 6450157 6678068 6729031 6526496 6520890 6324550 6458400 6522099
3519 6522099 6360797 6552897 6496141 6590777 6481772 6316243 6228826 6285097 6358908 6335877 6399141
3508 6399141 6555333 6381770 6245507 6428814 6676160 6791124 6484409 6502712 6591355 6777807
3498 6777807 6797956 6628902 6724357 6672831 6660380 6874205 6984386 6914271 6720322 6650599 6911027
3487 6911027 7199288 7297674 7309070 7429553 7613716 7460530 7620888 7729276 7856264 7974009
3477 7974009 8173166 8302507 8278394 8414597 8733388 8877490 9149410 9226723 9393577 9360582
3467 9360582 9402980 9739440 10032573 10108344 10377574 10546456 10589956 10622445 11004048 11572863
3457 11572863 11645030 11845130 12292882 12841839 13231581 13648797 14051509 14772079 15558625 16177373
3447 16177373 16936192 17678994 18832765 19642433 21043978 22596388 24396573 26547290 28660378
3438 28660378 31420605 34999801 38596096 42799383 48150952 55187299 62853820 69934283
3430 69934283 74774981 71889402 63501021 53816685 46134502 40669327 36888900 34270265
3422 34270265 32373138 31109668 30228931 29688515 29504799 29535574 29883075 30569105 31148081
3413 31148081 32068729 33472029 35259148 37677060 40640182 44110120 48076106 52683164
3405 52683164 58665197 65473667 72859187 82147227 94659926 109457408 123192167 134151945
3397 134151945 130873765 114988071 95268319 78087251 65654993 56569181 50273307
3390 50273307 45438223 41788997 38908102 36261926 34234487 32720066 31534850 30953817
3382 30953817 30376612 30153794 29973496 30006303 30530650 31586623 32557827 34108214 36083708
3373 36083708 38535659 41301150 44316099 48203798 53579307 60324251 66941927 72390402
3365 72390402 72635080 65846191 56199664 47063368 40155097 34970232 31355158 28628919
3357 28628919 26426673 24496269 23115018 21608406 20509749 19507632 18617879 17989607
3349 17989607 17235825 16568076 16064859 15528117 15137687 14849484 14883020 14623778 14458805 14151993
3339 14151993 13842689 13728191 13697002 13561217 13266452 13062092 12930935 12856421 12785185 12692605
3329 12692605 12616228 12673562 12745028 12651456 12605646 12482027 12364900 12111135 12002992 11912621
3319 11912621 11828092 11756925 11685662 11596058 11551001 11594564 11674230 11543920 11378801 11486751 11481758
3308 11481758 11456861 11703121 11803718 11957709 12046501 12022205 12168154 12255349 12147192 12027344
3298 12027344 12084567 12182009 12462316 12674696 12812945 12939155 12990327 13245176 13275871 13360119
3288 13360119 13550010 13782257 14244335 14356664 14333250 14743135 14980855 14985212 15478447 15774881
3278 15774881 16238648 16409292 16718929 17207726 17913697 18330109 19003632 19974993 20648711
3269 20648711 21353217 22368211 23416874 24467701 25743652 26992029 28313513 29502829
3261 29502829 30776551 32011125 32867612 33742122 34308784 34320732 34076990 33142098 32059885
3252 32059885 30832920 29285907 27723137 26202903 24808200 23688901 22444280 21658526
3244 21658526 20790300 19929788 19278072 18522778 17736940 16964935 16275831 15927834 15339899
3235 15339899 14640019 14363268 13837081 13455401 13085190 12838368 12754216 12731965 12722361 12543705
3225 12543705 12371950 12241046 12145766 12146900 12127171 12206664 12211013 12180714 12117406 12145956 12176927
3214 12176927 12378630 12534737 12886350 12960950 12802630 12395592 12056115 11430506 10621129 10226080
3204 10226080 10067690 9822829 9574749 9441521 9057873 8778325 8762942 8660546 8789548 8869964
3194 8869964 8637922 8481771 8587933 8490355 8384062 8412820 8491628 8479529 8417311 8361169 8175070
3183 8175070 8383019 8530920 8600158 8630373 8677734 8795065 8691653 8565832 8450367 8134796
3173 8134796 7876625 7831873 7632680 7365202 7146878 7084646 7135897 6759036 6568524 6554577
3163 6554577 6571271 6273910 6274280 6379714 6336539 6123483 6081289 6105440 5949646 6016854 5945615
3152 5945615 5915563 5830911 5850475 5918986 5930025 5929264 5652613 5562697 5775149 5792926 5904202
3141 5904202 5819295 5813321 5812580 5848914 5735898 5626756 5397623 5269822 5142854 5126627 5170004
3130 5170004 4972536 4817834 4714888 4725053 4795234 4893314 4714335 4786579 4953307 4957585 5055900
3119 5055900 5034255 4973751 4864249 4835256 4866087 4948728 4871205 4682319 4778644 4720888 4693968
3108 4693968 4605217 4644928 4815833 4904567 4648646 4473892 4258390 4268482 4268430 4016959 4015122
3097 4015122 4013603 3681275 3773784 3726338 3504538 3673456 3655578 3770618 3681289 3638263 3836534
3086 3836534 3861130 3844924 3778854 3719980 3762801 3663824 3615116 3781716 3760079 3635619 3490881
3075 3490881 3701032 3608381 3586004 3575440 3329147 3468310 3466345 3392174 3369487 3232937 3151367
3064 3151367 3132299 3025826 2983668 3081225 2844637 2804323 2849200 2980822 2850624 2731573
3054 2731573 2986881 3018418 2940831 2791566 2779113 2770425 2864980 2992936 2846077 2788159 2904984
3043 2904984 2860140 2900700 2927373 3046781 2884725 2633765 2601420 2706931 2986053 2892455
3033 2892455 3038156 2960273 2903878 3054160 3327414 3290938 3302391 3387318 3392761 3725722 3895068
3022 3895068 4108706 4107201 4117855 4229542 4398844 4381271 4347409 4251271 4379499 4426664 4432538
3011 4432538 4566080 4319759 4135444 4061553 4271968 4333236 4325858 4268660 4156916 3986895
3001 3986895 4207800 4690551 4641514 4786327 4894055 4797053 4827798 5085765 5229443 5423985
2991 5423985 5552240 5589705 5887737 6280631 6358242 6589093 6660589 6674881 6810526 6826516
2981 6826516 7039133 7051670 7029872 7184026 6861260 6763409 6713361 6679593 6630440 6640702 6644219
2970 6644219 6488506 6320894 6342024 6413052 6472114 6317003 6224565 6110495 6225318 6255437
2960 6255437 6302222 6251784 6428769 6581276 6882716 6789106 6796679 6836015 6975347 7239228 7269534
2949 7269534 7186355 7409573 7756709 7859603 8057985 8017981 8039080 7856863 7999993 8090479
2939 8090479 7954529 7932611 7850080 7622517 7629560 7472857 7382131 7464515 7523351 7527372 7641939
2928 7641939 7662156 7620866 7853480 8199612 8366288 8600246 8698090 8812181 8813636 9139531
2918 9139531 9431648 9653719 9612403 9512978 9378039 9145590 8739855 8402643 8201683 7975162
2908 7975162 7694434 7749899 7574876 7233988 7193209 7136072 7221718 7184214 7284466 7487215
2898 7487215 7408383 7441359 7507167 7645118 7638672 7665337 7841256 7918955 7845709 7789645 7623845
2887 7623845 7780901 7850537 7662794 7337868 6885534 6757890 6619641 6392868 6213743 6056971
2877 6056971 5902900 5716436 5774460 5470164 5338855 5631282 5449435 5407771 5374641 5262639
2867 5262639 5110646 5145940 5026846 4877967 4615887 4397458 4439429 4266651 4064134 3769713
2857 3769713 3929120 3934142 3720962 3512091 3603175 3548525 3469666 3398785 3263173 3345112 3167835
2846 3167835 2947838 2928874 2853095 2794522 2639191 2506447 2554642 2482954 2450258 2577099 2609295
2835 2609295 2507377 2659170 2471302 2434355 2324413 2405522 2414645 2474463 2425177 2210977 2340369
2824 2340369 2273754 2292081 2160772 2029871 2051799 1904830 1962322 1999816 1861405 1728278
2814 1728278 1707737 1811673 1835462 1822724 1746700 1833943 1829418 1602827 1758296 1669718 1626719
2803 1626719 1658530 1663589 1473605 1467553 1354901 1499091 1413810 1256340 1263460 1207378 1187920
2792 1187920 1220901 1189750 1392605 1507203 1316084 1126606 1111060 1203209 1238347 1077809
2782 1077809 1251762 1366527 1255599 1057597 908957 906445 1119025 1149586 1036427 986846
2772 986846 769441 688077 514541 574466 930337 1214601 943375 1059066 1037031 917485
2762 917485 748716 771705 810533 754905 739877 807183 647956 498628 512431 561915 599869
2751 599869 571560 445217 434992 650202 721783 557698 557869 711709 685030 838770 774028
2740 774028 617524 805148 777667 689708 657424 567990 575625 549119 753325 879798 600415
2729 600415 579307 664240 615837 504155 466626 594146 571604 428544 625000 592917 621501
2718 621501 623340 467461 446443 632737 531544 643077 601594 522632 477826 327303 548381
2707 548381 606176 428101 466861 696979 492659 411340 458523 505918 427144 489528 596664
2696 596664 730943 729102 633367 556744 454245 399920 228002 343999 510515 493336 586962
2685 586962 386089 222083 342829 308643 445746 672762 621982 527379 546403 663583
2675 663583 657864 504093 621420 665867 666196 773637 742195 805783 757638 851091 612898
2664 612898 671801 763692 744473 759986 852398 743136 541576 671511 769945 802051 890243
2653 890243 761945 598869 422811 475611 785763 709515 829746 750976 911857 880984
2643 880984 955520 994980 898409 882967 1013679 998906 848890 1238250 1325243 1236770 1193536
2632 1193536 1071553 1016617 1125866 1174671 1260617 1562849 1503296 1316689 1151219 1314228
2622 1314228 1338741 1354240 1549985 1514017 1354857 1396587 1415675 1291368 1247331 1332463 1465157
2611 1465157 1417095 1362939 1582445 1622961 1501834 1573611 1499573 1455394 1651474 1755855 1650010
2600 1650010 1714675 1601159 1603609 1538792 1498141 1452715 1451488 1240246 1069886 1220637 1122989
2589 1122989 1144604 1327900 1346864 1335571 1595294 1444124 1279649 1333979 1144553 1066722
2579 1066722 1142507 1248685 1162194 1218708 1301908 1434450 1296070 1292478 1056406 939180 1136476
2568 1136476 1153266 1206667 1337585 1158324 1210490 1259770 975651 997742 1071337 988386 1019719
2557 1019719 949818 804414 842738 929614 743196 569010 570000 483007 442733 537643 594987
2546 594987 743605 881126 768180 750568 503487 337288 535066 687732 758946 624473
2536 624473 603303 831395 717027 632307 661605 455768 204381 362421 445013 563121
2526 563121 366953 390505 388768 327572 325205 256853 233451 260852 134903 125423 252185 369145
2514 369145 558372 525261 371711 450640 456528 219934 84805 322990 94677 150639 222364
2503 222364 274946 113231 -86724 223212 132753 180745 271082 298208 180003 58403 32494
2492 32494 201723 179106 294313 245379 147538 211859 221545 337099 130864 79829 -28446
2481 -28446 1838 -47699 -712 111665 164926 306499 114699 159024 132656 203139 243515
2470 243515 -46241 -33073 47799 91860 224355 159201 258797 80847 -84017 -84839 -9121
2459 -9121 -126502 -47384 7726 -67198 -47200 26947 46051 174714 -34436 -90415 -107328
2448 -107328 101187 106230 -20896 21159 -35963 195421 203570 97015 42674 179684 205741
2437 205741 236278 121508 111935 168949 99024 -45795 7851 114497 137162 -16919 -88315
2426 -88315 -241088 -381405 -148806 -110557 -54894 -58568 -116218 -96215 -24888 -64121 -46896
2415 -46896 84038 53590 -33282 106676 -64020 -62207 153494 181438 199479 121112 213527
2404 213527 331969 214485 -162202 -132820 42313 146308 135395 191202 60863 4925
2394 4925 65779 177257 164192 181701 231545 317098 445773 621246 626748 752878 832706
2383 832706 670724 673747 710519 385621 166252 162496 119937 165158 44431 78320 172598
2372 172598 311805 87882 135007 173378 25316 434 8629 102302 103553 271975 258723
2361 258723 82049 147956 76105 -57420 -12470 173484 278876 189284 161549 176676 113495
2350 113495 148037 184561 363404 410202 143718 406716 369629 265266 385751 211444
2340 211444 215241 59309 166010 43115 93954 156642 61623 166467 108672 27298 70041
2329 70041 -140891 -65188 117392 186083 196904 237139 443450 421653 296748 240316 301440
2318 301440 339717 263753 167864 375864 284089 277806 137540 4078 53313 183549 323510
2307 323510 370539 295694 324759 401634 162174 -14355 94731 142536 233714 170693 -12591
2296 -12591 76278 116507 187120 215752 292715 391952 236832 195346 284389 321161 280070 294447
2284 294447 341894 220725 143559 57769 -65014 218527 137179 304891 218889 314733 489352
2273 489352 397207 464330 444031 482127 486827 285640 3356 203689 451384 390585 304559
2262 304559 249446 369856 469851 310211 262840 222822 410421 613977 653705 648134 527730
2251 527730 498714 499328 384130 532246 531084 424150 350871 298653 228379 293735 375950 549850
2239 549850 570454 525505 583771 497661 612138 548649 438294 452132 469133 485546 554140
2228 554140 543127 548402 634155 522758 564234 653194 758206 650136 582279 613798 706430
2217 706430 753163 806097 766421 523811 615960 666145 852901 843883 536164 772805 946805
2206 946805 968219 1100044 1208537 1186718 1034702 1004164 1200088 1333944 1515593 1548195
2196 1548195 1660352 1671133 1585860 1641484 1865244 1887162 1885706 2009001 1995779 2134636 2153733
2185 2153733 2196994 2390577 2395837 2459065 2544853 2745598 2554060 2442067 2729107 3003277
2175 3003277 2857237 2655130 2834902 3209404 3318744 3281141 3270783 3520885 3553398 3616626
2165 3616626 3796797 4017049 4069691 4028003 4315375 4374083 4516451 4607337 4800952 4967819
2155 4967819 5228509 5148515 5247276 5686667 5871809 6129753 6533202 6755318 7011780 7470003
2145 7470003 7973618 8386493 8767674 9209818 9679909 10385821 11010915 11850737 12813634 13938945
2135 13938945 15103596 16655317 18540297 20493856 21886392 23654292 25674261 28317818
2127 28317818 31449738 35367606 40392036 46370687 53270485 60810381 69986973 82382576
2119 82382576 97968838 114073402 124473543 116003158 98360872 79161012 62572628
2112 62572628 51324436 43013965 36822214 32006442 28545953 25811941 23348898 21566694
2104 21566694 20332019 19214666 18590539 17481379 16076804 14764347 13795843 12696868
2096 12696868 11937814 11082468 10552638 10022189 9686181 9219839 8562208 8265364 8210258 7785345
2086 7785345 7386559 7194987 7050710 6698614 6465478 6322730 6173306 5845486 5451846 4960915
2076 4960915 4857694 4681398 4422571 4317267 4065287 4039001 3942958 3814305 3971341 3760103
2066 3760103 3498999 3176591 3221858 2941305 2967130 2729137 2806797 2597635 2471272 2703911
2056 2703911 2459082 2582511 2486121 2301077 2315664 2390812 2388396 2223681 2205367 2182623 2061961
2045 2061961 2172456 2136731 2000350 1883379 2033742 2138889 1948671 1856390 1953617 1977474
2035 1977474 1745213 1697360 1577705 1533179 1660203 1618574 1525814 1434079 1415711 1353975 1466548
2024 1466548 1492334 1309801 1249407 1089358 979751 1069624 872189 1068739 889891 833722
2014 833722 847727 809795 983761 969545 999820 783995 767759 881778 957245 934272 879131
2003 879131 689542 882169 885795 833384 838134 730561 456371 492685 611883 523084 540798
1992 540798 633664 590408 501886 625037 506171 508776 554616 578052 676996 649507 704929
1981 704929 454835 360578 403472 326074 511705 622167 623635 421842 465907 677095 638471
1970 638471 402141 406564 454386 453060 475193 670608 679539 488410 585762 592931 361433 294412
1958 294412 314556 327998 341315 280235 465394 613429 539541 489214 453369 460548 433155
1947 433155 473783 406638 424997 378381 334464 443695 397654 404927 266538 132827 190521
1936 190521 225721 229314 453094 398550 345250 393925 243636 299932 172647 233466 131432
1925 131432 250912 233429 282284 169128 257930 285091 202208 173380 269549 122376 94466
1914 94466 244500 197096 54592 267336 495071 194695 124082 204215 216197 47563 61943
1903 61943 210048 159890 85854 -17271 -8596 -40640 173029 229734 163758 138730 9999
1892 9999 185796 153255 190318 88492 166261 141935 97039 312205 353276 217956 106975
1881 106975 31589 67852 133685 223778 270264 416039 434448 557952 299926 251195 336712
1870 336712 226672 157884 36142 135430 146929 100330 -1650 94203 421209 439787 500499
1859 500499 448894 156109 38392 172499 231848 335911 537498 664210 460473 352160
1849 352160 356384 438136 610481 628137 616178 387413 402837 415362 381731 382094 344164 280236
1837 280236 374267 249233 156562 69390 91578 180789 196639 179208 245997 338604 205920
1826 205920 177577 48645 50776 52120 83384 96866 140472 220732 249514 43148 77165 -3214
1814 -3214 8173 -28827 -63295 -193584 -48264 70554 136793 219333 84643 165184 130768
1803 130768 85405 14124 99399 85265 38157 88581 11865 150554 291557 233651 123091
1792 123091 231650 152427 2463 22055 65395 33502 22236 -55858 -72424 16471 -8024
1781 -8024 -113342 -186767 4209 80746 -81046 -100881 91846 93819 115672 83336 -8500
1770 -8500 -205824 -125893 47145 -111217 -219426 -122427 -110850 -78814 -86575 -182734 -156287
1759 -156287 -16055 35181 168483 167902 157113 -89012 -184567 -124995 86594 194501 143856
1748 143856 52075 178586 152705 6429 5952 92487 119699 -115056 -75421 -43047 -15725
1737 -15725 -90674 -46010 82519 56479 58487 -75025 -91682 -162541 -193071 -186534 -88600 156091
1725 156091 206544 -45476 89016 135880 80221 11971 79740 21583 29265 62699 31843
1714 31843 1953 -176038 -108384 -87199 82621 -7166 95241 17183 78904 -10689 -125831
1703 -125831 -193143 -113084 -121803 -27727 -78056 -102317 66282 151319 240964 240601 138405 85353
1691 85353 -47068 -225850 -241901 -45705 -73194 33878 52856 -275303 -231067 -163636 22504
1680 22504 -141835 91221 233289 162308 120425 15051 -18323 -53799 17178 -8114 -23211
1669 -23211 158462 71214 135161 4223 -168898 -107738 59276 41002 -73779 -179822 -153777
1658 -153777 64912 33409 -67704 89597 3010 35720 2552 -178599 -81169 -52846 -31050
1647 -31050 -82142 5914 -75539 -165749 -34156 -84768 -72883 54721 29459 -7639 42892
1636 42892 59995 19218 72612 188469 -80027 -227825 -34774 37901 38853 -166521 -157972
1625 -157972 -84502 -168098 -272330 -40354 21280 -180544 -173855 -223366 -148551 -15327 -207611
1614 -207611 -342483 -346313 -110566 -80235 -86325 -54073 147471 42655 -43455 33621 -35186
1603 -35186 -189935 -110811 25196 39702 55005 84698 114640 -8570 -54081 -141869 -216392
1592 -216392 -153916 -72695 62370 132686 -73112 -103190 86370 58143 222511 203069 77683
1581 77683 52186 -199201 -182281 6954 25906 -110299 -88491 -84030 -69041 -20218 36971
1570 36971 154082 219872 356692 153673 74935 156943 1268 -141576 -131273 74199 231094
1559 231094 94612 36626 71742 44256 -78190 -85875 -27307 -52355 -177954 16668 137892
1548 137892 55638 74401 14055 -10073 18971 71534 -23048 83281 61752 64181 305318
1537 305318 167443 67975 187829 64408 -107890 -159971 22886 14267 -137033 -219127 -212132
1526 -212132 -175811 -35779 2081 -71382 -99303 -133980 -186291 -155427 -40182 209221 149465
1515 149465 70840 -221832 -146312 -125534 -128200 42772 105958 27461 37474 120821 -234506
1504 -234506 -251703 -262016 -10310 45402 -65098 214648 182889 264131 361234 229278 -75436
1493 -75436 -170004 -52960 151606 16889 -204267 -119043 -130351 -113362 -74706 18046 -69044
1482 -69044 -194066 -118036 -310113 -293467 -145444 148980 113524 170424 272233 65287 -133431
1471 -133431 -141909 -121483 -385349 -428624 -263603 -103907 -180254 -64997 -30459 -36336 -34481
1460 -34481 19410 -40511 -71905 102605 -33645 -59917 -97602 34715 132922 14849 -68445
1449 -68445 -162827 -120888 189569 319775 133467 -6535 221299 95369 -28660 -46903
1439 -46903 61648 210113 418 56859 52093 82449 -19157 108861 101759 2674 -41593
1428 -41593 -109234 -308725 -138064 -174664 -258991 -244465 -180247 -231595 -245286 -90112 183130
1417 183130 167093 137027 107326 132682 -45903 -115656 -19314 76414 19787 81651 -2846
1406 -2846 -167435 -49544 -100634 -131520 32928 47753 50697 -98215 -217477 -234933 -263703
1395 -263703 -151809 126284 330484 319045 146891 197648 264848 215437 251633 -14331 -137218
1384 -137218 -275839 -180635 25940 88728 -30994 -129000 -176026 -42229 137156 96111 -49986
1373 -49986 -49622 -60296 -176073 -140466 16817 233640 128963 -152000 27173 -48308 -192543
1362 -192543 -266835 -127061 -164250 -19659 -75164 -151604 -104274 -35047 -54178 45975 24377
1351 24377 21482 -27723 166486 296498 251639 90901 3637 43886 -126271 11775 189806
1340 189806 148107 118571 25872 -1603 22535 -108277 -56529 -98575 -57311 -150755 -207745
1329 -207745 -184729 -81436 76115 -96383 -51865 -99531 -66203 182460 -29023 -131518
1319 -131518 -5538 -69374 -106812 16899 78984 36651 -17934 -126818 -34995 -35348 -81352
1308 -81352 97666 6125 32285 75178 35676 -87312 -171912 -162610 -94656 -86159 -115557 23249
1296 23249 111765 -185995 -176952 -106891 -60533 -109884 -119858 -89910 226313 364886 123253
1285 123253 29979 -89898 55234 8388 -173600 -176648 -132739 -107411 -133469 -166862 -129561
1274 -129561 -71471 69952 -78613 -122965 -74247 -223013 80208 84176 -117787 -80651 -64619
1263 -64619 40837 -44946 -138381 -71326 -51046 -30458 73154 162324 -42571 49017 -77644
1252 -77644 20206 144671 40605 1454 54190 73934 12537 -25067 73037 11368 33946
1241 33946 -229759 -102964 54958 4463 174724 -83919 -136642 -126090 -37063 110905 6087
1230 6087 -228241 -138741 53675 103898 -157258 -123813 -302049 -298465 -124115 55050 207569
1219 207569 176456 -175320 53920 9657 -6710 52143 136087 124238 180415 55793 1831
1208 1831 171278 71435 -38264 -4092 29653 -116118 -171613 -350576 -108715 -79781 -211000
1197 -211000 -95747 -48103 -71566 -3702 135277 96038 69626 269343 177084 -242170 -284319
1186 -284319 -44077 -172957 -194067 -144865 -192622 -270553 -297217 -154592 1417 -48233 -168700
1175 -168700 -18933 19516 -86948 -235193 -185997 -45908 -113009 -106850 -32871 -60808 -24279
1164 -24279 22570 -152790 -59046 -65055 -95369 -113039 -17364 75862 114557 -76348 -74518 -70279
1152 -70279 -60949 -66520 -127650 -148866 -196481 -187030 -27947 -37484 58948 19372 -70358 -101578
1140 -101578 -210561 -68462 201605 109009 119332 135643 68063 136721 66227 -91909 -180873
1129 -180873 -34562 -107575 38075 118726 70033 61164 125803 -143690 -409038 -286525 -47528
1118 -47528 77714 207955 123934 157750 69060 35187 99504 59164 115739 55207 -130767
1107 -130767 7381 52267 -188737 52121 7373 177110 126539 86786 68448 193312 257092
1096 257092 -14422 -44157 -17520 168549 -113 -199982 -210822 -77689 117944 247742
1086 247742 53844 -57592 -31747 93075 122253 170913 131859 -18746 -24371 -149510 57934
1075 57934 -97932 -112134 2702 -36160 -32443 -44506 80372 51940 -132410 -184706 -130092
1064 -130092 -110668 -92215 -329171 -272398 -14282 -49078 -90314 -9081 -65332 -174784 -174224
1053 -174224 -80947 -233359 -6729 58679 121418 86834 -101438 -159332 -164371 -150094 -64622
1042 -64622 -121686 -117158 -38735 65170 65563 -146958 -29109 -53932 -50738 36155 -111051 110834
1030 110834 84776 -57645 -11774 -50924 60826 149136 173710 114798 151955 177565 88858
1019 88858 -30336 71510 -169536 -220764 69604 112750 111489 5153 -51616 -12835 92709
1008 92709 101667 26117 101735 149408 172441 100536 97147 165902 146477 117195 12758 112475
996 112475 34774 87259 249814 197342 68077 -91849 -6052 92251 50903 -206825 -192685
985 -192685 -158983 -89374 32558 60824 -2689 -42914 -7262 65972 3835 -115321 -117861 27310
973 27310 -29085 109757 265802 176022 111796 22192 -11233 30678 -71768 43353 123495
962 123495 129349 93113 167257 141698 -2947 -58907 -81352 122231 109283 -149112 -85607
951 -85607 36628 40281 -157991 -11271 171555 -10218 28161 -24427 195745 100096 105273
940 105273 192574 33621 -27158 -146039 8612 -61100 -178465 -119010 -141236 -71764 37921
929 37921 -75509 -126505 -83159 -65706 54417 150648 64963 26957 -177574 -138305 -149954
918 -149954 -259475 -190046 -30674 -10041 -124335 -100920 26749 208882 47845 198755
908 198755 90300 113551 27861 -79510 4315 -115452 -9921 257198 199578 97518 106827
897 106827 32404 -89009 -80160 -32325 58305 100383 63248 -81689 -63206 -114485 -274963
886 -274963 -198468 -10285 94411 308183 242603 222938 28483 -18591 -136553 -145151 -195012
875 -195012 -82581 -195896 -185785 19042 11146 130396 -81217 -52375 -30824 -77283 -124540
864 -124540 -41818 -23199 -65728 -49248 -82544 -39848 34580 -13720 49364 108761 232232 83678
852 83678 99701 163833 162114 -94116 -135599 -140474 -219355 -100875 -118411 -204664 -120076 -32847
840 -32847 -88403 -144217 -187279 -191958 -30191 -3514 -93374 44229 108131 8227 36567 -70636
828 -70636 -85123 67259 -74979 -5803 49518 -46086 14436 -165975 -172766 -47754 -72141
817 -72141 -61795 74801 -25006 -75252 66012 38310 -69268 201375 303967 103222 47830
806 47830 110639 127842 80429 -48925 -27286 -13184 85084 115121 42063 172248 36672
795 36672 25448 122415 127056 206845 221430 -98206 -92452 -29934 -132444 -117300 -94271 63031
783 63031 -4994 -88880 98864 56295 -38836 -44025 180110 210057 152954 116151 7606 -163078
771 -163078 -172495 -154219 -154375 -186422 -192883 -79163 -163080 -63915 -43874 84591 88016 126104
759 126104 134572 47502 -87252 -106586 -10320 -127253 -141058 48608 78728 -75850 -59949
748 -59949 -160663 -74544 -54892 -129859 14788 164777 64769 29880 82595 23922 -5425
737 -5425 140542 144959 9853 -70605 -32928 143767 123142 -52215 42455 234575 246513
726 246513 134878 5486 127487 51259 -17156 -147065 -180630 -66968 191998 172266 20735
715 20735 34568 120369 84018 191837 152926 -62569 -107836 -144894 -45284 33270 37153 -190838
703 -190838 -171124 -69680 -10675 58631 105774 128945 146635 266422 301052 134158 -49815
692 -49815 -217200 -169530 -293783 -161070 16263 49377 188425 270688 33474 51737 184981
681 184981 22014 -74600 -93016 -113685 -9264 104334 171819 138366 119305 52155 92501
670 92501 -57749 -121738 42719 260405 244377 5954 31115 -30165 -162875 -293258 -190127
659 -190127 -258201 -252483 -50961 37894 -111159 -29727 70312 55792 144885 -111498 -101085
648 -101085 -134035 58048 218785 164410 285054 175643 15847 -42179 61870 37337 74006
637 74006 36524 4082 -122204 -160058 -99846 -119190 137425 126006 14688 -120852 -14059
626 -14059 206604 54992 127612 82347 57612 128159 -33710 -240727 -183050 84891 77617
615 77617 -39752 9815 173871 139804 3730 80292 32566 -108590 -231529 -93838 -161182
604 -161182 -31699 71407 185611 124651 -60029 27403 235686 66355 5290 136250
594 136250 -28182 -154295 -143352 -95579 -19259 -45656 -133076 -138507 -122265 -101062 -43231 -1229
582 -1229 -67736 -129745 -91444 -154814 -67471 1080 -118764 19270 124973 262860 73860
571 73860 -59942 -89085 -160057 -130712 -135475 -207243 -171206 -58726 -284675 -245643 -170395 -170310
559 -170310 -26234 193827 -5348 -255596 -128603 -138734 -15608 -34307 -103861 87417
549 87417 260851 151142 20994 71385 39947 -43423 -5728 21726 31365 -73155 -73896 -96338
537 -96338 -51522 -15684 -43577 -56428 -47662 -97793 -207665 -30536 -63300 -106328 -82646 -108666
525 -108666 27715 -60537 -302669 -295740 -64122 77203 167500 102135 45431 151384 96312
514 96312 -109639 -39318 -235090 -144580 -123601 -130983 -176233 -245081 -80881 -231679 -149579
503 -149579 -90539 -351398 -180977 75488 25510 66574 234705 46973 -141869 -151941 -181294
492 -181294 -116845 -141594 -295212 -267975 -173163 -88484 -113320 19984 76306 -44181 105205
481 105205 98072 8467 -29727 -100687 209249 173999 91702 79344 56493 -26785 105711 146068
469 146068 -1349 18164 -10635 16219 -52759 -40710 -75881 125275 31514 -80029 -172076
458 -172076 144810 137613 174889 18859 -140018 -159666 -154926 -192775 -97163 73 132595
447 132595 104568 -45638 71465 55239 53893 2349 -61115 83350 81119 -28620 -4619
436 -4619 3568 27129 153102 -68087 -42560 72058 82451 215352 93886 94050 -111907 -61387
424 -61387 -34651 -246383 -63787 8807 -7983 34844 61624 96283 266737 365947 194699
413 194699 24348 -86345 -47969 -105538 111397 39251 -23621 -73645 138643 103755 142805
402 142805 60595 -29638 39624 40060 -39247 41 175674 37448 -178061 -71911 -76031 -246386
390 -246386 -170794 -32869 -32619 -95464 116865 107094 -31086 -75945 -171622 -180255 -71034 155784
378 155784 107110 -54056 -4378 201356 189275 109963 -55823 10819 264197 197545 365152
367 365152 368895 126957 -22058 -58376 -16433 142318 105122 138893 188179 174930 205103
356 205103 111220 89408 129604 -38473 102588 169997 291345 179080 60320 -136910 37629
345 37629 34032 173428 132947 -135666 -123951 -88292 -28674 16110 85772 74303 182487 -45876
333 -45876 -377640 -209204 -62495 -195998 -37849 -8433 -5311 88839 90670 9256 -146410
322 -146410 102311 66466 99984 202079 183354 95352 7086 -124784 -64004 133160 -4261
311 -4261 58798 12792 -50128 -83613 81570 81222 92989 51728 -12515 38998 -10708 -117061
299 -117061 -8258 174092 78723 -35564 23784 27238 52085 19966 -52645 123096 124115
288 124115 -53016 -151236 -185935 -86413 -146907 -67950 -120219 -198078 -448057 -346476 -196988
277 -196988 -182517 -211362 106836 228194 98071 237347 208437 187983 114906 -106719 -117459
266 -117459 122526 133969 86621 269996 262136 131677 -82581 -6479 66714 -19241 -162361
255 -162361 -183659 -199356 -156164 -49869 -137041 -176293 -120663 -137655 -123066 -100942 -32077 -2260
243 -2260 -86647 -77488 47236 402 100630 172921 98532 -16132 -70442 21977 -117988 -100243
231 -100243 -8869 200113 254977 88531 -142510 -54211 -101943 -78169 -45632 24105 18204
220 18204 -61057 -35049 144938 247227 269662 80707 13709 207225 228120 190797 188793
209 188793 70440 10774 120435 111435 94685 53797 -50005 -82378 -50523 116047 105488
198 105488 64889 75339 97010 240582 89828 116093 234273 191897 261242 239411 43592
187 43592 -35298 18205 51967 137912 90330 116154 86565 34523 -58996 -26828 58630 55145
175 55145 -49512 7548 -25446 -235028 -244981 -32493 35799 169331 172397 3594 -171006
164 -171006 -336148 -246939 -194275 -124635 -80252 -9078 7847 -54663 30196 144351 11314
153 11314 -27180 -8887 16414 -64551 67024 128770 44823 -124159 -38770 11555 -43544 -44794
141 -44794 -178929 -2003 -55549 20270 11537 -66689 -73858 -7459 19059 -83949 -91697 -51526
129 -51526 -34480 -14839 51375 116482 104146 5095 -46011 82152 73881 236309 227166 25433
117 25433 -69918 -181590 75440 74225 71104 155464 46065 81687 -5981 -61048 -44996 -137626
105 -137626 -224689 -113961 -77079 -82704 -29226 -97026 -61526 -167743 -311139 -279098 -70966
94 -70966 -74618 -254249 -179310 -161696 -83209 112426 9499 -57479 39152 27732 -100736 85528
82 85528 242844 222953 193486 57884 -26658 208276 237916 41251 -28432 104269 117219
71 117219 30501 -67609 60552 148662 214979 103965 -17286 -66735 -197293 -55331 -104058
60 -104058 -153302 -94847 -16517 75805 -35702 -74364 -261039 -231943 -160279 -50900 -67397
49 -67397 -119558 3089 32451 119495 76289 -64522 47164 76296 71039 -19426 -17050 -34562
37 -34562 16170 79812 140091 80227 89215 223266 176196 104411 16165 21066 -7295 53916
25 53916 203867 97541 -76666 -147856 -91672 -21948 -148598 -159360 -171102 -13254 54869
14 54869 3654 35419 131056 -80366 73908 23614 -109636 -169829 -124750 -1384 9549
3 9549 17117 -109277 -14812
0 -14812
$$ Imaginary data points
##PAGE= N=2
##DATA TABLE= (X++(I..I)), XYDATA
16383 -1761167 -1637565 -1673929 -1632080 -1618880 -1605028 -1554165 -1580350 -1428721 -1285084 -1277344 -1285960
16372 -1285960 -1191587 -1121305 -1146293 -1098439 -1086303 -999200 -1039556 -1028335 -990536 -817489 -696028
16361 -696028 -786257 -725548 -715440 -769385 -818576 -819966 -806971 -825324 -631582 -623326 -559138 -477367
16349 -477367 -575165 -627572 -655758 -569170 -543047 -441439 -414780 -374052 -301686 -293449 -213362
16338 -213362 -200225 -203875 -43556 -113093 -133204 -38410 10978 60540 73748 80886 180489 88738
16326 88738 228224 304255 175878 245044 217823 209377 229018 190821 259401 363403 581230
16315 581230 615713 565450 585803 560519 591588 634754 612246 660103 679519 865243 638040
16304 638040 693617 747537 806578 879074 934675 1074746 1024097 968891 873882 903578 965579
16293 965579 920278 965352 1131094 1252261 1263772 1155168 1155868 1182258 1259107 1434078 1341136
16282 1341136 1155536 1111144 1287747 1567497 1563020 1490707 1596344 1546081 1527713 1487059 1492081
16271 1492081 1448154 1459126 1453639 1715365 1744160 1715233 1693257 1586962 1736069 1784843 1923477
16260 1923477 1678634 1642731 1612868 1671538 1768946 1706668 1802284 1945058 1814668 1903937 1838582
16249 1838582 1819336 1905794 1876868 1823149 1885773 2038891 2227233 2210585 2222587 2085798 2122728
16238 2122728 2231292 2261624 2259503 2207707 2215911 2165514 2183162 2221363 2305622 2301762 2224503 2287119
16226 2287119 2491617 2566126 2457926 2461203 2440830 2416167 2395626 2631727 2605871 2449686 2466206
16215 2466206 2628110 2544794 2441015 2500119 2610782 2688227 2663482 2721295 2675589 2583386 2551180
16204 2551180 2651710 2574055 2687031 2795536 2670018 2553232 2611389 2867425 2816272 2728096
16194 2728096 2553663 2733408 2937371 2871019 2874613 2865215 3082573 2959184 2927547 2800458
16184 2800458 2753574 2860529 2932759 2686678 2666835 2878618 3111515 2930398 2994992 2837531
16174 2837531 2838397 2799780 2795588 2791531 3021499 3103627 2831785 2942411 3008293 2963184 2843302
16163 2843302 2978541 2985197 3009133 2991661 2988591 3016150 3057831 2944716 2914435 3068923 3357160
16152 3357160 3231563 3076756 3094401 3182276 3160335 3048371 3084211 3180135 3092004 3224034
16142 3224034 3242039 3235407 3279069 3127656 3207146 3167372 3035253 3126843 3181642 3070573 3122426
16131 3122426 3150856 3003887 3009369 3097129 3249876 3336686 3331403 3442742 3402299 3223065 3287302
16120 3287302 3287949 3361763 3192796 3285416 3349772 3305134 3516403 3434509 3136312 3172663 3216424
16109 3216424 3313613 3388242 3377367 3399772 3375739 3410348 3507050 3370889 3033903 3254332 3378299
16098 3378299 3424042 3253984 3249647 3435833 3222708 3052337 3045555 3170480 3331707 3222352
16088 3222352 3483922 3478711 3494083 3388430 3348971 3290461 3104334 3213993 3293145 3221453 3326976
16077 3326976 3577264 3366745 3401894 3462152 3557638 3520155 3431625 3492463 3401700 3396530 3319444
16066 3319444 3336375 3365744 3501422 3553781 3252312 3138089 3245625 3382199 3319599 3292723
16056 3292723 3301394 3295860 3281400 3345204 3426812 3333505 3249791 3308599 3424808 3447947 3540791
16045 3540791 3491586 3481445 3630988 3544555 3568499 3696790 3528477 3394297 3521673 3539276
16035 3539276 3361392 3068206 3059585 3240338 3313021 3350668 3381603 3279989 3153999 3167282
16025 3167282 3391907 3608009 3618772 3476579 3448352 3479949 3414705 3342741 3285971 3343491 3456171
16014 3456171 3478302 3385516 3412919 3367440 3481605 3381447 3300666 3334199 3366350 3443421 3459588
16003 3459588 3264546 3225651 3364721 3488116 3424325 3410423 3425054 3480151 3591464 3504239
15993 3504239 3365899 3494626 3581155 3544805 3505274 3397338 3382738 3259767 3288801 3332044
15983 3332044 3412764 3518303 3441036 3241207 3284515 3256056 3357151 3452392 3581115 3358291
15973 3358291 3414178 3464427 3470608 3463669 3506237 3662047 3591732 3444789 3352182 3596326 3596001
15962 3596001 3307484 3350637 3240961 3281314 3242233 3252589 3287477 3404909 3546090 3544164 3667831
15951 3667831 3423554 3474150 3540060 3565984 3584005 3674961 3527853 3420652 3314845 3449491
15941 3449491 3247496 3466482 3511096 3285433 3326456 3378869 3342829 3278616 3441249 3249160
15931 3249160 3336689 3514670 3512148 3444855 3655728 3528075 3391754 3630607 3476154 3317507
15921 3317507 3162716 3256121 3423676 3482238 3493187 3577272 3496127 3387430 3342795 3546958
15911 3546958 3461745 3257985 3225385 3416579 3435242 3269915 3402769 3201998 3243627 3537546
15901 3537546 3514730 3299321 3312369 3381865 3489356 3448137 3448174 3346368 3424451 3341631 3616381
15890 3616381 3541873 3384168 3159860 3267661 3524071 3727397 3664721 3614108 3415020 3166550
15880 3166550 3234477 3548345 3529005 3385947 3478408 3318747 3537101 3522753 3594391 3559702
15870 3559702 3508112 3572764 3408451 3306755 3138585 3251091 3448034 3254081 3188852 3346463
15860 3346463 3454905 3346421 3421027 3468543 3296689 3358340 3415781 3290985 3574467 3533958
15850 3533958 3550334 3250267 3267957 3380748 3379090 3382993 3670306 3927933 3892596 3898972 3772271
15839 3772271 3604109 3469810 3520690 3600765 3581860 3521644 3572823 3525391 3520613 3441908 3447439
15828 3447439 3562966 3362912 3441532 3462417 3392956 3341982 3451669 3565704 3681333 3517320
15818 3517320 3534630 3475884 3385459 3440205 3645428 3655943 3500685 3427426 3427773 3548719 3487214
15807 3487214 3589156 3542819 3392382 3308290 3297178 3209507 3339227 3546159 3639631 3432546
15797 3432546 3479490 3414573 3423096 3459014 3455653 3404120 3337432 3307514 3344965 3570412 3809023
15786 3809023 3710425 3523199 3468461 3524783 3724388 3659349 3381533 3233803 3267441 3466003
15776 3466003 3517057 3626979 3502595 3598643 3416787 3505827 3610113 3377052 3342506 3557516
15766 3557516 3578363 3718749 3483628 3380934 3524016 3478733 3389593 3297399 3502663 3447382
15756 3447382 3100627 3351347 3492212 3548131 3529123 3434307 3503921 3365419 3231041 3388451
15746 3388451 3366244 3238449 3426320 3276347 3395706 3472877 3656065 3542574 3714063 3553846
15736 3553846 3439465 3474319 3385702 3451523 3584498 3351686 3356805 3402705 3480101 3365058 3323227
15725 3323227 3373095 3251317 3198396 3577867 3581800 3486881 3401989 3157788 3050955 2856139
15715 2856139 3248232 3378020 3334950 3689994 3796582 3789518 3535296 3529663 3496354 3568543 3500039
15704 3500039 3474638 3405568 3304362 3428679 3367238 3437318 3427165 3443320 3460907 3405182 3466918
15693 3466918 3647557 3595994 3668745 3584554 3579455 3578647 3668035 3393473 3300236 3585609 3744433
15682 3744433 3608642 3567911 3392060 3271014 3547197 3617628 3625609 3449810 3440857 3589482
15672 3589482 3631148 3536527 3468591 3605071 3502318 3464649 3403529 3483351 3609337 3517354 3482936
15661 3482936 3451735 3428413 3683312 3684762 3467514 3549090 3586171 3578524 3729897 3634077 3708976
15650 3708976 3591063 3376515 3489516 3655323 3522913 3583510 3459673 3477560 3872187 3745225
15640 3745225 3786619 3638021 3611941 3471632 3368601 3464774 3455823 3580069 3616266 3676220 3684272
15629 3684272 3663390 3589528 3545022 3593039 3714847 3581115 3444754 3724316 3738212 3639192
15619 3639192 3864828 3761674 3479428 3345803 3303031 3378674 3573832 3600141 3485293 3720843
15609 3720843 3578557 3554789 3685585 3625429 3673772 3570376 3663714 3397845 3333141 3407484
15599 3407484 3440590 3474599 3541094 3507013 3558105 3549927 3632214 3638955 3654351 3669359 3710827 3644883
15587 3644883 3761886 3876014 3680860 3603546 3557014 3688048 3532455 3513566 3495609 3413682
15577 3413682 3482512 3523972 3418997 3530946 3692892 3628046 3414664 3488478 3314243 3526662
15567 3526662 3629496 3649967 3616150 3714590 3663198 3547298 3663005 3775211 3585810 3659590
15557 3659590 3780291 3691185 3432103 3469123 3695862 3636623 3674475 3613023 3648723 3689280 3796855
15546 3796855 3821510 3657866 3902578 3844855 3758631 3676646 3487071 3589912 3608285 3473204
15536 3473204 3482236 3601735 3565309 3573007 3584851 3728642 3524964 3552374 3491639 3567064 3562740
15525 3562740 3622047 3547301 3627477 3857917 3598304 3509396 3591186 3753647 3716072 3817428
15515 3817428 3641373 3546337 3752925 3697281 3421021 3478001 3688022 3635752 3556717 3516163
15505 3516163 3614865 3454483 3389502 3519310 3524593 3554615 3587585 3636723 3718415 3686367 3670147
15494 3670147 3662373 3833042 3702680 3662971 3651330 3680086 3756864 3733925 3673460 3500787 3710220
15483 3710220 3629528 3519988 3670204 3680690 3553216 3509268 3510262 3717796 3721191 3654284 3693571
15472 3693571 3674207 3691806 3618772 3714850 3819068 3661670 3561459 3449990 3358355 3516720
15462 3516720 3598995 3672915 3547204 3530333 3546232 3665249 3800802 3762652 3700310 3610897 3618889
15451 3618889 3753742 3737078 3681655 3554082 3573659 3690349 3774257 3833350 3707798 3723119
15441 3723119 3808529 3804713 3937208 3905446 3659988 3668307 3604172 3582375 3430907 3553050 3634039
15430 3634039 3560074 3664101 3621612 3751769 3677375 3555670 3531635 3415870 3408116 3525068
15420 3525068 3600575 3625391 3530942 3377589 3271165 3511722 3763639 3658232 3608539 3532603
15410 3532603 3541118 3682982 3703354 3722600 3635120 3668548 3495029 3601497 3740793 3742074 3693184
15399 3693184 3735735 3780039 3679015 3672729 3703086 3824759 3671960 3735194 3872127 3849375 3904975
15388 3904975 3727500 3728674 3575163 3605954 3804681 3922397 3840915 3753390 3602791 3458354
15378 3458354 3444834 3719007 3784658 3669229 3739814 3583059 3606435 3630316 3470186 3314248
15368 3314248 3396406 3529679 3748706 3583051 3648559 3740503 3812663 3647244 3651200 3674942 3632262
15357 3632262 3565671 3775809 3612281 3524176 3649914 3590604 3887214 3807295 3530865 3598693
15347 3598693 3592101 3673236 3894023 3879507 3808878 3687082 3633724 3708256 3638268 3565303 3638940
15336 3638940 3660552 3696303 3852593 3709257 3819608 3698043 3702899 3686162 3701485 3961500
15326 3961500 3945671 3844947 3787979 3889174 3798333 3752542 3736041 3573268 3482475 3360483
15316 3360483 3518781 3651024 3467173 3564242 3708947 3773136 3707796 3758018 3788791 3831633
15306 3831633 3563414 3410743 3591945 3536527 3651091 3742115 3781752 3664497 3593822 3615568
15296 3615568 3546350 3512843 3612168 3661341 3768776 3751648 3670998 3721163 3680078 3576262 3596532
15285 3596532 3535647 3512652 3627258 3705109 3945047 3646495 3563282 3738290 3718892 3401900
15275 3401900 3634513 3793360 3877471 3782914 3640130 3759534 3846022 3626708 3692747 3911765
15265 3911765 3742121 3693892 3954288 3959763 3960652 3795985 3628389 3710959 3696827 3649009 3789365
$$ [...]
##END NTUPLES=NMR SPECTRUM
##END=
