##TITLE=1H_EC-K2
 CDCl3, 8 sc, 
 28.1.2020
##JCAMPDX= 6.0         $$ Bruker NMR JCAMP-DX V2.0
##DATA TYPE= NMR FID
##DATA CLASS= NTUPLES
##ORIGIN= UXNMR, Bruker Analytische Messtechnik GmbH
##OWNER= root
$$ XWIN-NMR		Version 3.5
$$ Tue Jan 28 14:10:58 2020 Russian Standard Time (UT+4h)  she@DPX200
##.OBSERVE FREQUENCY= 200.1315
##.OBSERVE NUCLEUS= ^1H
##.DELAY= (6, 6)
##.ACQUISITION MODE= SIMULTANEOUS
##.ACQUISITION SCHEME= undefined
##.AVERAGES= 8
##.DIGITISER RES= 18
##SPECTROMETER/DATA SYSTEM= spect
##.PULSE SEQUENCE= zg30
##.SOLVENT NAME= CDCl3
##.SHIFT REFERENCE= (INTERNAL, CDCl3, 0, 15.7039)
##AUDIT TRAIL= $$ (NUMBER, WHEN, WHO, WHERE, WHAT)
$$ ##TITLE= Audit trail, XWIN-NMR		Version 3.5
$$ ##JCAMPDX= 5.01
$$ ##ORIGIN= Bruker BioSpin GmbH
$$ ##OWNER= she
$$ F:/spectra/data/she/nmr/H-F/1/audita.txt
$$ ##AUDIT TRAIL=  $$ (NUMBER, WHEN, WHO, WHERE, WHAT)
(   1,<2020-01-28 14:09:55.85 +0400>,<she>,<DPX200>,
      <created by zg, POWCHK disabled, PULCHK disabled
       configuration hash MD5:
       00 E9 B6 7A A2 85 ED C7 34 08 36 98 17 FE 4E 26
       data hash MD5: 16K
       50 EF C1 B8 C2 86 72 E6 2B 2B C3 2A 1A CA D6 64>)
$$ ##END=
$$ 
$$ hash MD5
$$ B5 17 45 F1 88 E9 CA 29 E4 1B 49 DF ED A7 06 1E
##$RELAX= 
##$RELAX= 
##$RELAX= 
##$RELAX= 
##$RELAX= 
##$RELAX= 
$$ Bruker specific parameters
$$ --------------------------
##$DU= <F:/spectra>
##$EXPNO= 1
##$NAME= <H-F>
##$PROCNO= 1
##$TYPE= <nmr>
##$USER= <she>
##$AMP= (0..31)
100 100 100 100 100 100 100 100 100 100 100 100 100 100 100 100 100 100 
100 100 100 100 100 100 100 100 100 100 100 100 100 100 
##$AQSEQ= 0
##$AQ_mod= 1
##$AUNM= <au_zg>
##$AUTOPOS= <>
##$BF1= 200.13
##$BF2= 200.13
##$BF3= 200.13
##$BF4= 200.13
##$BF5= 200.13
##$BF6= 200.13
##$BF7= 200.13
##$BF8= 200.13
##$BYTORDA= 1
##$CFDGTYP= 0
##$CFRGTYP= 5
##$CHEMSTR= <none>
##$CNST= (0..31)
1 1 145 1 1 1 1 1 1 1 1 1 1 1 1 1 1 1 1 1 1 1 1 1 1 1 1 1 1 1 1 1 
##$CPDPRG= <>
##$CPDPRG1= <>
##$CPDPRG2= <>
##$CPDPRG3= <>
##$CPDPRG4= <mlev>
##$CPDPRG5= <mlev>
##$CPDPRG6= <mlev>
##$CPDPRG7= <mlev>
##$CPDPRG8= <mlev>
##$CPDPRGB= <>
##$CPDPRGT= <>
##$D= (0..31)
0 1.2 0 0 0 0 0 0 0 0.06 0 0.03 0 0 0 0 0.0002 0 0 0 0 0 0 0 0 0 0 0 0 
0 0 0 
##$DATE= 1580206195
##$DBL= (0..7)
120 120 120 120 120 120 120 120 
##$DBP= (0..7)
150 150 150 150 150 150 150 150 
##$DBP07= 0
##$DBPNAM0= <>
##$DBPNAM1= <>
##$DBPNAM2= <>
##$DBPNAM3= <>
##$DBPNAM4= <>
##$DBPNAM5= <>
##$DBPNAM6= <>
##$DBPNAM7= <>
##$DBPOAL= (0..7)
0.5 0.5 0.5 0.5 0.5 0.5 0.5 0.5 
##$DBPOFFS= (0..7)
0 0 0 0 0 0 0 0 
##$DE= 6
##$DECBNUC= <off>
##$DECIM= 24
##$DECNUC= <off>
##$DECSTAT= 4
##$DIGMOD= 1
##$DIGTYP= 9
##$DL= (0..7)
0 120 120 120 120 120 120 120 
##$DP= (0..7)
150 150 150 150 150 150 150 150 
##$DP07= 0
##$DPNAME0= <>
##$DPNAME1= <>
##$DPNAME2= <>
##$DPNAME3= <>
##$DPNAME4= <>
##$DPNAME5= <>
##$DPNAME6= <>
##$DPNAME7= <>
##$DPOAL= (0..7)
0.5 0.5 0.5 0.5 0.5 0.5 0.5 0.5 
##$DPOFFS= (0..7)
0 0 0 0 0 0 0 0 
##$DQDMODE= 0
##$DR= 18
##$DS= 0
##$DSLIST= <SSSSSSSSSSSSSSS>
$$ [...]
##$SUBNAM2= <"">
##$SUBNAM3= <"">
##$SUBNAM4= <"">
##$SUBNAM5= <"">
##$SUBNAM6= <"">
##$SUBNAM7= <"">
##$SUBNAM8= <"">
##$SUBNAM9= <"">
##$SW= 24.9337058887773
##$SWIBOX= (0..15)
0 0 2 0 0 0 0 0 0 0 0 0 0 0 0 0 
##$SW_h= 4990.01996007984
##$TD= 16384
##$TD0= 1
##$TE= 0
##$TE2= 300
##$TE3= 300
##$TEG= 300
##$TL= (0..7)
0 120 120 120 120 120 120 120 
##$TP= (0..7)
150 150 150 150 150 150 150 150 
##$TP07= 0
##$TPNAME0= <>
##$TPNAME1= <>
##$TPNAME2= <>
##$TPNAME3= <>
##$TPNAME4= <>
##$TPNAME5= <>
##$TPNAME6= <>
##$TPNAME7= <>
##$TPOAL= (0..7)
0.5 0.5 0.5 0.5 0.5 0.5 0.5 0.5 
##$TPOFFS= (0..7)
0 0 0 0 0 0 0 0 
##$TUNHIN= 0
##$TUNHOUT= 0
##$TUNXOUT= 0
##$USERA1= <user>
##$USERA2= <user>
##$USERA3= <user>
##$USERA4= <user>
##$USERA5= <user>
##$V9= 5
##$VALIST= <valist>
##$VCLIST= <CCCCCCCCCCCCCCC>
##$VD= 0
##$VDLIST= <DDDDDDDDDDDDDDD>
##$VPLIST= <PPPPPPPPPPPPPPP>
##$VTLIST= <TTTTTTTTTTTTTTT>
##$WBST= 1024
##$WBSW= 4
##$XGAIN= (0..3)
0 0 0 0 
##$XL= 0
##$YL= 0
##$YMAX_a= 424389
##$YMIN_a= -292022
##$ZGOPTNS= <>
##$ZL1= 120
##$ZL2= 120
##$ZL3= 120
##$ZL4= 120
##$ABSF1= 10
##$ABSF2= 0
##$ABSG= 5
##$ABSL= 3
##$ALPHA= 0
##$AQORDER= 0
##$ASSFAC= 0
##$ASSFACI= 0
##$ASSFACX= 0
##$ASSWID= 0
##$AUNMP= <proc_1d>
##$AZFE= 0.1
##$AZFW= 0.1
##$BCFW= 1
##$BC_mod= 2
##$BYTORDP= 1
##$COROFFS= 0
##$CY= 11.3945322036743
##$DATMOD= 1
##$DC= 2
##$DFILT= <>
##$DTYPP= 0
##$F1P= 16.9975609425685
##$F2P= -3.02152046262296
##$FCOR= 0.5
##$FTSIZE= 0
##$FT_mod= 4
##$GAMMA= 1
##$GB= 0.15
##$INTBC= 1
##$INTSCL= 1
##$ISEN= 128
##$LB= 0.24
##$LEV0= 0
##$LPBIN= 0
##$MAXI= 10000
##$MC2= 0
##$MEAN= 0
##$ME_mod= 0
##$MI= 1.114404
##$NCOEF= 0
##$NC_proc= 0
##$NLEV= 6
##$NOISF1= 3.799351
##$NOISF2= 2.8
##$NSP= 1
##$NTH_PI= 0
##$NZP= 0
##$OFFSET= 15.70392
##$PC= 1
##$PHC0= -9787.441
##$PHC1= 16.20081
##$PH_mod= 1
##$PKNL= yes
##$PPARMOD= 0
##$PSCAL= 0
##$PSIGN= 0
##$REVERSE= no
##$SF= 200.130013532006
##$SI= 16384
##$SIGF1= 3
##$SIGF2= 2
##$SINO= 400
##$SIOLD= 16384
##$SREGLST= <1H.CDCl3>
##$SSB= 0
##$STSI= 0
##$STSR= 0
##$SW_p= 3612.71676300578
##$SYMM= 0
##$S_DEV= 0
##$TDeff= 0
##$TDoff= 0
##$TI= <>
##$TILT= no
##$TM1= 0
##$TM2= 0
##$TOPLEV= 0
##$USERP1= <user>
##$USERP2= <user>
##$USERP3= <user>
##$USERP4= <user>
##$USERP5= <user>
##$WDW= 1
##$XDIM= 8192
##$YMAX_p= 0
##$YMIN_p= 0
$$ End of Bruker specific parameters
$$ ---------------------------------
##NTUPLES= NMR FID
##VAR_NAME=  TIME,          FID/REAL,        FID/IMAG
##SYMBOL=    X,             R,               I
##VAR_TYPE=  INDEPENDENT,   DEPENDENT,       DEPENDENT
##VAR_FORM=  AFFN,          ASDF,            ASDF
##VAR_DIM=   8192,          8192,            8192
##UNITS=     SECONDS,       ARBITRARY UNITS, ARBITRARY UNITS
##FACTOR=    0.0002004,     1,               1
##FIRST=     0,             0,               0
##LAST=      1.6414764,     0,               0
##MIN=       0,             -292022,         0
##MAX=       1.6414764,     424389,          0
$$ Real data points
##PAGE= N=1
##DATA TABLE= (X++(R..R)), XYDATA
0@%%%%%%%Qj6J6k2L0l2M0n6O4p2Q9j08J29j51J77k06K37k75L16l59M11m68N28
$$ 0 0 0 0 0 0 0 0 8 -8 8 -14 16 -16 24 -32 32 -40 49 -59 70 -81 96 -110 127 -148 168 -191 220 -248 280
30B80n96O71p52Q45r47J054j173J307j452J608j782J974k187K422k681K970l297
$$ 280 -316 355 -397 448 -499 555 -618 689 -763 845 -937 1037 -1150 1272 -1409 1561 -1736
47a736L667m086M571n138N810o621P622q901J0594j2957J6524k2594L5627j12762
$$ -1736 1931 -2155 2416 -2722 3088 -3533 4089 -4812 5782 -7175 9349 -13245 22382 -90380
61i0380J57252K19560k63253l01520j3681L14840K04879j10953k59092k2946K23232
$$ -90380 66872 286432 23179 -278341 -292022 22818 227697 116744 -142348 -165294 57938
72E7938J77265j08189k11750j3461K32658J67744j19089k63063n4733K21528K17065
$$ 57938 235203 127014 -84736 -98197 134461 302205 183116 -79947 -134680 86848 303913
83C03913o5485k54871j40839J21733K02604L3329j61590j41843K8833J20263L6039
$$ 303913 238428 -16443 -157282 -35549 167055 200384 38794 -103049 -74216 46047 82086
94H2086p6509o6365L6262P0985r847q4903l4357P2826Q9312n595q8563o3565K8636
$$ 82086 5577 -60788 -24526 46459 36612 -48291 -82648 -9822 79490 73895 -14668 -78233 -49597
107d9597P9887M3028k9240n4999k6623N008J6520K2963K5212K109m3090o0616
$$ -49597 30290 73318 44078 -10921 -37544 -32536 -16016 6947 32159 34268 -8822 -69438
119f9438j0909O6084P5857o277q3478n7170L3001P5428K8221l5746l9261R882
$$ -69438 -80347 -14263 61594 55317 -28161 -85331 -52330 23098 51319 15573 -23688 -13806
131a3806L4335j708l8275q675N1162M8154l2608r3230m5816O6458J04509R959
$$ -13806 20529 18821 -19454 -28129 23033 71187 38579 -54651 -100467 -34009 70500 80459
143H0459j03494r7431J5349R5375O0567l3766p6743l0290L8117M6266K750k0498
$$ 80459 -23035 -120466 -105117 -9742 50825 17059 -59684 -89974 -51857 -5591 -2841 -23339
155b3339K63K2100N359k3876j8481K5953N2682J8736l7199m8891q203L5659M3725
$$ -23339 -23076 -976 4383 -19493 -37974 -12021 40661 59397 22198 -26693 -34896 763 44488
168D4488J4780k6494m7167k8819J3561M3626L5864r474n3879m8275R444N7375
$$ 44488 59268 32774 -14393 -43212 -29651 13975 49839 40365 -13514 -61789 -52345 5030
180E030M3089j6923n4698k4984L1548M1546m003l1437J377L8745J5482m2323n0176
$$ 5030 48119 31196 -23502 -48486 -16938 24608 20605 -10832 -9455 29290 44772 2449 -47727
193d7727J8040Q3089M9929n8301j07589k4717R5275J02944j3633j13718p3603
$$ -47727 -29687 53402 103331 45030 -62559 -87276 7999 110943 97310 -16408 -90011
204i0011N3808J04917K0981p7878n8123L8084O9964k035p0980l3695O5925Q3616
$$ -90011 -36203 68714 89695 11817 -46306 -8222 61742 59707 -11273 -44968 20957 104573
216A04573j9851j13018o2414P6167J22654J3060j19066j06797L2979J19467M5529
$$ 104573 84722 -28296 -90710 -14543 108111 121171 2105 -104692 -71713 47754 93283
227I3283q1438r4235R254P8183K5812o3504n8481L5185Q1339L097r4813o8281
$$ 93283 11845 -82390 -73136 5047 30859 -32645 -91126 -55941 25398 28495 -66318 -134599
239a34599N9901J20083K7385j03968j03940L0585J27783O3029p1635r9356M272
$$ -134599 -74698 45385 72770 -31198 -135138 -104553 23230 86259 14624 -84732 -80460
250h0460R0225M8880n0325o7012K0250Q2599K2713p9559p3649M3307J16023L8317
$$ -80460 9765 58645 8320 -58692 -38442 44157 66870 -12689 -86338 -43031 72992 111309
262A11309r5221j10969J7212J26822P7749o4471j14836j7162R0474P2968l3229
$$ 111309 16088 -94881 -77669 49153 126902 62431 -52405 -69567 20907 93875 60646
273F0646q1275j2307O9502M5060n1530p7233J0203R1019M8665o7390j05909j0947
$$ 60646 -20629 -32936 36566 81626 30096 -47137 -36934 54085 102750 35360 -70549 -81496
285h1496R9581Q2730l8221j07897m4102O2760Q0653l66o7028l9109L4238M8312
$$ -81496 18085 100815 62594 -45303 -89405 -26645 54008 53642 -13386 -52495 -18257 30055
297C0055r111m6728o975M8669L6978k9921o3509j3036O0469O0336j5310o9418
$$ 30055 20944 -25784 -32759 15910 52888 22967 -40542 -53578 6891 67227 51917 -17501
309a7501l8835L0830N5699J4190l4033l5306J946K1190M284j1504P57J6187L045
$$ -17501 -56336 -25506 30193 44383 10350 -24956 -23010 -1820 2464 -9040 -8283 7904 10949
322A0949k3890k5496P637L7141K4550j9155m0131j4272K2751K8516O935j4872
$$ 10949 -12941 -38437 -30800 6341 30891 11736 -28395 -42667 -19916 8600 15535 663
334F63j6425m554J453J261O556J5201O287j8803k7286o097K4659L0664L231k7533
$$ 663 -15762 -20316 -18863 -17602 -11046 4155 10442 -8361 -35647 -41744 -17085 13579 16810 -10723
348a0723k5689L033K3399J6314O13o235n643n291m116M235J8490K0253k518k8386
$$ -10723 -36412 -33379 -9980 6334 6947 712 -4931 -10222 -14338 -10103 8387 28640 26122 -2264
362b264k1561J2434L3604J8385j5231k6788q618J4578J3732j585l670O327L364
$$ -2264 -23825 -11391 22213 40598 25367 -1421 -10039 4539 18271 16686 13016 19343 22707
375B2707j5202k0815M063L4136K7422j7118m8830k1501L5480M8830M119m3290
$$ 22707 7505 -13310 -9247 24889 52311 35193 -13637 -35138 342 49172 53291 10001
387A0001l4456J4107L8039Q306k9679j9505K0566K6686j4605m4059j1910M4074
$$ 10001 -24455 -10348 27691 35997 6318 -13187 7379 34065 19460 -24599 -36509 7565
399G565M7353j6908p0521l7651M6648P2890P318o6491n5985K2305O6677K2885
$$ 7565 54918 38010 -32511 -70162 -23514 49376 56694 -9797 -65782 -43477 23200 46085
411D6085m6987m6345J8434N2544P508n0509l5892L5390O4265L469p1708n6992
$$ 46085 -902 -47247 -28813 23731 31239 -19270 -55162 -19772 44493 47962 -23746 -80738
423h0738L6399Q6605K5981o8525p6682R963P9248M5174m4122o8148r86N9695L2184
$$ -80738 -44339 42266 68247 -278 -76960 -66997 12251 57425 13303 -54845 -55831 3864 36048
436C6048l8051n0208J2647O1908K3555n4083o1139J8098P9928L8713n2577p7087
$$ 36048 -2003 -52211 -39564 22344 45899 -8184 -69323 -51225 28703 67416 14839 -62248
448f2248m026P2898N5900k8934o8904j6104M9705M2459k0216m6329l563M4871
$$ -62248 -66274 6624 62524 33590 -35314 -51418 -1713 40746 20530 -25799 -29362 15509
460A5509K7850l3941n0107P224O0997L5294l7825o4116p622N7872N0343j8901
$$ 15509 43359 9418 -40689 -33465 27532 62826 25001 -39115 -46737 11135 61478 42577
472D2577n8615k1551L7211L9603q878l6833j0355K8340K2183k1273l6856K849
$$ 42577 -16038 -37589 -378 39225 30347 -6486 -16841 11499 33682 12409 -24447 -21598
484b1598M4102K5503l0139n0787o845M6265M2390j3629m9828k1655K9123L6519
$$ -21598 22504 48007 17868 -32919 -39764 6501 48891 35262 -14566 -36221 -7098 29421
496B9421n77k8851j3947J7884J9248r669k5120L61L0695J9038k1684l7498p057
$$ 29421 28844 -7 -13954 3930 23178 13509 -11611 -11250 19445 38483 16799 -20699 -27756
509b7756L4339L3309q608l9726k2595J7257L0263N545j9988j7187K569J1578n47
$$ -27756 6583 39892 31284 -8442 -31037 -13780 16483 22028 2040 -15147 -12578 -1000 -1547
522a547j0600j659J2743O190j3723j8924k058J8637J7595m483k1245j4487N912
$$ -1547 -12147 -13806 -1063 5127 -8596 -27520 -29578 -10941 6654 2171 -19074 -33561 -27649
535b7649J6281R275k787q571q498k616N374J0497R239m3j1008j0240M326J5232
$$ -27649 -11368 -2093 -4880 -13451 -21949 -24565 -19191 -8694 545 502 -10506 -20746 -16420 -1188
549a188R657k897p325l68M553K033k102L156J2430P642j1624j9466k060K3554
$$ -1188 8469 5572 -1753 -2121 2432 4465 2363 5519 17949 25591 13967 -5499 -7559 15995
563A5995K3804n330l1178k0667J5910L1919O984k4856k3083N769K1370M709j8770
$$ 15995 39799 34469 3291 -17376 -1466 30453 37437 12581 -10502 -4733 16637 21346 2576
576B576j4218J2853K1407o447l0934j5806K3969L5503kl9900l2747J7209M5747
$$ 2576 -11642 1211 22618 16171 -14763 -30569 -6600 28903 28901 -10999 -43746 -26537 19210
589A9210J4897l3088l6154N858L5584J6674k2846k6359Q458L1463O853k9401k4874
$$ 19210 34107 1019 -35135 -29277 6307 22981 135 -26224 -17766 13697 20550 -8851 -33725
602c3725J8555M1562J0015l8893l9050J3678N1273K3207l3814m4381J061M1839
$$ -33725 -15170 26392 36407 -2486 -41536 -27858 23415 46622 12808 -31573 -30512 11327
614A1327K5481k2065l6294N78L3356J6635k6967l1637J0000M0192J5168l5431
$$ 11327 36808 14743 -21551 -20973 12383 29018 2051 -29586 -19586 20606 35774 343
626C43m2995P947N0495K7082l2012m8715l651M3116L1323j8315m0140o249L3629
$$ 343 -42652 -34705 15790 42872 10860 -37855 -41506 1610 32933 14618 -25522 -31771 1858
639A858K3559j9138l2494K708L7163K0097k6968m1037K689M6206L0051k5731m7324
$$ 1858 25417 6279 -26215 -23507 13656 33753 6785 -34252 -31563 14643 44694 18963 -28361
652b8361q588L9657L5255j2188m0628j4343K7760K8567j0243l1701o199K7945
$$ -28361 -36949 2708 37963 25775 -14853 -29196 -1436 27131 16888 -14813 -21012 6933
664F933K1898j7405l5670m062L6314K8748j7544m1819j2474L1206L3973m528l4708
$$ 6933 28831 11426 -24244 -28306 8008 36756 19212 -22607 -35081 -3875 30098 25570 -9138
677i138j8857J8974K8245q35k4330j1100J7481J9515o989k4861o359K4455K3188
$$ -9138 -27995 -9021 19224 18389 -5941 -17041 440 19955 12966 -11895 -18254 6201 29389
690B9389r428l0576j1804K1015K7415R40k4537j8850Q926K1375N540j3990j2454
$$ 29389 19961 -10615 -22419 -1404 26011 26951 2414 -16436 -7510 13865 19405 5415 -7039
703g039M546J0707r39j2662n019J0424J0661o034j7397p619R988J4405J876j2619
$$ -7039 -2493 8214 7275 -5387 -10406 18 10679 4645 -12752 -20371 -10383 4022 5898 -6721
717f721j2953k70J0302P407j720o127l672l16Q19K600M471L000j799o212j920
$$ -6721 -19674 -19944 -9642 -2235 -3955 -10082 -13754 -14070 -13251 -10651 -6180 -3180 -4979 -11191 -13111
732a3111N573O440J186j511m15M89p00r50K552P350O146l667j1605m791J0408
$$ -13111 -7538 -1098 88 -1423 -1838 -1349 -2049 -2999 -447 6903 13049 9382 -2223 -7014 3394
747C394J6078K732j4210j4506L971J7494P993j0662j2960J622J1435L280j0197
$$ 3394 19472 22204 7994 -6512 -2541 14953 22946 12284 -676 946 12381 15661 5464
760E464q415N648J4075Q9j8034j4124R714K1984N788k0299k1874L569K4553J1797
$$ 5464 -2951 2697 16772 16861 -1173 -15297 -5583 16401 22189 1890 -19984 -16415 8138 19935
774A9935j4854k0570J087J7238R209j1631j4260M404J8091M794j7787j6365R115
$$ 19935 5081 -15489 -14402 2836 12045 414 -13846 -9442 8649 13443 -4344 -20709 -11594
787a1594K5660Q012k1706k3576N180K7862J4276j7399k3977J275K2309J0888j3756
$$ -11594 14066 22078 372 -23204 -18024 9838 24114 6715 -17262 -15987 6322 17210 3454
800C454j8050L215K1207P261j9511k0207Q900K8251R423k4159k8011N202L2515
$$ 3454 -14596 -11381 9826 17087 -2424 -22631 -13731 14520 23943 -216 -28227 -23025 9490
813I490J6932k1108l0542M97K8089J6920j5341k5732l99K5622J5168j8564k6812
$$ 9490 26422 5314 -25228 -24731 3358 20278 4937 -20795 -21194 4428 19596 1032 -25780
826b5780L399L1741J6749k1525l3139n06L4708K5310j7378l5892p483K9226K6337
$$ -25780 -22381 9360 26109 4584 -28555 -29061 5647 30957 13579 -22313 -29796 -570 25767
839B5767r478l0282j0151K3435K3048q847k8353p052K5064K2677j1123l1100r224
$$ 25767 16289 -13993 -24144 -709 22339 13492 -14861 -21913 3151 25828 14705 -16395 -25619
852b5619K5536K7600p071l1731j4925J9456K7481J054k4104j6722J1403K2082
$$ -25619 -83 27517 20446 -11285 -26210 -6754 20727 21781 -2323 -19045 -7642 14440
864A4440K853j9047j1660J1461J7955j390j8778j0261J3040J9870l26j9158j3232
$$ 14440 17293 -1754 -13414 -1953 16002 14612 -4166 -14427 -1387 18483 18157 -1001 -14233
877a4233R188J8487N029j3091j3573K119J3271N065q239p304L515P173j167q422
$$ -14233 -5045 13442 18471 5380 -8193 -6074 7197 12262 4023 -3281 234 7407 6240 -2182
891b182l426P053Q572k667j1504n383O556Q991L61p558o143J988N391R21m135
$$ -2182 -5608 1445 10017 7350 -4154 -9537 -2981 6010 6371 -1187 -7330 -5342 49 970 -3165
906c165j425L497J239m559m388K043P682L238o028q270L4P622O061k664n622k082
$$ -3165 -4590 -1093 146 -4413 -8801 -6758 924 4162 -1866 -10136 -10102 -2480 3581 917 -4705 -6787
922f787K407L509K37j442N22K777j262l956o37M857M347j038n465k904L292M631
$$ -6787 -4380 -871 -634 -2076 -1554 1223 -39 -3995 -4632 225 4572 3534 -1931 -4835 -1543 3088
938C088J32k610p66J663m29l034o0M193M954k008q478n042O422J0955O89j0557
$$ 3088 3220 610 -156 1507 1078 -1956 -2016 2177 7131 5123 -3355 -8397 -1975 8980 9669 -888
954h88q357M049J1058L041q858q187M730J0507K79j0915p010P627J3762R07j5591
$$ -888 -9245 -5196 5862 8903 45 -8142 -3412 7095 7374 -3541 -10551 -2924 10838 11745 -3846
969c846j2307Q159J9976N275j6836j7144M717K0063R717j3416j7878K161J8446
$$ -3846 -16153 -7994 11982 17257 421 -16723 -12006 8057 17774 4358 -13520 -11359 7087
982G087Q669j2311j6100K782J8633R155j4107j9887K373K3090J2373j4561k3248
$$ 7087 15756 3445 -12655 -9873 8760 17915 3808 -16079 -13706 9384 21757 7196 -16052
995a6052j642K1641J6814j0144k2683n413J8097J5525p459j9605m008J6444J3783
$$ -16052 -17694 3947 20761 10617 -12066 -17479 618 16143 8684 -10921 -14929 1515 15298
1008A5298q782j9983l145J8800J5137r423k1992n410J8193J7854n653k1411q427
$$ 15298 6516 -13467 -16612 2188 17325 7902 -14090 -19500 -1307 16547 10894 -10517 -18944
1021a8944J5436J6147l380j7253o361J3059J3513n270j6783m362J6218J3935p245
$$ -18944 -3508 12639 9259 -7994 -14355 -1296 12217 6947 -9836 -14198 2020 15955 8710
1034H710j8676n468J5922J6486m589j9219p531J3143J6046k662j5660p394J0839
$$ 8710 -9966 -15434 488 16974 12385 -6834 -14365 -1222 14824 12162 -3498 -10892 -53
1047e3J3335k688j5861n830J3097J3169m733j7288o554J2676J5919k530j7112
$$ -53 13282 10594 -5267 -11097 2000 15169 10436 -6852 -13406 -730 15189 12659 -4453
1060d453j0410J0180J5520Q84j4016r617O348J2790J058j2032p740P265J1971
$$ -4453 -14863 -4683 10837 11721 -2295 -11912 -5564 7226 8284 -3748 -11488 -4223 7748
1073G748p84j2111p607O947J2822J939j1518j0193M424J2454M198p664q930P65
$$ 7748 6964 -5147 -12754 -5807 7015 8954 -2564 -12757 -8333 4121 8319 655 -8275 -7510
1087g510Q325M778m632o005R31N919J721m418l588J303N444K266l730n249P39
$$ -7510 815 5593 961 -5044 -4113 1806 3527 -891 -4479 -3176 2268 4534 804 -4445 -3706
1102c706M742K656j301l168k048N73K374J461o2n51j941j847P59L278J402j992
$$ -3706 1036 3692 2391 -777 -2825 -2252 122 1583 1521 970 -971 -2818 -2059 1219 2621 629
1118F29k881k15K448J772j347k745P12L442P42m041k680K218N566J954n034o230
$$ 629 -2252 -2467 -19 1753 406 -2339 -1627 1815 2557 -1484 -4164 -1946 3620 5574 540 -5690
1134e690J233P841M177m920p342l00O581M579k944o536k87O702K804m702o003
$$ -5690 -4457 3384 7561 2641 -4701 -5001 1580 6159 3215 -3321 -3608 3094 5898 1196 -4807
1149d807J967P481L456o552q347J485R611N152o002r796K48Q908N785n032q695
$$ -4807 -2840 4641 8097 1545 -6802 -5317 4294 9446 3444 -6352 -6104 2804 8589 3557 -5138
1164e138K96Q819M587p241p982K593J0259M155q465j0760K320J2800O649r340
$$ -5138 -4842 3977 8564 1323 -6659 -4066 6193 10348 1883 -8877 -6557 6243 12892 3552
1178C552j2621Q33J2655P701p555j2779n12J2416P162p844j2644M26J3408P417
$$ 3552 -9069 -8236 4419 12120 4565 -8214 -8726 3690 10852 3008 -9636 -9210 4198 11615
1192A1615q924j5098n2J4773J0655q972j6819k510J4699J1902n974j5845n295
$$ 11615 2691 -12407 -12459 2314 12969 3997 -12822 -15332 -633 11269 5295 -10550 -15845
1205a5845J3038J2594m836j5386l983J2318J2207n019j5188n320J3158J4067l969
$$ -15845 -2807 9787 4951 -10435 -14418 -2100 10107 5088 -10100 -15420 -2262 11805 7836
1218G836j6303o667J1813J4711p92j5003q267Q615J4465L74j2838p456P236J2069
$$ 7836 -8467 -15134 -3321 11390 10598 -4405 -12672 -4057 10408 10782 -2056 -9512 -2276 9793
1232I793K32j1503p484P551J2216o3j2497p383O729J1979J146j0094q760M189
$$ 9793 10025 -1478 -8962 -1411 10805 10742 -1755 -9138 -2409 9570 10716 622 -8138 -3949
1246c949J0706K098q477o800L470P980J446p404n991M176Q286k70p582m975M066
$$ -3949 6757 8855 378 -6422 -2952 5028 6474 -930 -6921 -2745 5541 5271 -2311 -7286 -3220
1261c220Q018R81o990o010L044P364J807o148m358K921N257J068m610l463L080
$$ -3220 4798 5779 -1211 -7221 -4177 3187 4994 -1154 -5512 -2591 2666 3734 -876 -4339 -1259
1276a259N898k52n736l467L860N534K67m558m601K173N976J383m059l610J082
$$ -1259 4639 4387 -1349 -4816 -956 4578 4845 287 -4314 -2141 3835 5218 1159 -2451 -1369
1291a369L785R28k535k557J137L097M2k952j427J246K891K6j876k087j63K165
$$ -1369 2416 3344 809 -1748 -611 2486 2528 -424 -1851 -605 2286 2312 436 -1651 -1814 351
1307C51J064n29j230p12p82O54J590K79o81j551j200J123K591P32l030k043J540
$$ 351 1415 886 -344 -1056 -1838 -1184 406 685 4 -1547 -2747 -1624 967 1699 -1331 -3374 -1834
1324a834K896K0k961j839K281L394K01m455l547L260N995N20n494n088K088P489
$$ -1834 1062 1082 -1879 -3718 -1437 1957 2158 -2297 -5844 -2584 3411 3931 -1563 -6651 -4563 2926
1340B926L237n804o762J546P166L473m886o685J023P582L954n519p421R50Q708
$$ 2926 6163 359 -6403 -4857 2309 5782 896 -5789 -4766 2816 6770 1251 -6170 -5220 3488
1355C488M866n886q838k11R323O772n149r798j350Q303P156m027q897j742P299
$$ 3488 8354 2468 -6370 -6581 2742 9514 4365 -5433 -6783 1520 8676 4649 -4248 -5990 1309
1370A309P210m215r138j833Q406O830l999r978k547Q755Q120l673j0671k824P910
$$ 1309 8519 4304 -4834 -6667 1739 8569 4570 -5408 -7955 800 8920 5247 -5424 -8248 -338
1385c38P738k651q862m019O948P783k337r213k876P457P684l148r861k933Q021
$$ -338 7400 4749 -4113 -8132 -1184 6599 4262 -4951 -7827 -370 7314 4166 -5695 -8628 -607
1400f07Q877l069j0482l310P602Q869j858r790m376O583R244r56j0110l854O950
$$ -607 8270 5201 -5281 -8591 -989 7880 6022 -3768 -8144 -1561 7683 6727 -3383 -7237 -287
1415b87Q495j831r823l928O974R181j133j0478n215O861Q946J11r039o141M707
$$ -287 8208 6377 -3446 -7374 -400 8781 7648 -2830 -8045 -1184 7762 7873 -1166 -7307 -2600
1430b600R177Q88q397o262M589Q546M35p837n600L731Q611J238p922o400L625
$$ -2600 6577 7465 -932 -7194 -2605 5941 6376 -1461 -7061 -3330 5281 6519 -1403 -7803 -4178
1445d178Q137K070o345o486J712P286L261n163o265J701N996K115m181m502J177
$$ -4178 3959 6029 -316 -6802 -5090 2196 5457 294 -5971 -4270 1726 3841 -340 -4842 -3665
1460c665N608J887l959m417J067M644K503k586m673n31M653K695k008l483k18
$$ -3665 1943 3830 -129 -4546 -3479 1165 3668 1082 -3591 -4122 531 3226 1218 -2265 -2483
1475b483K494K108j445k058L4J735J142j486j726P92J468M72m48j488k72J063
$$ -2483 11 2119 674 -1384 -1350 385 1527 41 -1685 -893 575 1047 599 -889 -1161 -98
1491i8P56J45r64j01K76m66m7J130M14n76j242j63Q25J167n64j412R8J148N44
$$ -98 658 803 -161 -262 14 -452 -499 631 1045 469 -773 -936 -111 1056 492 -920 -822 326 870
1510H70r25j028N57J362P35j533k100R24K641J016j960k839M06L253J841k355
$$ 870 -55 -1083 -526 836 1571 38 -2062 -1138 1503 2519 559 -2280 -1874 1379 3220 865
1526H65l073L39L573J340k265k902Q94L264J684k790m190R66M833K518m019m834
$$ 865 -2208 -1869 1704 3044 779 -2123 -1229 2035 3719 929 -3261 -2295 2538 5056 1037 -3797
1542c797P03N420L308l610n472j44N679L244l418n155m71N454L481l365n985m93
$$ -3797 -3094 2326 5634 2024 -3448 -3592 2087 5331 1913 -3242 -3713 1741 5222 1857 -4128 -4621
1558d621O365M558m007p125q02O563N507l051p954j763O783N374k502p355k038
$$ -4621 1744 6302 2295 -4830 -5632 931 6438 3387 -4567 -6330 453 5827 3325 -4030 -6068
1573f068N418O121k168p254l052O569O398k193p846k904O024O779j615p519m018
$$ -6068 -650 5471 3303 -3951 -7003 -434 5964 3771 -4075 -6979 -955 5824 4209 -3310 -7328
1588g328N807P237j290o957m044N058O254J58o935m385M680O953q69o571m308
$$ -7328 -1521 5716 4426 -2531 -6575 -1517 4737 4895 -2040 -6425 -1745 5208 4339 -2232 -6540
1603f540M410O807K11o842m549L885O767O52o108m417L228O145R48n716m559K980
$$ -6540 -2130 4677 4888 -1954 -6503 -2618 4149 4801 -1307 -5724 -2496 3649 4597 -1119 -5678 -2698
1619b698O688O66n771l975K584O062P97n315m511K776N873J188m632m625K028
$$ -2698 3990 4656 -1115 -5090 -2506 3556 4353 -962 -5473 -2697 3176 4364 -268 -4893 -2865
1634b865N602J723m213m113J378N414J214l548m004J331M625J571l249m042P65
$$ -2865 2737 4460 247 -3866 -2488 2926 4140 592 -3412 -2081 2544 4115 866 -3176 -2411
1649b411M845J703k768m061L47L830K399k557l305L65K995J727k055k336k97K778
$$ -2411 2434 4137 1369 -2692 -2345 1485 3884 1327 -1978 -1613 1382 3109 1054 -1282 -1579 1199
1665A199J407j469k470k02K057J503q13k056o44J234J548l6j535n92P91R15l61
$$ 1199 2606 1137 -1333 -1535 522 2025 1212 -844 -1488 -254 1294 1258 -277 -869 -78 837 476
1682D76n38l77J44N64o6r7p15M34J49L2J91k64n20k18R23M32K67j405p43N93J785
$$ 476 -62 -439 -295 269 203 106 -609 -175 -26 6 197 -67 -587 -805 118 550 817 -588 -1331 -738 1047
1703A047R2j392j284J16K451M99j327j582j8K018R40j581j921M49K655Q69j703
$$ 1047 1139 -253 -1537 -1421 1030 1529 202 -1380 -1398 620 1560 -21 -1942 -1493 1162 2031 328
1720C28k736L49L133J505k077l394M72L178J838j725l489l10L578J974j737l769
$$ 328 -2408 -2059 1074 2579 502 -2892 -2420 758 2596 871 -2618 -2928 650 2624 887 -2882
1736b882m4L749K070k251l662l12L896L068k419m464l75M073L278k218m295j362
$$ -2882 -2926 823 2893 642 -3020 -3332 564 3632 1213 -3251 -3626 447 3725 1507 -2788 -4150
1752d150M000L704j718m237j459M109L581j473n035j441M530L917j715n400j408
$$ -4150 -150 3554 1836 -2401 -3860 249 3830 2357 -2678 -4119 411 4328 2613 -2787 -4195
1767d195M244M342j199n263k047L816M894p67n694k263M115M569q32n019k543
$$ -4195 49 4391 3192 -2071 -4118 -302 4592 3825 -1869 -4132 -17 4552 3720 -1299 -3842
1782c842L488N048m60n405l005L475N191J32n675l212L029N228N69n161l497K475
$$ -3842 -354 4694 4234 -1171 -4176 -701 4490 4622 -1053 -4265 -1236 3992 4561 -600 -4097 -1622
1798a622M907M97m291l859K383M893J326m696l921K267M798P61l649l762J523
$$ -1622 3285 3782 -509 -4368 -1985 2908 4234 -462 -4383 -2116 2682 3443 -206 -3968 -2445
1813b445M288J757l708l809J540L933J676l255l401J177L793J563k776l383J008
$$ -2445 1843 3600 -108 -3917 -2377 1556 3232 -23 -3424 -2247 1546 3109 333 -3050 -2042
1828b042L436J358k359l100O74L315J623k354k447Q6K646J530j561k500k42K779
$$ -2042 1394 2752 393 -2707 -2033 1282 2905 551 -1896 -1810 836 2366 805 -1695 -1937 842
1844H42J423j781k074k44K260J693j729j931o37K394J388j085k047n77K156R26
$$ 842 2265 484 -1590 -1834 426 2119 390 -1541 -2178 216 1604 519 -1528 -2105 51 977
1860I77m06j898o28J430J017j93j369m34R72J084m1j081m65L86J221r5p83m28
$$ 977 571 -1327 -1955 -525 492 299 -1070 -1504 -532 552 511 -570 -1035 -649 572 477 -306 -734
1878g34L19L88K00J70n91l79L82P05K37J17j091m42P95Q33k72p96l98O17R52J49
$$ -734 -415 -27 173 343 -248 -627 -245 460 697 814 -277 -719 76 909 637 -159 -557 60 1012 1161
1898A161j354r00J072J637K51j978j164P11K003Q40j352k331N64J881J271j547
$$ 1161 -193 -1093 -21 1616 1867 -111 -1275 -564 1439 2279 927 -1404 -840 1041 2312 765
1914G65k018o9K274J362j547k752N98K633J435j682k607j54K521K332j628l508
$$ 765 -1253 -1322 952 2314 767 -1985 -1387 1246 2681 999 -1608 -1762 759 3091 1463 -2045
1930b045l19K989K324j569l286m94K427K603j387k846j198K957K242q69l357r07
$$ -2045 -2364 625 2949 1380 -1906 -2400 27 2630 1243 -1603 -2801 156 2398 1529 -1828 -2735
1946b735K541K946j268l449j352K871K947p42l139j665K603L076p43l223j725
$$ -2735 -194 2752 1484 -1965 -3317 -446 2501 1759 -1380 -3045 -442 2634 1891 -1332 -3057
1961c057K812K937o55l571j422K218L770n45l795j810K061L941k80l877j741K205
$$ -3057 -245 2692 2037 -1534 -2956 -738 3032 2487 -1308 -3118 -1057 2884 2604 -1273 -3014 -809
1977h09L398L38l789k491K350L357K87l618k273K101L452L18l615k861K246M004
$$ -809 2589 2927 -862 -3353 -1003 2354 2641 -977 -3250 -1149 2303 2621 -994 -3855 -1609 2395
1993B395ql043k871J161L749J567l244l001J145L593R35k533k765N33L498J422
$$ 2395 2387 -656 -3527 -2366 1383 2950 -294 -3295 -2150 1443 2378 -155 -2920 -2387 1111 2533
2009B533k500k627M21L550J138j563l042n5L018J822j506k956J64J971K132j215
$$ 2533 33 -2594 -2173 1377 2515 952 -2090 -2145 873 2695 1189 -1767 -1603 368 2500 1285
2025A285k294j6J666J423r42j933o57K046J294o89k030l21J467J469q70j198p86
$$ 1285 -1009 -1025 641 2064 1122 -811 -1468 578 1872 1183 -847 -1168 299 1768 898 -300 -1086
2042a086J190R40l88j174O2L46J164j00j368l51P15R80j32q09l45J25J142k69
$$ -1086 104 1044 656 -518 -456 -110 1054 954 -414 -765 -50 930 798 -11 -356 -231 911 642
2060F42q87r3J67N27m6J4p01J31L03K51k32k6J49pk7j46m7m2l04O53J11j53l91
$$ 642 -245 -338 -171 356 310 324 -377 -246 57 308 76 50 199 192 165 19 -28 -70 -374 279 390 237 -154
2083a54j41K99K14P1o48m24N79M47L36p09p21L81R70J25j126m74M30R76M87j169
$$ -154 -295 4 218 289 -359 -783 -204 243 579 -130 -851 -470 500 625 -501 -975 -545 431 918 -251
2103b51r84k2J801N42j329j437M73J727Q63j112j596m2J748O37r41j779K28J716
$$ -251 -1235 -1257 544 1086 -243 -1680 -1207 520 1383 271 -1325 -1367 381 1018 77 -1702 -1474 242
2121B42J252r33k308N7J821J837j257k319m39K262K006j195k597q80K381K393
$$ 242 1494 561 -1747 -1690 131 1968 711 -1608 -2047 215 2221 1026 -1571 -2451 -70 2323
2137B323j378k115q16J763K113l68k672j090J929K270n12k223j376J810K572k67
$$ 2323 945 -1170 -1986 -223 1890 1522 -1150 -2240 -311 1959 1447 -776 -2152 -342 2230 1963
2153A963k900j285J684K396M57k761j658J327K458O38k314k051J513K720j40k430
$$ 1963 -937 -2222 -538 1858 2315 -446 -2104 -777 1681 2319 5 -2046 -533 2187 2047 -383
2169c83j537J132K668N36k519j922J088K568M73j980j828O96K400R21k110j991
$$ -383 -1920 -788 1880 2416 -103 -2025 -937 1631 2104 124 -1704 -1008 1392 2313 203 -1788
2185a788N20K665M76j828j842Q35K203P64j998k010Q50K040P46j288j622J76J956
$$ -1788 -1268 1397 1873 45 -1797 -962 1241 2005 7 -2003 -1153 887 1633 345 -1277 -1101 855
2202H55J102j541j807J4K073Q67j305j373j72J723J112j307j313n69K106Q93p45
$$ 855 1957 416 -1391 -1377 696 1563 258 -1115 -1287 436 1548 241 -1072 -1641 465 1358 613
2219F13j783q13K091J372o64j854l14J228J305m69j295m85P64J084Qj492q30P98
$$ 613 -1170 -1983 108 1480 816 -1038 -1352 -124 1181 712 -583 -1068 -304 780 788 -704 -1534 -736
2237g36J175L02j387n39L41J093N08j034o36K00P53N03m44q26K95M92L91k06q16
$$ -736 439 741 -646 -1185 -844 249 757 -277 -913 -713 40 543 99 -727 -432 60 451 245 -571
2256e71r5M47O55k62o57k35M99P79r3m48r4k3J87P34m85o25r3M77O55j83l79n22
$$ -571 -666 -219 436 174 -483 -718 -219 560 467 19 -75 -98 89 823 338 -287 -380 97 752 569 190 -332
2278c32K29O13J46o67m13L50O78n5o20m51J61Q48L10p84j094N36J255L99r40q92
$$ -332 -103 510 656 -11 -424 -74 604 549 -71 -522 -361 487 797 13 -1081 -545 710 1109 169 -723
2298g23J51J159O81q22j031L17P74N30p56j203L28J366Q66j216j398l1J424R86
$$ -723 -572 587 1268 446 -585 -268 506 1036 280 -923 -595 771 1637 421 -977 -1008 416 1402
2316A402p98j306R3Q26J223p74j179n29J475Q61o44j126p38J483J436q99j757
$$ 1402 604 -702 -609 217 1440 666 -513 -1042 433 1294 650 -476 -1214 269 1705 806 -951
2333i51k39R19J685m45j895q13J386J625l18j958n74Q74J665N7j767j131J155
$$ -951 -1190 -271 1414 969 -926 -1739 -353 1272 954 -1004 -1578 -704 961 1018 -749 -1880 -725
2350g25J910m9j617j349R59J841L74j547j554Q28K012N72j608j429M52J592N44
$$ -725 1185 1136 -481 -1830 -871 970 1344 -203 -1757 -929 1083 1655 47 -1382 -930 662 1206
2367A206j132j681J37K239N91j666r31L49J525Q96j442j622K2K175O87j113j650
$$ 1206 74 -1607 -1470 769 1360 -306 -1237 -888 637 1533 91 -1531 -1509 666 1353 240 -1410
2384a410J67J478J042r69j384l51J626Q90q04j196l14J559Q54r57j477l1J224
$$ -1410 -1243 235 1277 308 -1076 -1427 199 1089 285 -911 -1225 334 1188 231 -1246 -1277 -53
2401e3J255m31j233m18R01R24k39j102m44Q19P87j88r01m89J007O18P0j288j92
$$ -53 1202 771 -462 -880 21 945 706 -396 -840 -21 766 578 -323 -812 195 813 883 -405 -597
2420e97N09J068j87j328j34M55Q99j9p26m24M31Q30m30k00n11o1P32N03q13p36
$$ -597 -88 980 793 -535 -669 -214 685 666 -60 -484 -53 777 347 147 -364 -425 307 810 -3 -739
2440g39L75R64N2o09j36k03M55N35q1o23l76L12M90N3n99l20L45K79N25n67m42
$$ -739 -364 600 652 43 -93 -296 159 694 613 -10 -386 -74 416 469 -130 -450 -105 174 699 132 -310
2461c10K85N03k4P1r22K20M76K18k84m97j84K23O24po44n99N03O79K83p22m51
$$ -310 -25 478 454 525 -397 -177 299 517 233 -264 -448 -225 399 392 -252 -851 -348 331 614 -108 -559
2482e59LQ10q7m18p08N57M35M01q83o55N11Q62M81n46j022rJ047R23p28j011L8
$$ -559 -556 254 167 -251 -959 -402 33 434 -449 -1104 -593 269 750 204 -818 -827 220 1143 415 -596 -558
2503e58O18P09j75j287J59O37R69p87j127J87P61Q05l66j469n02J470J392l69
$$ -558 60 769 594 -693 -534 103 1072 285 -842 -655 106 911 545 -924 -1426 44 1436 1067
2521A067j770m32P75J101L9j243o21Q98P98q3j146j47M54R87L83j694l41M86J195
$$ 1067 -703 -1135 -360 741 780 -463 -1084 -186 612 529 -617 -764 -310 677 1060 -634 -975 -489 706
2540G06J35q30q34M15J112K93j079q57N27J114J21q35q46Q11Q83M93j074j118
$$ 706 841 11 -823 -408 704 997 -82 -939 -412 702 823 -12 -858 -47 836 1329 255 -863
2558h63K73J589J94r44j024J85J079P18q07j437L78J346L04o29j372K19J241N37
$$ -863 -590 999 1193 249 -775 -590 489 1207 400 -1037 -659 687 991 362 -1010 -791 450 987
2576I87n20j226k3J137P41q60r12l6Q15R05l03j548j17R12Q04j78j108l78R12
$$ 987 467 -759 -782 355 1096 236 -676 -712 103 1008 705 -843 -960 -48 756 578 -530 -908 4
2595DO09l28p50l66J124K39j57j037O1K11J249k19q43n88K06J147O9o12o76NQ53
$$ 4 613 285 -465 -831 293 532 375 -662 -601 -390 859 640 -203 -791 -585 562 631 19 -657 -652 201
2616B01K77m56l62j53P23l4r1q25%O73N87p86l61J04K08P22k89l53k74L51L11
$$ 201 478 22 -340 -493 230 196 105 -720 -720 -47 540 -246 -607 -503 -295 427 138 -215 -489 -138 173
2637A73j07m9j22J54J27j15l0k50R9K99J87n70j69j0O60Q3k89n83P5P43L65k92
$$ 173 66 17 -105 49 176 61 31 -219 -120 179 366 -204 -373 -383 277 360 71 -512 -437 306 671 379
2659C79n92j51M30J46l4k96k39M37J0L72p00K11J44K93J07q30J60j12N90q0p8
$$ 379 -213 -364 66 212 178 -118 -357 80 90 462 -238 -27 117 410 517 -313 -153 -265 325 245 167
2680A67n82K0Q15K44n84ln12Q58kl57n45l6O69P35q06o47N89N12J72l36r03lJ017
$$ 167 -415 -395 420 664 80 77 -435 423 421 64 -481 -517 152 887 81 -566 23 535 707 371 -532 -535 482
2703D82K50k99m84k26K5J010k41p22j41M93O27m0j246l33Q25P48p9j213n02R72
$$ 482 732 433 -51 -277 -252 758 517 -205 -346 147 774 734 -512 -845 -20 728 649 -564 -1066 -94
2723i4O62L56j507l59M98Q17J22m49q19L09J017j05p88k45L73P86l50l31r62M13
$$ -94 568 924 -583 -942 -444 373 495 46 -773 -464 553 448 -340 -585 -212 574 224 -107 -1069 -656
2743f56J019N30p95j015K03Q21P93r53n57l02Q89L29k48l86MN32O85o41p29NM84
$$ -656 363 893 98 -917 -714 107 900 -53 -610 -912 -23 306 58 -328 -324 208 893 252 -477 -472 12
2764A2O22m78p26J50K40N62j00q66l93P71O89n90l82M5P23n2K7n74j86M55N46
$$ 12 634 156 -570 -420 -180 382 282 -584 -977 -206 483 -107 -489 -444 279 227 254 -320 -506 -51 495
2785D95o8p67m14L62J080j09q04n14P54N31j30k77n88L94O57j76l18j52M8K81
$$ 495 427 -340 -754 -392 688 579 -225 -739 15 546 416 139 -449 -55 602 426 108 -44 4 285
2805B85J33o61l89M04N09L67n01j76m17L73O79l44k36l73L39O89m66l81o6N50
$$ 285 418 -243 -632 -228 281 648 147 -29 -446 -73 606 262 26 -347 -8 681 215 -166 -232 318
2825C18p3K7l53k05K75M07k91k36j72o7R64m5l92l96k6M90L07n35k83J2N5M13
$$ 318 245 272 -81 -286 -11 396 105 -131 -303 -370 594 549 157 -239 -265 225 532 -3 -286 -274 -219 194
2847A94k59j9j65L00L07k82n17J98J85L64l8o19k67M06O62j44n31n36L99L97k0
$$ 194 -65 -84 -249 51 358 76 -441 -243 -58 306 268 -351 -618 -212 450 306 -225 -761 -362 35 15
2868A5l1k71J03O15k12k57o33N19M51r4k60n29K55J65O04l38n40j86O27M55l41
$$ 15 -16 -287 -184 431 219 -38 -671 -152 299 205 -55 -584 -329 -164 440 102 -438 -624 3 458 117
2889A17j49n33P29J82n68k67J03K46N14k29m73l01P08M76k75p70j9L24Q33k80
$$ 117 -32 -565 164 346 -222 -489 -386 -140 374 145 -328 -629 79 555 280 -490 -509 -185 648 368
2909C68p45j31L44M80K6n35j05L04M80j9n57k54L36Q06k44o76m03K03Q43%m77
$$ 368 -377 -508 -164 316 342 -193 -298 6 486 467 -90 -344 -8 798 554 -122 -525 -322 521 521 44
2930D4p65O66L77J73n83l05J52M94L31l82n73kJ008J2k83o76n6O24M96o10n38
$$ 44 -721 -55 322 495 -88 -393 -241 253 584 202 -371 -373 635 647 364 -312 -368 256 752 142 -396
2951c96J03N13N37p9r45q7M48L46k37n92K86R4J22Mk48l53L42K49q0j06o19N89
$$ -396 -293 220 757 678 -267 -354 94 440 203 -389 -103 -9 113 117 -131 -484 -142 107 27 -79 -698 -109
2973a09N81j24k45o03L79M48K2m16k67K76L18J63l34n22J09O20m0k57m72N0Q28
$$ -109 472 348 103 -500 -121 327 349 -67 -334 -58 260 423 89 -433 -324 296 256 -1 -473 -423 405
2994D05l42K00m60QL26J27j51k79R2J54o7m7o8m13L54L37j51p28K66N20J50m80
$$ 405 63 263 -197 -189 137 264 113 -166 -74 80 13 -34 -102 -515 -161 176 25 -703 -437 83 233 -247
3016b47k68L9L58L44q0k94OO6K12K31k64n96K10O76l23p6o26K81N73j48p9j1q2
$$ -247 -515 -476 -118 226 146 -148 -142 -76 136 367 103 -493 -283 393 70 -6 -632 -351 222 74 -5 -16 -98
3039i8J69l0L51q27J44J63L75j36j97j52K38L06P2n19J68l43M69o8j83j41K70
$$ -98 71 41 392 -435 -291 -128 247 111 -86 -238 0 306 378 -141 27 -316 153 85 -98 -239 31
3060C1K25j0j41l29j16P44o2l71k62J11N51L2k2p25Q3M51N5k85j87P0L74K58n05
$$ 31 256 246 105 -224 -340 404 342 -29 -291 -180 371 403 381 -344 -261 190 245 -40 -227 -157 217 475 -30
3083c0j07r6M45J9j02l60j25M60K89l4l19l04N21J72n58K7r9M93O3K2p66J67N60
$$ -30 -137 -233 212 231 129 -231 -356 104 393 359 40 -264 257 429 -129 -102 -201 292 355 377 -389 -222 338
3106C38j18J9l06l16P0O07r2j72m89J49K66L46l67j05j65P45Pp38lr2P04J15m73
$$ 338 220 239 -67 -383 -313 294 202 30 -459 -310 -44 302 -65 -170 -335 410 417 -321 -324 -416 288 403 -70
3129g0j65p6N19J7K9k98j94L22L82k91m45Q8L98J65j56o30K19M13L27n53k60k06
$$ -70 -235 -311 208 225 254 -44 -238 84 466 175 -270 -182 216 381 225 -405 -186 227 554 1 -259 -465
3151d65M08N50k15m25l56K64L79M6j82j04q8N62m78J56j76Q7J77J86m22k68M81
$$ -465 -57 493 278 -147 -503 -239 140 186 4 -100 -188 374 -104 52 -124 -37 140 326 -96 -364 117
3172A17l3L28m86m0O0J07J27k5n54M06J52O4K46n41K9J27L52l51m37K44K15J41
$$ 117 84 412 -74 -114 -54 53 180 155 -399 7 159 223 469 -72 -43 84 436 85 -352 -108 107 248
3194B48L9o78L16O2O52j38p91P2J24K58J18m83L05j50K02K15k81J5K76l12K4j59
$$ 248 287 -391 -75 -13 639 501 -290 -218 -94 164 282 -201 104 -46 156 371 90 105 381 69 93 -66
3216f6k02L74K69p5k7p07M14q7J84K10m24K88j7m3k51K53m39L04L05r2m08K61
$$ -66 -268 106 375 300 273 -434 -20 -107 77 287 -137 151 134 91 -160 93 -346 -42 263 171 -237 24
3238B4J12J35k58k81N6P2L18K44p35PL24m1L62n30j86K4N39l5k89j45L7P48k77
$$ 24 136 271 13 -268 -212 -140 178 422 -313 -306 18 -23 339 -191 -377 -353 186 151 -138 -283 -246 502 225
3261B25l25m77K59L38J61m01j25lK83K37j77m21J80K83K2J48m41r7M43K14k74
$$ 225 -100 -577 -318 20 181 -220 -345 -348 -65 172 -5 -426 -246 37 59 207 -234 -331 112 326 52
3282E2j55l4K3N20p02R0JJ13L51j8m75J44K03J03j66K5j74J17O26p08%k81J85
$$ 52 -103 -137 -114 406 -296 -206 -205 -92 259 241 -234 -90 113 216 50 75 -99 18 644 -64 -64 -345 -160
3305a60L12R4k10j38J40L04m54j87l6K36J36M70k17k60k23L12Q3k53j38J50M8
$$ -160 152 246 36 -102 38 342 -112 -299 -335 -99 37 507 290 30 -193 119 202 -51 -189 -39 9
3326IO5r0Rq3K50N56m34j78k64L56J06k1n18m5M00L5m2p1k19L61KO7l69K7m3L25
$$ 9 74 -16 -7 -90 160 716 282 104 -160 196 302 281 -237 -282 118 153 111 40 -179 182 184 251 -118 -91 -134 191
3352A91l3l16j78N26Q5R7m95j35K79q0K80k09k48J39J01J39l39p7K76J91Q1n07
$$ 191 158 -158 -336 190 275 372 -123 -258 21 -59 221 12 -236 -97 4 143 -196 -273 3 194 275 -232
3374b32O0K58k20L36l94m6l87M65M5m4K02l48M34J24j56l4j46k11L66j01j23j49
$$ -232 -172 86 -134 202 -192 -238 -625 -160 -115 -159 43 -305 129 253 97 63 -83 -294 72 -29 -152 -301
3396c01j37O06j26ml65K74K02m7o8m04R4K78K49k14j71J62K84l87j36p4L72j51
$$ -301 -438 168 42 38 -327 -53 149 102 34 -370 -276 2 251 37 -134 28 312 -75 -211 -285 87 -64
3418f4J81k83J33j91M44J60l16k34k51M35L7q8r3R2k83O04r9l60q2L40J39j09
$$ -64 117 -166 -33 -224 220 380 64 -170 -421 14 51 -37 -130 -38 -321 283 184 -176 -258 82 221 112
3440A12k7n02M28Q2j07K80m95N47k02J59n46m9L43%N3K2k00q6M56n7m32J98o8
$$ 112 85 -417 11 93 -14 266 -229 318 116 275 -271 -320 23 23 76 98 -102 -188 268 211 -221 -23 -91
3463i1K76O6j49k68M44m9J13k13l81J21K59J86k72k26J88K03Q3l31j73J20L67
$$ -91 185 251 102 -166 278 229 342 129 -252 -131 128 314 42 -184 4 207 290 -41 -214 -94 273
3484B73k48J16r8m34N48J3q4k52P0N1K39J75o40K47k58P4J60JM5J17o8K92k90
$$ 273 25 141 43 -391 157 170 86 -166 -96 -45 194 369 -271 -24 -282 -208 -48 -47 -2 115 47 339 49
3507D9k52J39J49J00k87j66J73J00J37M1m36N0J31J76r7k14O9L05K40m83j04J9
$$ 49 -203 -64 85 185 -102 -268 -95 5 142 183 -253 -203 -72 104 7 -207 -138 167 407 -76 -180 -161
3529a61JK17K17J7n84K28J29J67j29k47K81j24M8l65L29k3L06r4r1j96J03k92
$$ -161 -160 57 274 291 -293 -65 64 231 102 -145 136 12 60 -305 24 1 307 213 122 -74 29 -263
3551b63N56k31l38M73M59p74K54l91K17J90j45J71J47l13j29L05P7l11J66j89
$$ -263 293 62 -276 197 656 -118 136 -255 -38 152 7 178 325 12 -117 188 265 -46 120 -69
3571f9K12j23j28K1M72k4o01K45j91K91n2M5k01l3L24K16k44j77o5J83q8M45l88
$$ -69 143 20 -108 -87 385 361 -240 5 -186 105 53 98 -103 -136 188 404 160 -17 -82 101 13 458 70
3594G0MQk55R2n8m9J17L61k7K3k97l48L10L08m63J2J16J54K15k5l12j41J79N7
$$ 70 74 82 -173 -81 -139 -188 -71 290 263 286 -11 -359 -49 259 -204 -192 -76 78 293 268 -44 -185 -6 51
3618E1o6j49j25M17j14l8j93q2J38L06j26O9j16q5k8K12j14M3p6Q7j3m96K30K71
$$ 51 -15 -164 -289 128 14 -24 -217 -299 -161 145 19 88 -28 -113 -141 71 -43 0 -76 11 -2 -498 -268 3
3642CJ61R1m14K6J29J42N7n01J40K16L1O9j36k02J61j82J41J64j67r2K42JK08
$$ 3 164 255 -159 -133 -4 138 195 -306 -166 50 81 150 14 -188 -27 -209 -68 96 -71 -163 79 80 288
3665B88k25l33N60k05m36K05jK85q5J30j49k00K30r9O6J93l27J60k6l6K36l51
$$ 288 63 -270 290 85 -351 -146 -147 138 53 183 34 -166 64 -35 31 224 -103 57 31 -5 231 -120
3687a20K05R1k69K1q3L74j18OL5k96Q8o5K52K82o92J96P1RK25k5l14M88l49M6
$$ -120 85 176 -93 -72 -155 219 101 107 142 -154 -66 -131 121 403 -289 -93 -22 -13 212 187 -127 361 12 58
3711E8k15J52K9M0o9%j80n6M98k62J53k67J48Q5J43p2k09L59k49j21r8L6J54j29
$$ 58 -157 -5 24 64 -5 -5 -185 -241 257 -5 148 -119 29 114 257 185 -24 335 86 -35 -133 -97 57 -72
3735g2J94q8Q4j32m6R7j39k75N07j54Q9P6l73J32P6l5o0J75j53K2L12j10m11K64
$$ -72 122 34 118 -14 -60 37 -102 -377 130 -24 65 141 -232 -100 -24 -59 -119 56 -97 -75 237 127 -284 -20
3759b0O3J45m05R1o5j48K69Q1j10l3K7K33l1m6o8K4K74k24l89J34J4J91j79J99
$$ -20 43 188 -217 -126 -191 -339 -70 11 -99 -132 -105 128 97 51 -17 7 281 57 -332 -198 -184 7 -172 27
3783B7m53N23p9M7r5j13K48J06r5l6j16l1K22q5l65J81r6L57J21k41m13J42K89
$$ 27 -426 97 18 65 -30 -143 105 211 116 80 -36 -67 155 70 -295 -114 -210 147 268 27 -386 -244 45
3806D5q4K2j04p4J30M07n0o53P9L07J79M9l48m31P74n7J2j86l10J01M15O7m83
$$ 45 -39 -17 -121 -195 -65 342 292 -361 -282 25 204 253 -95 -526 248 191 203 17 -293 -192 223 290 -193
3829a93K74j23M36k66j31m3J8K74k78k08p8K85J86k51L50l25K01j52M5p7j4l3
$$ -193 81 -42 394 128 -3 -46 -28 246 -32 -240 -318 -33 153 -98 252 -73 128 -24 21 -56 -70 -103
3851a03K36l32M08k71j5J55L52Q3q85K90K21k56J48l6p1K10j16k52K67l48M14
$$ -103 133 -199 209 -62 -77 78 430 513 -372 -82 139 -117 31 -5 -76 134 18 -234 33 -315 99
3872I9J3j24l18L87J0J46k50j1j80L07k5m30L34j87K33MR5l6N9j26j14P6J1k09
$$ 99 112 -12 -330 57 67 213 -37 -48 -228 79 54 -376 -42 -229 4 8 103 67 126 0 -114 -38 -27 -236
3896b36M9L15j10j03n5K77j39k20m4J37K95k38K68m01M02q7j59j92lL03j96M9
$$ -236 -187 128 18 -85 -140 137 -2 -222 -266 -129 166 -72 196 -205 197 110 -49 -241 -244 59 -137 -88
3918h8J20rK9k18L04j34J05Q0l36R2j27L4L05j01j9K32k38L1j73K7K22k69R7K30
$$ -88 32 23 52 -166 138 4 109 189 -147 -55 -182 -148 157 56 37 269 31 62 -111 -84 138 -131 -34 196
3942A96l2k72R3k1k18R0K03j21m2K41ql56O24l81NJ07Rj03K06j60m8J26j17K98
$$ 196 164 -108 -15 -36 -254 -164 39 -82 -124 117 109 -247 377 -4 1 108 117 14 220 60 12 138 21 319
3966C19l64q5N09m80K60q4j65J47J23J2k22K23L1l53K84j14R5j7N1k87O1J65r2
$$ 319 -45 -130 379 -101 159 75 -90 57 180 192 -30 193 224 -129 155 41 136 119 170 -117 -56 109 17
3989A7K38Pk78R6j32J92M7m6j21r9N30l63j52n4J67K04l51K42k94l9L90l71K30
$$ 17 255 262 -16 80 -52 140 187 141 20 -79 451 88 -64 -118 49 253 -98 144 -150 -189 201 -170 60
4012F0O6J54n38M34k0j53j52P5O8k65L17m42M13J86j09m18N30r5k93K34k89J95
$$ 60 126 280 -258 176 156 3 -149 -74 -6 -271 46 -396 17 203 94 -324 206 111 -182 52 -237 -42
4034d2K7J23j41k91L09J21k27K64Jl35J64J49N2k98L4k2J27k9J06J0Oj33L53n51
$$ -42 -15 108 -33 -324 -15 106 -121 143 144 -191 -27 122 174 -124 -90 -112 15 -14 92 102 108 -25 328 -223
4058b23J82J15p3L87l46Mk18q5L40K6m5k24K70l3J22j39k11Q9K25m6o3m06N65
$$ -223 -41 74 1 388 42 46 -172 -257 83 109 64 -160 110 77 199 60 -151 -62 163 117 54 -352 213
4081B13k17j03K8l27K33M10j90Q9j9k75L39p1J60l38Q2K2k8j27J97m0K3r7L37
$$ 213 -4 -107 -79 -406 -173 237 47 136 117 -158 181 110 270 -68 14 36 8 -119 78 38 61 -36 301
4104C01l45o9N2K48p5k27N05k44N3j95K98k38p6L39j13k12j34q8M10J5j77k54
$$ 301 -44 -113 -61 187 112 -115 390 146 199 4 302 64 -12 327 214 2 -132 -220 190 205 28 -226
4126b26J44J31j00J25l36M1Q9J82j52L36k98K03J6k76J76o9K68j58k79L53l89
$$ -226 -82 49 -51 74 -262 -221 -132 50 -102 234 -64 139 155 -121 55 -14 254 96 -183 170 -219
4147b19K7N16j88k30J91j82j23K51k85J74J27l0Mm33J8O49l20j26j6j08N28l12
$$ -219 -192 324 136 -94 97 -85 -208 43 -242 -68 59 29 33 -400 -382 267 -53 -179 -195 -303 225 -87
4169h7K06k97R2j24J12K32m00p0L29j27O40k77n53J95L57j88p0j79j01L35J3L93
$$ -87 119 -178 -86 -210 -98 134 -266 -336 -7 -134 506 229 -324 -129 228 40 -30 -209 -310 25 38 431
4191D31n07J81Q3j79p0K39j79q7J75k75L3K15R9k4l48m11O06K85j74j05l0L40
$$ 431 -76 105 188 9 -61 178 -1 -88 87 -188 -155 60 159 135 -213 -624 -18 267 93 -12 -42 298
4213B98l84K07Q5j96j99J76J58m4j03r0J75J6K42l68J04O3k81K06Jk51J08j43
$$ 298 -86 121 206 10 -189 -13 145 101 -2 -92 83 99 341 -27 77 140 -141 65 66 -185 -77 -220
4235b20L42j57k21L55j01J22k04j36L93r6j24M2L41k67j23K66l42J08n7Q3rJ38
$$ -220 122 -35 -256 99 -2 120 -84 -220 173 77 -47 -5 336 69 -54 212 -130 -22 -79 4 -5 133
4257A33k72J95n5k23l5Q7J30Q2k9J81m38K27K36j05n3J16nj22K78n02L78j86l2
$$ 133 -139 56 1 -222 -257 -170 -40 42 13 194 -244 -17 219 114 61 177 172 50 328 -174 204 18 -14
4280a4K4K8l62K01N9L55l25P2j20L35l56J74j73j92L62J9q9K88k73j4K73j7R0
$$ -14 10 38 -324 -123 -64 291 -34 38 -82 253 -103 71 -102 -294 68 87 -2 286 13 -1 272 255 345
4303C45n07mL7O0k26K26m9J5L23k55l22N51j92n5O9j87L19j35m3K9j94L90m27
$$ 345 -162 -166 -129 -69 -295 -69 -118 -103 220 -35 -357 194 2 -53 16 -171 148 13 -30 -1 -195 195 -232
4326b32L83K15m60NJ10l1m1J80K8k17o1J88k92k06J79K86Pn5L29j72K5j45L09
$$ -232 151 366 -94 -89 21 -10 -51 129 157 -60 -121 67 -225 -431 -252 34 41 -14 315 143 168 23 332
4349C32l56k33L57J0Q1k56k99M75Nmj09j12J67L18k61l25M98l03J41j5j48j26
$$ 332 -24 -257 100 110 191 -65 -364 111 116 112 3 -109 58 376 115 -210 288 -15 126 111 -37 -163
4371a63J45L57N1k71J11j91L7P6p4l40K70J77j28j69L9J13n0K22k03j03K10l66
$$ -163 -18 339 390 119 230 39 76 152 78 -262 8 185 57 -112 -73 40 -10 212 9 -94 116 -250
4393b50K63k1l53K09J06O4K91j10o00M58L6j20J56l49K93%Q7k13M5r6L04o0j72
$$ -250 13 -8 -361 -152 -46 18 309 199 -401 57 93 -27 129 -220 73 73 160 -53 -8 -104 200 140 -32
4416c2L5k76K05J63k1l01K40J02j46P8k10J70J38k09J74k25N15j68m97L60r0p3
$$ -32 3 -273 -68 95 74 -227 13 115 -31 47 -163 7 145 -64 110 -115 400 232 -265 95 5 -68
4438f8K20l58L57k55J38k30J68N4J08n4m02K72R0k08K61L0j28J94O5j89j38L33
$$ -68 152 -206 151 -104 34 -196 -28 26 134 80 -322 -50 40 -168 93 123 -5 189 254 65 -73 260
4460B60k77k91L86j57R4j27J72j05j57J38K51k99K21j23M80n20J93o3J84l50K2
$$ 260 -17 -308 78 -79 15 -112 60 -45 -202 -64 187 -112 109 -14 466 -54 139 76 260 -90 -68
4481f8J24l9k02K64j21K56M2k37Jo8k00J23J59l70M72j01J09ok62J92O9l99K44
$$ -68 56 17 -185 79 -42 214 256 19 20 -48 -248 -125 34 -336 136 35 144 138 -124 68 137 -262 -18
4504a8k1o6%l32K87J28Q4J24j42k15K05l21K33L8k51M06O7l37k71L37k16L45j86
$$ -18 -39 -105 -105 -437 -150 -22 62 186 44 -171 34 -287 -54 -16 -267 139 206 -131 -402 -65 -281 64 -122
4527a22k7J80J0j30N9r5l9l3K43J63j53K04k70J7K13k49K9rK35k37J90p7o0k23
$$ -122 -149 31 41 -89 -30 -125 -164 -197 46 209 56 260 -10 7 220 -29 0 -9 226 -11 179 102 42 -181
4551a81L5J61RJ23l17J61J97l67K14l5j65K36Ol14J44M25j36n10k5K09J04j08
$$ -181 -146 15 24 147 -170 -9 188 -179 35 0 -165 71 77 -237 -93 332 196 -314 -339 -130 -26 -134
4573a34J79k1K5q5J74J50k18k20L20k83m8J51j18O1J96pl55K86p9N2j26k3J24
$$ -134 45 24 49 -36 138 288 70 -150 170 -113 -161 -10 -128 -67 129 122 -233 53 -26 26 -100 -123 1
4596AR5J8j56j13j8K47N2j73P8p4J00np1J6K3j39L65j55n2k59L55j79q1J93j35
$$ 1 96 114 -42 -155 -173 74 126 -47 31 -43 57 52 -19 -3 20 -119 246 91 39 -220 135 -44 -125 68 -67
4621f7K56k72O4K27l05j38J78K62m64M67l99L55l64J44k80K35J49k03K09J60k19
$$ -67 189 -83 -19 208 -97 -235 -57 205 -259 208 -191 164 -200 -56 -336 -101 48 -155 54 214 -5
4642ej48L38l63k71M02j55j7M20r1r8q9P2j28j72K99Qj35K21L3o3l59M55J4n8
$$ -5 -153 185 -178 -449 -47 -202 -219 201 110 12 -77 -5 -133 -305 -6 2 -133 88 121 58 -301 154 168 110
4666A10j11j46L27j92J36l88K19L6J28R3l48J54J7j70J26K7J90l86J05K00j39
$$ 110 -1 -147 180 -12 124 -264 -45 -9 119 212 -136 18 35 -135 -9 18 208 -178 -73 127 -12
4687a2K81j00k01J85k84L23m01M03p1l45M23k00L72Kk09j72J83J01k71l0J22r8
$$ -12 269 169 -32 153 -131 192 -209 194 123 -222 201 1 373 375 166 -6 177 278 7 -23 99 1
4709AJ27J9l3J56j48j62O1No5m8J00j00J28Q9l67O8N9M56m97J87J14j43m5Q2O5
$$ 1 128 147 114 270 122 -40 21 26 -39 -87 13 -87 41 130 -237 -169 -110 346 -151 36 150 7 -38 44 109
4734A09k37k6K4L98j47M4n9j36J05j44J51j05j40J51J98j89p1n3J51j77K95J99
$$ 109 -128 -154 -130 268 121 165 106 -30 75 -69 82 -23 -163 -12 186 -3 -74 -127 24 -153 142 341
4756C41k62J89k24R6j59J45n7r9j89L52J89j88k59o4N71l03J9k97K00j12l1K42
$$ 341 79 268 44 140 -19 126 69 -30 -219 133 322 134 -125 -189 382 79 98 -199 1 -111 -142 100
4778A00k03mJ47j5N3j09o4j09J44J08J68k51Q4M0o1k57K45R3n6J55m50L50J35
$$ 100 -103 -107 40 25 78 -31 -95 -204 -60 48 216 -35 49 89 28 -229 16 109 53 208 -242 108 243
4801B43n21M17k47k3M90k34l3k60L25l60L66k79j0J57k25N3J70j00J23j80J95
$$ 243 -278 139 -108 -131 359 125 92 -168 157 -203 163 -116 -126 31 -194 -141 29 -71 52 -128 67
4822F7K63j94k57J4J16J01l39R9K7R9k31M84j82j49j1K32k14O9k10K62k24rJ05
$$ 67 330 136 -121 -107 9 110 -229 -130 -103 -4 -235 249 67 -82 -93 139 -75 -6 -216 46 -178 -187 -82
4845h2J30j25j90M00q7m2J31j58j69l1K24J71l01L4L05P3l99L18k51O4J16K60
$$ -82 48 -77 -267 133 46 4 135 -23 -192 -223 1 172 -129 -95 210 283 -116 202 -49 15 131 391
4867C91n62J54J26j18j97K99k9J09k18MR3m0J43m62K26R1P8r4J30k36j99K65K50
$$ 391 -171 -17 109 -9 -206 93 64 173 -45 -41 52 12 155 -307 -81 10 88 -6 124 -112 -311 -46 204
4890B04m0n12L78J03Qj70n1j31J13j9O7P4k52J30J47K0k33J41Rk97L34j03LL50
$$ 204 164 -348 30 133 141 -29 -80 -211 -98 -117 -50 24 -228 -98 49 69 -164 -23 -14 -311 23 -80 -77 273
4914B73n49K03k02l3J72k4j44M01j69J39RJ2r3l05M56j17J43l70L61j88k02K69
$$ 273 -276 -73 -275 -308 -136 -160 -304 97 -72 67 76 88 -5 -310 146 29 172 -198 163 -25 -227 42
4936D2l47O7K78J21j79l8j7J39j9o3P7Nl26M37n4k28J81m9j99R3r0K26l30K93
$$ 42 -305 -238 40 161 -18 -56 -73 66 47 -16 61 66 -260 177 123 -105 76 27 -172 -79 -169 57 -273 20
4960B0J67j3k50J08qJ8L3m9K39n23M58k29L00k19j81K98l23J66j31K17j9J7m64
$$ 20 187 174 -76 32 24 42 75 26 265 -258 200 -29 271 52 -129 169 -154 12 -119 98 79 96 -368
4983c68J51J57K45j16j38J32o5j59M15l20J60j03M1k5j30p3L24j47M5j79O4K74
$$ -368 -217 -60 185 69 -69 63 -2 -161 254 -66 94 -9 32 7 -123 -196 128 -19 26 -153 -89 185
5005A85k41O2n4j32K49k55L34J09l28J08p0O0P5k08j36L47j98K34l6l3N8j1O4
$$ 185 -56 6 -48 -180 69 -186 148 257 -71 37 -33 27 102 -106 -242 105 -93 141 105 72 130 119 183
5028A83j95J48P7k83N4k3K67k42j16J76j01O9J05L73n84nQ5o2J05j15R9m7n0K62
$$ 183 -12 136 213 -70 -16 -39 228 -14 -130 46 -55 14 119 492 -92 -97 -12 -74 31 -84 15 -32 -82 180
5052A80l97K14l5J19M0N4l46L14j5j71j16K02k22j8J96j13Q9P4o6k29J45K66N3
$$ 180 -217 -3 -38 81 121 175 -171 143 128 -43 -159 43 -179 -197 -1 -114 -25 49 -17 -246 -101 165 218
5075B18j52j5r0j59K26L8k0k65N09l12j81L27k85Q4j69Q7R2m9jK50K4l31N2K39
$$ 218 66 51 -39 -198 28 66 46 -219 290 -22 -203 124 -161 -77 -246 -159 -67 -116 -117 133 157 -174 -122 117
5099A17Mok90M0J49j41l2O54k44j13l13K23QJ06k00K31k94L39l07j74J62L03l80
$$ 117 121 115 -175 -135 14 -127 -159 495 251 138 -175 48 56 162 -38 193 -101 238 -69 -243 -81 222 -158
5122a58J00J36J62k59J10l31N32l62r9K24j68N12k80O4j25L26l04k02P3J50J45
$$ -158 -58 78 240 -19 91 -240 292 -70 -169 55 -113 399 119 183 58 384 80 -122 -49 101 246
5143B46m47L36k45K5L57j78p8o9P8P7M7l01J45K44k81n7k0K11L0K30n26K67K00
$$ 246 -201 135 -110 -85 272 94 16 -53 25 102 149 -152 -7 237 -44 -101 -121 90 120 350 -176 91 291
5166B91k90K37n0j69m75L62Qp0J49K08l27K46j55N0j17k85M46K34j91k19J31k21
$$ 291 1 238 188 19 -456 -94 -86 -156 -7 201 -126 120 -35 15 -102 -387 59 293 102 -117 14 -207
5188b07J18j85J15J23M3j34K85j24j83J14l21L77oj1k73l3J28J05J32k58N7mJ55
$$ -207 -89 -274 -159 -36 7 -127 158 34 -149 -35 -356 21 15 4 -269 -302 -174 -69 63 -195 -138 -142 13
5211A3O0P5j80K45l40J34K41l15n2K87k12Kj07o9M89l67NJ60j63J79L99o34L1
$$ 13 73 148 -32 213 -127 7 248 -67 -119 168 -44 -42 -149 -218 271 -96 -91 69 -94 85 484 -150 -119
5234a19O3L70m16J46N8l67K51K06j76J74j89j28l6P4p8L6J90K69m33R9n4j83J36
$$ -119 -56 314 -102 44 102 -265 -14 192 16 190 1 -127 -163 -89 -167 -131 59 328 -105 -6 -60 -243 -107
5257a07L01o7o80N01n6L22l54O2K19j28M3j20m6j43J44K46j26j05L2N5j81N62
$$ -107 194 127 -553 -52 -108 214 -140 -78 141 13 56 -64 -110 -253 -109 137 11 -94 -62 -7 -188 374
5279C74k85j71n8m5N1K55p3k07K68m3j16m1P3J86o1j85j62J49L5J40j76K57k54
$$ 374 89 -82 -140 -185 -134 121 48 -159 109 66 -50 -91 -18 168 107 -78 -240 -91 -56 84 -92 165 -89
5302h9P9j83K0K54lr9K55j62mj97K47m4L0m23M67J3k13K5l24L52p5K05r1lk76
$$ -89 -10 -193 -173 81 78 -21 234 72 68 -129 118 74 104 -319 148 161 -52 -27 -351 1 -74 131 40 37 -239
5327b39J97J7J51j75Q9j48J05J67k33L2K97j77l5j5J01j66P3n3P1j66J74p5J01
$$ -239 -42 -25 126 -49 40 -108 -3 164 -69 -37 260 83 48 33 134 -32 41 -12 59 -107 67 -8 93
5350I3q2j7J62p9r4j26K37m07K92M5J01Q7l13J31L6J4q2K00k54J01L47l79jO4
$$ 93 11 -6 156 77 -17 -143 94 -313 -21 24 125 212 -101 30 66 80 -2 198 -56 45 392 13 12 76
5374G6n9K8j07K82k04K38j80J52mm2j33q4j06J32k9m6J09q9o5l0L67k03k41N07
$$ 76 17 45 -62 220 16 254 74 226 222 180 47 -37 -143 -11 -40 -86 23 -66 -131 -161 206 3 -238 269
5398B69j77k17J21L02j81J7j93L1J03j86K45k15j48Q5J18N1J1l11R4J60J09L2
$$ 269 92 -125 -4 298 117 134 -59 -28 75 -111 134 -81 -229 -144 -26 25 36 -275 -181 -21 88 120
5420A20k26l3K20K44l77J55k90K50k20J97J5k21L08k17l10K25J73r9J41n1Q1k12
$$ 120 -106 -139 81 325 -52 103 -187 63 -157 40 55 -166 142 -75 -385 -160 13 -86 55 4 85 -127
5442a27l8J14Q5J16r6k58J38k30K57j81L97j03q9J11k44K71l46L83k54J42k62
$$ -127 -165 -51 34 150 54 -204 -66 -296 -39 -220 177 74 -15 96 -148 123 -223 160 -94 48 -214
5463b14L6L09j40p4K36l77K28j38PN29m49J64lQ5l35K0L16m07L54o7j81K43l14
$$ -214 -178 131 -9 -83 153 -224 4 -134 -127 402 -47 117 114 199 -136 -116 200 -207 147 80 -101 142 -172
5486a72R6L3n4K41n02M74p3l21L27j22J65J28m09K66l63L21k28L88j46oJ32k50
$$ -172 -76 -43 -97 144 -358 116 43 -278 49 -73 92 220 -189 77 -286 35 -193 195 49 43 175 -75
5508g5M6J28J12k85K4n0J85j06J96r6j76qr7J87J52k25Q0j35k2K06j99K66K7j99
$$ -75 -29 99 211 -74 -50 -100 85 -21 175 79 -97 -105 -202 -15 137 -88 -8 -143 -165 41 -158 108 135 -64
5532f4J30j68K7K17k20J54r2rK80k15o2J30j93K81p4k29Q1K1r2J72R6j53n4J41
$$ -64 66 -102 -75 142 -78 76 -16 -25 255 40 -22 108 -85 196 122 -107 -26 -5 -97 75 171 18 -36 105
5556A05J97j94j99m7J33k13N24l42L19m30OJ08J69k12qJ0J12R3l64L19r1R6k7
$$ 105 302 108 -91 -138 -5 -218 306 -36 283 -147 -141 -33 136 -76 -84 -74 38 131 -233 86 -5 91 64
5579F4j28l5K98l27P3J05j56R8k82L37R2l59M70j99J28q0Kqj51k07L03P0J5l0
$$ 64 -64 -99 199 -128 -55 50 -106 -8 -290 47 139 -220 250 51 179 99 101 93 -58 -265 38 108 123 93
5603I3l8l4J20Qk6j29q3K71k77L2R6j73O1J5J75j84K03k70J42R7k51q7M2J68P3
$$ 93 55 21 141 149 123 -6 -89 182 -95 -63 33 -140 -79 -64 111 -73 130 -140 2 99 -152 -239 -197 -29 44
5628D4j44m66N74L3J53k27j01J36L5J74l79L30K34o04M79o58M11K12m40K04J78
$$ 44 -100 -566 8 41 194 -33 -134 2 37 211 -168 162 396 -208 271 -387 24 236 -204 0 178
5649A78L0k79K15k22M07j28m58R4O5J12O7O4j27k52K11j98K19K93j09j11J18j99
$$ 178 208 -71 144 -78 329 201 -257 -163 -98 14 81 145 18 -234 -23 -221 -2 291 182 71 189 -10
5671a0J8K80j99k37K37m37L51j66J9J87r0N9m0q2J53r7J11K36k51K02j8l95o7
$$ -10 8 288 89 -148 89 -348 3 -163 -144 43 -47 12 -28 -110 43 -54 57 293 42 244 226 -169 -236
5694b36J71j56L34j05L08k90l04K78P1k32L38n66K05K59j17P2l4j98J59j13J30
$$ -236 -65 -221 113 8 316 26 -278 0 71 -161 177 -389 -184 75 -42 30 -4 -202 -43 -156 -26
5715b6J4O0j88K28k59J92r3K38J08p0l8l28K47J53j64k01k7q0K93Q9k21L3K4j06
$$ -26 -12 48 -140 88 -171 21 -72 166 274 204 166 -162 85 238 74 -127 -154 -234 59 148 -73 -40 -16 -122
5739a22K19o3k44M36l64j0J54K3J93n77O06m67L35m60K02J1K94k6J13m08nR8l2
$$ -122 97 34 -210 226 -138 -148 6 29 222 -355 251 -216 119 -341 -139 -128 166 140 253 -155 -160 -62 -94
5762i4J50k44J89j74J8J03J0j46L20k4k88k34O26k21J36j78P3j99J77J83q9k09
$$ -94 56 -188 1 -173 -155 -52 -42 -188 132 108 -180 -414 212 -9 127 -51 22 -177 0 183 94 -115
5784a15M34r1j87J36j88o9j35K96j03o5k05M46k99L61l60J1Q0J08NO6n6k4n6n5
$$ -115 319 228 41 177 -11 -80 -215 81 -22 -87 -292 154 -145 216 -144 -133 -53 55 60 126 70 46 -10 -65
5808f5K28k97L10l96L4K51j55j29K42J04l12M03N7l46J01R0Mj92J30j00J07k50
$$ -65 163 -134 176 -220 -186 65 -90 -219 23 127 -185 218 275 -71 30 120 124 -68 62 -38 69 -181
5830a81J56J57k14n0K81l38N6J73k4J81k03j94K18J3l6m1J84j92r8M0J39K46j40
$$ -181 -25 132 -82 -132 149 -189 -133 40 16 197 -6 -200 18 31 -5 -46 138 -54 -152 -112 27 273 133
5853A33j02n5r7r3L49j26N7K6L03m10j9K80q0m08J57po1P8J28j17k03K62j27K4
$$ 133 31 -24 -121 -214 135 9 66 92 395 -15 -34 246 166 -242 -85 -92 -153 -75 53 -64 -267 -5 -132 -108
5877a08k2J81j99L6J48J46j20j80J74K9j04J66j27j46M34m01K33j57J78n6j03
$$ -108 -130 51 -148 -112 36 182 62 -118 56 85 -19 147 20 -126 308 -93 140 -17 161 105 2
5898BL17k57k13J6N51l48N8J08k81o0K08J01j37j5k65L00o1m08L70j48J14m6K3
$$ 2 319 62 -151 -135 416 68 126 234 -47 -107 101 202 65 50 -215 85 24 -384 -14 -162 -48 -94 -71
5921g1J69k18P6J44M2o1j96j1r5J10K46k58R2j74K91k46M54j87k17k92L01p0n
$$ -71 98 -120 -44 100 142 81 -115 -126 -221 -111 135 -123 -31 -205 86 -160 294 107 -110 -402 -101 -171 -176
5944a76J5K67Pr9K37k43l6m8J90j17L3j3j75J59l5j65M7J53l8j58K99j98q0L10
$$ -176 -161 106 113 14 251 8 -28 -76 114 -3 30 17 -158 1 -34 -199 -152 1 -37 -195 104 -94 -174 136
5968A36l10J1M27k73J97J63n37n7Q5J7L6K96q1J06j10l09L29l05K20J87j81l05
$$ 136 -174 -163 264 -9 188 351 -186 -243 -158 -141 -105 191 110 216 106 -203 126 -179 41 228 47 -258
5990b58M08k34l6J84k58L32p1m5K2l3j36K00m9o9N8m3k8j17J13L11k41k45M12
$$ -258 150 -84 -120 64 -194 138 67 22 44 11 -125 75 26 -43 15 -28 -56 -173 -60 251 10 -235 177
6013A77k62J04J21j68n1j64N36m11Ol6J56O9r8L20l29J64m8J48k64LnR9j07J96
$$ 177 -85 19 140 -28 -79 -243 293 -118 -112 -148 8 77 -21 299 -30 134 86 234 -30 -27 -32 67 -40 156
6037A56k83j28L92N6l06J2J01l04N09j61k5R4j52k1J1J51P9j61Qm4nJ24J2J3o9
$$ 156 -127 -255 137 193 -113 -101 0 -304 205 44 19 113 -39 -60 -49 102 181 20 28 -16 -21 103 115 128 59
6062E9QL91n56Ml5J3M43l7j75On2K27k90K41j20J14k43J68j19r4J33j20l3k07
$$ 59 67 458 -98 -94 -129 -116 327 290 115 121 69 296 6 247 127 241 -2 166 47 -47 86 -34 -67 -274
6086b74K21j85J42K65l07M85m65n3L93R4j54m59K19r2L9M88l70K56o8o9j53J55
$$ -274 -53 -238 -96 169 -138 347 -118 -171 222 316 162 -297 -78 -170 -131 357 -13 243 175 106 -47 108
6108A08l79J87n5l7J19j94K77l76L98k59R8J69J63j38J32l10k86M40N6m09R6L77
$$ 108 -271 -84 -139 -176 -57 -251 26 -350 48 -211 -113 56 219 81 213 -97 -383 57 113 -296 -200 177
6130A77O1k55j9Q3K45k67m4r3M2j99L85k39R1j53J16K57j65j58J04K52l52Q0j3
$$ 177 238 -17 -36 47 292 25 -19 -112 -70 -269 116 -123 -32 -185 -69 188 23 -135 -31 221 -131 -51 -64
6153f4q7m6L57o0k98j0L02m30J57O0n0P1K15J33l67J16P6j36k8J2M1m6J45j87
$$ -64 -151 -197 160 100 -198 -208 94 -336 -179 -119 -169 -98 117 250 -117 -1 75 -61 -89 -77 -36 -82 63 -124
6177a24L7k16L72j09J29q1P0m17M12M2l06J9M76p4J57m29J04k75L41m8M0o71Q53
$$ -124 -87 -303 69 -40 89 8 78 -339 73 115 -191 -172 304 230 387 -42 62 -213 128 80 120 -551 302
6200C02j39M2m66K16q7M6K37j53K73j61l39M50j47k89L53l06J02L73l32P4J2K
$$ 302 163 205 -261 -45 -132 -86 151 -2 271 110 -229 221 74 -215 138 -168 -66 307 -25 49 61 63
6222F3K6j15P9j52J6J16R1j85j44L2L71k27Or2O9J6l03M03o6o1L1k58M05Ol34
$$ 63 89 -26 53 -99 -83 33 124 -61 -205 -173 198 -29 -23 -115 -46 -30 -333 70 4 -57 -26 -284 121 127 -207
6247b07L6J34J56k82O4J21j07J69k69K49l7M8J10l6l00l7J0r1J65j59M71r8k26
$$ -207 -171 -37 119 -163 -99 22 -85 84 -185 64 27 75 185 149 -151 -188 -178 -269 -104 -263 208 110 -116
6270a16K58k07m1J36N2j27L8j62K67j16J12k28J61l13J52J19l8K84k64k0QJ88
$$ -116 142 -65 -106 30 82 -45 -7 -169 98 -18 94 -134 27 -286 -134 -15 -53 231 -33 -53 -45 143
6292A43J2L1j48%Q1P7k03J6o0k5j14J24K11j95k90O00k91j99L66R7L3l0j66J20
$$ 143 155 186 38 38 119 196 -7 9 -51 -76 -190 -66 145 -50 -340 260 -31 -230 136 233 266 236 70 190
6316A90K4m67L09j39Q4j90J53j10K39m1P2l29J61L1L4P4k91J64j67J25K16l17
$$ 190 214 -253 56 -83 1 -189 -36 -146 93 52 124 -205 -44 -13 21 95 -196 -32 -199 -74 142 -175
6338a75J92M9Q5k31%J21r2J04Q1l67R8K5o7M87j66k70K08l01L23k21j00K81K3
$$ -175 17 66 151 -80 -80 41 -51 53 134 -233 -135 -110 -177 310 144 -126 82 -219 104 -117 -217 64 87
6361H7L9q7L38m44J40j88Q1K48ol50O0K21J0o5K56j79j91J82l77Q2N3L41q2k98
$$ 87 126 39 377 -67 73 -115 -34 214 208 -142 -82 139 149 84 340 161 -30 152 -225 -143 -90 251 169 -129
6385a29K87P9n0k06j94J39j78r1N28k31K04m37M32M6n8o12M62j40J73J06k40q
$$ -129 158 237 187 -19 -213 -74 -252 -343 185 -46 158 -279 153 199 141 -471 -9 -149 24 130 -110 -118
6407a18K8M07k29J60k24j37p3L07l10J65J44k77J22r5N8K12l22J36K30j45l17
$$ -118 -90 317 88 248 24 -113 -186 121 -189 -24 120 -157 -35 -130 -72 140 -182 -46 184 39 -278
6428b78K85K16l2L5j53j52J69o0J35j43k65L67J05l10J72j47Q8m5J03j43mP0l
$$ -278 7 223 191 226 73 -79 90 30 165 22 -243 124 229 -81 91 -56 32 -13 90 -53 -57 13 10
6451A0j54N9p4K43n7MR0m6J88j0lk80K01k20K19p8l22J00M41k93n9r9K69j07K5
$$ 10 -144 -85 -159 84 27 31 121 75 263 253 250 -30 171 -49 170 92 -230 -130 311 18 -41 -140 129 22 47
6476D7j96J81O9k64M53j47k65K90j29L4k9j88k5J93j52K81K3j69k03M28R3k31
$$ 47 -149 32 101 -163 290 143 -122 168 39 73 44 -144 -169 24 -128 153 176 7 -196 232 325 94
6498I4l95K19L92k96l5l4J98j2j70q8j04M28k8l10J37j42K10j05J72l28J82j7
$$ 94 -301 -82 310 14 -21 -55 143 131 -39 -127 -231 197 169 -141 -4 -146 64 -41 131 -197 -15 -32
6520c2J42j00j51L97j19k62J31j53M20m28K70j24q3J75j40j30J26K35k9j49rP8
$$ -32 110 10 -141 256 137 -125 6 -147 273 -155 115 -9 -92 83 -57 -187 -61 174 145 -4 -13 65
6542F5J98k84Q1k65J03j72K19K37k33rK5K68j85K7j17L23k41O3j05K55o7k7j21
$$ 65 263 -21 60 -205 -102 -274 -55 182 -51 -60 -35 233 48 75 -42 281 40 103 -2 253 186 159 38
6565C8l79M16l03K22k07K17K9o6K6l56K61k9J11N2k98J69J23Q9k59K20j77j70
$$ 38 -341 75 -228 -6 -213 4 33 -33 -7 -363 -102 -131 -20 32 -266 -97 26 115 -144 76 -101 -271
6587b71J24J26J15q0lq9L13k0k83M4q0O0j5J06J02j38J45k06p8n9K06J26j6m45
$$ -271 -147 -21 94 14 11 -78 235 215 -68 -24 -104 -44 -59 47 149 11 156 -50 -128 -187 19 145 129 -316
6611c16M30p6j29M6p8K54l82L16j27J1J59o0K96m18rK9j48q3K26k01L63kk7j34
$$ -316 114 38 -91 -45 -123 131 -251 65 -62 -51 108 48 344 -74 -83 -54 -202 -285 -59 -260 103 101 74 -60
6635f0K0P8J18j51L6o0rL8L35k00J97m46Q5O6L4Q0p3j13o4L23j35j89M64k33j24
$$ -60 -40 38 156 5 41 -19 -28 10 345 145 342 -104 -19 47 81 161 88 -25 -89 234 99 -90 374 141 17
6660A7k8j28O4J68r1K46j91J9N1j38r7L26l25M20l26K7j37K03m70N24l07L29k32
$$ 17 -11 -139 -75 93 2 248 57 76 127 -11 -108 218 -107 313 -13 14 -123 80 -390 134 -173 156 -76
6683g6J76k1j58J55J92j36j16J33k37L37m61J31R6j01L17l69J64K70m34L04k29
$$ -76 100 79 -79 76 268 132 16 149 -88 249 -212 -81 15 -86 231 -138 26 296 -138 166 -63
6704f3J49r9R7j66q1J49p5K45k01Q8j9j08Q1J80l22J31kk59K34L03n02Q1J02J61
$$ -63 86 -13 84 -82 -163 -14 -89 156 -45 43 24 -84 -3 177 -145 -14 -16 -275 -41 262 -240 -159 -57 104
6728A04J2l60J24J31P0J97n92M10j95J67m90L07K95l09p7R2j7K24j41j7l5M9m6
$$ 104 116 -244 -120 11 81 278 -314 96 -99 68 -422 -115 180 -129 -206 -114 -131 93 -48 -65 -100 -51 -97
6751i7K86j21P7k10J04n5l8M2k9O2J17o6j64J01k57K47k11L92l11N66m47K3Q1
$$ -97 189 68 145 -65 39 -16 -54 -12 -41 21 138 72 -92 9 -248 -1 -212 180 -131 435 -12 11 92
6774I2l40L6K17j46J00jJ22P5l76N2J49J88k33J59k9O6j82J74k31m9lJ72q8k3
$$ 92 -248 -212 5 -141 -41 -42 80 155 -221 -169 -20 168 -65 94 65 131 -51 123 -108 -157 -160 12 -76 -99
6798i9J6j25K03m8Q0k30L80N9k47j82J26p6L90l01r9K92k10K92m13M35Jq3j5j30
$$ -99 -83 -208 -5 -53 27 -203 177 236 -11 -193 -67 -143 247 -54 -153 139 -71 221 -192 243 244 161 146 16
6822A6k2mQl9M9J45j73k11l6K83J1o0K80l66L11p8m5q3QrL23k41K19k44K46k91
$$ 16 -6 -10 -2 -41 8 153 -20 -231 -267 16 27 -33 247 -119 192 114 69 -14 -6 -15 308 67 286 42 288 -3
6848cR0q0NJ65j46lj6L53n99N12l57J84k37K40Nm10M25k79L12j1j78m6O1J4J97
$$ -3 87 7 12 177 31 28 12 365 -234 278 -79 105 -132 108 113 -297 128 -151 161 150 -28 -74 -13 1 198
6873A98k26j4K17l65K50k92L80j44K6n2j62J64j19J69J17q2j48K35l76R2K42k42
$$ 198 -28 -42 175 -190 60 -232 148 4 30 -22 -184 -20 -139 30 147 65 -83 152 -224 -132 110 -132
6895a32J80Q3Rk92K66j1j54K10j90j62j0L43l17L07j66j07M9K08Q5J9L2k78j16
$$ -132 48 131 140 -152 114 103 -51 159 -31 -193 -203 140 -177 130 -36 -143 -94 114 199 218 250 -28 -144
6918a44j32K32J15J33k02J15J3O1l06N97o93L77n99O21j72K5l8k25K66j49jJ7
$$ -144 -276 -44 71 204 2 117 130 191 -115 482 -211 166 -433 188 16 41 3 -222 44 -105 -106 -89
6940h9K42k1l32R8j72K67J70j88jJ85l08j22K07M3J67j92K01j74j60M17j17p0
$$ -89 153 132 -200 -102 -274 -7 163 -25 -26 159 -149 -271 -64 -21 146 -46 155 -19 -179 238 121 51
6962E1O6r8p0j1J48j63J13J3P7j71l34L42J26k09L3K73j62O9Lk41j49QL18%j66
$$ 51 117 19 -51 -62 86 -77 36 49 126 -45 -379 -37 89 -120 -87 186 24 93 96 -145 -294 -286 32 32 -134
6987a34K40k02m1L94k86p9M95k89J2k5k50N2p8L89k91Q5R3j04K62l12J17O3j32
$$ -134 106 -96 -137 257 -29 -108 387 98 110 85 -165 -113 -191 198 -93 -8 85 -19 243 -69 48 111 -21
7010b1M7k6J95k71LL01K1l86L8M0j54L26j25J58J3j1k66M04l53J34Nj51K81K4
$$ -21 26 0 195 -76 -73 228 249 -137 -99 -59 -213 113 -12 146 159 148 -118 286 -67 67 72 -79 202 226
7034B26k87J83j41N5Q4j28j18M20j48o2Q6j7r2j51K92l80J60L7P0l61K78M7M6
$$ 226 -61 122 -19 36 120 -8 -126 294 146 84 170 153 61 -90 202 -178 -18 19 89 -272 6 53 99
7057I9J15r9l9J74j83K13j08P2Rk27J14m14K93l1n0K92k36K56j81q8j86J78M7
$$ 99 214 115 76 250 67 280 172 244 253 26 140 -274 19 -12 -62 230 -6 250 69 -19 -205 -27 20
7080B0k46L72j24N1k7k11M93l42k02O56p80M13j46J8N4M4J02j05l92M13L1j25
$$ 20 -226 146 22 73 46 -165 328 -14 -216 440 -340 73 -73 -55 -1 43 145 40 -352 61 92 -33
7102c3K7p7m3J18o6l2j42L08K09m80L05n00M75j54J70k1MN5p5k03K36j84J37m1
$$ -33 -6 -83 -126 -8 -74 -106 -248 60 269 -211 94 -406 69 -85 85 64 68 123 48 -155 81 -103 34 -7
7126gR7q6N8k00L26k54J15N5l48K25J05k28L24k31m8j5K50k39j47K02O6N9m10
$$ -7 90 4 62 -138 188 -66 49 104 -244 -19 86 -142 182 -49 -97 -112 138 -101 -248 -46 20 79 -331
7149c31K48K05j18K5R6k57l2J82j31j51J68k4m9J8N9K28k3k69J27L8l86L83Jm6
$$ -331 -83 122 4 29 125 -132 -164 18 -113 -264 -96 -120 -169 -151 -92 136 113 -156 -29 9 -377 6 7 -39
7173c9j30j49M32k72K52N0j61q9j5k06M77j65o2K40M3L8j06j49j65J53j9M04r6
$$ -39 -169 -318 114 -158 94 144 -17 -106 -121 -327 150 -15 -77 163 206 244 138 -11 -176 -23 -42 362 266
7196B66j37l07K75k45K41k27L53q4L7k03R3q6J60m42K04R0O4J74j80Oj52j28K92
$$ 266 129 -178 97 -148 93 -134 219 135 172 -31 62 -24 136 -306 -102 -12 52 226 46 52 -100 -228 64
7219F4m7j62M01l07L3j98M41m30J42L2J38l20K3J34K81O8j30Ll26j9K2M00j56
$$ 64 17 -145 256 -51 -18 -216 225 -205 -63 -31 107 -213 -190 -56 225 293 163 166 -160 -179 -157 243 87
7242H7ml21L29k91L14j79M5J27L0j80J98q2P2k37J02k5K44j68j65J40NJ06k78
$$ 87 83 -238 91 -200 114 -65 -20 107 137 -43 155 73 145 -92 10 -15 229 61 -104 36 41 147 -131
7265a31Q2l5J66J1j26j45K47J3O1p3NO5j46p0J47k75J95K1J72k46p4K47k65J93
$$ -131 -49 -84 82 93 -33 -178 69 82 143 70 75 140 -6 -76 71 -204 -9 12 184 -62 -136 111 -154 39
7289C9j18L2J22J53l99J80k1j47K40q4J11k7J29P2l20L38j16k18k7k28LK07k2
$$ 39 -79 -47 75 228 -171 9 -12 -159 81 -3 108 81 210 282 -38 300 184 -34 -61 -289 -286 -79 -101
7312a01k02J14K2J1J60J35j2Ql28k5L90j72o7J03j06n6K29L1j03P2o9p3n0M02
$$ -101 -303 -189 -167 -156 4 139 127 135 -193 -218 172 0 -67 36 -70 -126 103 134 31 103 34 -39 -89 313
7336C13j21j43J8k59J94j28R9K38J62l95K4K07j32m6N6J37l26K20m71M03l2J00
$$ 313 192 49 67 -192 2 -126 -27 211 373 -22 2 209 77 31 87 224 -102 118 -353 50 18 118
7358A18%j43J25k09L77n8k57j45n4N46n6j63j68J49p8N3j57L10l8k32o9L5J1K11
$$ 118 118 -25 100 -109 268 210 -47 -192 -246 300 244 81 -87 62 -16 37 -120 190 152 -80 -149 -114 -103 108
7382A08K8J72n22J62J32j59L4K2m5L50k91O0R9l7j87P6m9K39j43q4J72j84R5j89
$$ 108 136 308 -214 -52 80 -79 -45 -23 -68 282 -9 51 150 113 -74 2 -47 192 49 -35 137 -47 48 -141
7406a41K55j34L7J35l11n7L84o4k11o9N6M72n49L62j48p2K24k83L94m45J56K3
$$ -141 114 -20 17 152 -159 -216 168 104 -107 -176 -120 352 -197 165 17 -55 169 -114 280 -165 -9 14
7428A4J4Q4j05P4k13m8Q8j55L29P6j34jJ69n90L22M08o73M53k66K23l8N3m67L83
$$ 14 28 112 7 81 -132 -180 -92 -247 82 158 24 23 192 -398 -76 332 -341 112 -154 69 31 84 -383 0
7452@JK06l15J52L02l39r4K69P3k39m9j75K28M6R4Q8j8l17J14m36N61l15L47l59
$$ 0 1 207 -108 44 346 7 -87 182 255 16 -33 -208 20 66 160 248 230 -87 27 -409 152 -163 184 -175
7476a75P3J61O9n20K75J93M4k89J66J85m3j56N1N2K9k17j75K49j47J92k14L16
$$ -175 -102 59 128 -392 -117 76 120 -169 -3 182 139 -17 34 86 115 -102 -277 -28 -175 17 -197 119
7498A19R3k52J34l80L79p6K34l49M1K7K58o5n04J42n1K11Mq6K03j14J50J43j98
$$ 119 212 -40 94 -286 93 17 251 -98 -57 -30 228 163 -341 -199 -250 -39 -35 -121 82 -32 118 261 63
7521F3m5J08o1j97K5J62n8L3n8L4J55k40n9pJ11K86q1k45J59J87m16K3J62J18
$$ 63 18 126 65 -132 -107 55 -3 30 -28 6 161 -79 -138 -145 -34 252 171 -74 85 272 -144 -121 41 159
7545A59j37k10P9q7J58j50L88j92J12J8o4k15L07k43%J38k29l3M17j11q7J93l01
$$ 159 22 -188 -109 -196 -38 -188 200 8 120 138 74 -141 166 -77 -77 61 -168 -201 216 105 18 211 -90
7568i0J98O3J12l91L57m72R2k4K25J58j55J01K8j19l4p8J23k59j15N2J73M1l01
$$ -90 108 171 283 -108 249 -223 -131 -155 70 228 73 174 202 83 49 -29 94 -165 -280 -228 -55 -14 -315
7591c15J20K47O0m61L94q2K33l6J21l68QK40K1r7L0j90K81k04j74M54j23K59k60
$$ -315 -195 52 112 -349 45 -37 196 160 281 -87 -79 161 182 85 115 -75 206 2 -172 282 159 418 158
7614A58J98j87j04l08K77J6K97n30J69J18k97J44K67k43j13lN7J91k43p9M89l54
$$ 158 356 169 65 -243 34 50 347 -183 -14 104 -193 -49 218 -25 -138 -141 -84 107 -136 -215 274 -80
7636h0J6J49j59K95m36J12rQ8J72n6j20J24j95J47J63k71j68L60l90J73L15k99
$$ -80 -64 85 -74 221 -215 -103 -112 -24 148 92 -28 96 -99 48 211 -60 -228 132 -258 -85 230 -69
7658f9l4J37P9j74K0K66k10J0K53l76K9Q0L8j53P0j37J94q7k7J84J24N5j96K8
$$ -69 -103 34 113 -61 -41 225 15 25 278 -98 -69 11 49 -104 -34 -171 23 -64 -91 93 217 272 76 104
7682A04m58L29O7m3Q6q0N2r8J29j97K10j40R6l4j36K17l32J77J06j38J33k10L92
$$ 104 -354 -25 42 -1 85 5 57 -41 88 -109 101 -39 57 23 -113 104 -228 -51 55 -83 50 -160 232
7705B32j97l5P9l84L41j3l09J50P9M16m90R2J65P0l02n2k18M66r6k80L14J77j50
$$ 232 35 0 79 -305 36 23 -286 -136 -57 359 -131 -39 126 196 -106 -158 -376 90 -6 -286 28 205 55
7728E5L10n74J79K14k11pK7m4J02L0j71R6k18JK73P3j08k09N9L20l39J47r7K13
$$ 55 365 -209 -30 184 -27 -34 -7 -51 51 81 -90 6 -212 -211 62 135 27 -182 -123 197 -142 5 -92 121
7752A21K06m00K61j83Mj1K45M8j59k92J70O3L68n71%Q7K03l59J81l99M25K13m75
$$ 121 327 -73 188 5 9 -2 243 291 132 -160 10 73 441 -130 -130 -43 160 -199 -18 -417 8 221 -254
7775b54K67K23m40J18J66k98L59m66L76Nj82l7K22J6K6j22K9k56J27J75l04L40
$$ -254 13 236 -204 -86 80 -218 141 -325 51 56 -126 -163 59 75 101 -21 8 -248 -121 54 -250 90
7797I0O6j73L6J24lJ66m96K32o3j25RJ3Q8O5q0q0O5K82l40QL52j61k21O8K5J59
$$ 90 156 -17 19 143 140 306 -190 42 -21 -146 -137 -124 -36 29 -51 -131 -66 216 -124 -116 236 75 -146 -78 -53 106
7823A06k64R7r1L23r9R1k7m8O8O7k86j66K74j9m4L3L4N4oj23k16K31J18k56P5
$$ 106 -158 -61 -152 171 72 163 136 88 156 223 -63 -229 45 26 -18 15 49 103 97 -26 -242 -11 107 -149 -74
7848g4q0r2L72l8lK33k91J27j13l67J62K6L73m82J89M55Qm84J72l02K37j70K48
$$ -74 -154 -246 126 88 85 318 27 154 41 -326 -164 -138 235 -247 -58 397 405 -79 93 -209 28 -142 106
7871A06q6j78J99j78J42k50J14M24j81k45J20l4J52K83l13k15J4J80m3K70m17
$$ 106 20 -158 41 -137 5 -245 -131 293 112 -133 -13 -47 105 388 75 -140 -126 54 11 281 -136
7892a36k2J28R8J48l99K88l36K20K73k02k40J50J29j43J28k6j59K4K45j94J46
$$ -136 -158 -30 68 216 -183 105 -231 -11 262 60 -180 -30 99 -44 84 58 -101 -77 168 -26 120
7913A20k9j4p7j06j35M8J6L6L18K3j90l2L53l68k6L3k8K22j99j05J3J69o3Q9n4
$$ 120 91 77 0 -106 -241 -193 -177 -141 177 200 10 -22 331 -37 -63 -30 -58 164 -35 -140 -127 42 -21 68 14
7938A4J09k19p1J57O1k1j49Ol0J16j21k57O03j19k2K51k70K33k74k22L83p7p8
$$ 14 123 -96 -167 -10 51 30 -119 -113 -143 -27 -148 -405 198 79 57 308 38 271 -3 -225 158 81 3
7961Cj24J60j43L41Lj97K05j91l6j99M1K30l35J51J07J12j3l06J11J3K09k05K28
$$ 3 -121 39 -104 237 240 43 248 57 21 -178 -137 93 -242 -91 16 128 115 -191 -80 -67 142 -63 165
7984A65m15K18Q9j24J22R4j57J93m35K96O7k56M02k55j04J08J8j36Q0rk0N6L5
$$ 165 -250 -32 57 -67 55 149 -8 185 -250 46 113 -143 259 4 -100 8 26 -110 -30 -39 -59 -3 32
8007C2j41j0L64m15K32K9R0k66J6Ok31M75l25K68po3M0l11P3K64p7j90j6L64l84
$$ 32 -109 -119 245 -170 62 91 181 -85 -69 -63 -294 181 -144 124 117 54 94 -217 -144 120 43 -147 -163 201 -183
8032a83J17j37K65k11J00K89l51K54m47K09K37k58J09L21n35K53l56L17L43k37
$$ -183 -66 -203 62 -149 -49 240 -111 143 -304 -95 142 -116 -7 314 -221 32 -324 -7 336 99
8052I9r0J69j80P3l73J98L15k70K66m24o2K31K8k3Q8k28Q0L63q4j73k40m0K56
$$ 99 9 178 -2 71 -302 -104 211 -59 207 -217 -279 -48 -20 -43 45 -183 -103 260 176 3 -237 -277 -21
8075b1j65mK74P9j49j62R0K50p7j23N6J33m08O08l77K0L9k00K84l43l4j47K82
$$ -21 -186 -190 84 163 14 -148 -58 192 115 -8 48 181 -227 381 4 24 63 -137 147 -196 -230 -377 -95
8098i5k6k23N4L21J75l37K8L27o5k32j43J52K6j44r8K67Rj26J00N7rj52J03j9
$$ -95 -121 -344 -290 31 206 -131 -103 224 159 -73 -216 -64 -38 -182 -280 -13 -4 -130 -30 27 18 -134 -31 -50
8122e0j89K09l9J9J18M8J71n38L65J03p4j99j02j73M90j45qM32q45L39M1J55j58
$$ -50 -239 -30 -69 -50 68 116 287 -251 114 217 143 -56 -158 -331 159 14 6 438 -407 -68 -27 128 -30
8145c0nN0m9j21L01K6k57J05j91J23rl2j05J56M7n5M5P6j72r0J42J69k14K82k18
$$ -30 -35 15 -34 -155 146 172 -85 20 -171 -48 -57 -89 -194 -38 9 -46 -1 75 -97 -187 -45 124 -90 192 -26
8170b6J68j40J03j43j2l46M45o2%j80J93j23K73j23j23K55m35J15m3M7M2
$$ -26 142 2 105 -38 -50 -396 49 -13 -13 -193 0 -123 150 27 -96 159 -276 -161 -204 -157 -115
8191a15
$$ Imaginary data points
##PAGE= N=2
##DATA TABLE= (X++(I..I)), XYDATA
0@%%%%QqQj6J6k4L2m0M8n6P2q8J04j28J52j76K09k42K79l27L78m29M90n60O32
$$ 0 0 0 0 0 8 0 8 -8 8 -16 16 -24 24 -32 40 -48 56 -72 80 -96 113 -129 150 -177 201 -228 262 -298 334
29C34p15Q11r08J017j142J274j419J581j756J948k162K396k652K935l250L600
$$ 334 -381 430 -478 539 -603 671 -748 833 -923 1025 -1137 1259 -1393 1542 -1708 1892
45A892l992M436m938N509o174O958p892R032j0460J2307j4805J8396k4035L4237
$$ 1892 -2100 2336 -2602 2907 -3267 3691 -4201 4831 -5629 6678 -8127 10269 -13766 20471
59B0471n8527K18332K44113l86079k43859R4080L45917J00944k14466k67155M2832
$$ 20471 -38056 180276 424389 38310 -205549 -111469 234448 335392 120926 -146229 -103397
70a03397K36897J10579j80996j98398M3878K35530Q7358j85226k31006M1294K59114
$$ -103397 133500 244079 63083 -135315 -91437 144093 231451 46225 -184781 -143487 115627
81A15627J48680j58696k56066m9115K00965J84950m4910k03361j07063Q7281J35200
$$ 115627 264307 105611 -150455 -199570 1395 186345 141435 -61926 -168989 -81708 53492
92E3492L987j04783o1887M8936O3147k6707p9808q883Q5586O7824m0562r2572
$$ 53492 57479 -47304 -109191 -60255 2892 -23815 -103623 -112506 -26920 40904 342 -92230
104i2230k6696P0881Q8426J8598n3215n1722J624L7666L3823J8045M796j8242
$$ -92230 -118926 -48045 40381 58979 5764 -45958 -44334 -6668 27155 45200 49996 31754
116C1754m3583l5312J9303O8242M2111m7611r4039l4316N8484P0159j446o1093
$$ 31754 -11829 -47141 -27838 40404 82515 34904 -59135 -93451 -34967 35192 33746 -27347
128b7347m1322J9154L7594k058l1176L061M9963K9164m4542p0940J933R3641Q4251
$$ -27347 -68669 -49515 -11921 -13979 -45155 -42094 7869 37033 -7509 -78449 -76516 17125 101376
141A01376l0500j13379n8457O5471J07789K7787p0453p9718m738N8967M2996j5663
$$ 101376 70876 -42503 -100960 -35489 72300 100087 29634 -50084 -54822 4145 47141 31478
153C1478l5794n300J7358J002k2226p721L1086L9261l529m8714l5353J9485N1755
$$ 31478 -4316 -9616 7742 8744 -13482 -21203 9883 49144 45615 -3099 -38452 -18967 32788
166C2788L3051j0115m0919l7414j055L6227M2341J0611l5064n5815k4649L3751
$$ 32788 65839 55724 14805 -22609 -23664 12563 54904 65515 30451 -25364 -50013 -16262
178a6262N7404J6804m4201n6754q174M4533L7412j5378l5887L135L5150O614l9397
$$ -16262 41142 57946 13745 -43009 -51183 -6650 30762 15384 -20503 -17368 17782 24396 -15001
191a5001k7368L9376P3490J5450p7758q2303K2171J12735O9533o1689j20134l6471
$$ -15001 -42369 -2993 70497 85947 8189 -74114 -51943 60792 130325 68636 -51498 -87969
203h7969Q6705R4696j8288r9847m7998N2452O2664k2629p4041j6641O8762N6256
$$ -87969 -1264 93432 75144 -24703 -72701 -20249 42415 19786 -54255 -70896 -2134 54122
215E4122m9691j04993j9341J03484R9590l5018j30639o4071Q3380J24098J0834
$$ 54122 4431 -100562 -119903 -16419 83171 48153 -82486 -146557 -63177 60921 71755
226G1755j05359p6205M5421R0815J1641p0302m2078N0578P0265j8790r1270l2937
$$ 71755 -33604 -109809 -64388 26427 38068 -32234 -74312 -23734 46531 27741 -63529 -96466
238i6466Q6094J01070j7673j19868o7655P5891J28739K2584j02957q5421M0818
$$ -96466 -10372 90698 73025 -46843 -114498 -38607 90132 112716 9759 -75662 -34844
249c4844J02943K9174o8277n8535L6575P6520k11q4861m8091O6231R7949q406
$$ -34844 68099 97273 28996 -29539 7036 83556 83345 -1516 -49607 16624 114573 106167
261A06167j17190q1921N8710J26185K9871j05325j07913K0637J06999M9150o3690
$$ 106167 -11023 -92944 -34234 91951 121822 16497 -91416 -70779 36220 85370 21680
272B1680q3064P536P6436K9541o1737o1339L4703Q7967J8236q5370q1265L2179
$$ 21680 -61384 -53848 22588 52129 -9608 -70947 -36244 51723 69959 -15411 -96676 -64497
284f4497J11101N0983p5132j05197o061R1225O8704l1476p9623k4926M9772M6020
$$ -64497 46604 97587 22455 -82742 -88803 2422 71126 39650 -39973 -64899 -15127 30893
296C0893k0562m7173J562M9066K1056m2382n1928J2868O8456L9542m0430p0888
$$ 30893 10331 -36842 -35280 13786 34842 -7540 -59468 -46600 21856 61398 20968 -49920
308d9920j3416N5533N3803o740m8737k9822J5762K9588L639j5189k531J0890k953
$$ -49920 -63336 -7803 46000 39260 -9477 -39299 -23537 6051 9690 -5499 -8030 2860 -93
321i3k2506j4243J8718L3966Q275l2026l5680K853L5543K6981o012k2888j3934
$$ -93 -22599 -36842 -18124 15842 24117 -7909 -43589 -40736 -5193 21788 15776 -7112 -21046
334b1046N387J1998P351P179P922j968j8698j7099R244L0788K0124j2046l2596
$$ -21046 -15659 -3661 3690 10869 18791 16823 -1875 -18974 -9730 21058 41182 29136 -3460
347c460j7505J6479K8282R520j2043j4311o086k76K518Q143J3989P780j3332k7057
$$ -3460 -20965 -4486 23796 33316 21273 6962 876 600 3118 11261 25250 33030 19698 -7359
361g359q992K3529L1701L855k7106k6024J486K2653J3036p265j0435J142n04j3698
$$ -7359 -16351 7178 38879 42734 15628 -10396 -8910 13743 26779 19514 9079 10221 9717 -3981
375c981j1786J1346K8358R168l1283m3039k171M5400L7714j7674n0616k2411K9347
$$ -3981 -15767 -4421 23937 33105 1822 -41217 -43388 2012 39726 22052 -28564 -50975 -21628
388b1628L9045j229l3903j5061K4572K2506j8501l5209M158M6938K9443l5374
$$ -21628 17417 16188 -17715 -32776 -8204 14302 -4199 -39408 -35250 11688 41131 5757
400E757o3255r222O3801N9181k1545p6164l5380M6903O6486K215n9196l7455L3017
$$ 5757 -57498 -66720 -2919 56262 34717 -41447 -76827 -29924 36562 38777 -20419 -57874 -24857
413b4857N1261m989n1716k0048M6439N1915j8294p1974k9795O0239P7818n944
$$ -24857 26404 21415 -30301 -50349 -3910 48005 29711 -42263 -72058 -11819 65999 60055
425F0055q3847n5544M2584Q4572K0501o5100o1076K0550O7145J8539m9514m1861
$$ 60055 -23792 -79336 -36752 47820 68321 3221 -57855 -37305 29840 48379 -1135 -42996
437d2996K6655N7313M393o0487m2578M0393P5839J0616p1079o1468K7117Q1622
$$ -42996 -16341 40972 45365 -15122 -57700 -17307 58532 69148 -1931 -63399 -36282 45340
449D5340L3596n2818o7182N022O2210L2734l4835m6091O862M5769J4934m1772
$$ 45340 78936 26118 -41064 -36042 26168 58902 24067 -22024 -15162 30607 45541 3769
461C769l9836K2508N7711J3007n4907n3516J6075O5170L2211m1203o0144l538
$$ 3769 -36067 -13559 44152 57159 2252 -51264 -35189 29981 62192 20989 -39155 -42693
473d2693N0637L3615k2016m0697j816L2555J6111k5151k9744J3815M2550J0381
$$ -42693 7944 41559 19543 -21154 -22970 9585 25696 545 -29199 -15384 27166 37547
485C7547m0931m0972J3125N2701K6190l2675n0866n619M1207L2693j4192l5099
$$ 37547 -3384 -44356 -31231 21470 47660 14985 -35881 -41500 -293 32400 18208 -16891
497a6891q969K3012J6651j3222k2055N787K8604P808k8533l0643Q716L9137K1133
$$ -16891 -25860 -2848 13803 581 -21474 -15687 12917 20725 -7808 -38451 -29735 9402 30535
510C0535k3557m1342q960L0555K8892n435k7116j4564J0242J5242l19j0439m96
$$ 30535 6978 -34364 -43324 -12769 16123 10688 -16428 -30992 -20750 -5508 -5827 -16266 -16762
523a6762J1758L149j3580j2539Q396K1821J1661j1521k0692m682J6325J9689M509
$$ -16762 -5004 -1855 -15435 -27974 -19578 2243 13904 2383 -18309 -22991 -6666 13023 17532
536A7532q895j0123l352N252R874R264K831n701j1622m938R272J5016L293r735
$$ 17532 8637 -1486 -4838 414 10288 19552 22383 16682 5060 122 9394 24410 27703 17968
550A7968r565n16O110J563k889P95O493P9j4922j4700N857K3041J2220j7334l1671
$$ 17968 8403 7887 13997 15560 12671 13466 19959 20038 5116 -9584 -3727 19314 31534 14200 -17471
565a7471r296K4622K7970n025l1734j8519J4538K2865n04k0843j0280J5687J7143
$$ -17471 -26767 -2145 25825 20800 -10934 -29453 -14915 7950 7446 -13397 -23677 -7990 9153
578I153j0976k7275l123K9802K6798j3258m0620j6565L2215M3417j09m1640k7390
$$ 9153 -1823 -29098 -32221 -2419 24379 11121 -29499 -46064 -13849 29568 29459 -12181 -39571
591c9571K0613L9161P541k9164k2624J5897L0084j094l1128j5656K6666L4230
$$ -39571 -18958 20203 27744 -1420 -24044 -8147 21937 20843 -10285 -25941 725 34955
603C4955n936m3904k5900K9115M8035M762m6391l6936J7946M5523J3920l3437
$$ 34955 29019 -14885 -40785 -11670 36365 41127 -5264 -42200 -24254 21269 35189 1752
615A752l2800J0502L5637Q121l1210k3848J9507L7417J532m0766l0192K4751M9682
$$ 1752 -31048 -20546 15091 23212 -7998 -31846 -12339 25078 26610 -14156 -44348 -19597 30085
628C0085J0392m4701m0161J5280M9343J9604l1578l7746N333L8502J6409k6281
$$ 30085 40477 -4224 -44385 -29105 20238 39842 8264 -29482 -24149 14353 30762 4481
640D481k8504J1771L5913Q672l4228l1337J6901M6601J4342l9297m1985R144M6689
$$ 4481 -24023 -12252 23661 32333 -1895 -33232 -16331 30270 44612 5315 -36670 -27526 19163
653A9163K3719k7603m0917k346L5523K2323j9424l0976J607L0191J3487k4172
$$ 19163 42882 15279 -25638 -27984 7539 29862 10438 -20538 -18931 11260 24747 575
665E75k9383P962L8091J7148k9442l7754L431L9765K5578j8827l6805q439K8713
$$ 575 -28808 -20846 17245 34393 4951 -32803 -29372 10393 35971 17144 -19661 -28100 613
678F13K5346r217k6946n828K0748J5558j2560k2722P10K5469J4854j9042k9369
$$ 613 25959 16742 -10204 -16032 4716 20274 7714 -15008 -14298 11171 26025 6983 -22386
691b2386j031K7476K0391j0625k9052j2000J7314K1315j430j8601j0446Q070J1703
$$ -22386 -23417 4059 24450 13825 -15227 -27227 -9913 11402 9972 -8629 -19075 -11005 698
704F98k653j1905j735J1962P799r271j4863k71J5422J2037l550j4690q220P145
$$ 698 -1955 -13860 -15595 -3633 4166 -5105 -19968 -20239 -4817 7220 3670 -11020 -19240 -12095
718a2095J4472N445n618o843j023L423M042L402L184Q40l276m639O72P775N377
$$ -12095 2377 7822 2204 -4639 -5662 -2239 1803 5205 8389 9229 5953 1314 1986 9761 15138
733A5138j717m030j159J063l1k17K493L850J154p348j0096k09J1993J0263n535
$$ 15138 13421 9391 8232 9295 9264 9047 11540 15390 16544 9196 -900 -1109 10884 21147 15612
748A5612j7618j0098R480J6598J931j5833j2572N364J2341K29j1257o271Q051
$$ 15612 -2006 -12104 -2624 13974 15905 72 -12500 -7136 5205 5434 -5823 -12094 -4043
761d043J0878m285j6860p084J5235J9264k953k2724j5110J3195K5029N234k0757
$$ -4043 6835 2550 -14310 -21394 -6159 13105 10152 -12572 -27682 -14487 10542 15776 -4981
774d981j7594P957K0720M477j4209j1996Q790J6268m5j8310j0512J5407K2114
$$ -4981 -22575 -14618 6102 10579 -3630 -15626 -6836 9432 9387 -8923 -19435 -4028 18086
787A8086j233k5295j6771J4295K8359M946k4825k0378R409K4032N814j8706j5484
$$ 18086 16853 -8442 -25213 -10918 17441 22387 -2438 -22816 -13407 10625 16439 -2267 -17751
800a7751Q664J9956J409k1404j3868J5204K5622l56k8463j9227J6333L2477O079
$$ -17751 -9087 10869 12278 -9126 -22994 -7790 17832 17476 -10987 -30214 -13881 18596 24675
813B4675k8343k5410J1584L0960R793k2385k2275Q009K6770P967k2504k1188J1754
$$ 24675 -3668 -29078 -17494 13466 23259 874 -21401 -13392 13378 21345 -1159 -22347 -10593
826a0593L0935O714k8162k6281J1968L5998J3843k7802l2818N098L4976J8466
$$ -10593 20342 27056 -1106 -27387 -15419 20579 34422 6620 -26198 -21100 13876 32342
838C2342k0443k9851q30K7460J7825j6215k7199J027K7895J5413j9521k7968R44
$$ 32342 11899 -17952 -18782 8678 26503 10288 -16911 -15884 12011 27424 7903 -20065 -19121
851a9121L0366J9394j7417l1842n141K7615K3060r219k7663j0148J8512K0724
$$ -19121 11245 30639 13222 -18620 -23761 3854 26914 17695 -9968 -20116 -1604 19120
863A9120m169k1646p898J5999J5326p339j9127m504J7048J5818p179k1440p326
$$ 19120 14951 -6695 -14593 1406 16732 9393 -9734 -14238 2810 18628 11449 -9991 -17317
876a7317J5046J7288k231j6995j1143P557J3866J871j0899o629N212P125k891
$$ -17317 -2271 15017 12786 -4209 -15352 -7795 6071 7942 -2957 -9586 -4374 2751 -140
889a40q045q72Q022O006n829j0696j306R458Q273l109r078l980N168O669Q6m674
$$ -140 -8185 -9057 -1035 4971 -858 -11554 -12860 -3402 4871 1762 -7316 -11296 -6128 541 627 -4047
905d047j081L836J262l675k865M313O807M99p162o105L535Q960L503n299n784
$$ -4047 -5128 -1292 -30 -3705 -6570 -2257 4550 5049 -2113 -8218 -4683 4277 7780 2481 -3303
920c303j36M320L475m49k758J85K224j619l087R23M803K561l316n748p53M140
$$ -3303 -3439 881 4356 3907 1149 1334 3558 1939 -1148 -225 4578 7139 3823 -1925 -2678 1462
936A462M565j326m401o53J452j03j586M35L108K670l858p432j426Q633P806l211
$$ 1462 6027 4701 300 -353 1099 996 -590 -155 2953 5623 1765 -5667 -7093 1540 9346 6135
952F135j1248n274P897J0499l98j0199o231P244R243j886j0860m158J0373J0714
$$ 6135 -5113 -10387 -2490 8009 7611 -2588 -8819 -1575 7668 5782 -5078 -9236 1137 11851
966A1851m534j5178o936J3472J7454k395j9629j1957J1337K0129K841j7844j4687
$$ 11851 7317 -7861 -14797 -1325 16129 13734 -5895 -17852 -6515 13614 16455 -1389 -16076
979a6076P958J8684L750j6039j2765P709J8171K832j7457j5171R224K2476M905
$$ -16076 -8118 10566 14316 -1723 -14488 -6779 11392 14224 -3233 -18404 -9180 13296 18201
992A8201k0258j9107P168K3832R938j6785k1591K439K1707J1107j3039j8314J370
$$ 18201 -2057 -21164 -13996 9836 19774 2989 -18602 -16163 5544 16651 3612 -14702 -13332
1005a3332J8467R615j3099j8025L693K0539R667j5486j9331K532K1516J2614j2475
$$ -13332 5135 14750 1651 -16374 -12681 7858 17525 2039 -17292 -14760 6756 19370 6895
1018F895k0779j220J9173J3172r355j7428j663J5676J0665r337j5669P45J6879
$$ 6895 -13884 -15104 4069 17241 7886 -9542 -11205 4471 15136 5799 -9870 -9125 7754
1031G754R681j2498j7188J705J7916J1429j0829j9199k092J7018J2583p780j7067
$$ 7754 17435 4937 -12251 -10546 7370 18799 7970 -11229 -13321 3697 16280 8500 -8567
1044h567k986J3712J0271p021j5256j316J4453R561r686j5798j243J5962J1721
$$ -8567 -11553 2159 12430 5409 -9847 -11163 3290 12851 3165 -12633 -13876 2086 13807
1057A3807q127j7802m705J4876J3559m642j5692n742J0607J2213k907j2115n299
$$ 13807 5680 -12122 -16827 -1951 11608 6966 -8726 -14468 -3861 8352 5445 -6670 -11969
1070a1969J0103J0201l676j2461l293J0137J1022k667j2988o448Q767J2173M17
$$ -11969 -1866 8335 4659 -7802 -11095 -958 10064 7397 -5591 -12039 -3272 8901 9318
1083I318j0615p337M179R338L005p044n397K164O865J14n206k776L149M568J14
$$ 9318 -1297 -8634 -4455 4883 7888 844 -4553 -2389 4476 4590 -616 -3392 -243 4325 4439
1098D439m888l790K178N212J452l023l760m68J940K591O01j042j457j392n28J757
$$ 4439 -449 -4239 -2061 3151 4603 1580 -2180 -2648 -708 1883 2484 1442 -15 -1407 -1935 -178
1114a78K829L58l004k424R98K930J257k035k376J119K993P8l647j716L569M301
$$ -178 2651 3009 5 -2419 -1421 1509 2766 731 -1645 -526 2467 2545 -1102 -2818 751 5052
1130E052m39n929m418M230P599J213o919o140K587O955K715m729o101J377O504
$$ 5052 4613 -1316 -5734 -1504 6095 7308 389 -5751 -3164 3791 6506 1777 -4324 -2947 3557
1145C557J754n454n091L638O576P49p469o099M593R566J507q583p719L478R822
$$ 3557 5311 -143 -5234 -1596 4980 5729 -1740 -7839 -3246 6320 7827 -756 -8475 -4997 4825
1160D825K868p090p900K646R135K094p970o765M839R820J39r624p661N630J2204
$$ 4825 7693 603 -7297 -4651 4484 6578 -1392 -8157 -3318 6502 6641 -2983 -10644 -5014 7190
1175G190J916j1885r704N126J3137L838j0991j0990L734J2925M273j0814j0676
$$ 7190 9106 -2779 -12483 -7357 5780 9618 -1373 -12363 -8629 4296 8569 -2245 -12921
1188a2921M778J3395L574j1570j1366M796J5329N844j2749j3927L337J6702Q019
$$ -12921 -8143 5252 8826 -2744 -14110 -9314 6015 11859 -890 -14817 -11480 5222 13241
1201A3241j0522j5592Q26J5779R471r041j4647N87J4574R151q662j4352j54J5266
$$ 13241 2719 -12873 -12047 3732 13203 4162 -10485 -9898 4676 13827 5165 -9187 -9341 5925
1215E925J0122q956j5728j221J4674J1493o687j5667m068J2474J2098m488j4510
$$ 5925 16047 7091 -8637 -9858 4816 16309 9622 -6045 -10113 2361 14459 9971 -4539
1228d539m294J0501J0139l632j3212l612R755R858l938j3107m035R729J0237k914
$$ -4539 -8833 1668 11807 8175 -5037 -8649 1106 10964 7026 -6081 -10116 -387 9850 6936
1242F936j2036n551P984R926j005j0516m760O165P970j149q068l619N880P507
$$ 6936 -5100 -10651 -2667 7259 6254 -4262 -9022 -2857 5113 3964 -4104 -7723 -1843 5664
1256E664j971q645k499O505P039j768p875l550N488P171m41o865l345M349N440
$$ 5664 3693 -4952 -7451 -946 6093 4325 -3550 -7100 -1612 5559 5118 -1747 -5092 -743 4697
1271D697r22n258k223M169M820k101n782j704N017M828j762n903k645L513N653
$$ 4697 3775 -1483 -3706 463 5283 3182 -2600 -4304 713 5541 3779 -2124 -4769 -1256 4397
1286D397o01m795l249K607L674L12l230k250J856K601m11l040r27K110K166k17
$$ 4397 3796 -999 -4248 -1641 2033 2345 -885 -3135 -1279 1322 911 -2129 -3056 -946 1220 1003
1302A003k828j647J312K171J287j797j341m54Q48Q32R09K6r75j269P6J433J689
$$ 1003 -1825 -3472 -2160 11 1298 -499 -1840 -2294 -1446 -614 295 321 -654 -1923 -1847 -414 1275
1319A275j3k672j153K310K078q63k652n24K303L069j084m840r96L954M980j294
$$ 1275 1262 -1410 -2563 -253 1825 962 -1690 -2214 89 3158 2074 -2766 -3762 192 5172 3878
1335C878o279l066M548O721M23p119n104L981P551Q72o857m665L030O998J951
$$ 3878 -2401 -5467 -919 5802 6225 -894 -5998 -2017 5534 6406 -451 -5116 -2086 4912 6863
1350F863o841n994L674Q505J781p858p310L091R779L328p699q832K421R497M350
$$ 6863 22 -5972 -2298 6207 7988 130 -7180 -4089 5690 9018 1319 -7513 -5092 4405 8755
1365H755p044q070P13Q535M608o032q479J188R382M247o518r152J158R507N623
$$ 8755 1711 -6359 -5646 2889 7497 1465 -7014 -5826 3556 7803 1285 -7867 -6709 2798 8421
1380H421o645r608o4J0017N953n266r403q29Q945O046m926q823k74Q810N829n741
$$ 8421 1776 -7832 -7896 2121 8074 2808 -6595 -7424 1521 7567 2641 -6182 -6456 2354 8183 2442
1396B442q983J64R424O028n491j0172l33R781O818n319r606j695Q841O709l951
$$ 2442 -6541 -6377 3047 9075 3584 -6588 -6921 2860 9678 4359 -5247 -6942 1899 8608 4657
1411D657r766j582Q854O609n094r453j057Q854O826m670j0515j980Q918P508l748
$$ 4657 -5109 -6691 2163 8772 3678 -5775 -6832 2022 8848 4178 -6337 -8317 601 8109 4361
1426D361r605l372P246Q077j852r648l696O878P141j809q291l559O326P681j643
$$ 4361 -5244 -8616 -1370 6707 4855 -4793 -8489 -1611 5530 3721 -4570 -8129 -1803 5878 4235
1441D235q852l593O065P620r21p521m330M405P229P62o597m701L337O248R46n561
$$ 4235 -4617 -8210 -2145 5475 4554 -2967 -7297 -2892 4337 5099 -1498 -6199 -2862 3386 4332 -1229
1457a229l526K919N212J029n295l440K616M973O85l510l949J525M090K144l216
$$ -1229 -4755 -1836 3376 4405 -890 -4330 -1714 3259 3944 434 -3515 -1990 2100 4244 1028
1472A028l715R56L340J112k406j679M53K314M26j845j433J287J460M09j599j186
$$ 1028 -2687 -1731 1609 2721 315 -1364 -911 1403 1829 -16 -1449 -162 1298 1707 108 -1078
1488a078P32J010P11o33j265J32Q87l1m57O69L16p71q62J90Q40J001o73j490L04
$$ -1078 -346 664 1375 742 -523 -391 496 465 8 677 993 222 -640 -450 390 1391 718 -772 -468
1507d68J014N30q92p18N94J000K82j456j392J160K749K13k890k063J187L411N94
$$ -468 546 1076 184 -534 60 1060 1342 -114 -1506 -346 2403 2616 -274 -2337 -1150 2261 2855
1524B855k977k572J406L729M29l215k057J362L318L91l313l022K123M708N37m465
$$ 2855 -122 -2694 -1288 2441 2870 -345 -2402 -1040 2278 2669 -644 -3666 -1543 3165 3702 -763
1540g63m068K568N137J296m312n023J900N659K155n007m312J493N432K261m679
$$ -763 -4831 -2263 2874 4170 -142 -5165 -3265 2394 4549 -458 -4770 -3277 2155 4416 -263
1555b63n513J772O570K833n710n891J724P341K850m876o875O81P276L753m211
$$ -263 -5776 -4004 2566 5399 -311 -6202 -4478 2863 5713 837 -6038 -5357 1919 5672 1461
1570A461p050M87O441M302l699p087m81P816M213m625p314k13P518M766l745p748
$$ 1461 -5589 -5102 1339 5641 1942 -5145 -5626 2190 6403 1778 -5536 -5749 1769 6535 2790 -4958
1586d958j387P307N775l294p429j705N664O003k486p227j942O295N466k546p471
$$ -4958 -6345 962 6737 3443 -3986 -5691 -27 5976 3490 -3737 -5679 616 6082 3536 -3935
1601c935j989N738O606k309p395k629N784N863j611o811k644M790N599j008o276
$$ -3935 -5924 -186 6420 4111 -3284 -5913 -129 5734 4123 -2688 -5332 -542 5057 4049 -2227
1616b227k708M132N881j179o434k389M755N063j010n874k867M132N507n03n830
$$ -2227 -4935 -803 5078 3899 -2535 -4924 -169 4894 3884 -1990 -4857 -725 4782 4279 -1551
1631a551k869L221N248Q4m803l545L250M708p3m611k873L024M508K2m611k846
$$ -1551 -4420 -1199 4049 4133 -670 -4215 -965 3743 3670 -941 -3814 -790 3718 3740 -871 -3717
1647c717K529M259K82l853k676J428L766J374l134l021R27L733O61k866k263R42
$$ -3717 -1188 3071 3353 -500 -3176 -1748 2018 3392 258 -2763 -1836 1897 2558 -308 -2571 -1629
1663a629K774O63j913k051K56K624R21j396k205K7J850J724j040k054m12J369
$$ -1629 1145 1808 -105 -2156 -1900 724 1645 249 -1956 -1929 -79 1645 605 -1449 -1861 -492
1679d92J253m62q75o17Q80M5L89n36l98N79j62K37J02l1q14O13M06N23p32q72
$$ -492 761 299 -576 -1193 -313 -268 121 -415 -813 -234 -396 -159 -57 -88 -902 -289 117 640 -92 -964
1699i64J61M91J672l87j396j567J322J746K17j718j247P81K237j4k016j440J259
$$ -964 -803 -312 1360 973 -423 -1990 -668 1078 1295 -423 -1670 -889 1348 1334 -682 -2122 -863
1716h63K587Q6k254k069J377K997L84k701k549J030L912Q47l094k435P23L257
$$ -863 1724 1810 -444 -2513 -1136 1861 2245 -456 -3005 -1975 1937 2784 -310 -2745 -2022 1235
1732A235J510k648l231J370L484J345k919l213R60M128J725l251l950R46M802
$$ 1235 2745 97 -3134 -1764 1720 3065 146 -3067 -2107 2021 3746 495 -3455 -2509 2293
1747B293K003l508m004P05M199K595k730m573N39M352K589k883m391J18M773K965
$$ 2293 4296 788 -3216 -2511 1688 4283 1553 -3020 -2481 1871 4460 1577 -2814 -2696 2077 5042
1763E042l214m934j87N142L483l414m882m08M758L870k860n296r61M549L787k146
$$ 5042 1828 -3106 -3293 1849 5332 1918 -2964 -3372 1386 5256 2396 -2900 -3861 688 4475 2329
1779B329m895j434M443M205k283n637j176M573M135j754n364k105M166M625j287
$$ 2329 -2566 -4000 443 4648 2365 -3272 -4448 125 4260 2506 -2858 -4963 -797 3828 2541
1794B541n028k571L992M436j076m533k473L394M716p08n299k084L570M319n19
$$ 2541 -2487 -5058 -1066 3370 2294 -2239 -4712 -1318 3398 2690 -2609 -4693 -1123 3196 2677
1809B677m530k614K894M664o3m249k677K566L928J26l601k143J591L849N26l856
$$ 2677 -1853 -4467 -1573 3091 3028 -1221 -3898 -1332 2596 2722 -879 -3022 -1431 2418 2944 -912
1825i12j896J644L637K62l306k108J097L375J094l051k678J240L156N88k516k201
$$ -912 -2808 -1164 2473 2735 -571 -2679 -1582 1793 2887 -164 -2842 -1602 1554 2142 -374 -2575
1841b575Q84K945O49k358j930J199K303O31j870k179O57K444J064j583k407M99
$$ -2575 -1691 1254 1903 -455 -2385 -1186 1117 1748 -122 -2301 -1644 800 1864 281 -2126 -1627
1857a627K369Q84j227j562j95J398J252o74j251j65J074P00j82r18o01J166O34
$$ -1627 742 1626 399 -1163 -1358 40 1292 618 -633 -798 276 976 794 -124 -725 441 1075
1874A075n1j215j98O52N91p2j96n55j75K98N09J55l28l38p0J26J166n15r98m26
$$ 1075 1024 -191 -389 263 854 782 586 31 -144 154 663 818 490 152 82 208 1374 859 -139 -565
1894e65P37Q56n13q70m93J242J006o7j954r13J246J871o4j927j668J231K129N54
$$ -565 172 1028 515 -355 -848 394 1400 1333 -621 -1534 -288 1583 1519 -408 -2076 -845 1284 1838
1912A838k237j501P34K516L77k030j912R24K416J108k421k081M94K615J280k261
$$ 1838 -399 -1900 -1166 1350 1727 -303 -2215 -1291 1125 2233 -188 -2269 -1775 840 2120 -141
1928a41k353K96L153J489k040l268N39K666J850j843l078M71L205J811k325l097
$$ -141 -2494 -2198 955 2444 404 -2864 -2325 341 2191 348 -2730 -2259 946 2757 432 -2665
1944b665L40L241J407j579l197j88L404K053j634l136q28L252K495j316l688r54
$$ -2665 -2325 916 2323 744 -2453 -2641 763 2816 1182 -1954 -2782 470 2965 1649 -2039 -2993
1960b993L546K584j942l112o02K817K734j441l917q14L722K608j489l879n65K792
$$ -2993 553 3137 1195 -1917 -2519 298 3032 1591 -2326 -3140 582 3190 1701 -2178 -2743 49
1976D9K880j054l807r07K986K745j209l806j426L217L179j046l673j460K736L546
$$ 49 2929 1875 -1932 -2839 147 2892 1683 -2123 -3549 -332 2847 1801 -1872 -3332 -596 2950
1992B950n12l931j722K253L353J94l471k163K062L786k78k966k115J720L700Q0
$$ 2950 2438 -1493 -3215 -962 2391 2585 -886 -3049 -987 2799 2521 -445 -2560 -840 2860 2940
2008B940l409k033J511L072O36k585k427J187L151O95k269k476P03L126N87j946
$$ 2940 -469 -2502 -991 2081 2717 132 -2295 -1108 2043 2738 469 -2007 -1304 1822 2409 463
2024D63j835J37K180Q83j476j782M74J811Q55j398j620J48J607J377j250j818
$$ 463 -1372 -1235 945 1828 352 -1430 -956 855 1710 312 -1308 -1160 447 1824 574 -1244
2040a244L30R44J297j025j188m10J304Q40o09j080QJ006O52o81p99q3Q36M54k70
$$ -1244 -914 30 1327 302 -886 -1296 8 848 239 -841 -833 173 825 144 -655 -738 98 552 282
2059B82o79n05Q23L95k73k34k56K35L67r1l32P3K41j66J54m41j7k00N89O1j13
$$ 282 -397 -902 -79 316 43 -191 -447 -212 155 64 -268 -195 46 -120 34 -407 -424 -624 -35 26 -87
2080h7o52n5L41Q20j8l82m63m22P64N55l55q85k17L56J433k64j004m92J034R10
$$ -87 -739 -794 -453 367 349 -33 -496 -918 -154 401 46 -839 -1056 -700 733 469 -535 -1027 7 917
2100I17m05j217m49Q52J263k2j443j241R78J883M54j947j202R81J976K35j658
$$ 917 512 -705 -1154 -302 961 939 -504 -1745 -767 1116 1570 -377 -1579 -598 1378 1613 -45
2117d5j388P40J999M33j685j515M67K140J057j949k293Q66K433R75j427k690K47
$$ -45 -1433 -693 1306 1739 54 -1461 -994 1146 2203 254 -2039 -1173 1260 2235 808 -1882 -1635
2134a635K681J620j685k507j54K613J261r05k465n74K600J594j567k152q22K753
$$ -1635 1046 2666 981 -1526 -1680 933 2194 1289 -1176 -1750 850 2444 877 -1275 -2097 656
2150F56J998j181k846o51K461K029r56k383j378K123K331m89k616j240K159K305
$$ 656 2654 1473 -1373 -2024 437 2466 1510 -873 -2251 -128 2203 1714 -902 -2142 17 2322
2166B322q95k541p26J547K082m78k230j316J734K198j78k378j217J064K445k10
$$ 2322 1427 -1114 -1840 -293 1789 1311 -919 -2235 -501 1697 1519 -859 -2076 -1012 1433 1223
2182A223j932j622J586K313o1k524o26O34K550k29j962j487J179K319J66k155
$$ 1223 -709 -2331 -745 1568 1507 -1017 -1643 -1009 1541 1312 -650 -2137 -958 1361 1527 -628
2198f28j696J030K200O74k115j377P84K108M44j835j606R10J869L01j369j251
$$ -628 -2324 -1294 906 1580 -535 -1912 -1128 980 1424 -411 -2017 -1107 762 1063 -306 -1557
2214a557K36J796J027j409j961O12J314J091q40j458k51J495J273j009j569K46
$$ -1557 -1321 475 1502 93 -1868 -1256 58 1149 309 -1149 -1400 95 1368 359 -1210 -964
$$ [...]
8191g3
##END NTUPLES=NMR FID
##END=
