##TITLE=1H_EC-Cl-hY
 DMSO
 8 sc, 
 29.9.2023
##JCAMPDX= 6.0         $$ Bruker NMR JCAMP-DX V2.0
##DATA TYPE= NMR SPECTRUM
##DATA CLASS= NTUPLES
##ORIGIN= UXNMR, Bruker Analytische Messtechnik GmbH
##OWNER= root
$$ XWIN-NMR		Version 3.5
$$ Fri Sep 29 13:45:34 2023 Russian Standard Time (UT+4h)  she@DPX200
##.OBSERVE FREQUENCY= 200.13135
##.OBSERVE NUCLEUS= ^1H
##.ACQUISITION MODE= SIMULTANEOUS
##.ACQUISITION SCHEME= undefined
##.AVERAGES= 8
##.DIGITISER RES= 18
##SPECTROMETER/DATA SYSTEM= spect
##.PULSE SEQUENCE= zg30
##.SOLVENT NAME= CDCl3
##.SHIFT REFERENCE= (INTERNAL, CDCl3, 0, 15.8229)
##AUDIT TRAIL= $$ (NUMBER, WHEN, WHO, WHERE, WHAT)
$$ ##TITLE= Audit trail, XWIN-NMR		Version 3.5
$$ ##JCAMPDX= 5.01
$$ ##ORIGIN= Bruker BioSpin GmbH
$$ ##OWNER= she
$$ F:/spectra/data/she/nmr/H-F/1/pdata/1/auditp.txt
$$ ##AUDIT TRAIL=  $$ (NUMBER, WHEN, WHO, WHERE, WHAT)
(   1,<2023-09-29 13:43:41.67 +0400>,<she>,<DPX200>,
      <created by zg, POWCHK disabled, PULCHK disabled
       configuration hash MD5:
       00 E9 B6 7A A2 85 ED C7 34 08 36 98 17 FE 4E 26
       data hash MD5: 16K
       C4 55 34 BF 63 91 3A E2 4C 53 CA 8B 09 4B 74 5A>)
(   2,<2023-09-29 13:43:44.01 +0400>,<she>,<DPX200>,
      <Start of raw data processing
       efp BC_mod = 2 LB = 0.24 FT_mod = 6 PKNL = 1 PHC0 = -21708.96 PHC1 = 7.052711 SI = 16K 
       data hash MD5: 16K
       A7 3C E4 D5 65 88 75 A4 F7 B4 39 1C 2C 4A 97 E5>)
(   3,<2023-09-29 13:44:06.57 +0400>,<she>,<DPX200>,
      <pk PHC0 = 0.190917 PHC1 = -2 
       data hash MD5: 16K
       4F 14 58 C2 D2 F9 C5 56 2E 73 58 2E C7 90 27 91>)
(   4,<2023-09-29 13:44:13.57 +0400>,<she>,<DPX200>,
      <abs ABSG = 5 
       data hash MD5: 16K
       9E CC A5 0A EC 05 E7 1A DA E9 EF BF D9 14 B3 61>)
$$ ##END=
$$ 
$$ hash MD5
$$ 22 67 59 18 00 BE 3F 0D 3B 6D 13 C8 38 8B B4 64
##$RELAX= 
##$RELAX= 
##$RELAX= 
##$RELAX= 
##$RELAX= 
##$RELAX= 
$$ Bruker specific parameters
$$ --------------------------
##$DU= <F:/spectra>
##$EXPNO= 1
##$NAME= <H-F>
##$PROCNO= 1
##$TYPE= <nmr>
##$USER= <she>
##$AMP= (0..31)
100 100 100 100 100 100 100 100 100 100 100 100 100 100 100 100 100 100 
100 100 100 100 100 100 100 100 100 100 100 100 100 100 
##$AQSEQ= 0
##$AQ_mod= 1
##$AUNM= <au_zg>
##$AUTOPOS= <>
##$BF1= 200.13
##$BF2= 200.13
##$BF3= 200.13
##$BF4= 200.13
##$BF5= 200.13
##$BF6= 200.13
##$BF7= 200.13
##$BF8= 200.13
##$BYTORDA= 1
##$CFDGTYP= 0
##$CFRGTYP= 5
##$CHEMSTR= <none>
##$CNST= (0..31)
1 1 145 1 1 1 1 1 1 1 1 1 1 1 1 1 1 1 1 1 1 1 1 1 1 1 1 1 1 1 1 1 
##$CPDPRG= <>
##$CPDPRG1= <>
##$CPDPRG2= <>
##$CPDPRG3= <>
##$CPDPRG4= <mlev>
##$CPDPRG5= <mlev>
##$CPDPRG6= <mlev>
##$CPDPRG7= <mlev>
##$CPDPRG8= <mlev>
##$CPDPRGB= <>
##$CPDPRGT= <>
##$D= (0..31)
0 1.2 0 0 0 0 0 0 0 0.06 0 0.03 0 0 0 0 0.0002 0 0 0 0 0 0 0 0 0 0 0 0 
0 0 0 
##$DATE= 1695980621
##$DBL= (0..7)
120 120 120 120 120 120 120 120 
##$DBP= (0..7)
150 150 150 150 150 150 150 150 
##$DBP07= 0
##$DBPNAM0= <>
##$DBPNAM1= <>
##$DBPNAM2= <>
##$DBPNAM3= <>
##$DBPNAM4= <>
##$DBPNAM5= <>
$$ [...]
##$SUBNAM3= <"">
##$SUBNAM4= <"">
##$SUBNAM5= <"">
##$SUBNAM6= <"">
##$SUBNAM7= <"">
##$SUBNAM8= <"">
##$SUBNAM9= <"">
##$SW= 18.05172834244
##$SWIBOX= (0..15)
0 0 2 0 0 0 0 0 0 0 0 0 0 0 0 0 
##$SW_h= 3612.71676300578
##$TD= 16384
##$TD0= 1
##$TE= 0
##$TE2= 300
##$TE3= 300
##$TEG= 300
##$TL= (0..7)
0 120 120 120 120 120 120 120 
##$TP= (0..7)
150 150 150 150 150 150 150 150 
##$TP07= 0
##$TPNAME0= <>
##$TPNAME1= <>
##$TPNAME2= <>
##$TPNAME3= <>
##$TPNAME4= <>
##$TPNAME5= <>
##$TPNAME6= <>
##$TPNAME7= <>
##$TPOAL= (0..7)
0.5 0.5 0.5 0.5 0.5 0.5 0.5 0.5 
##$TPOFFS= (0..7)
0 0 0 0 0 0 0 0 
##$TUNHIN= 0
##$TUNHOUT= 0
##$TUNXOUT= 0
##$USERA1= <user>
##$USERA2= <user>
##$USERA3= <user>
##$USERA4= <user>
##$USERA5= <user>
##$V9= 5
##$VALIST= <valist>
##$VCLIST= <CCCCCCCCCCCCCCC>
##$VD= 0
##$VDLIST= <DDDDDDDDDDDDDDD>
##$VPLIST= <PPPPPPPPPPPPPPP>
##$VTLIST= <TTTTTTTTTTTTTTT>
##$WBST= 1024
##$WBSW= 4
##$XGAIN= (0..3)
0 0 0 0 
##$XL= 0
##$YL= 0
##$YMAX_a= 617979
##$YMIN_a= -750948
##$ZGOPTNS= <>
##$ZL1= 120
##$ZL2= 120
##$ZL3= 120
##$ZL4= 120
##$ABSF1= 15.74248
##$ABSF2= -2.309369
##$ABSG= 5
##$ABSL= 3
##$ALPHA= 0
##$AQORDER= 0
##$ASSFAC= 0
##$ASSFACI= 0
##$ASSFACX= 0
##$ASSWID= 0
##$AUNMP= <proc_1d>
##$AZFE= 0.1
##$AZFW= 0.1
##$BCFW= 0
##$BC_mod= 2
##$BYTORDP= 0
##$COROFFS= 0
##$CY= -3
##$DATMOD= 1
##$DC= 0
##$DFILT= <>
##$DTYPP= 0
##$F1P= 0
##$F2P= 0
##$FCOR= 1
##$FTSIZE= 16384
##$FT_mod= 6
##$GAMMA= 0
##$GB= 0
##$INTBC= 1
##$INTSCL= 3.70164e-10
##$ISEN= 128
##$LB= 0.24
##$LEV0= 0
##$LPBIN= 0
##$MAXI= 10000
##$MC2= 0
##$MEAN= 0
##$ME_mod= 0
##$MI= 1.114404
##$NCOEF= 0
##$NC_proc= -4
##$NLEV= 6
##$NOISF1= 3.799351
##$NOISF2= 2.8
##$NSP= 0
##$NTH_PI= 0
##$NZP= 0
##$OFFSET= 15.82291
##$PC= 1
##$PHC0= -21708.77
##$PHC1= 5.052711
##$PH_mod= 1
##$PKNL= yes
##$PPARMOD= 0
##$PSCAL= 0
##$PSIGN= 0
##$REVERSE= no
##$SF= 200.129989719198
##$SI= 16384
##$SIGF1= 3
##$SIGF2= 2
##$SINO= 5.538805
##$SIOLD= 16384
##$SREGLST= <1H.CDCl3>
##$SSB= 0
##$STSI= 16384
##$STSR= 0
##$SW_p= 3612.71676300578
##$SYMM= 0
##$S_DEV= 0
##$TDeff= 16384
##$TDoff= 0
##$TI= <>
##$TILT= no
##$TM1= 0
##$TM2= 0
##$TOPLEV= 0
##$USERP1= <user>
##$USERP2= <user>
##$USERP3= <user>
##$USERP4= <user>
##$USERP5= <user>
##$WDW= 1
##$XDIM= 16384
##$YMAX_p= 412514034
##$YMIN_p= -66094
$$ End of Bruker specific parameters
$$ ---------------------------------
##NTUPLES= NMR SPECTRUM
##VAR_NAME=  FREQUENCY,     SPECTRUM/REAL,   SPECTRUM/IMAG
##SYMBOL=    X,             R,               I
##VAR_TYPE=  INDEPENDENT,   DEPENDENT,       DEPENDENT
##VAR_FORM=  AFFN,          ASDF,            ASDF
##VAR_DIM=   16384,         16384,           16384
##UNITS=     HZ,            ARBITRARY UNITS, ARBITRARY UNITS
##FACTOR=    0.220516191357247, 1,           1
##FIRST=     3166.63887743552, 0,            0
##LAST=      -446.077885570261, 0,           0
##MIN=       -446.077885570261, -66094,      0
##MAX=       3166.63887743552, 412514034,    0
$$ Real data points
##PAGE= N=1
##DATA TABLE= (X++(R..R)), XYDATA
$$ [...]
$$ plain form
11010 -13381 15326 -8021 -12862 543 3657 -7134 -25481 927 34567 -5708 1153 -2793
10998 -2793 -1025 5282 -8101 -24851 -37128 -36396 -31125 5880 -495 -10353 -9299 -760 -14067 -33712
10984 -33712 -25004 -17668 -27999 2918 8550 -6251 -24901 -16112 -27944 -5290 4926 16594
10972 16594 -26438 -38265 -27585 -17041 -8022 -45933 -40946 -29296 -18011 -18437 -9967 -25193 -17218
10959 -17218 -10722 -10412 -8022 -9390 -15915 -13833 -34755 -15709 -3073 3087 1331 -21475 -16103 -12416
10945 -12416 25245 15831 663 -6843 -20209 -20057 -28187 -6952 9211 16472 1613 7040 15705
10932 15705 20541 7425 -7847 -16744 4207 7148 4788 -18812 -15303 -24626 -16272 9797 -9408
10919 -9408 -36481 -37215 -11225 -41849 -6672 -13455 -13632 -13725 -11266 -16479 -9650 -12672 3937 -3742
$$ packed form
11010a3381K8707k3347m841J3405L114j0791j8347K6408L3640m0275O861l946
10998b793J768O307j3383j6750j2277P32N271L7005o375r858J054Q539j3307j9645
10984c3712Q708P336j0331L0917N632j4801j8650Q789j1832K2654J0216J1668
10972A6594m3032j1827J0680J0544R019l7911M987J1650J1285m26Q470j5226P975
10959a7218O496L10K390j368o525K082k0922J9046J2636O160j756k2806N372L687
10945a2416L7661r414j5168p506j3366J52q130K1235J6163P261j4859N427Q665
10932A5705M836j3116j5272q897K0951K941k360k3600L509r323Q354K6069j9205
10919i408k7073p34K5990l0624L5177o783j77r3K459n213O829l022J6609p679
$$ plain form
10905 -3742 -9363 591 2914 3558 -6267 -34368 -13533 -6043 -33075 -29529 -19446 -10806 -30847 -11089
10891 -11089 -3535 -26616 -50963 -39107 -27414 -30725 -10401 11203 17922 13987 4480 1825 -13252
10878 -13252 -26800 -22971 -12562 -10492 -15345 -9822 -20237 -14944 -11187 -10022 3255 -4969 -26384
10865 -26384 -16401 -9802 -11199 -2085 -32413 -32800 -12902 -17280 4024 860 -8621 -2361 15880 10336
10851 10336 2525 -8021 -3836 -7072 -8273 -4851 6990 9320 -19742 -10907 -14766 -3149 6520
10838 6520 16095 8647 -6051 1416 -264 -16526 -1193 -7618 -22103 -10267 890 -920 7295
10825 7295 -16566 -12704 -3491 -14617 -12042 -10144 -34892 -521 1166 -5014 -1197 -6479 -2235 -18795
10811 -18795 3926 29447 6954 -14145 -22865 -34020 -41349 -37650 -24234 -8863 -4881 -6293 2232
$$ packed form
10905c742n621R954K323O44r825k8101K0835P490k7032L546J0083Q640k0041J9758
10891a1089P554k3081k4347J1856J1693l311K0324K1604O719l935r507k655j5077
10878a3252j3548L829J0409K070m853N523j0415N293L757J165J3277q224k1415
10865b6384R983O599j397R114l0328l87J9898m378K1304l164r481O260J8241n544
10851A0336p811j0546M185l236j201L422J1841K330k9062Q835l859J1617R669
10838F520R575p448j4698P467j680j6262J5333o425j4485J1836J1157j810Q215
10825G295k3861L862R213j1126K575J898k4748L4371J687o180L817n282M244j6560
10811a8795K2721K5521k2493k1099q720j1155p329L699J3416J5371L982j412Q525
$$ plain form
10798 2232 -8461 -15444 -21042 10220 -10589 -9369 -541 -16361 1391 226 -3897 -16147 -3937
10785 -3937 2271 -9526 -24191 3826 26366 -50 669 -3564 -3838 -22227 -21604 -4986 -18545
10772 -18545 -14304 -3200 3549 21101 37946 -15687 -23401 -6041 26924 -1033 -28783 -16458
10760 -16458 -27012 -38942 -36456 -8661 -20235 -3757 -24689 -15306 -18808 -10621 -10939 -32596 -46607
10747 -46607 -15655 3182 23527 29288 10571 -5862 602 22282 19479 17801 -6700 -8155 -18498
10734 -18498 -31217 -33113 3156 3070 -1399 -13931 3139 9457 26588 5946 -11358 -263 11114
10721 11114 11970 3581 -3857 -26272 -8182 5680 6918 10821 -4834 -20421 -14045 1216 15053
10708 15053 21872 9895 9100 2208 -21159 270 12470 15457 -660 3745 29704 30461 -10926
$$ packed form
10798B232j0693o983n598L1262k0809J220Q828j5820J7752j165m123j2250J2210
10785c937O208j1797j4665K8017K2540k6416P19m233k74j8389O23J6618j3559
10772a8545M241J1104O749J7552J6845n3633p714J7360L2965k7957k7750J2325
10760a6458j0554j1930K486K7795j1574J6478k0932R383l502Q187l18k1657j4011
10747d6607L0952J8837K0345N761j8717j6433O464K1680k803j678k4501j455j0343
10734a8498j2719j896L6269q6m469j2532J7070O318J7131k0642j7304J1095J1377
10721A1114Q56q389p438k2415J8090J3862J238L903j5655j5587O376J5261J3837
10708A5053O819j1977p95o892k3367K1429J2200K987j6117M405K5959P57m1387
$$ plain form
10695 -10926 -15965 -23170 -7168 -27327 -29056 762 10031 1437 -40794 -33732 -10656 3672 -14168
10682 -14168 -1733 14471 1690 10642 -14007 -26847 -4142 11463 953 -5863 4636 -3778
10670 -3778 5882 4669 112 -266 15329 1840 -8802 -10679 -17412 -2464 -19397 -17872 -8630 -14097
10656 -14097 -18004 -20727 6679 10100 -20346 -7504 -1878 3390 -17511 -8157 1408 7220 -15381
10643 -15381 6199 25171 13295 -2279 -15480 -29703 -11084 -14139 -19134 -9098 10434 10503 -6623
10630 -6623 -8193 20636 14938 -20431 -18051 -10908 2803 -22629 -15060 -4494 -3044 -31104 -17326
10617 -17326 -2834 9087 13723 26862 15001 7066 -6596 2775 28813 38448 48469 24709
10605 24709 17647 580 -11055 -10087 -16165 -22965 -6647 3225 10582 505 -17497 -2092 -2299
$$ packed form
10695a0926n039p205J6002k0159j729K9818R269q594m2231P062K3076J4328j7840
10682a4168J2435J6204j2781Q952k4649j2840K2705J5605j0510o816J0499q414
10670c778R660j213m557l78J5595j3489j0642j877o733J4948j6933J525R242n467
10656a4097l907k723K7406L421l0446J2842N626N268k0901R354R565N812k2601
10643a5381K1580J8972j1876j5574j3201j4223J8619l055m995J0036J9532O9j7126
10630f623j570K8829n698l5369K380P143J3711k5432P569J0566J450k8060J3778
10617a7326J4492J1921M636J3139j1861p935j3662R371K6038R635J0021k3760
10605B4709p062j7067j1635R68o078o800J6318R872P357j0077j8002J5405k07
$$ plain form
10592 -2299 -20591 -24765 -9501 -3029 8773 25445 17534 1380 12066 13873 22980 449 -24325
10579 -24325 -21386 -18020 -20539 -6077 -6333 4366 10113 22052 -9094 -27584 -15078 25196 20421
10566 20421 -3073 6781 26431 10814 -2153 10908 -5289 -5462 -10115 -14105 10430 -13061 -17840
10553 -17840 13654 -846 11197 17270 12925 -18091 -7060 -34191 -46877 -21810 -20683 -16150
10541 -16150 -23454 3618 -12947 -14769 14579 5939 1625 -12652 -7526 -7155 -39931 -11128 -3047
10528 -3047 7352 -8770 9587 17967 -4945 -25393 -55264 -16483 -4247 -13535 -3219 8745
10516 8745 -9476 -19682 1328 20374 -8253 -7039 -30508 -15226 15981 18305 11199 19671 -1156
10503 -1156 -20260 -31934 -31089 -22102 -30231 -8421 -11681 -11327 15636 9303 -4644 -11195 -22948 -19845
$$ packed form
10592b299j8292m174J5264O472J1802J6672p911j6154J0686J807R107k2531k4774
10579b4325K939L366k519J4462k56J0699N747J1939l1146j8490J2506M0274m775
10566B0421k3494R854J9650j5617j2967J3061j6197j73m653l990K4535k3491m779
10553a7840L1494j4500J2043O073m345l1016J1031k7131j2686K5067J127M533
10541a6150p304K7072j6565j822K9348q640m314j4277N126L71l2776K8803Q081
10528c047J0399j6122J8357Q380k2912k0448k9871L8781J2236r288J0316J1964
10516H745j8221j0206K1010J9046k8627J214k3469J5282L1207K324p106Q472k0827
10503a156j9104j1674Q45Q987q129K1810l260L54K6963o333j3947o551j1753L103
$$ plain form
10489 -19845 -39512 -35815 2218 16613 15141 9964 4867 11483 -2486 16622 18743 -4219 -7357
10476 -7357 10312 -9463 -14911 -23742 -24196 15765 -6004 -12057 -10780 17852 20588 13830 -18048
10463 -18048 -13098 -9728 3311 4792 -6882 6700 -10538 -3987 35755 26958 -8252 -21303 4392
10450 4392 -3390 -13547 -15900 -10795 3747 -556 9042 14217 -11104 -31999 -6067 -4111 -14414
10437 -14414 -17475 -10965 -11830 -1345 8355 15701 11882 5678 13329 30250 19059 -8036 -20834
10424 -20834 -17641 -21385 -23352 -1953 -4135 -9062 779 8078 -2261 9610 31398 7407 -1645
10411 -1645 -11288 -19110 -7371 -18288 -7900 -28344 -8883 16510 -5495 -37924 -26745 6731
10399 6731 -1780 -12057 -21834 -10962 -31087 -15451 6944 -26188 -29915 -1654 8386 13027 1239
$$ packed form
10489a9845j9667L697L8033J4395j472n177n097O616j3969J9108K121k2962l138
10476g357J7669j9775n448q831m54L9961k1769o053J277K8632K736o758l1878
10463a8048M950L370J3039J481j1674J3582j7238O551L9742q797l5210j3051K5695
10450D392p782j0157k353N105J4542m303R598N175k5321k0895K5932J956j0303
10437a4414l061O510q65J0485R700P346l819o204P651J6921j1191k7095j2798
10424b0834L193l744j967K1399k182m927R841P299j0339J1871K1788k3991r052
10411a645r643p822J1739j0917J0388k0444J9461K5393k2005l2429J1179L3476
10399F731q511j0277r777J0872k0125J5636K2395l3132l727K8261J0040M641j1788
$$ plain form
10386 1239 8218 11320 17112 2848 -2862 1052 -7007 -17047 -21413 -3363 3116 6606 20332 15531
10372 15531 3816 1721 17948 8338 -18362 -29136 -2329 12068 -4134 -6186 -33200 -27500
10360 -27500 -12994 -25495 -22642 2310 1576 -5535 5426 -33277 -29531 -32634 2938 14967 -4613
10347 -4613 -34917 -46373 -32557 -22385 -913 -13973 -2779 24525 13470 -2952 -14671 -26527
10335 -26527 -22331 -2789 1880 -3003 -26933 -29055 6630 25950 9862 -1934 1511 -3481 -16436
10322 -16436 -11784 10129 7657 -419 15985 11452 -14835 -4631 -3046 -916 4168 -10155 -32951
10309 -32951 -18855 -1045 9368 35936 26868 17449 28061 5505 -2235 -22142 -34709 1586
10297 1586 8881 -12865 -17771 -11025 -14597 322 24132 289 11144 10453 -9854 -14231 -4259
$$ packed form
10386A239O979L102N792j4264n710L914q059j0040m366J8050O479L490J3726m801
10372A5531j1715k095J6227r610k6700j0774K6807J4397j6202k052k7014N700
10360b7500J4506j2501K853K4952p34p111J0961l8703L746l103L5572J2029j9580
10347d613l0304j1456J3816J0172K1472j3060J1194K7304j1055j6422j1719j1856
10335b6527M196J9542M669m883k3930k122L5685J9320j6088j1796L445m992j2955
10322a6436M652K1913k472q076J6404m533k6287J0204J585K130N084j4323k2796
10309c2951J4096J7810J0413K6568r068r419J0612k2556p740j9907j2567L6295
10297A586P295k1746m906O746l572J4919K3810k3843J0855o91k0307m377R972
$$ plain form
10284 -4259 -18294 -19725 -2500 -23454 -11788 1998 11277 14367 -22185 -31596 -18183 -11467 -29760
10271 -29760 -32297 -1152 13559 8077 16758 12760 14309 -3268 17173 10205 -13820 4083 8988
10258 8988 -6090 15790 6003 2338 10802 15182 16801 15058 1530 -29240 -23358 -5276 6351
10245 6351 -4686 -2695 -2890 -8195 -15961 -47918 -37335 -27672 2778 3416 -9119 12822 1761
10232 1761 -18313 -3984 -6558 -2623 -10748 -16425 -13432 18300 11460 -15983 1827 -18099 -30510
10219 -30510 -21130 -28249 -32281 -21098 -12793 1362 -3595 4890 -5373 -16402 -19556 -8244 -4487
10206 -4487 10565 -14186 3947 21002 17277 20227 17016 -7472 -20346 -15543 -9166 -15722 -7799
10193 -7799 -669 30970 41799 37002 27537 8140 20084 31159 9067 -6064 -7087 7866 10913
$$ packed form
10284d259j4035j431J7225k0954J1666J3786R279L090l6552r411J3413O716j8293
10271b9760k537L1145J4711n482Q681l998J549j7577K0441o968k4025J7903M905
10258H988j5078K1880r787l665Q464M380J619j743j3528l0770N882J8082J1627
10245F351j1037J991j95n305p766l1957J0583R663L0450O38j2535K1941j1061
10232A761k0074J4329k574L935q125n677K993L1732o840k7443J7810j9926j2411
10219c0510R380p119m032J1183Q305J4155m957Q485j0263j1029l154J1312L757
10206d487J5052k4751J8133J7055l725K950l211k4488j2874M803O377o556P923
10193g799P130L1639J0829m797r465j9397J1944J1075k2092j5131j023J4953L047
$$ plain form
10180 10913 161 -8317 5367 25360 21457 -6904 6462 8556 686 202 11967 -1875 2782
10167 2782 34858 14098 -2403 -12614 6892 6255 -8416 17149 -3265 13522 5897 -2812 15051
10154 15051 9394 14686 -9054 16666 31219 9165 8572 20477 11409 -16293 -958 5064 -7330
10141 -7330 10506 -19996 -15977 -4757 -14208 12811 17312 3407 18531 31439 11693 -8272
10129 -8272 11904 165 13869 24347 5706 -6732 -10841 -17466 -6656 22923 23369 23741 18557
10116 18557 11693 -1206 -7206 260 -14201 -13515 -24646 -7944 15119 21279 19598 26700 -5279
10103 -5279 -20984 -24806 -6563 2292 -1226 39 -7363 -5515 -19492 2070 -6855 -37167 -27201
10090 -27201 -29981 -1164 -10483 -22107 -16590 1454 2570 -15732 5622 23130 10127 1537 -5386
$$ packed form
10180A0913j0752q478J3684J9993l903k8361J3366K094p870m84J1765j3842M657
10167B782L2076k0760j6501j0211J9506o37j4671K5565k0414J6787p625q709J7863
10154A5051n657N292k3740K5720J4553k2054n93J1905r068k7702J5335O022j2394
10141g330J7836l0502M019J1220r451K7019M501j3905J5124J2908j9746j9965
10129h272K0176j1739J3704J0478j8641j2438m109o625J0810K9579M46L72n184
10116A8557o864j2899o000P466j4461O86j1131J6702K3063O160j681P102l1979
10103e279j5705l822J8243Q855l518J265p402J848j3977K1562q925l0312R966
10090b7201k780K8817r319j1624N517J8044J116j8302K1354J7508j3003q590o923
$$ plain form
10077 -5386 11276 12203 11142 -7952 -13887 3395 21583 30292 16892 10081 -11925 -17326 -6724
10064 -6724 -748 -11633 -8658 -22158 -9799 -18954 -24841 4645 5378 -15047 6694 35147 42849
10051 42849 60469 63758 43676 32317 45151 48856 33931 39229 34996 27892 45711 46289 12376
10038 12376 32176 5435 -19427 -18145 -3134 -13528 437 23858 25249 15434 28892 39279
10026 39279 33426 24616 21436 26403 11825 11661 17617 24948 13971 5286 34310 41302 32424 -4741
10012 -4741 12828 37434 28726 30642 -857 -4896 5098 17794 47128 41592 34241 30523 2895
9999 2895 4837 11651 23390 37669 25134 25127 23758 2844 11712 -78 -5868 -687 4210 -15485
9985 -15485 3852 36653 27096 14518 -13144 9543 35848 41038 50236 49248 41053 15960 -12268
$$ packed form
10077e386J6662R27j061j9094n935J7282J8188Q709j3400o811k2006n401J0602
10064f724N976j0885K975j3500J2359r155n887K9486P33k0425K1741K8453P702
10051D2849J7620L289k0082j1359J2834L705j4925N298m233p104J7819N78l3913
10038A2376J9800k6741k4862J282J5011j0394J3965K3421J391r815J3458J0387
10026C9279n853q810l180M967j4578j64N956P331j0977q685K9024O992q878l7165
10012d741J7569K4606q708J916l1499m039R994J2696K9334n536p351l718k7628
9999B895J942O814J1739J4279j2535pj369k0914Q868j1790n790N181M897j9695
9985a5485J9337L2801r557j2578k7662K2687K6305N190R198r88q195k5093k8228
$$ plain form
9972 -12268 3134 9782 585 -5967 1560 -960 4607 7942 9469 1535 7713 22075 6744 -364
9958 -364 -18274 13738 -2028 29851 18756 21949 30107 7009 21284 21615 2754 -13675 -13929
9945 -13929 1639 -14074 -12271 -20978 -25136 -9928 9424 12099 17863 5927 21222 27535 19878
9932 19878 13401 943 2616 -11915 -26507 -30439 765 26134 -319 -11290 7274 16938 20387
9919 20387 6146 24662 -1201 460 -7310 -12264 -10710 -41391 -32822 -2921 -4135 -3127 -7433
9906 -7433 3609 -3327 -133 -16529 -23372 -22959 -20325 27199 19603 8404 16424 34065 21245 19611
9892 19611 28646 -2016 -13 5915 7353 -4932 -17934 -34501 -289 13621 13967 2765 -21348
9879 -21348 -9009 -5460 -15531 -11252 11557 10280 35070 20818 -5831 16918 6664 -14455
$$ packed form
9972a2268J5402O648r197o552P527k520N567L335J527p934O178J4362j5331p108
9958c64j7910L2012j5766L1879j1095L193Q158k3098J4275L31j8861j6429k54
9945a3929J5568j5713J803q707m158J5208J9352K675N764j1936J5295O313p657
9932A9878o477j2458J673j4531j4592l932L1204K5369k6453j0971J8564R664L449
9919B0387j4241J8516k5863J661p770m954J554l0681Q569K9901j214J008m306
9906g433J1042o936L194j6396o843M13K634M7524p596j1199Q020J7641j2820j634
9892A9611R035l0662K003N928J438j2285j3002j6567L4212J3910L46j1202k4113
9879b1348J2339L549j0071M279K2809j277K4790j4252k6649K2749j0254k1119
$$ plain form
9867 -14455 -19868 -10683 8166 15824 16520 -19966 -5938 406 -17761 -6566 1559 8733 -9655
9854 -9655 14554 15435 24527 10441 10291 26950 19902 -1630 -16485 -2378 16538 20640 -2166
9841 -2166 -6179 -13104 15718 9750 -12604 -31096 -15606 16817 26573 20026 5288 12548 5816
9828 5816 -15146 -20511 -10472 -3512 11543 -1432 31171 17409 -30133 -13017 15013 -849
9816 -849 -1497 12412 25182 38437 36787 34103 -9241 -7444 15594 33013 37296 8292 -11088
9803 -11088 6665 -3281 9720 483 -27849 -6548 13605 8545 -14021 -22475 -29753 -15127 -2496
9790 -2496 30326 33331 -6931 -10510 -1141 -13848 -23511 12066 15720 -23468 -20357 4561 -6996
9777 -6996 -20421 -5552 -4268 4243 -1746 1735 17707 25022 34457 15807 867 2203 -7339 -10648
$$ packed form
9867a4455n413R185J8849P658O96l6486J4028O344j8167J1195Q125P174j8388
9854i655K4209Q81R092j4086j50J6659p048k1532j4855J4107J8916M102k2806
9841b166m013o925K8822n968k2354j8492J5490L2423R756o547j4738P260o732
9828E816k0962n365J0039O960J5055j2975L2603j3762m7542J7116K8030j5862
9816h49o48J3909J2770J3255j650k684m3344J797K3038J7419M283k9004j9380
9803a1088J7753r946J3001r237k8332K1301K0153n060k2566q454p278J4626J2631
9790b496L2822L005m0262l579R369j2707r663L5577L654l9188L111K4918j1557
9777f996j3425J4869J284Q511n989L481J5972P315R435j8650j4940J336r542l309
$$ plain form
9763 -10648 -9902 10060 26884 15197 15614 40724 18043 18276 41334 30112 30704 23259 17901 18809
9749 18809 9512 -10467 3633 9252 -2431 -2490 12784 14312 -5786 -12972 -6121 2150 8656 18243
9735 18243 17177 5874 29150 11731 12290 11737 14309 21339 17208 22433 39964 11946 -8455 -22581
9721 -22581 3979 6544 14693 16310 36544 43788 23951 8155 4695 4467 4012 33763 28783 17932
9707 17932 37687 22117 15882 28635 10888 8996 14352 33820 16859 3774 1951 719 -21055
9694 -21055 -5595 18700 22639 21317 24725 39054 43170 6399 9356 28839 26374 13178 -17246
9681 -17246 -21925 11886 -1063 -3756 21132 8669 50777 56342 38832 61890 41553 34379 28230
9668 28230 28310 12984 24444 22028 16311 21615 22884 -111 17801 15123 13580 29163 31706 28889
$$ packed form
9763a0648P46J9962J6824j1687M17K5110k2681K33K3058j1222N92p445n358R08
9749A8809r297j9979J4100N619j1683n9J5274J528k0098p186O851Q271O506R587
9735A8243j066j1303K3276j7419N59n53K572P030m131N225J7531k8018k0401j4126
9721b2581K6560K565Q149J617K0234P244j9837j5796l460k28m55K9751m980j0851
9707A7932J9755j5570o235J2753j7747j892N356J9468j6961j3085j823j232k1774
9694b1055J5460K4295L939j322L408J4329M116l6771K957J9483k465j3196l0424
9681a7246m679L3811j2949k693K4888j2463M2108N565j7510K3058k0337p174o149
9668B8230Q0j5326J1460k416n717N304J269k2995J7912k678j543J5583K543k817
$$ plain form
9654 28889 40958 29386 34179 11019 15641 19810 6049 11884 -9454 -15072 3811 12554 1259
9641 1259 19185 44453 26418 17122 33744 24350 16318 15046 17820 3330 15306 20520 12770
9628 12770 5224 15805 19319 17619 28175 49765 35675 35801 49884 51923 51550 32443 39357 53039
9614 53039 44118 46230 49320 76075 43915 31811 20256 6136 31388 32501 59642 51954 25229
9601 25229 9388 27592 45979 41452 34627 41099 47250 44331 57720 45287 34461 19608 43413
9588 43413 14012 -2292 11819 9745 20793 27449 36046 31631 22961 6229 7075 10151 -12795
9575 -12795 -4338 1694 -9064 12808 9430 10473 21787 11471 33935 52278 27406 35068 12152
9562 12152 -2984 -493 21659 29161 38050 35808 22791 37373 39654 1642 -6361 25771 31524
$$ packed form
9654B8889J2069j1572M793k3160M622M169j3761N835k1338n618J8883Q743j1295
9641A259J7926K5268j8035r296J6622r394q032j272K774j4490J1976N214p750
9628A2770p546J0581L514j700J0556K1590j4090J26J4083K039l73j9107O914J3682
9614E3039q921K112L090K6755l2160j2104j1555j4120K5252J113K7141p688k6725
9601B5229j5841J8204J8387m527o825O472O151k919J3389j2433j0826j4853K3805
9588D3413k9401j6304J4111k074J1048O656Q597m415q670j6732Q46L076k2946
9575a2795Q457O032j0758K1872l378J043J1314j0316K2464J8343k4872P662k2916
9562A2152j5136K491K2152P502Q889k242j3017J4582K281l8012q003L2132N753
$$ plain form
9549 31524 44863 19711 20537 20001 28526 4730 -3085 2120 11411 16882 2346 11575 17870 26908
9535 26908 24914 37892 24957 -8147 -801 1953 283 33617 72378 64054 56696 58499 30956
9522 30956 18894 18517 19729 19891 15213 34910 16380 16113 29818 58684 48740 41720 37152 30896
9508 30896 28344 33117 33105 1065 23559 26902 33091 26568 20482 10747 -21471 -1780 23248 36261
9494 36261 69855 49263 35768 23598 25308 33906 60208 64501 43587 47403 40768 16748 34512
9481 34512 45179 30203 28072 29348 44573 57648 36477 32902 56852 74298 85769 41375
9469 41375 28748 27304 43294 46189 22992 27524 44346 32646 26583 37319 58061 73013 54212
9456 54212 61998 42629 38160 51965 63306 54564 51309 53770 29009 42586 53446 66219 74274
$$ packed form
9549C1524J3339k5152Q26n36Q525k3796p815N205R291N471j4536R229O295R038
9535B6908j994J2978j2935l3104P346K754j670L3334L8761q324p358J803k7543
9522C0956j2062l77J212J62m678J9697j8530k67J3705K8866r944p020m568o256
9508C0896k552M773j2l2040K2494L343O189o523o086r735l2218J9691K5028J3013
9494C6261L3594k0592j3495j2170J710Q598K6302M293k0914L816o635k4020J7764
9481C4512J0667j4976k131J276J5225J3075k1171l575K3950J7446J1471m4394
9469D1375j2627j444J5990K895k3197M532J6822j1700o063J0736K0742J4952j8801
9456E4212P786j9369m469J3805J1341q742l255K461k4761J3577J0860J2773Q055
$$ plain form
9443 74274 50672 58033 66784 54784 51475 40152 47184 34563 21562 26595 53641 66419 55437
9430 55437 56625 40715 39845 14062 42261 36856 42857 66292 47561 40736 46721 26529 18428
9417 18428 35214 61466 56371 61711 59936 58130 49916 70991 73132 67752 74920 71028 86925 76355
9403 76355 53207 58556 67402 58082 52832 39894 34167 43238 52091 51760 76243 83343 74341 62042
9389 62042 74692 51233 76861 91132 83393 65617 83242 68369 48500 79232 72313 80954
9377 80954 56869 57589 62243 49553 55363 64323 47246 65086 88600 77392 81114 103418 87646
9364 87646 86381 95745 86227 92030 103962 84546 85061 91898 66014 50609 53969 80692 86862 94016
9350 94016 83347 102984 104395 78805 82050 111840 90896 109020 79039 92947 91318 73069
$$ packed form
9443G4274k3602P361Q751j2000l309j1323P032j2621j3001N033K7046J2778j0982
9430E5437J188j5910q70k5783K8199n405O001K3435j8731o825N985k0192q101
9417A8428J6786K6252n095N340j775j806q214K1075K141n380P168l892J5897j0570
9403G6355k3148N349Q846r320n250j2938n727R071Q853l31K4483P100r002j2299
9389F2042J2650k3459K5628J4271p739j7776J7625j4873j9869L0732o919Q641
9377H0954k4085P20M654j2690N810Q960j7077J7840K3514j1208L722K2304j5772
9364H7646j265R364r518N803J1932j9416N15O837k5884j5405L360K6723O170P154
9350I4016j0669J9637J411k5590L245K9790k0944J8124k9981J3908j629j8249
$$ plain form
9338 73069 93045 95554 108757 129094 124222 126014 127234 102477 111419 127367 126646 128679 121389 119947
9324 119947 116886 121485 98726 85953 122314 125616 107955 109800 108511 109315 112474 107983 117488 119661
9310 119661 124020 141456 143660 142556 149592 133016 117537 118078 136555 147738 157765 144860 146264
9297 146264 117857 136068 131181 142868 136992 126816 119326 143719 157346 147436 146196 164769 186718
9284 186718 152758 149031 147952 163776 158285 160176 168750 162963 137874 135481 137044 133387 127516 140418
9270 140418 184273 185170 171822 172491 195793 193801 198560 183029 191484 191262 191197 184550 177751 183105 173143
9255 173143 203864 205438 185857 174873 202965 235853 224081 233824 239768 238312 246875 248614 258219
9242 258219 257336 261819 247585 260386 283184 277985 227526 211619 233109 223714 228546 260074 292993
$$ packed form
9338G3069J9976K509J3203K0337m872J792J220k4757Q942J5948p21K033p290j442
9324A19947l061M599k2759j2773L6361L302j7661J845j289Q04L159m491R505K173
9310A19661M359J7436K204j104P036j6576j5479N41J8477J1183J0027j2905J404
9297A46264k8407J8211m887J1687n876j0176p490K4393J3627r910j240J8573K1949
9284A86718l3960l727j079J5824n491J891Q574n787k5089k393J563l657n871J2902
9270A40418M3855Q97j3348O69K3302j992M759j5531Q455k22o5o647o799N354r962
9255A73143L0721J574j9581j0984K8092L2888j1772R743N944j456Q563J739R605
9242B58219q83M483j4234J2801K2798n199n0459j5907K1490r395M832L1528L2919
$$ plain form
9229 292993 288732 286669 310628 320057 318314 297182 304403 308412 299238 291808 301118 331584 338634 317616
9215 317616 302046 328979 328634 342468 344522 342889 339901 323501 335278 359928 359216 347669 327102
9202 327102 315124 341650 351740 370806 367281 363570 351464 339328 343314 376489 393075 382403
9190 382403 370403 369379 388381 367697 364685 375475 388924 407321 409469 385901 392026 400738 430951
9177 430951 436834 426469 410846 411587 442854 434953 419358 424309 457909 477459 467739 485486 469197
9164 469197 505399 522223 521072 517371 514124 560503 594986 582955 553383 560936 579164 605978
9152 605978 591636 619862 618092 645314 644543 676136 688318 656829 696265 714689 723991 730738 754370
9139 754370 760938 752408 769721 781356 790245 812251 850276 852186 890463 899617 899019 921286 923880
$$ packed form
9229B92993m261k063K3959R429j743k1132P221M009r174p430R310L0466P050k1018
9215C17616j5570K6933l45J3834K054j633k988j6400J1777K4650p12j1547k0567
9202C27102j1978K6526J0090J9066l525l711j2106j2136L986L3175J6586j0672
9190C82403j2000j024J9002k0684l012J0790J3449J8397K148k3568O125Q712L0213
9177D30951N883j0365j5623P41L1267p901j5595M951L3600J9550r720J7747j6289
9164D69197L6202J6824j151l701l247M6379L4483j2031k9572P553J8228K6814
9152F05978j4342K8226j770K7222p71L1593J2182l1489L9436J8424R302O747K3632
9139G54370O568q530J7313J1635Q889K2006L8025J910L8277R154n98K2267K594
$$ plain form
9126 923880 932096 936109 992840 1007669 1038116 1059422 1082036 1098312 1096138 1143983 1166508 1191841
9114 1191841 1224594 1244223 1271584 1336210 1368672 1396941 1403215 1410184 1466510 1534835 1581400 1660681
9102 1660681 1711406 1733778 1771326 1813943 1876797 1933806 1981847 2019390 2052874 2093077 2157989
9091 2157989 2229104 2275623 2325150 2411140 2474971 2537044 2595923 2663239 2725535 2804374 2888706
9080 2888706 2971391 3058895 3142939 3232477 3333112 3425776 3528758 3646031 3756206 3869097
9070 3869097 3986182 4103937 4232549 4357340 4496331 4662092 4822513 4985887 5176062 5358443
9060 5358443 5538870 5757218 5953885 6147714 6386841 6639075 6882958 7132177 7438401 7763599
9050 7763599 8085613 8424704 8778890 9179873 9580859 10012062 10492778 11007505 11538290 12098160
$$ packed form
9126I23880Q216M013N6731J4829L0447K1306K2614J6276k174M7845K2525K5333
9114A191841L2753J9629K7361O4626L2462K8269O274O969N6326O8325M6565P9281
9102A660681N0725K2372L7548M2617O2854N7009M8041L7543L3484M0203O4912
9091B157989P1115M6519M9527Q5990O3831O2073N8879O7316O2296P8839Q4332
9080B888706Q2685Q7504Q4044Q9538J00635R2664J02982J17273J10175J12891
9070C869097J17085J17755J28612J24791J38991J65761J60421J63374J90175J82381
9060E358443J80427K18348J96667J93829K39127K52234K43883K49219L06224L25198
9050G763599L22014L39091L54186M00983M00986M31203M80716N14727N30785N59870
$$ plain form
9040 12098160 12748693 13424740 14171099 15036938 15975902 16999279 18088260 19308925 20671368
9031 20671368 22192384 23879490 25713380 27735711 29868138 32169193 34576069 37013606
9023 37013606 39447621 41689798 43621786 45073547 45916613 46059922 45451315 44191250 42397151
9014 42397151 40228647 37908837 35493343 33053690 30711608 28517218 26512414 24655512
9006 24655512 22944330 21399936 19992127 18712142 17581491 16542802 15609262 14740378
8998 14740378 13968785 13272620 12599818 12024519 11495968 10973149 10490939 10018095 9594166
8989 9594166 9225500 8862302 8526221 8229678 7932388 7644427 7384878 7130574 6873805 6674568
8979 6674568 6464165 6241209 6051779 5873868 5711994 5549439 5374597 5227891 5076985 4943787
$$ packed form
9040A2098160O50533O76047P46359Q65839R38964J023377J088981J220665J362443
9031B0671368J521016J687106J833890K022331K132427K301055K406876K437537
9023C7013606K434015K242177J931988J451761Q43066J43309o08607j260065j794099
9014D2397151k168504k319810k415494k439653k342082k194390k004804j856902
9006B4655512j711182j544394j407809j279985j130651j038689r33540q68884
8998A4740378p71593o96165o72802n75299n28551n22819m82210m72844m23929
8989I594166l68666l63198l36081k96543k97290k87961k59549k54304k56769j99237
8979F674568k10403k22956j89430j77911j61874j62555j74842j46706j50906j33198
$$ plain form
8969 4943787 4847837 4718212 4583655 4472470 4399629 4294184 4187255 4100737 4009177 3932001
8959 3932001 3869867 3782294 3730868 3665395 3619604 3574402 3519174 3509902 3506968 3511903 3495292 3444192
8947 3444192 3380833 3305146 3231837 3118727 3017176 2957717 2887341 2827876 2780828 2710197 2655321
8936 2655321 2618562 2593710 2559283 2533300 2486456 2439761 2432001 2391947 2396461 2376286 2325066 2308031
8924 2308031 2300463 2264233 2233513 2209485 2173339 2165378 2155969 2144171 2139235 2121230 2088354 2074412
8912 2074412 2080895 2059761 2042237 2013486 1992060 2009235 2029622 2035636 2030453 2038284 2028562 2023319 1991740
8899 1991740 2014704 2030914 2009247 2041252 2035399 1999219 2020253 2051226 2071225 2075304 2088292 2094223
8887 2094223 2100967 2150401 2146387 2148199 2166998 2191368 2196602 2253662 2248466 2260902 2320051 2314895 2350099
$$ packed form
8969D943787r5950j29625j34557j11185p2841j05445j06929q6518r1560p7176
8959C932001o2134q7573n1426o5473m5791m5202n5228r272k934M935j6611n1100
8947C444192o3359p5687p3309j13110j01551n9459p0376n9465m7048p0631n4876
8936B655321l6759k4852l4427k5983m6844m6695p760m0054M514k0175n1220j7035
8924B308031p568l6230l0720k4028l6146p961r409j1798m936j8005l2876j3942
8912B074412O483k1134j7524k8751k1426J7175K0387O014n183P831r722n243l1579
8899A991740K2964J6210k1667L2005n853l6180K1034L0973J9999M079J2988N931
8887B094223O744M9434m014J812J8799K4370N234N7060n196J2436N9149n156L5204
$$ plain form
8874 2350099 2390503 2436373 2477390 2526883 2567899 2600262 2655724 2713396 2754332 2786596 2811797
8863 2811797 2853896 2908002 2955982 3001365 3042033 3101872 3167448 3208086 3253051 3313535 3376685
8852 3376685 3455484 3506511 3559000 3643902 3721434 3815393 3901646 3994177 4082867 4175433 4267493
8841 4267493 4348019 4465976 4589779 4690922 4824282 4971864 5090174 5205249 5358444 5533897
8831 5533897 5702220 5874582 6026801 6191312 6388803 6612226 6853560 7096196 7344764 7626689
8821 7626689 7922228 8218547 8540789 8885903 9242086 9626051 10016482 10439777 10917288 11395386
8811 11395386 11921048 12512378 13159037 13852943 14635537 15499594 16432635 17511348 18694750
8802 18694750 20012076 21500632 23148416 25003136 27121774 29488898 32113582 34963877
$$ packed form
8874B350099M0404M5870M1017M9493M1016L2363N5462N7672M0936L2264K5201
8863B811797M2099N4106M7980M5383M0668N9839O5576M0638M4965O0484O3150
8852C376685P8799N1027N2489Q4902P7532R3959Q6253R2531Q8690R2566R2060
8841D267493Q0526J17957J23803J01143J33360J47582J18310J15075J53195J75453
8831E533897J68323J72362J52219J64511J97491K23423K41334K42636K48568K81925
8821G626689K95539K96319L22242L45114L56183L83965L90431M23295M77511M78098
8811A1395386N25662N91330O46659O93906P82594Q64057R33041J078713J183402
8802A8694750J317326J488556J647784J854720K118638K367124K624684K850295
$$ plain form
8794 34963877 38050568 41363691 44706622 47896737 50665703 52668228 53633776 53454037
8786 53454037 52107154 49792843 46783829 43424404 39984904 36652191 33525632 30638931
8778 30638931 28054569 25716400 23655405 21839923 20217976 18785335 17494178 16352144
8770 16352144 15352126 14429320 13619822 12889705 12198651 11579985 11026924 10486836 10023687
8761 10023687 9579239 9145216 8778334 8437050 8125332 7795972 7509971 7227964 6950979
8752 6950979 6737630 6511679 6293779 6109202 5889261 5709212 5552173 5375077 5182243 5015336
8742 5015336 4877004 4760231 4624657 4504130 4419125 4322454 4201653 4090653 3977166 3869821
8732 3869821 3807590 3717134 3626527 3542316 3470409 3393899 3340193 3257373 3190236 3134300 3062669
$$ packed form
8794C4963877L086691L313123L342931L190115K768966K002525R65548j79739
8786E3454037j346883k314311l009014l359425l439500l332713l126559k886701
8778C0638931k584362k338169k060995j815482j621947j432641j291157j142034
8770A6352144j000018r22806q09498p30117o91054o18666n53061n40088m63149
8761A0023687m44448m34023l66882l41284l11718l29360k86001k82007k76985
8752F950979k13349k25951k17900j84577k19941j80049j57039j77096j92834j66907
8742E015336j38332j16773j35574j20527q5005r6671j20801j11000j13487j07345
8732C869821o2231r0456r0607q4211p1907p6510n3706q2820o7137n5936p1631
$$ plain form
8721 3062669 2997144 2922921 2881058 2840431 2800439 2747854 2705910 2649240 2612611 2586612 2554237
8710 2554237 2512506 2433370 2427015 2419959 2409587 2381868 2371263 2355363 2297615 2296523 2302040 2282200
8698 2282200 2256517 2227720 2223423 2205428 2191030 2172410 2151039 2110776 2107826 2100782 2083894 2063537
8686 2063537 2073729 2046515 2047952 2046159 2019023 2049245 2046301 2033353 2032718 2047509 2046260 2030016 2031998
8673 2031998 2048453 2034818 2026741 2033160 2052247 2030356 2049664 2065882 2107849 2142173 2136060 2118716
8661 2118716 2121220 2130118 2140703 2149739 2174808 2194871 2205229 2227426 2242137 2272383 2310062 2338874
8649 2338874 2354869 2382152 2404902 2474902 2522867 2572905 2596123 2634713 2700482 2738814 2813648
8638 2813648 2857987 2894267 2952041 3043366 3091446 3154417 3214372 3288282 3368750 3471905 3595954
$$ packed form
8721C062669o5525p4223m1863m0627l9992n2585m1944n6670l6629k5999l2375
8710B554237m1731p9136o355p056j0372k7719j0605j5900n7748j092N517j9840
8698B282200k5683k8797m297j7995j4398j8620k1371m0263k950p044j6888k0357
8686B063537J0192k7214J437j793k7136L0222k944j2948o35J4791j249j6244J982
8673B031998J6455j3635q077O419J9087k1891J9308J6218M1967L4324o113j7344
8661B118716K504Q898J0585R036K5069K0063J0358K2197J4711L0246L7679K8812
8649B338874J5995K7283K2750P0000M7965N0038K3218L8590O5769L8332P4834
8638B813648M4339L6280N7774R1325M8080O2971N9955P3910Q0468J03155J24049
$$ plain form
8627 3595954 3722077 3812187 3893560 3944832 3980474 4002460 4029886 4069434 4095721 4162308 4202135
8616 4202135 4219539 4298403 4369940 4452000 4557912 4672690 4781432 4894765 5008242 5129748
8606 5129748 5277125 5404251 5548278 5679257 5825422 6003271 6185094 6368177 6546485 6756070
8596 6756070 6988332 7209887 7422781 7660120 7954395 8246651 8561465 8869905 9225324 9606313
8586 9606313 9966860 10349664 10781004 11242443 11726375 12245066 12824703 13431450 14087750 14840532
8576 14840532 15690054 16587436 17572066 18640653 19818458 21117077 22524894 24081950 25795448
8567 25795448 27685384 29754432 31923269 34211953 36596082 38992512 41239255 43227070
8559 43227070 44843334 45911674 46264592 45888371 44799625 43117180 40983979 38563405
$$ packed form
8627C595954J26123R0110Q1373N1272L5642K1986K7426L9548K6287O6587L9827
8616D202135J7404P8864P1537Q2060J05912J14778J08742J13333J13477J21506
8606E129748J47377J27126J44027J30979J46165J77849J81823J83083J78308K09585
8596F756070K32262K21555K12894K37339K94275K92256L14814L08440L55419L80989
8586I606313L60547L82804M31340M61439M83932N18691N79637O06747O56300P52782
8576A4840532Q49522Q97382R84630J068587J177805J298619J407817J557056J713498
8567B5795448J889936K069048K168837K288684K384129K396430K246743J987815
8559D3227070J616264J068340L52918l76221j088746j682445k133201k420574
$$ plain form
8551 38563405 36001712 33440446 30986687 28663287 26496445 24493392 22669729 21054684
8543 21054684 19577119 18203824 16993013 15942426 14974948 14062661 13236950 12502492 11823084
8534 11823084 11199898 10628175 10099814 9637197 9183389 8754582 8396674 8046464 7668501
8525 7668501 7346776 7071504 6767362 6493011 6266668 6021833 5791969 5600700 5397808 5179746
8515 5179746 5024521 4851825 4671713 4510244 4375668 4242024 4095223 3964508 3851737 3737290
8505 3737290 3650442 3521126 3437643 3356003 3256337 3155376 3072947 3006071 2920510 2827604 2746787
8494 2746787 2673281 2616169 2541966 2445428 2392356 2347967 2304742 2255289 2199818 2112723 2063689
8483 2063689 2047492 1993671 1945213 1898215 1834959 1813486 1773363 1728086 1714052 1689618 1658822
$$ packed form
8551C8563405k561693k561266k453759k323400k166842k003053j823663j615045
8543B1054684j477565j373295j210811j050587r67478r12287q25711p34458o79408
8534A1823084o23186n71723n28361m62617m53808m28807l57908l50210l77963
8525G668501l21725k75272l04142k74351k26343k44835k29864j91269k02892k18062
8515E179746j55225j72696j80112j61469j34576j33644j46801j30715j12771j14447
8505C737290q6848j29316q3483q1640r9666j00961q2429o6876q5561r2906q0817
8494B746787p3506n7112p4203r6538n3072m4389m3225m9453n5471q7095m9034
8483B063689j6197n3821m8458m6998o3256k1473m0123m5277j4034k4434l0796
$$ plain form
8472 1658822 1610514 1586931 1566234 1521002 1487270 1473031 1441289 1428239 1379436 1350403 1318569
8461 1318569 1307301 1293148 1265802 1229125 1220419 1200466 1161518 1156467 1142236 1137401 1117507 1091741
8449 1091741 1075144 1037108 1008039 993437 981198 1007362 940916 921772 918405 904684 923545 908722
8437 908722 897415 883884 871167 853041 850427 849911 840288 826122 821902 808886 770866 771834 762296
8424 762296 749916 726890 716867 694419 680800 674113 695477 704337 676338 648918 674513 670373
8412 670373 661169 627797 617164 614237 630418 618068 608053 623660 618778 618282 583901 572312 556046
8399 556046 558186 550542 545930 555744 551637 568598 564306 532892 516336 498163 497878 477061 489053
8386 489053 502695 506005 489604 453725 461975 464032 456677 420012 408706 426752 420130 418338 407596
$$ packed form
8472A658822m8308k3583k0697m5232l3732j4239l1742j3050m8803k9033l1834
8461A318569j1268j4153k7346l6677q706j9953l8948n051j4231m835j9894k5766
8449A091741j6597l8036k9069j4602j2239K6164o6446j9144l367j3721J8861j4823
8437I08722j1307j3531j2717j8126k614n16r623j4166m220j3016l8020R68r538
8424G62296j2380k3026j0023k2448j3619o687K1364Q860k7999k7420K5595m140
8412F70373r204l3372j0633k927J6181j2350j0015J5607m882m96l4381j1589j6266
8399E56046K140p644m612R814m107J6961m292l1414j6556j8173k85k0817J1992
8386D89053J3642L310j6401l5879Q250K057p355l6665j1306J8046o622j792j0742
$$ plain form
8373 407596 424583 408375 392230 368371 362113 353578 351272 330337 347089 348997 333763 323589
8361 323589 300189 321157 330679 320963 314284 342551 336365 324628 314901 317560 333900 322888 324214
8348 324214 333290 303480 298381 305990 313795 300038 308342 332882 311800 316448 304776 317738 319263
8335 319263 306954 323090 337613 324903 329463 315436 305192 299406 278113 275612 296654 318449
8323 318449 315211 311460 291138 293555 298054 287808 275403 301541 301703 273425 280710 286404 305461
8310 305461 297241 270770 247108 268114 268363 270600 269295 272023 295880 268685 261899 248504 282900
8297 282900 303112 262053 257349 279256 258042 242269 233234 264076 269258 274482 263453 253942 241930
8284 241930 241459 229927 228864 230459 212490 208732 197173 215105 234222 244844 236933 272052 276181
$$ packed form
8373D07596J6987j6208j6145k3859o258q535k306k0935J6752J908j5234j0174
8361C23589k3400K0968R522r716o679K8267o186j1737r727K659J6340j1012J326
8348C24214R076k9810n099P609P805j3757Q304K4540k1082M648j1672J2962J525
8335C19263j2309J6136J4523j2710M560j4027j0244n786k1293k501K1042K1795
8323C18449l238l751k0322K417M499j0246j2405K6138J62k8278P285N694J9057
8310C05461q220k6471k3662K1006K49K237j305K728K3857k7195o786j3395L4396
8297B82900K0212m1059m704K1907k1214j5773r035L0842N182N224j1029r511j2012
8284B41930m71j1532j063J595j7969l758j1559J7932J9117J0622p911L5119M129
$$ plain form
8271 276181 266049 267536 262456 245671 262160 263852 260629 253575 254179 261239 238607 231071 246878
8258 246878 273282 302824 299142 294341 301462 293699 297157 305113 300128 291613 299288 316043 307774 292775
8244 292775 251364 264069 287580 263119 274977 295705 278744 264397 285093 284292 301032 311028
8232 311028 279046 267783 280164 270435 276259 297457 295337 268493 278129 295150 293666 295255 274712
8219 274712 258605 256069 271578 288845 296682 277485 282541 295598 295977 328121 306900 319772 310538
8206 310538 283729 295352 287364 277622 291386 296952 281306 283213 302317 290198 296766 282119 293921
8193 293921 313626 420584 405089 360316 348869 308825 316714 328488 334011 318512 319485 312341
8181 312341 321435 306071 316858 326199 298273 292581 298245 284787 305579 309677 337079 334486 343949
$$ packed form
8271B76181j0132J487n080j6785J6489J692l223p054O04P060k2632p536J5807
8258B46878K6404K9542l682m801P121p763L458P956m985q515P675J6755q269j4999
8244B92775m1411J2705K3511k4461J1858K0728j6961j4347K0696q01J6740R996
8232C11028l1982j1263J2381r729N824K1198k120k6844R636J7021j484J589k0543
8219B74712j6107k536J5509J7267P837j9197N056J3057L79L2144k1221J2872r234
8206C10538k6809J1623p988r742J3764N566j5646J907J9104j2119O568j4647J1802
8193B93921J9705J06958j5495m4773j1447m0044P889J1774N523j5499R73p144
8181C12341R094j5364J0787R341k7926n692N664j3458K0792M098K7402k593R463
$$ plain form
8168 343949 335952 328868 317836 324723 327570 340196 345329 351750 346588 356477 358241 375043 352858
8155 352858 351110 374026 355290 358023 367280 385849 373556 396646 381975 365708 380918 389757
8143 389757 384303 387363 415249 396971 393085 396553 384269 395953 376096 364741 370393 379913 385777
8130 385777 386196 377284 401414 415854 420847 420193 425254 442979 441589 444760 410929 422289 431959 423010
8116 423010 410614 447634 433936 420099 449039 437076 421389 414524 430673 422849 423337 409938
8104 409938 426797 435096 440301 444179 444045 446584 437717 423120 426880 457515 465822 445618 443618 456485
8090 456485 450041 452848 463980 448282 448027 475737 478405 472643 490467 488218 469519 486572 513082
8077 513082 526389 533360 534014 514473 483855 465837 473598 502099 492771 501965 489922 460478 484398
$$ packed form
8168C43949p997p084j1032O887K847J2626N133O421n162R889J764J6802k2185
8155C52858j748K2916j8736K733R257J8569j2293K3090j4671j6267J5210Q839
8143C89757n454L060K7886j8278l886L468j2284J1684j9857j1355N652R520N864
8130C85777M19q912K4130J4440M993o54N061J7725j390L171l3831J1360R670q949
8116D23010j2396L7020j3698j3837K8940j1963j5687o865J6149p824M88j3399
8104D09938J6859Q299N205L878j34K539q867j4597L760L0635Q307k0204k000J2867
8090D56485o444K807J1132j5698k55K7710K668n762J7824k249j8699J7053K6510
8077E13082J3307O971O54j9541l0618j8018P761K8501r328R194j2043k9444K3920
$$ plain form
8064 484398 503773 498759 472390 483384 517525 508404 498967 520034 522447 530784 522390 505750 497492
8051 497492 508419 528544 542772 538663 539225 549250 529035 550477 530282 526156 542790 539130 557720
8038 557720 553561 571176 589487 570442 543794 566506 595213 605372 582060 569198 581157 568627
8026 568627 577936 594426 594996 617195 642543 635715 617926 597479 616952 631353 627027 627320 657124
8013 657124 665202 646063 649841 649062 644940 670651 674463 663444 676149 666150 664592 686563 683954
8000 683954 690715 675556 698590 696562 692273 705055 693280 709426 735397 715735 723833 716388 702795
7987 702795 708343 713653 726551 718781 747491 737620 717955 738027 764267 747371 789315 819278
7975 819278 792845 804777 814720 803230 818395 832702 838354 826794 829502 830237 837345 846596 871984
$$ packed form
8064D84398J9375n014k6369J0994L4141r121r437K1067K413Q337q394j6640q258
8051D97492J0927K0125J4228m109N62J0025k0215K1442k0195m126J6634l660J8590
8038E57720m159J7615J8311j9045k6648K2712K8707J0159k3312j2862J1959j2530
8026E68627R309J6490N70K2199K5348o828j7789k0447J9473J4401m326K93K9804
8013F57124Q078j9139L778p79m122K5711L812j1019J2705r999j558K1971k609
8000F83954O761j5159K3034k028m289J2782j1775J6146K5971j9662Q098p445j3593
7987G02795N548N310J2898p770K8710r871j9665K0072K6240j6896M1944K9963
7975H19278k6433J1932R943j1490J5165J4307N652j1560K708P35P108R251K5388
$$ plain form
7962 871984 880819 857940 849578 877676 904302 917208 931468 899453 885234 905458 934652 922118
7950 922118 924415 926880 944852 983145 959403 950750 975856 958112 954607 965040 955068 960392 993453
7937 993453 985913 982883 971597 983926 1026105 1029928 1040967 1034455 1043237 1055535 1041310 1027478 1057142
7924 1057142 1055255 1062691 1048396 1043396 1065713 1075713 1075680 1082219 1093471 1105771 1131195 1157986 1145866
7911 1145866 1156609 1149445 1169723 1180720 1201371 1198537 1182423 1206968 1215052 1245258 1234504 1228634
7899 1228634 1261422 1276933 1306184 1316759 1304197 1310827 1338159 1326458 1335259 1331044 1342391 1356155
7887 1356155 1370261 1393579 1389755 1394518 1391542 1396240 1391664 1398861 1385164 1405744 1443683 1433032 1443877
7874 1443877 1469027 1467764 1475594 1498749 1506243 1538148 1562346 1542466 1563292 1553971 1570103 1588118
$$ packed form
7962H71984Q835k2879q362K8098K6626J2906J4260l2015j4219K0224K9194j2534
7950I22118K297K465J7972L8293k3742q653K5106j7744l505J0433r972N324L3061
7937I93453p540l030j1286J2329M2179L823J1039o512Q782J2298j4225j3832K9664
7924A057142j887P436j4295n000K2317J0000l3O539J1252J2300K5424K6791j2120
7911A145866J0743p164K0278J0997K0651k834j6114K4545Q084L0206j0754n870
7899A228634L2788J5511K9251J0575j2562O630K7332j1701Q801m215J1347J3764
7887A356155J4106K3318l824M763k976M698m576P197j3697K0580L7939j0651J0845
7874A443877K5150j263P830K3155P494L1905K4198j9880K0826r321J6132J8015
$$ plain form
7862 1588118 1599251 1604916 1632441 1639194 1640439 1642994 1660876 1674644 1677030 1686552 1698564 1700046 1741187
7849 1741187 1753120 1748842 1745333 1751955 1761142 1775328 1817959 1831358 1836553 1869983 1894778 1872456
7837 1872456 1861405 1877974 1919685 1936692 1940645 1971266 1990075 2000532 1997942 2042069 2051625 2044364
7825 2044364 2051213 2074101 2090286 2113276 2128098 2133017 2133721 2146270 2185601 2227652 2270669 2248502
7813 2248502 2270717 2306247 2342166 2371558 2402338 2417213 2486095 2442349 2420914 2493390 2512539
7802 2512539 2558628 2562461 2564463 2607051 2636018 2666703 2704132 2733902 2779642 2770113 2792491 2830892
7790 2830892 2875703 2902727 2942802 2971979 2992208 3038686 3096115 3105863 3138785 3178812 3202124 3246644
7778 3246644 3298180 3345238 3384126 3451471 3466307 3526750 3565699 3624362 3669726 3698287 3748955
$$ packed form
7862A588118J1133N665K7525O753J245K555J7882J3768K386R522J2012J482M1141
7849A741187J1933m278l509O622R187J4186M2631J3399N195L3430K4795k2322
7837A872456j1051J6569M1711J7007L953L0621J8809J0457k590M4127R556p261
7825B044364O849K2888J6185K2990J4822M919P04J2549L9331M2051M3017k2167
7813B248502K2215L5530L5919K9392L0780J4875O8882m3746k1435P2476J9149
7802B512539M6089L833K002M2588K8967L0685L7429K9770M5740r529K2378L8401
7790B830892M4811K7024M0075K9177K0229M6478N7429R748L2922M0027K3312M4520
7778C246644N1536M7058L8888O7345J4836O0443L8949N8663M5364K8561N0668
$$ plain form
7767 3748955 3771561 3815401 3873645 3863465 3874217 3892173 3950315 3992227 4010216 4063314 4091573
7756 4091573 4125207 4176382 4232844 4273928 4319311 4363870 4415948 4481345 4517995 4572407 4584330
7745 4584330 4608969 4669155 4713147 4778859 4859559 4948937 5018225 5123983 5198420 5312952 5409286
7734 5409286 5503244 5609057 5734053 5878595 6001618 6136476 6256752 6389436 6532459 6713154
7724 6713154 6889599 7054646 7239837 7425170 7605710 7790504 7988841 8217995 8440678 8650364
7714 8650364 8872431 9082662 9309298 9525930 9761601 10023308 10260519 10525437 10800579 11089879
7704 11089879 11363109 11672228 11980504 12304274 12621274 12943977 13272617 13672379 14057467
7695 14057467 14412594 14809633 15209452 15637983 16076925 16539830 16995375 17473062 17936378
$$ packed form
7767C748955K2606M3840N8244j0180J0752J7956N8142M1912J7989N3098K8259
7756D091573L3634N1175N6462M1084M5383M4559N2078O5397L6650N4412J1923
7745D584330K4639O0186M3992O5712Q0700Q9378O9288J05758P4437J14532R6334
7734E409286R3958J05813J24996J44542J23023J34858J20276J32684J43023J80695
7724F713154J76445J65047J85191J85333J80540J84794J98337K29154K22683K09686
7714H650364K22067K10231K26636K16632K35671K61707K37211K64918K75142K89300
7704A1089879K73230L09119L08276L23770L17000L22703L28640L99762L85088
7695A4057467L55127L97039L99819M28531M38942M62905M55545M77687M63316
$$ plain form
7686 17936378 18431745 18970695 19519580 20068910 20658344 21283682 21876236 22423051 22958119
7677 22958119 23484945 23926767 24412071 24886285 25366769 25870478 26367647 26865202 27403590
7668 27403590 27993386 28574833 29216516 29853907 30516243 31258391 31965537 32714280 33475252
7659 33475252 34258192 35054003 35853608 36679090 37461636 38276458 39048423 39855179 40656584
7650 40656584 41508065 42379940 43316047 44305162 45358956 46457274 47595296 48824757 50124246
7641 50124246 51531784 52977728 54358255 55571446 56581945 57428139 58005275 58361408 58541977
7632 58541977 58510506 58479207 58457922 58515843 58698298 58979953 59308222 59742170 60291016 60891611
7622 60891611 61582593 62331073 63191214 64157411 65216128 66347758 67608816 69017898 70578031
$$ packed form
7686A7936378M95367N38950N48885N49330N89434O25338N92554N46815N35068
7677B2958119N26826M41822M85304M74214M80484N03709M97169M97555N38388
7668B7403590N89796N81447O41683O37391O62336P42148P07146P48743P60972
7659C3475252P82940P95811P99605Q25482P82546Q14822P71965Q06756Q01405
7650D0656584Q51481Q71875R36107R89115J053794J098318J138022J229461J299489
7641E0124246J407538J445944J380527J213191J010499Q46194N77136L56133J80569
7632E8541977l1471l1299k1285N7921J82455K81655L28269M33948N48846O00595
7622F0891611O90982P48480Q60141R66197J058717J131630J261058J409082J560133
$$ plain form
7613 70578031 72286333 74136019 76161767 78416714 80853783 83518734 86396136 89486767
7605 89486767 92851370 96433799 100215573 104223681 108420152 112894413 117715750 123022625
7597 123022625 128804571 135045884 141860133 149304531 157277812 165460122 173602680 181851286
7589 181851286 190804688 201266162 213875804 228894627 246334593 266057348 287871042
7582 287871042 311022950 333700499 353444989 369034218 381424206 392426833 402562538
7575 402562538 410301657 412514034 406413491 391159406 368181428 340020436 309456251
7568 309456251 278717266 249400838 222630234 199005914 178535945 160879737 145685131
7561 145685131 132544130 121161773 111235779 102504018 94865456 88136180 82175639 76888303
$$ packed form
7613G0578031J708302J849686K025748K254947K437069K664951K877402L090631
7605H9486767L364603L582429L781774M008108M196471M474261M821337N306875
7597A23022625N781946O241313O814249P444398P973281Q182310Q142558Q248606
7589A81851286Q953402J0461474J2609642J5018823J7439966J9722755K1813694
7582B87871042K3151908K2677549J9744490J5589229J2389988J1002627J0135705
7575D02562538P739119K212377o100543j5254085k2977978k8160992l0564185
7568C09456251l0738985k9316428k6770604k3624320k0469969j7656208j5194606
7561A45685131j3141001j1382357r925994q731761p638562o729276n960541n287336
$$ plain form
7553 76888303 72205464 68001905 64175475 60754461 57602932 54722286 52045346 49587608
7545 49587608 47302857 45191396 43173926 41335691 39574928 37935180 36407388 34911588
7537 34911588 33515697 32183532 30935197 29771017 28667616 27589241 26578228 25625834
7529 25625834 24720025 23842653 23015659 22240319 21511238 20806117 20191150 19586850 18976125
7520 18976125 18410203 17870220 17342388 16843563 16363782 15909628 15479048 15047446 14673538
7511 14673538 14275502 13912358 13532481 13180218 12847410 12524880 12222670 11930044 11634470
7502 11634470 11337095 11071788 10788158 10557929 10313669 10051511 9811152 9565843 9345597
7493 9345597 9138989 8917630 8735437 8520835 8355335 8191060 8020850 7836390 7666833 7499524
$$ packed form
7553G6888303m682839m203559l826430l421014l151529k880646k676940k457738
7545D9587608k284751k111461k017470j838235j760763j639748j527792j495800
7537C4911588j395891j332165j248335j164180j103401j078375j011013r52394
7529B5625834r05809q77372q26994p75340p29081p05121o14967o04300o10725
7520A8976125n65922n39983n27832m98825m79781m54154m30580m31602l73908
7511A4673538l98036l63144l79877l52263l32808l22530l02210k92626k95574
7502A1634470k97375k65307k83630k30229k44260k62158k40359k45309k20246
7493I345597k06608k21359j82193k14602j65500j64275j70210j84460j69557j67309
$$ plain form
7483 7499524 7361157 7235404 7081963 6917038 6777223 6618885 6473133 6322291 6178917 6022413
7473 6022413 5893086 5759441 5634816 5488145 5365847 5267048 5138816 5029559 4934551 4826416
7463 4826416 4722957 4654681 4548751 4469389 4411324 4329695 4257577 4187806 4101678 4028866 3982683
7452 3982683 3933219 3887239 3833745 3800449 3721993 3685674 3610626 3501036 3464923 3410881 3354006
7441 3354006 3294045 3264664 3215848 3155691 3095736 3077752 3028480 2971475 2928855 2902655 2846719
7430 2846719 2845990 2778824 2715837 2711679 2695892 2655612 2634885 2596281 2530029 2502841 2455184 2421329
7418 2421329 2394281 2345372 2330758 2289898 2247322 2224873 2202310 2149435 2095129 2061949 1994002
7407 1994002 1940218 1881526 1843843 1803923 1737742 1691369 1605672 1554284 1508003 1473288 1421066
$$ packed form
7483G499524j38367j25753j53441j64925j39815j58338j45752j50842j43374j56504
7473F022413j29327j33645j24625j46671j22298r8799j28232j09257r5008j08135
7463D826416j03459o8276j05930p9362n8065q1629p2118o9771q6128p2812m6183
7452C982683m9464m5980n3494l3296p8456l6319p5048j09590l6113n4042n6875
7441C354006n9961k9381m8816o0157n9955j7984m9272n7005m2620k6200n5936
7430B846719p29o7166o2987m158j5787m0280k0727l8604o6252k7188m7657l3855
7418B421329k7048m8909j4614m0860m2576k2449k2563n2875n4306l3180o7947
7407A994002n3784n8692l7683l9920o6181m6373q5697n1388m6281l4715n2222
$$ plain form
7396 1421066 1368036 1326931 1287995 1257468 1247326 1224351 1193896 1180075 1144084 1083690 1030132
7385 1030132 967187 951956 957236 950640 932710 926346 887909 882267 875767 881909 885155 889162 897044
7372 897044 838754 860335 856690 853960 865028 849834 846194 846340 819564 822714 822380 786957 783094
7359 783094 774985 780117 761052 755475 780457 776204 739683 713713 703511 690062 686694 647834 649250
7346 649250 665172 662967 659239 646921 638097 627289 625064 634623 631995 628154 614252 618582 622419
7333 622419 615516 579319 573102 584444 566449 564952 574774 566212 559765 549314 548663 518590 523613
7320 523613 518354 501232 492604 486933 461132 458128 442789 461598 464689 473225 464949 470206 481191
7307 481191 468100 488279 468352 438765 419393 428128 430031 415452 400393 383063 419276 410639
$$ packed form
7396A421066n3030m1105l8936l0527j0142k2975l0455j3821l5991o0394n3558
7385A030132o2945j5231N280o596j7930o364l8437n642o500O142L246M007P882
7372H97044n8290K1581l645k730J1068j5194l640J46k6776L150l34l5423l863
7359G83094q109N132j9065n577K4982m253l6521k5970j0202j3449l368l8860J416
7346F49250J5922k205l728j2318q824j0808k225R559k628l841j3902M330L837
7333F22419o903l6197o217J1342j7995j497R822q562o447j0451o51l0073N023
7320E23613n259j7122q628n671k5801l004j5339J8809L091Q536q276N257J0985
7307D81191j3091K0179j9927k9587j9372Q735J903j4579j5059j7330L6213q637
$$ plain form
7295 410639 403332 419747 412518 412710 421252 401867 380506 369583 385732 382014 378175 375500 371965
7282 371965 374638 388873 389356 382467 370255 347609 348065 354866 321689 307111 342211 332053 334893
7269 334893 316867 320879 303287 288570 302583 332604 342782 330483 313021 315183 306863 305489
7257 305489 316803 326225 315073 315569 319289 311357 295074 299043 321018 299733 302269 329546 322081
7244 322081 324223 323663 315732 304874 311032 290825 330486 322080 304554 293332 296605 315330 295441
7231 295441 285851 293475 298941 271491 248270 248816 246694 255004 250524 220450 231501 213007 239481
7218 239481 235440 199308 212670 207865 227894 219672 224382 188323 183281 203426 206023 226006 189273
7205 189273 178382 213698 194521 180956 191656 167423 151229 164708 171619 173793 171568 171737 173704
$$ packed form
7295D10639p307J6415p229J92Q542j9385k1361j0923J6149l718l839k675l535
7282C71965K673J4235M83o889j2212k2646M56O801l3177j4578L5100j0158K840
7269C34893j8026M012j7592j4717J4013L0021J0178j2299j7462K162q320j374
7257C05489J1314R422j1152M96L720p932j6283L969K1975k1285K536K7277p465
7244C22081K142n60p931j0858O158k0207L9661q406j7526j1222L273J8725j9889
7231B95441r590P624N466k7450k3221N46k122Q310m480l0074J1051j8494K6474
7218B39481m041l6132J3362m805K0029q222M710l6059n042K0145K597J9983l6733
7205A89273j0891L5316j9177j3565J0700k4233j6194J3479O911K174k225J69J967
$$ plain form
7192 173704 162305 162308 170797 195694 208198 199493 189265 171094 163865 173012 189584 192666 201925 203156
7178 203156 202495 211048 211011 200760 177759 172168 192843 197564 194100 203258 184949 189949 188767 188834 173608
7163 173608 199561 178321 147767 150673 178252 165202 158527 154152 159177 144138 148094 167826 171640
7150 171640 161585 135733 132163 140068 155872 165886 183103 152906 162321 158103 139713 128382
7138 128382 148802 155551 168213 173649 165022 159904 138772 135119 125175 123318 123640 132343 141430 136097
7124 136097 148420 140477 143139 155589 152650 168712 153385 146544 150154 121450 130980 142045 133134
7111 133134 116900 133904 154507 154514 125370 104084 106763 94169 105583 99312 93738 102636 106135
7098 106135 99911 109454 125731 146465 127674 129936 125463 109463 95801 99741 96663 76388 112477
$$ packed form
7192A73704j1399LQ489K4897J2504q705j0228j8171p229R147J6572L082R259J231
7178B03156o61Q553l7j0251k3001n591K0675M721l464R158j8309N000j182O7j5226
7163A73608K5953k1240l0554K906K7579j3050o675m375N025j5039L956J9732L814
7150A71640j0055k5852l570P905J5804J0014J7217l0197R415m218j8390j1331
7138A28382K0420O749J2662N436q627n118k1132l653r944j857L22Q703R087n333
7124A36097J2323p943K662J2450k939J6062j5327o841L610k8704R530J1065q911
7111A33134j6234J7004K0603Pk9144k1286K679j2594J1414o271n574Q898L499
7098A06135o224R543J6277K0734j8791K262m473j6000j3662L940l078k0275L6089
$$ plain form
7085 112477 108734 77854 84385 99768 100800 95876 85316 69033 67517 112241 110390 108992 84572
7072 84572 79225 99108 79307 94433 77721 93225 79354 86562 72068 78956 93967 66866
7060 66866 75842 60787 78523 62706 40174 48763 70006 78136 64071 68130 72584 73527 54406
7047 54406 59771 65055 52416 57638 47881 46955 69749 44996 54413 72287 89154 85719 70685
7034 70685 66202 71380 74644 45072 28544 32738 29050 29025 44923 15650 45958 61029 48922
7021 48922 34495 58578 56487 67869 62390 56619 65379 58799 59429 49908 46190 54328 32204 45224
7007 45224 60070 65264 60291 39031 26528 37581 51180 37907 70046 65056 39044 15820
6995 15820 10364 16507 40671 46818 36363 56795 72486 59687 56626 37087 34701 38223 50807
$$ packed form
7085A12477l743l0880O531J5383J032m924j0560j6283j516M4724j851j398k4420
7072H4572n347J9883j9801J5126j6712J5504j3871P208j4494O888J5011k7101
7060F6866Q976j5055J7736j5817k2532Q589K1243Q130j4065M059M454R43j9121
7047E4406N365N284j2639N222r757r26K2794k4753R417J7874J6867l435j5034
7034G0685m483N178L264k9572j6528M194l688k5J5898k9273L0308J5071j2107
7021D8922j4427K4083k091J1382n479n771Q760o580O30r521l718Q138k2124J3020
7007D5224J4846N194m973k1260j2503J1053J3599j3273L2139m990k6012k3224
6995A5820n456O143K4164O147j0455K0432J5691j2799l061j9539k386L522J2584
$$ plain form
6982 50807 37587 39831 47684 38251 58873 36003 13548 28771 42954 47479 48213 45554 34715
6969 34715 60251 63660 30013 23351 21884 5410 10805 15857 8797 32554 34873 40767 23222
6956 23222 27971 35185 20247 13708 17322 30856 40315 2970 -10183 3301 16541 27512 24818
6943 24818 26232 -13486 -1703 2757 15959 25909 26345 16866 37824 35012 -5936 -10806 -24534
6930 -24534 -9447 28397 12396 -7337 11194 12060 11185 27210 11050 -9935 -1876 -17501 -15883
6917 -15883 -18375 10279 12863 7390 -1110 8345 22008 6102 3170 -2998 -26995 -34735 -21019
6904 -21019 -5534 -9046 -22327 -31495 -9503 -9332 -6779 -14651 -18292 -27317 -33280 -10445 6565 15830
6890 15830 24580 11659 -5320 17377 34240 27352 695 6536 1951 9900 23745 31581 20007
$$ packed form
6982E0807j3220K244P853r433K0622k2870k2455J5223J4183M525P34k659j0839
6969C4715K5536L409l3647o662j467j6474N395N052p060K3757K319N894j7545
6956B3222M749P214j4938o539L614J3534R459l7345j3153J3484J3240J0971k694
6943B4818J414l9718J1783M460J3202R950M36r479K0958k812m0948m870j3728
6930b4534J5087L7844j6001j9733J8531Q66q75J6025j6160k0985Q059j5625J618
6917a5883k492K8654K584n473q500R455J3663j5906k932o168k3997p740J3716
6904b1019J5485l512j3281r168K1992J71K553p872l641r025n963K2835J7010R265
6890A5830Q750j2921j6979K2697J6863o888k6657N841m585P949J3845P836j1574
$$ plain form
6877 20007 22522 55714 32599 35684 55657 27654 41928 29623 21290 8077 17821 -11029 -14398
6864 -14398 2390 13800 -3302 -29826 -28549 -15139 -8890 19423 12641 6410 3097 -21856 13498
6851 13498 493 8538 5276 14095 -2871 1028 1566 -11442 -20219 -30668 -17674 -19342 -15568 -22522
6837 -22522 10926 35047 24902 -4092 -13882 -15438 -2747 7574 21164 32348 24548 15295 13328
6824 13328 -20780 -20795 -11429 -29835 -26186 6392 9046 -18747 -23161 -24096 3761 17691 7884 -12377
6810 -12377 -14154 17778 -10777 -10143 -2015 -32206 -21320 2533 -134 4871 10276 -862 15197
6797 15197 -694 -16019 -2148 10230 13842 22243 -2801 -2877 17163 21741 7335 23601 19160
6784 19160 11495 -9659 -33626 -26535 -26836 -47613 -36781 -10756 6988 -5695 -19634 -9407 -21607
$$ packed form
6877B0007K515L3192k3115L085J9973k8003J4274j2305q333j3213R744k8850l369
6864a4398J6788J1410j7102k6524J277J3410O249K8313o782o231l313k4953L5354
6851A3498j3005Q045l262Q819j6966L899N38j3008q777j0449J2994j668L774o954
6837b2522L3448K4121j0145k8994r790j556J2691J0321J3590J1184p800r253j967
6824A3328l4108j5R366j8406L649L2578K654k7793m414r35K7857J3930r807k0261
6810a2377j777L1932k8555O34Q128l0191J0886K3853k667N005N405j1138J6059
6797A5197j5891j5325J3871J2378L612Q401k5044p6K0040M578j4406J6266m441
6784A9160p665k1154k3967P091l01k0777J0832K6025J7744j2683j3939J0227j2200
$$ plain form
6771 -21607 -20504 -9357 -17269 -5374 -4804 -7955 -4752 7845 -31807 -18464 8083 2304 -12769
6758 -12769 -41101 -26734 -8415 10288 2673 7339 -5118 -19838 1603 11200 3078 15762 -3248
6745 -3248 -28882 -8465 19750 16789 7340 11469 19260 752 -19250 -7536 2582 12156 10205
6732 10205 7792 -16769 -5470 -11581 -21174 -3503 27980 33198 12506 14104 4834 12254 -216
6719 -216 16608 -2298 869 11828 -1947 -10402 6911 16876 41953 36692 6138 -10255 -10401
6706 -10401 684 3949 -4258 9449 4267 -2421 -27648 -19316 -16626 -9558 6679 15011 23697 27670
6692 27670 37030 16065 -2426 -12373 31128 29684 40953 42764 32725 7049 7723 6377 22301
6679 22301 -9144 -11986 3900 -15111 -4781 11698 30551 20019 16417 -466 -11214 -21156
$$ packed form
6771b1607J103J1147p912J1895N70l151L203J2597l9652J3343K6547n779j5073
6758a2769k8332J4367J8319J8703p615M666j2457j4720K1441R597q122J2684j9010
6745c248k5634K0417K8215k961r449M129P791j8508k0002J1714J0118R574j951
6732A0205k413k4561J1299o111r593J7671L1483N218k0692J598r270P420j2470
6719b16J6824j8906L167J0959j3775q455J7313R965K5077n261l0554j6393j46
6706a0401J1085L265q207J3707n182o688k5227Q332K690P068J6237Q332Q686L973
6692B7670R360k0965j8491r947M3501j444J1269J811j0039k5676O74j346J5924
6679B2301l1445k842J5886j9011J0330J6479J8853j0532l602j6883j0748r942
$$ plain form
6667 -21156 -1933 -20279 -22932 -11782 -14723 -33652 -21449 -6163 -44038 -19824 -15692 2005
6655 2005 -7657 -37745 -38029 -33350 -27329 -11848 -25187 -18493 -15119 -21997 -6595 -21486 -14561 -2044
6641 -2044 15305 -10936 -12750 3491 -10482 -1791 -209 -28751 -28125 -33144 -50109 -34521 -4866
6628 -4866 4911 -13743 -23101 -21789 -25289 -33881 5432 -23201 -15616 7113 -2903 -7625 -16097 -2008
6614 -2008 -1602 -11290 -23671 -28847 -11182 639 -23160 -17281 -41320 -19270 10040 -1620 -9274
6601 -9274 -39277 -43416 -17783 -15752 11766 -13497 251 -11395 -16421 -4056 -19815 -36908 -25402
6588 -25402 -25184 -10707 -3355 -15627 -7532 -6834 -8344 -27687 -46122 -17982 -14541 -23725 -14392 -6440
6574 -6440 -33933 -34981 -32955 -38135 -29097 -7839 -17535 -30775 -14929 -15819 3241 -19146 -3379
$$ packed form
6667b1156J9223j8346k653J1150k941j8929J2203J5286l7875K4214M132J7697
6655B005r662l0088k84M679O021J5481j3339O694L374o878J5402j4891O925J2517
6641b044J7349k6241j814J6241j3973Q691J582k8542O26n019j6965J5588K9655
6628d866R777j8654r358J312l500q592L9313k8633P585K2729j0016m722q472J4089
6614b008M06r688j2381n176J7665J1821k3799N879k4039K2050K9310j1660p654
6601i274l0003m139K5633K031K7518k5263J3748j1646n026J2365j5759j7093J1506
6588b5402K18J4477P352j2272Q095O98j510j9343j8435K8140L441r184R333P952
6574f440k7493j048K026n180R038K1258r696j3240J5846q90J9060k2387J5767
$$ plain form
6561 -3379 -13662 -1639 -1518 -5831 2774 -27483 -29442 -20548 -28901 -28290 -32249 -34237 -36031 -10481
6547 -10481 -6784 -8532 -21588 -8143 -28893 -11058 -7492 -27029 -21458 14179 -4346 -28218 -33693
6534 -33693 -17674 -28653 -45765 -45546 -25607 -27374 -31135 -29257 -10475 6353 -8870 -23116 -26754
6521 -26754 -15700 -33575 -33387 -11923 -24653 -36580 -18253 -26236 -20101 -19818 -6473 -5794 -4039 3416
6507 3416 6017 -15047 -28905 -24685 -41245 -59515 -23859 -3805 -9277 -7796 -26560 -26454 -49302
6494 -49302 -48792 -23782 -10437 -8760 -9751 -12960 -36389 -11243 -3625 9006 1623 -20787 -39299
6481 -39299 -28283 -2395 17639 1764 -25414 -29542 -39399 -6068 -7156 -21359 -13788 -30798 -12365
6468 -12365 -12756 10862 7653 -3206 -8273 -13262 -14746 -7082 -23137 -4567 -450 -31765 -25233 2214
$$ packed form
6561c379j0283J2023J21m313Q605l0257j959Q894q353O11l959j988j794K5550
6547a0481L697j748j3056J3445k0750J7835L566j9537N571L5637j8525k3872n475
6534c3693J6019j0979j7112K19J9939j767l761J878J8782J6828j5223j4246l638
6521b6754J1054j7875J88K1464j2730j1927J8327p983O135K83J3345O79J755P455
6507C416K601k1064j3858M220j6560j8270L5656K0054n472J481j8764J06k2848
6494d9302N10K5010J3345J677r91l209k3429K5146P618J2631p383k2410j8512
6481c9299J1016K5888K0034j5875k7178m128r857L3331j088j4203P571j7010J8433
6468a2365l91K3618l209j0859n067m989j484P664j6055J8570M117l1315O532K7447
$$ plain form
6454 2214 11957 13354 10424 5939 -2794 -13371 6246 17125 30461 5099 2169 21302 12240
6441 12240 -22851 -29803 -15719 -29480 -24654 -16056 -6251 -10906 -3491 7929 -6567 -3436 -5173
6428 -5173 -13783 -15191 -34338 -40627 -26337 -24240 -24527 -13809 -20281 -32798 -30656 -33654 -22680 -2824
6414 -2824 -9933 -24244 -559 5137 -3969 -18128 -27013 -15316 -35605 -41641 -36376 -19394 -4412
6401 -4412 -15473 -15025 -24693 -42327 -66094 -41256 -25150 -4366 -15064 -19381 -20650 -33295 -28359
6388 -28359 -27225 9569 -9676 -18538 -6581 -234 401 -127 -5705 -39565 -32990 -37515 -35857 -26227
6374 -26227 -33390 -38641 -23581 -31515 -25192 -19579 -13630 -24834 -44231 -28519 -33728 -26149 -17182 -6022
6360 -6022 -313 -4326 8105 -2042 -8875 -27359 -42332 -8577 -9043 -45277 -40049 -15011 11180
$$ packed form
6454B214R743J397k930m485q733j0577J9617J0879J3336k5362k930J9133r062
6441A2240l5091o952J4084j3761M826Q598R805m655P415J1420j4496L131j737
6428e173q610j408j9147o289J4290K097k87J0718o472j2517K142k998J0974J9856
6414b824p109j4311K3685N696r106j4159q885J1697k0289o036N265J6982J4982
6401d412j1061M48r668j7634k3767K4838J6106K0784j0698m317j269j2645M936
6388b8359J134L6794j9245q862J1957O347O35n28n578l3860O575m525J658R630
6374b6227p163n251J5060p934O323N613N949j1204j9397J5712n209P579Q967J1160
6360f022N709m013J2431j0147o833j8484j4973L3755m66l6234N228K5038K6191
$$ plain form
6347 11180 -19139 -33709 -41201 -58696 -29092 -16676 -40644 -47119 -29667 -11645 -2852 -24385
6335 -24385 -28874 -1725 3030 -5141 86 -13148 -2174 -12519 -10359 -1912 -9228 -7947 -15298 -37400
6321 -37400 -34931 -36642 -27043 -44184 -32335 -34623 -36226 6475 19479 -7266 -10411 707 -47809
6308 -47809 -45392 -36117 -24822 -38288 -30028 -18826 -19336 -8197 -34159 -9759 14205 15009 -8645
6295 -8645 -32555 -22243 -17120 -32544 -38260 -39120 -30532 -45806 -31367 -18676 -23561 -6914 -36177
6282 -36177 -28260 -15557 -9780 -10015 5497 8946 7450 -12203 -5347 -13071 -35394 -23240 -2840
6269 -2840 -18634 -50455 -27626 -21060 -9567 23312 12206 -8709 -26760 -14118 -20246 -60637
6257 -60637 -62522 -45077 -51348 -40388 -30743 -42388 -25725 -28492 -28479 -30429 -25469 -23844 -24768 -12712
$$ packed form
6347A1180l0319j4570p492j7495K9604J2416k3968o475J7452J8022Q793k1533
6335b4385m489K7149M755q171N227j3234J0974j0345K160Q447p316J281p351k2102
6321c7400K469j711R599j7141J1849k288j603M2701J3004k6745l145J1118m8516
6308d7809K417R275J1295j3466Q260J1202n10J1139k5962K4400K3964Q04k3654
6295h645k3910J0312N123j5424n716q60Q588j5274J4439J2691m885J6647k9263
6282c6177P917J2703N777k35J5512L449j496j9653O856p724k2323J2154K0400
6269b840j5794l1821K2829O566J1493L2879j1106k0915j8051J2642o128m0391
6257f0637j885J7445o271J0960R645j1645J6663k767J3j950M960J625r24J2056
$$ plain form
6243 -12712 -36341 -45540 -37702 -24299 -43494 -38260 -30559 -32535 -19027 -5695 11846 -3901 -9898
6230 -9898 -11773 -13289 -20424 -19586 -31060 -26053 -21144 -27819 -26914 -35730 -38892 -18079 -16318 -17465 -7200
6215 -7200 -30516 -25331 -6795 -24908 -25746 -47691 -45134 -32149 -25738 -31005 -21218 -14404 -21370 -33614
6201 -33614 -35535 -7456 -7438 -20629 -19599 6217 -1021 -34673 -27179 -45788 -37648 -14387 -20676 -37372
6187 -37372 -11253 -12429 -4660 -23613 -39140 -43800 -30959 -17634 -5072 20255 2242 10158 -6538
6174 -6538 -9995 68 1290 -8047 -14680 -27099 -36014 -32823 -16948 -3198 -23858 -37813 -35310
6161 -35310 -27701 -33313 -28641 -5509 6356 3032 -3677 -10968 -21302 -28278 -10309 -19484 -38694
6148 -38694 -42345 -41267 -22242 -44878 -53746 -29306 -2023 -9843 -26240 -50315 -25054 -8892 -8120
$$ packed form
6243a2712k3629r199P838J3403j9195N234P701j976J3508J3332J7541j5747n997
6230i898j875j516p135Q38j1474N007M909o675R05q816l162K0813J761j147J0265
6215g200k3316N185J8536j8113q38k1945K557J2985O411n267R787O814o966j2244
6201c3614j921K8079J8j3191J030K5816p238l3652P494j8609Q140K3261o289j6696
6187c7372K6119j176P769j8953j5527m660J2841J3325J2562K5327j8013P916j6696
6174f538l457J0063J222r337o633j2419q915L191J5875J3750k0660j3955K503
6161c5310P609n612M672K3132J1865l324o709p291j0334o976J7969r175j9210
6148c8694l651J078J9025k2636q868K4440K7283p820j6397k4075K5261J6162P72
$$ plain form
6135 -8120 -34702 -52507 -47278 -30026 -24814 693 -1030 -33120 -27160 -4009 -8418 -39748 -33859
6122 -33859 -24117 -22931 8597 -2115 -4310 -9427 -5155 -2970 -12353 -21378 -23314 -21516 -21822 -17462
6108 -17462 -30697 -26764 -22042 -35072 -58473 -26941 -40381 -45079 -42393 -34115 -22091 -13053 -26826
6095 -26826 -34496 -19035 -23730 -25496 -21443 -14592 -8940 -8071 8163 13975 -9910 -4915 -26317 -17850
6081 -17850 -15570 -23008 -30103 -27278 -34701 -15385 1640 1840 1365 5090 2657 9777 17268 14528 3615
6066 3615 6876 9982 -18366 -21360 -27947 -44543 -53680 -25048 -9375 -31702 -55208 -54209 -47722 -16715
6052 -16715 -21078 -4583 -20777 -49252 -22432 -19581 -17152 -11382 -15684 4310 639 -7789 -14006
6039 -14006 -14768 -11144 -16092 -19787 -28033 -39366 -36167 -17085 -22528 -23684 -26049 -32180 -29403 -34770
$$ packed form
6135h120k6582j7805N229J7252N212K5507j723l2090N960K3151m409l1330N889
6122c3859R742J186L1528j0712k195n117M272K185r383r025j936J798l06M360
6108a7462j3235L933M722j3030k3401L1532j3440m698K686Q278J2024R038j3773
6095b6826p670J5461m695j766M053O851N652Q69J6234N812k3885M995k1402Q467
6081a7850K280p438p095K825p423J9316J7025K00m75L725k433P120P491k740j0913
6066C615L261L106k8348k994o587j6596r137K8632J5673k2327k3506R99O487L1007
6052a6715m363J6495j6194k8475K6820K851K429N770m302J9994l671q428o217
6039a4006p62L624m948l695q246j1333L199J9082n443j156k365o131K777n367
$$ plain form
6025 -34770 -37279 2778 15214 11874 -15598 -5611 -12067 -29061 -8882 -17026 -20605 -36982 -33430
6012 -33430 -31406 -41214 -36287 -11355 -19733 -33819 -57715 -53966 -33091 -26289 -44172 -8646 -466
5999 -466 -29651 -36036 -44179 -46658 -11554 -16053 -22052 -10347 -17760 -5573 1551 -15444 2434 -12424
5985 -12424 -25401 -35986 -31686 -39392 -19316 -16689 -30386 -24678 -30784 -24530 -16992 -8113 -14691 -29954
5971 -29954 -12699 19580 3727 10408 -6122 -29077 -5265 3543 -17619 8344 1514 22618
5959 22618 -6068 -8175 -6319 -11684 -15941 -30405 -27415 -25994 -32985 -40305 -20970 -15703 -14214 -12011
5945 -12011 -2713 -24244 -17158 -20433 -26507 -38016 -33099 -21266 -37809 -41241 -21618 -32748 -52238
5932 -52238 -31208 -10864 -11877 -22885 -25107 -24787 -20337 -32443 -28556 -35323 -14229 -3082 -7545
$$ packed form
6025c4770k509M0057J2436l340k7472R987o456j6994K0179q144l579j6377L552
6012c3430K024r808M927K4932q378j4086k3896L749K0875O802j7883L5526Q180
5999d66k9185o385q143k479L5104m499n999J1705p413J2187P124j6995J7878j4858
5985a2424j2977j0585M300p706K0076K627j3697N708o106O254P538Q879o578j5263
5971b9954J7255L2279j5853O681j6530k2955K3812Q808k1162K5963o830K1104
5959B2618k8686k107J856n365m257j4464K990J421o991p320J9335N267J489K203
5945a2011R298k1531P086l275o074j1509M917J1833j6543l432J9623j1130j9490
5932e2238K1030K0344j013j1008k222L20M450j2106L887o767K1094J1147m463
$$ plain form
5919 -7545 -26118 -27548 -7608 -15699 -29264 -23139 -36110 -13493 -6868 -29087 -23387 -13341 -27736
5906 -27736 -50438 -55056 -53181 -24773 -17770 -27667 -27899 -35040 -18098 -26858 -14045 -17885 -18720 -23322
5892 -23322 -14166 -4820 -20998 -36142 -2931 6758 7008 848 -3960 5239 11583 -13858 -20300 -8007
5878 -8007 -4370 -24032 -32968 -11380 -12806 -15175 -20250 -12838 -10292 -24690 -34869 -8675 -3159 -11779
5864 -11779 -24678 -6956 -6042 2119 -20642 -28044 -18526 -10847 -5986 -35030 -42497 -39119 -26284 -9309
5850 -9309 -36377 -26785 -11874 -21364 -18637 -29401 -24665 -26762 -33229 -43327 -44200 -25680 -25149 -20763
5836 -20763 -46299 -29469 -28694 -28357 -886 2022 -9139 10706 -7851 -30248 -10287 -8722 -16861
5823 -16861 1672 -14439 -25390 -32172 -34359 -29959 -23625 -36274 -12488 -32976 -40750 -30368 -24201
$$ packed form
5919g545j8573j430J9940q091j3565O125j2971K2617O625k2219N700J0046j4395
5906b7736k2702m618J875K8408P003r897k32p141J6942q760J2813l840q35m602
5892b3322R156R346j6178j5144L3211R689K50o160m808R199O344k5441o442J2293
5878h007L637j9662q936K1588j426k369n075P412K546j4398j0179K6194N516q620
5864a1779j2899J7722R14Q161k2761p402R518P679M861k9044p467L378J2835J6975
5850i309k7068R592J4911r490K727j0764M736k097o467j0098q73J8520N31M386
5836b0763k5536J6830P75L37K7471K908j1161J9845j8557k2397J9961J565q139
5823a6861J8533j6111j0951o782k187M400O334j2649K3786k0488p774J0382O167
$$ plain form
5810 -24201 -42369 -53449 -41901 -54087 -35527 -27372 -20188 -14097 -7476 -35550 -45366 -36647 -32140
5797 -32140 -44247 -56569 -34519 -19140 -9553 -16319 -35320 -29189 -12392 -26774 -32669 -17526 -17777
5784 -17777 -22699 -20380 -38762 -50847 -40991 -44163 -26661 -21312 -25979 -20987 -31244 -26667 -31644 -43269
5770 -43269 -38931 -32034 -1844 -14326 -25109 -39771 -37607 -24807 -27201 -21028 -13081 -20304 -1205
5757 -1205 8736 4641 -18309 -13309 -9853 -34611 -58371 -26164 -15742 -21113 -5843 -9427 -11667
5744 -11667 -19632 7146 -3579 -21065 -15045 -23282 -20339 -34847 -8084 5757 -10364 -23352 -16643
5731 -16643 -8229 -20459 -45442 -37946 -13399 422 -4190 -13333 2171 2366 -15411 -17881 2318
5718 2318 -6730 -6650 -2520 10520 -6693 -20709 -21798 -27386 -16654 9148 -1440 -19312 -11353 -15259
$$ packed form
5810b4201j8168j1080J1548j2186J8560Q155P184O091O621k8074r816Q719M507
5797c2140j2107j2322K2050J5379R587o766j9001O131J6797j4382n895J5143k51
5784a7777m922K319j8382j2085R856l172J7502N349m667M992j0257M577m977j1625
5770d3269M338O897L0190j2482j0783j4662K164J2800k394O173P947p223J9099
5757a205R941m095k2950N000L456k4758k3760L2207J0422n371J5270l584k240
5744a1667p965K6778j0725j7486O020q237K943j4508K6763J3841j6121j2988O709
5731a6643Q414j2230k4983P496K4547J3821m612r143J5504J95j7777k470K0199
5718B318r048Q0M130J3040j7213j4016j089n588J0732K5802j0588j7872P959l906
$$ plain form
5704 -15259 -35902 -12057 4243 -7571 -13895 -33109 -28605 -51792 -50903 -59370 -32301 -29496 -27593
5691 -27593 -24442 -34322 -27713 -13701 -17000 -31246 -24206 3283 -14281 -30222 -24593 -24634 -18084 -28909
5677 -28909 -33547 -27972 -32248 -24796 -30384 -35655 -11290 -2970 -11707 -29422 -19691 -34493 -26447 -20849
5663 -20849 -15689 -16048 -19160 -10550 -17801 -19601 -36001 -31108 -30955 -28791 -12591 -10215 -28741 -46107
5649 -46107 -30213 -25362 -39939 -47490 -34857 -24072 -16322 5 21590 -11608 -22442 -25131 -16569
5636 -16569 -10891 -10695 -45988 -49193 -16376 -16586 -9039 -4069 748 -343 13118 1927 -8540 -1857
5622 -1857 -1621 -18783 -22833 -37990 -27876 -18235 -17856 -45194 -49406 -33325 -39501 -22583 -29474 -2177
5608 -2177 1166 -12217 -22775 -9472 -27566 -18383 -40443 -27553 -40280 -50840 -39948 -8974
$$ packed form
5704a5259k0643K3845J6300j1814o324j9214M504k3187Q89q467K7069K805J903
5691b7593L151r880O609J4012l299j4246P040K7489j7564j5941N629m1O550j0825
5677b8909m638N575m276P452n588n271K4365Q320q737j7715R731j4802Q046N598
5663b0849N160l59l112Q610p251j800j6400M893J53K164J6200K376j8526j7366
5649d6107J5894M851j4577p551J2633J0785P750J6327K1585l3198j0834k689Q562
5636a6569N678J96l5293l205L2817k10P547M970M817j091J3461j1191j0467O683
5622a857K36j7162m050j5157J0114R641L79k7338m212J6081o176J6918o891K7297
5608b177L343j3383j0558J3303j8094R183k2060J2890j2727j0560J0892L0974
$$ plain form
5596 -8974 6674 -11204 924 -2286 -16570 -28950 -27382 -39271 -38288 -51432 -54566 -26551 -13402
5583 -13402 -18604 -14199 -11524 1861 9754 -8868 6303 -8107 -23963 -1195 -15009 -7806 -14115
5570 -14115 -53234 -38906 -28041 -38805 -26470 -589 -6140 -21855 -7088 -23389 -27718 -14434
5558 -14434 -15079 -19518 -31277 -25307 -23976 -45731 -29447 -32445 -26359 -31520 -20501 -18036 -10673 -33412
5544 -33412 -27236 -19642 -16790 -17908 -30457 -41032 -32649 -3790 16995 14881 5677 873 2 -8777
5530 -8777 -21932 -23926 -35666 -40624 -40237 -12044 -38995 -39769 -10019 -25317 -25821 -21404 -7454 -29218
5516 -29218 -20830 9787 21075 8341 -30494 -23739 4154 12622 1731 -30338 -6824 -1685 18168
5503 18168 -8976 -35938 -11416 9143 17651 -4231 1391 13642 19815 -22881 -5859 -1714 -855
$$ packed form
5596h974J5648j7878J2128l210j4284j2380J568j1889R83j3144l134K8015J3149
5583a3402n202M405K675J3385P893j8622J5171j4410j5856K2768j3814P203o309
5570a4115l9119J4328J0865j0764J2335K5881n551j5715J4767j6301m329J3284
5558a4434o45m439j1759N970J331k1755J6284k998O086n161J1019K465P363k2739
5544c3412O176P594K852j118j2549j0575Q383K8859K0785k114r204m804q71q779
5530h777j3155j994j1740m958L87K8193k6951p74K9750j5298n04M417J3950k1764
5516b9218Q388L0617J1288j2734l8835O755K7893Q468j0891l2069K3514N139J9853
5503A8168k7144k6962K4522K0559Q508k1882N622J2251O173m2696J7022M145Q59
$$ plain form
5490 -855 -33081 -24151 -20644 -27508 -23700 -9038 -29843 -49092 -43111 -45612 -41450 -43597 -30149 -37266
5476 -37266 -12409 -6084 -11716 -34656 -28855 -27878 13241 13872 -1060 -2899 -26081 -45732 -21107
5463 -21107 -21635 -21427 2 -23608 -4288 -6080 -1460 24838 16676 9535 -16994 -12536 -5809 -13936
5449 -13936 -27016 -17081 -33089 -40678 -2459 1553 -12208 -29606 -9504 1109 -21055 -32758
5437 -32758 -22633 -11433 -7965 -23785 -9147 -7794 -20954 1724 -330 9026 12609 -7509 -4214
5424 -4214 4052 -12828 -28501 -10829 -17923 -9061 -2038 3747 -4212 -2582 -6065 -22315 -43473 -45321
5410 -45321 -52727 -33294 -35502 -31189 -44869 -38800 -34414 -38548 -44619 -24045 -14491 -11285 -37588 -36806
5396 -36806 -13597 27927 19375 2408 -15845 -23408 -13731 -17527 1753 2280 -7790 -55722 -35960
$$ packed form
5490h55l2226Q930L507o864L808J4662k0805j9249N981k501M162k147J3448p117
5476c7266K4857O325n632k2940N801R77M1119O31j4932j839k3182j9651K4625
5463b1107n28K08K1429k3610J9320j792M620K6298q162p141k6529M458O727q127
5449a3936j3080R935j6008p589L8219M012j3761j7398K0102J0613k2164j1703
5437c2758J0125J1200L468j5820J4638J353j3160K2678k054R356L583k0118L295
5424d214Q266j6880j5673J7672p094Q862P023N785p959J630l483j6250k1158j848
5410d5321p406J9433k208M313j3680O069M386m134o071K0574R554L206k6303P82
5396c6806K3209M1524q552j6967j8253p563R677l796J9280N27j0070m7932J9762
$$ plain form
5383 -35960 -29601 -48347 -65707 -50392 -24827 -14545 382 296 -9773 -9723 -30208 -11872 -3025
5370 -3025 -22412 -44547 -43543 -23140 -15357 -27420 -26042 -44088 -31844 -12935 2136 5762 1679
5357 1679 -10875 -20478 -2007 -4105 -26306 -7854 1870 631 7786 18053 -4475 3107 -23841
5344 -23841 -33532 -11688 -11074 -10864 -12898 19057 -4994 -8780 2194 9704 31525 50670 35291
5331 35291 15541 1222 3944 7343 -19558 -25391 -33102 -4704 14909 -3986 -21001 -32964 4311
5318 4311 9325 -8071 -27880 -11013 -4192 -13778 8313 -2252 -18858 -25789 -16432 -22104 -23979
5305 -23979 -25528 -17849 -13903 18521 18792 -4508 -17402 -22961 -30447 -15806 2998 7624 12279 3407
5291 3407 15554 40135 27186 9611 4044 -240 -3645 -21433 -6883 8758 22615 9616 -2519
$$ packed form
5383c5960O359j8746j7360J5315K5565J0282J4927q6j0069N0k0485J8336Q847
5370c025j9387k2135J004K0403P783j2063J378j8046J2244J8909J5071L626m083
5357A679j2554r603J8471k098k2201J8452R724j239P155J0267k2528P582k6948
5344b3841r691K1844O14K10k034L1955k4051l786J0974P510K1821J9145j5379
5331C5291j9750j4319K722L399k6901n833p711K8398J9613j8895j7015j1963L7275
5318D311N014j7396j9809J6867O821r586K2091j0565j6606o931R357n672j875
5305b3979j549P679L946L2424K71k3300j2894n559p486J4641J8804M626M655q872
5291C407J2147K4581j2949j7575n567m284l405j7788J4550J5641J3857j2999j2135
$$ plain form
5278 -2519 3097 2533 -2171 -7864 -12838 -825 4688 657 21644 7066 6136 7391 -25496 -18339
5264 -18339 -1692 12447 25699 16371 -3914 10900 10615 17933 9508 -9988 -28988 -11847 -14875
5251 -14875 -37678 -35480 -1557 8719 -473 2050 -7253 -4793 14977 20126 21844 26538 21100 -4995
5237 -4995 -5735 1564 -540 -1770 -5452 -2746 9200 19976 6223 3133 -4103 11590 9718 6246
5223 6246 -11238 -2287 23234 -108 317 1584 -8185 -16577 -1627 6256 9019 659 2673 23280
5209 23280 24460 26981 855 6943 25346 19863 15508 9671 -539 5960 4108 -821 -9418 -35016
5195 -35016 -22832 3094 -4830 -346 -1211 -9690 -22094 -1682 -3934 -23768 -21942 -24130 -38699
5182 -38699 -19776 -27294 -12448 10836 8971 -10789 -7132 4173 -30343 -28594 -15546 6882 -2380
$$ packed form
5278b519N616n64m704n693m974J2013N513m031K0987j4578r30J255l2887P157
5264a8339J6647J4139J3252r328k0285J4814k85P318q425j9496j9000J7141l028
5251a4875k2803K198L3923J0276r192K523r303K460J9770N149J718M694n438k6095
5237d995p40P299k104j230l682K706J1946J0776j3753l090p236J5693j872l472
5223F246j7484Q951K5521k3342M25J267r769q392J4950P883K763q360K014K0607
5209B3280J180K521k6126O088J8403n483m355n837j0210O499j852m929q597k5598
5195c5016J2184K5926p924M484q65q479j2404K0412k252j9834J826k188j4569
5182c8699J8923p518J4846K3284j865j9760L657J1305l4516J749J3048K2428r262
$$ plain form
5169 -2380 -17433 -19723 -20406 240 17254 20331 11798 18100 16528 -4283 12365 6520 -4299 -3890
5155 -3890 4806 -11229 -13786 -3764 10096 23568 1144 -8327 -6522 3077 -11211 -20905 -9800
5142 -9800 -13446 -23711 -47021 -37384 -30020 -15743 9152 10855 -6632 -7570 -16473 -5073 -4306 -9158
5128 -9158 -12969 1780 20076 -16409 -29148 -60696 -26441 -27357 -40521 -36603 -21616 7953 19569
5115 19569 14025 -11711 -5219 -9234 775 -3450 -4771 8363 2397 -14230 -24791 -21204 5370
5102 5370 -11723 2157 31769 24896 20521 25443 -19570 -9232 11525 10016 -945 8837 32118
5089 32118 11498 -11840 -19284 -16837 5425 30020 17220 1173 -1771 -10750 -3433 -8042 -19931
5076 -19931 -3696 12787 -13362 -3539 -6750 -31389 -10402 -83 8063 9885 9313 5570 12095
$$ packed form
5169b380j5053k290o83K0646J7014L077q533O302j572k0811J6648n845j0819M09
5155c890Q696j6035k557J0022J3860J3472k2424r471J805R599j4288r694J1105
5142i800l646j0265k3310R637P364J4277K4895J703j7487r38q903J1400P67m852
5128i158l811J4749J8296l6485j2739l1548L4255r16j3164L918J4987K9569J1616
5115A9569n544k5736O492m015J0009m225j321J3134n966j6627j0561L587K6574
5102E370j7093J3880K9612o873m375M922m5013J0338K0757j509j0961R782K3281
5089C2118k0620k3338p444K447K2262K4595j2800j6047k944q979P317m609j1889
5076a9931J6235J6483k6149R823l211k4639K0987J0319Q146J822n72l743O525
$$ plain form
5063 12095 7153 14565 523 31306 19921 14363 21220 27347 2256 -14160 -22882 17509 11519
5050 11519 -14713 -27018 -10398 -8912 13118 -4670 -11768 -3765 -14402 4741 17616 22898 -8761
5037 -8761 16840 8001 11928 6546 17577 4703 7626 16387 20828 23681 11473 1873 -7253 4992
5023 4992 -1064 14485 32106 17084 17128 16299 -109 -490 -8621 -27450 -16606 7039 -7619 14588
5009 14588 22155 -6610 15280 16623 10635 15561 34211 50901 20704 24744 39307 31186 42346
4996 42346 18598 31506 14615 5127 4986 11158 492 20101 35135 24848 25135 24020 29101
4983 29101 27611 30324 15173 1565 -6087 -1288 -7169 7711 14115 16673 17117 13744 -12714 4760
4969 4760 13023 7320 7898 758 10209 8971 28173 19656 22859 48295 52584 33221 11063 16881
$$ packed form
5063A2095m942P412j4042L0783j1385n558O857O127k5091j6416q722M0391n990
5050A1519k6232j2305J6620J486K2030j7788p098Q003j0637J9143J2875N282l1659
5037h761K5601q839L927n382J1031j2874K923Q761M441K853j2208r600r126J2245
5023D992o056J5549J7621j5022M4q29j6408l81q131j8829J0844K3645j4658K2207
5009A4588P567k8765K1890J343n988M926J8650J6690l0197M040J4563q121J1160
4996D2346k3748J2908j6891r488j41O172j0666J9609J5034j0287K87j115N081
4983B9101j490K713j5151j3608p652M799n881J4880O404K558M44l373k6458J7474
4969D760Q263n703N78p140R451j238J9202q517L203K5436M289j9363k2158N818
$$ plain form
4955 16881 4275 -7184 -1497 6257 23470 7839 10724 21963 35959 22147 23973 39698 23776
4942 23776 35092 47225 33189 30889 44943 20033 16279 18571 48001 40345 29224 25181 25857
4929 25857 26902 34924 46098 43270 40986 41535 41723 20170 40755 27602 39256 65484 61226 53596
4915 53596 59913 60437 43763 34817 39696 34218 32711 14087 1366 23160 9779 -4111 5508
4902 5508 7858 16018 10649 2326 15250 14200 8756 1650 12284 26504 11572 36128 16538
4889 16538 4348 13776 29460 19855 23748 24031 2991 1527 -494 -4157 -4100 33679 48223 36073
4875 36073 14304 -1110 -6263 14226 25084 28873 11428 20836 48035 50500 31895 -678 985
4862 985 3214 30222 42371 16354 26345 36149 28579 6881 8695 1825 2084 -8144 32453 30524
$$ packed form
4955A6881j2606j1459N687P754J7213j5631K885J1239J3996j3812J826J5725j5922
4942B3776J1316J2133j4036k300J4054k4910l754K292K9430p656j1121m043O76
4929B5857J045Q022J1174k828k284N49J88k1553K0585j3153J1654K6228m258p630
4915E3596O317N24j6674q946M879n478j507j8624j2721K1794j3381j3890R619
4902E508K350Q160n369q323J2924j050n444p106J0634J4220j4932K4556j9590
4889A6538j2190R428J5684r605L893K83k1040j464k021l663N7L7779J4544j2150
4875C6073k1769j5414n153K0489J0858L789j7445R408K7199K465j8605l2573J663
4862I85K229K7008J2149k6017R991R804p570k1698J814o870K59j0228M0597j929
$$ plain form
4848 30524 8910 -6099 12145 30081 16940 15189 3219 19462 2007 3001 31549 27962 31022
4835 31022 15987 26848 18350 17543 16736 12728 23579 433 -3385 20864 29435 40040 54627
4822 54627 50373 56136 56400 59724 37451 38040 24391 48739 32910 37160 48639 31884 39362 29780
4808 29780 24757 20235 20270 25837 21882 25548 15815 19268 -2463 -4581 11247 31248 43067 33746
4794 33746 24146 40661 40871 20872 30096 16064 34973 40489 48658 35493 14874 24635 12262
4781 12262 34945 35379 30377 52131 37274 40727 23244 39525 36972 28930 35739 32267 26107 18341
4767 18341 20773 -734 346 16763 6070 29045 38707 44957 38748 45176 41081 57958 74167
4754 74167 55457 48902 48028 42689 35640 21078 2248 19410 26205 42154 38822 51403 29407
$$ packed form
4848C0524k1614j5009J8244J7936j3141j751j1970J6243j7455R94K8548l587L060
4835C1022j5035J0861q498q07q07m008J0851k3146l818K4249Q571J0605J4587
4822E4627m254N763K64L324k2273N89j3649K4348j5829M250J1479j6755P478r582
4808B9780n023m522L5N567l955L666r733L453k1731k118J5828K0001J1819r321
4794C3746r600J6515K10j9999R224j4032J8909N516Q169j3165k0619R761j2373
4781A2262K2683M34n002K1754j4857L453j7483J6281k553q042O809l472o160p766
4767A8341K432k1507J080J6417j0693K2975R662O250o209O428m095J6877J6209
4754G4167j8710o555q74n339p049j4562j8830J7162O795J5949l332J2581k1996
$$ plain form
4741 29407 25429 41769 35465 32292 23773 3616 29891 24514 5370 -10195 3807 37881 56207
4728 56207 36010 25650 36439 40000 44645 37592 53328 16444 17971 18042 29106 37042 28190 32629
4714 32629 45771 39739 22380 33657 56520 31872 19999 22206 30335 27618 31006 17264 24376
4701 24376 49610 53651 57719 26543 25100 47535 68202 70327 53742 64888 59402 44449 60515
4688 60515 60177 66749 49008 65452 51762 41965 69899 72599 52332 66290 63379 60409 57752
4675 57752 45762 56877 65899 64130 71502 43175 44822 50273 37950 46910 27596 39071 46186
4662 46186 59086 42417 27870 48018 42516 24550 24295 27970 34857 11111 10456 14798 6744 22327
4648 22327 33040 36932 51010 24895 26799 34524 33554 48985 35721 18350 9225 40923 36444
$$ packed form
4741B9407l978J6340o304l173q519k0157K6275n377j9144j5565J4002L4074J8326
4728E6207k0197j0360J0789L561M645p053J5736l6884J527P1J1064P936q852M439
4714C2629J3142o032j7359J1277K2863k4648j1873K207Q129k717L388j3742P112
4701B4376K5234M041M068l1176j443K2435K0667K125j6585J1146n486j4953J6066
4688F0515l38O572j7741J6444j3690r797K7934K700k0267J3958k911k970k657
4675E7752j1990J1115R022j769P372k8327J647N451j2323Q960j9314J1475P115
4662D6186J2900j6669j4547K0148n502j7966k55L675O887k3746o55M342q054J5583
4648B2327J0713L892J4078k6115J904P725r70J5431j3264j7371r125L1698m479
$$ plain form
4635 36444 22400 18730 34668 25023 42689 19942 4121 14863 10947 7649 12718 45723 48176
4622 48176 24840 32370 9698 1988 33103 35934 35500 41777 37608 30147 31380 35591 31078 55629
4608 55629 78422 30362 1736 53722 38181 -2745 17556 41479 41257 20229 20892 15872 46226
4595 46226 44403 47089 36471 31162 33702 17780 385 -7063 19990 42271 37226 61893 30735
4582 30735 20074 18615 41202 67195 44690 44091 57545 60046 61447 28281 10486 13925 7594
4569 7594 -15332 -4769 7893 29692 35551 57832 60969 60169 38253 34806 45772 47064 54050
4556 54050 63901 80613 43345 29698 44581 37168 23114 51755 39449 39437 35984 41647 35188
4543 35188 12770 18531 37962 51505 59562 64225 32992 14935 36212 43710 40684 37218 29457
$$ packed form
4635C6444j4044l670J5938r645J7666k2747j5821J0742l916l298N069L3005K453
4622D8176k3336P530k2672p710L1115K831m34O277m169p461J233M211m513K4551
4608E5629K2793m8060k8626N1986j5541m0926K0301K3923k22k1028O63n020L0354
4595D6226j823K686j0618n309K540j5922j7395p448K7053K2281n045K4667l1158
4582C0735j0661j459K2587K5993k2505n99J3454K501J401l3166j7795L439o331
4569G594k2926J0563J2662K1799N859K2281L137q00k1916l447J0966J292O986
4556E4050R851J6712l7268j3647J4883p413j4054K8641j2306j2l453N663o459
4543C5188k2418N761J9431J3543Q057M663l1233j8057K1277P498l026l466p761
$$ plain form
4530 29457 45554 44716 39940 54620 54265 42624 35987 53061 50791 55270 64460 43970 38969 34161
4516 34161 29230 28539 8979 40710 46977 66753 73912 49922 75023 78414 60183 55474 36342
4503 36342 28094 47983 60795 61846 62337 52344 39637 57481 85672 90123 78161 50042 75877
4490 75877 80771 93785 108563 112566 69689 56733 74844 69192 88781 113853 100243 96675 90809
4477 90809 104782 113492 99944 94210 109452 131998 132759 101447 90985 97220 102417 107225 123265
4464 123265 120084 136402 165290 167105 149378 138965 168111 176692 158903 156506 161317 161734 172181
4451 172181 164377 166955 167655 176639 175818 174022 197019 217337 238464 240388 268521 279458 259568
4438 259568 267184 265392 275055 279874 298563 298086 306780 326930 352347 347447 387467 409608 386707
$$ packed form
4530B9457J6097q38m776J4680l55j1641o637J7074k270M479R190k0490n001m808
4516C4161m931o91j9560L1731O267J9776P159k3990K5101L391j8231m709j9132
4503C6342q248J9889J2812J051M91r993j2707J7844K8191M451j1962k8119K5835
4490G5877M894J3014J4778M003m2877j2956J8111n652J9589K5072j3610l568n866
4477I0809J3973Q710j3548n734J5242K2546P61l1312j0462O235N197M808J6040
4464A23265l181J6318K8888J815j7727j0413K9146Q581j7789k397M811M17J0447
4451A72181p804K578P00Q984q21j796K2997K0318K1127J924K8133J0937j9890
4438B59568P616j792R663M819J8689m77Q694K0150K5417m900M0020K2141k2901
$$ plain form
4425 386707 389293 410273 408887 429089 424909 463957 459266 467220 457655 479042 502620 501227 538732
4412 538732 583594 597473 626938 642318 669305 717977 716587 736691 769483 805763 816030 843306
4400 843306 887297 918669 960922 1015866 1088318 1171086 1231457 1285778 1340138 1419418 1512954 1646104
4388 1646104 1774082 1949982 2146287 2369743 2640531 2903488 3164040 3407227 3612371 3788987
4378 3788987 3999549 4251035 4581459 4949094 5309856 5668867 5888344 5947308 5972887 6069238
4368 6069238 6210375 6440101 6701714 6949372 6998420 6844708 6552230 6252539 6024788 5846826
4358 5846826 5775735 5691511 5551734 5307302 4937609 4566793 4206138 3883053 3628460 3446157
4348 3446157 3268864 3053726 2821210 2565027 2291525 2021708 1792946 1612860 1492715 1338681
$$ packed form
4425C86707K586K0980j386K0202m180L9048m691P954r565K1387K3578j393L7505
4412E38732M4862J3879K9465J5380K6987M8672j390K0104L2792L6280J0267K7276
4400H43306M3991L1372M2253N4944P2452Q2768O0371N4321N4360P9280R3536J33150
4388A646104J27978J75900J96305K23456K70788K62957K60552K43187K05144J76616
4378C788987K10562K51486L30424L67635L60762L59011K19477N8964K5579R6351
4368F069238J41137K29726K61613K47658M9048j53712k92478k99691k27751j77962
4358E846826p1091q4224j39777k44432l69693l70816l60655l23085k54593j82303
4348C446157j77293k15138k32516k56183k73502k69817k28762j80086j20145j54034
$$ plain form
4338 1338681 1231823 1134101 1041962 1013257 953733 887974 854454 842415 797986 743744 701545
4327 701545 646315 597359 590546 578448 568916 569281 547249 523234 494070 484577 448050 442777 426595
4314 426595 416991 393149 367576 353980 346638 338803 338570 331816 302836 309902 299461 269458 261695
4301 261695 277022 248784 230306 225777 216574 206852 224362 200313 184332 173021 183109 198737
4289 198737 193415 197001 184438 161961 155503 152643 160769 148629 156698 160010 160367 141656 117672
4276 117672 124367 110035 114281 111876 114871 138184 137356 108480 98303 102185 117875 114005 118856
4263 118856 92525 68590 68024 60749 63150 80971 77575 103885 93097 86005 108482 97071 68030
4250 68030 65778 81128 77633 59525 72823 99151 90350 79339 59288 57303 76319 88313 81241
$$ packed form
4338A338681j06858r7722r2139k8705n9524o5759l3520j2039m4429n4242m2199
4327G01545n5230m8956o813j2098r532L65k2032k4015k9164r493l6527n273j6182
4314D26595r604k3842k5573j3596p342p835k33o754k8980P066j0441l0003p763
4301B61695J5327k8238j8478m529r203r722J7510k4049j5981j1311J0088J5628
4289A98737n322L586j2563k2477o458k860Q126j2140Q069L312L57j8711k3984
4276A17672O695j4332M246k405K995K3313q28k8876j0177L882J5690l870M851
4263A18856k6331k3935n66p275K401J7821l396K6310j0788p092K2477j1411k9041
4250F8030k252J5350l495j8108J3298K6328q801j1011k0051j985J9016J1994p072
$$ plain form
4237 81241 86569 69862 51327 50299 69326 72406 84214 64987 56357 79571 64791 47086 75879
4224 75879 86177 81654 47515 24568 32862 39324 76481 68104 78476 79450 73458 85312 71779
4211 71779 68637 83180 88219 90927 59652 52599 52445 58525 40558 22834 20271 38991 47813 42493
4197 42493 55535 45930 40926 79867 60275 39298 54974 59462 45639 47625 60425 68527 76419
4184 76419 71430 80021 58955 59500 25106 20447 16749 31078 23018 9186 11984 9103 -8555 31557
4170 31557 38155 17409 13011 9620 14890 -6267 -3545 20562 35450 32075 24890 29377 37639 20842
4156 20842 33275 26266 23166 8684 7124 11988 -11431 -19634 2988 14682 15473 23564 7155
4143 7155 -2946 -1797 7058 5815 8952 14606 -2138 -996 2417 21 23784 24193 -12723 -17993
$$ packed form
4237H1241N328j6707j8535j028J9027L080J1808j9227q630K3214j4780j7705K8793
4224G5879J0298m523l4139k2947Q294O462L7157q377J0372R74n992J1854j3533
4211G1779l142J4543N039K708l1275p053j54O080j7967j7724k563J8720Q822n320
4197D2493J3042r605n004L8941j9592k0977J5676M488j3823J986J2800Q102P892
4184G6419m989Q591k1066N45l4394m659l698J4329q060j3832K798k881j7658M0112
4170C1557O598k0746m398l391N270k1157K722K4107J4888l375p185M487Q262j6797
4156B0842J2433p009l100j4482j560M864k3419q203K2622J1694P91Q091j6409
4143G155j0101J149Q855j243L137N654j6744J142L413k396K3763M09l6916n270
$$ plain form
4129 -17993 56 -14345 -6676 2982 -3966 24292 46580 24749 12350 6296 10053 5437 3628
4116 3628 24922 24029 -22231 -9318 -2121 -21281 12003 -10726 -115 6796 5569 -9620 -11962
4103 -11962 -2474 -5181 315 19031 25966 32778 19196 30542 20086 11201 -6629 -11297 -29572
4090 -29572 -12448 -12992 -17829 -3425 12214 37802 -5313 -14873 -452 13982 3635 19535 33936
4077 33936 14121 -3323 12188 18893 21497 27872 27043 6932 22093 25529 4095 24629 29235
4064 29235 14451 22488 32597 52609 41347 44197 38127 35971 27301 31107 42470 39153 29342
4051 29342 22047 25036 42297 33114 13354 8785 4628 44310 52426 45115 20984 18633 6417
4038 6417 -9010 -11299 -36478 -38893 -6068 19127 45118 52353 42867 3468 -8170 -4281 -10193
$$ packed form
4129a7993J8049j4401P669R658o948K8258K2288k1831j2399o054L757m616j809
4116C628K1294q93m6260J2913P197j9160L3284k2729J0611O911j227j5189k342
4103a1962R488k707N496J8716O935O812j3582J1346j0456q885j7830m668j8275
4090b9572J7124n44m837J4404J5639K5588m3115r560J4421J4434j0347J5900J4401
4077C3936j9815j7444J5511O705K604O375q29k0111J5161L436k1434K0534M606
4064B9235j4784Q037J0109K0012j1262K850o070k156q670L806J1363l317r811
4051B9342p295K989J7261r183j9760m569m157L9682Q116p311k4131k351j2216
4038F417j5427k289k5179k415L2825K5195K5991P235r486l9399j1638L889n912
$$ plain form
4025 -10193 16516 5250 -16438 -2790 -16291 -47535 -29081 -27608 -23821 -373 19982 10851
4013 10851 -8584 -24444 -23999 8477 -30904 -22818 -22926 -23341 1486 12476 31459 6499 8468
4000 8468 -18246 7730 44662 26064 10840 19905 -1761 17165 1712 -11532 -280 -4844
3988 -4844 -3836 -3115 12864 -8269 -18399 -24898 -18312 -15599 -10354 -3198 6486 -4492 -358 3805
3974 3805 -2323 11857 31806 27167 18618 33804 14799 -1751 1940 -12905 -1446 28662 -4689
3961 -4689 15609 18379 24075 8582 26412 10942 16770 34650 20465 -23403 -8896 15807 8527
3948 8527 19331 22628 39234 24757 17356 30729 68634 58002 48316 49098 44397 66906 80231
3935 80231 61315 50450 18972 38954 46441 34199 38452 43171 17109 20807 18820 32915 35245
$$ packed form
4025a0193K6709j1266k1688J3648j3501l1244J8454J473L787K3448K0355r131
4013A0851j9435j5860M45L2476l9381Q086j08m15K4827J0990J8983k4960J969
4000H468k6714K5976L6932j8598j5224R065k1666J8926j5453j3244J1252m564
3988d844J008P21J5979k1133j0130o499O586K713N245P156R684j0978M134M163
3974C805o128J4180J9949m639q549J5186j9005j6550L691j4845J1459L0108l3351
3961d689K0298K770N696j5493J7830j5470N828J7880j4185m3868J4507K4703p280
3948H527J0804L297J6606j4477p401J3373L7905j0632r686P82m701K2509J3325
3935H0231j8916j0865l1478J9982P487j2242M253M719k6062L698j987J4095K330
$$ plain form
3922 35245 11560 21142 43509 44815 61923 48751 36045 29404 23004 39657 29011 10905 15362
3909 15362 5646 29489 15840 14776 21941 17425 13655 23777 39635 30880 19565 30074 33832
3896 33832 38083 30778 13945 4949 21937 12069 4935 12448 10567 12813 30631 33011 17630 16689
3882 16689 19827 5338 -17985 14712 16265 6287 22076 3972 2763 3696 6333 -3939 -14511
$$ packed form
3922C5245k3685R582K2367J306J7108j3172j2706o641o400J6653j0646j8106M457
3909A5362r716K3843j3649j064P165m516l770J0122J5858q755j1315J0509L758
3896C3832M251p305j6833q996J6988r868p134P513j881K246J7818K380j5381r41
3882A6689L138j4489k3323L2697J553r978J5789j8104j209R33K637j0272j0572
$$ [...]
##END NTUPLES=NMR SPECTRUM
##END=
