##TITLE=1H_EC-Cl-h
 DMSO
 8 sc, 
 28.9.2023
##JCAMPDX= 6.0         $$ Bruker NMR JCAMP-DX V2.0
##DATA TYPE= NMR SPECTRUM
##DATA CLASS= NTUPLES
##ORIGIN= UXNMR, Bruker Analytische Messtechnik GmbH
##OWNER= root
$$ XWIN-NMR		Version 3.5
$$ Thu Sep 28 14:06:53 2023 Russian Standard Time (UT+4h)  she@DPX200
##.OBSERVE FREQUENCY= 200.13135
##.OBSERVE NUCLEUS= ^1H
##.ACQUISITION MODE= SIMULTANEOUS
##.ACQUISITION SCHEME= undefined
##.AVERAGES= 8
##.DIGITISER RES= 18
##SPECTROMETER/DATA SYSTEM= spect
##.PULSE SEQUENCE= zg30
##.SOLVENT NAME= DMSO
##.SHIFT REFERENCE= (INTERNAL, DMSO, 0, 15.7436)
##AUDIT TRAIL= $$ (NUMBER, WHEN, WHO, WHERE, WHAT)
$$ ##TITLE= Audit trail, XWIN-NMR		Version 3.5
$$ ##JCAMPDX= 5.01
$$ ##ORIGIN= Bruker BioSpin GmbH
$$ ##OWNER= she
$$ F:/spectra/data/she/nmr/H-F/1/pdata/1/auditp.txt
$$ ##AUDIT TRAIL=  $$ (NUMBER, WHEN, WHO, WHERE, WHAT)
(   1,<2023-09-28 14:05:36.56 +0400>,<she>,<DPX200>,
      <created by zg, POWCHK disabled, PULCHK disabled
       configuration hash MD5:
       00 E9 B6 7A A2 85 ED C7 34 08 36 98 17 FE 4E 26
       data hash MD5: 16K
       93 13 83 1C 1A 74 AD 5D 3A 82 BA FB FC 33 D7 E2>)
(   2,<2023-09-28 14:05:38.98 +0400>,<she>,<DPX200>,
      <Start of raw data processing
       efp BC_mod = 2 LB = 0.24 FT_mod = 6 PKNL = 1 PHC0 = -21869.21 PHC1 = 13.05271 SI = 16K 
       data hash MD5: 16K
       11 DF E6 06 C7 24 19 3A BF 97 78 41 D0 4B 9E 9E>)
(   3,<2023-09-28 14:06:00.21 +0400>,<she>,<DPX200>,
      <pk PHC0 = -2.612969 PHC1 = -2 
       data hash MD5: 16K
       36 30 EB DE 9B CF E4 05 A9 56 8A 79 08 88 06 9A>)
(   4,<2023-09-28 14:06:04.40 +0400>,<she>,<DPX200>,
      <abs ABSG = 5 
       data hash MD5: 16K
       F5 41 31 52 17 B7 BA FB EB 24 EE 0A 9B 01 38 F8>)
(   5,<2023-09-28 14:06:16.15 +0400>,<she>,<DPX200>,
      <abs ABSG = 5 
       data hash MD5: 16K
       95 14 DC 61 F4 FB AF 3E C0 43 BA 78 21 42 52 42>)
$$ ##END=
$$ 
$$ hash MD5
$$ F3 2A 4B AF 11 B1 57 23 DF C8 43 AB 29 A8 DF F7
##$RELAX= 
##$RELAX= 
##$RELAX= 
##$RELAX= 
##$RELAX= 
##$RELAX= 
$$ Bruker specific parameters
$$ --------------------------
##$DU= <F:/spectra>
##$EXPNO= 1
##$NAME= <H-F>
##$PROCNO= 1
##$TYPE= <nmr>
##$USER= <she>
##$AMP= (0..31)
100 100 100 100 100 100 100 100 100 100 100 100 100 100 100 100 100 100 
100 100 100 100 100 100 100 100 100 100 100 100 100 100 
##$AQSEQ= 0
##$AQ_mod= 1
##$AUNM= <au_zg>
##$AUTOPOS= <>
##$BF1= 200.13
##$BF2= 200.13
##$BF3= 200.13
##$BF4= 200.13
##$BF5= 200.13
##$BF6= 200.13
##$BF7= 200.13
##$BF8= 200.13
##$BYTORDA= 1
##$CFDGTYP= 0
##$CFRGTYP= 5
##$CHEMSTR= <none>
##$CNST= (0..31)
1 1 145 1 1 1 1 1 1 1 1 1 1 1 1 1 1 1 1 1 1 1 1 1 1 1 1 1 1 1 1 1 
##$CPDPRG= <>
##$CPDPRG1= <>
##$CPDPRG2= <>
##$CPDPRG3= <>
##$CPDPRG4= <mlev>
##$CPDPRG5= <mlev>
##$CPDPRG6= <mlev>
##$CPDPRG7= <mlev>
##$CPDPRG8= <mlev>
##$CPDPRGB= <>
##$CPDPRGT= <>
##$D= (0..31)
0 1.2 0 0 0 0 0 0 0 0.06 0 0.03 0 0 0 0 0.0002 0 0 0 0 0 0 0 0 0 0 0 0 
0 0 0 
##$DATE= 1695895535
##$DBL= (0..7)
$$ [...]
##$SUBNAM3= <"">
##$SUBNAM4= <"">
##$SUBNAM5= <"">
##$SUBNAM6= <"">
##$SUBNAM7= <"">
##$SUBNAM8= <"">
##$SUBNAM9= <"">
##$SW= 18.05172834244
##$SWIBOX= (0..15)
0 0 2 0 0 0 0 0 0 0 0 0 0 0 0 0 
##$SW_h= 3612.71676300578
##$TD= 16384
##$TD0= 1
##$TE= 0
##$TE2= 300
##$TE3= 300
##$TEG= 300
##$TL= (0..7)
0 120 120 120 120 120 120 120 
##$TP= (0..7)
150 150 150 150 150 150 150 150 
##$TP07= 0
##$TPNAME0= <>
##$TPNAME1= <>
##$TPNAME2= <>
##$TPNAME3= <>
##$TPNAME4= <>
##$TPNAME5= <>
##$TPNAME6= <>
##$TPNAME7= <>
##$TPOAL= (0..7)
0.5 0.5 0.5 0.5 0.5 0.5 0.5 0.5 
##$TPOFFS= (0..7)
0 0 0 0 0 0 0 0 
##$TUNHIN= 0
##$TUNHOUT= 0
##$TUNXOUT= 0
##$USERA1= <user>
##$USERA2= <user>
##$USERA3= <user>
##$USERA4= <user>
##$USERA5= <user>
##$V9= 5
##$VALIST= <valist>
##$VCLIST= <CCCCCCCCCCCCCCC>
##$VD= 0
##$VDLIST= <DDDDDDDDDDDDDDD>
##$VPLIST= <PPPPPPPPPPPPPPP>
##$VTLIST= <TTTTTTTTTTTTTTT>
##$WBST= 1024
##$WBSW= 4
##$XGAIN= (0..3)
0 0 0 0 
##$XL= 0
##$YL= 0
##$YMAX_a= 154393
##$YMIN_a= -155834
##$ZGOPTNS= <>
##$ZL1= 120
##$ZL2= 120
##$ZL3= 120
##$ZL4= 120
##$ABSF1= 15.74359
##$ABSF2= -2.308259
##$ABSG= 5
##$ABSL= 3
##$ALPHA= 0
##$AQORDER= 0
##$ASSFAC= 0
##$ASSFACI= 0
##$ASSFACX= 0
##$ASSWID= 0
##$AUNMP= <proc_1d>
##$AZFE= 0.1
##$AZFW= 0.1
##$BCFW= 0
##$BC_mod= 2
##$BYTORDP= 0
##$COROFFS= 0
##$CY= -3
##$DATMOD= 1
##$DC= 0
##$DFILT= <>
##$DTYPP= 0
##$F1P= 0
##$F2P= 0
##$FCOR= 1
##$FTSIZE= 16384
##$FT_mod= 6
##$GAMMA= 0
##$GB= 0
##$INTBC= 1
##$INTSCL= 3.70164e-10
##$ISEN= 128
##$LB= 0.24
##$LEV0= 0
##$LPBIN= 0
##$MAXI= 10000
##$MC2= 0
##$MEAN= 0
##$ME_mod= 0
##$MI= 1.114404
##$NCOEF= 0
##$NC_proc= -6
##$NLEV= 6
##$NOISF1= 3.799351
##$NOISF2= 2.8
##$NSP= 0
##$NTH_PI= 0
##$NZP= 0
##$OFFSET= 15.74359
##$PC= 1
##$PHC0= -21871.82
##$PHC1= 11.05271
##$PH_mod= 1
##$PKNL= yes
##$PPARMOD= 0
##$PSCAL= 0
##$PSIGN= 0
##$REVERSE= no
##$SF= 200.130005594475
##$SI= 16384
##$SIGF1= 3
##$SIGF2= 2
##$SINO= 5.538805
##$SIOLD= 16384
##$SREGLST= <1H.CDCl3>
##$SSB= 0
##$STSI= 16384
##$STSR= 0
##$SW_p= 3612.71676300578
##$SYMM= 0
##$S_DEV= 0
##$TDeff= 16384
##$TDoff= 0
##$TI= <>
##$TILT= no
##$TM1= 0
##$TM2= 0
##$TOPLEV= 0
##$USERP1= <user>
##$USERP2= <user>
##$USERP3= <user>
##$USERP4= <user>
##$USERP5= <user>
##$WDW= 1
##$XDIM= 16384
##$YMAX_p= 290700534
##$YMIN_p= -95723
$$ End of Bruker specific parameters
$$ ---------------------------------
##NTUPLES= NMR SPECTRUM
##VAR_NAME=  FREQUENCY,     SPECTRUM/REAL,   SPECTRUM/IMAG
##SYMBOL=    X,             R,               I
##VAR_TYPE=  INDEPENDENT,   DEPENDENT,       DEPENDENT
##VAR_FORM=  AFFN,          ASDF,            ASDF
##VAR_DIM=   16384,         16384,           16384
##UNITS=     HZ,            ARBITRARY UNITS, ARBITRARY UNITS
##FACTOR=    0.220516191357247, 1,           1
##FIRST=     3150.76482580715, 0,            0
##LAST=      -461.951937198631, 0,           0
##MIN=       -461.951937198631, -95723,      0
##MAX=       3150.76482580715, 290700534,    0
$$ Real data points
##PAGE= N=1
##DATA TABLE= (X++(R..R)), XYDATA
$$ [...]
8882C9862867J072299J076757J097254J141930J183299J203391J248338J228837
$$ 39862867 40935166 42011923 43109177 44251107 45434406 46637797 47886135 49114972
8874D9114972J318440J315085J357610J331408J367147J382554J381262J349963
$$ 49114972 50433412 51748497 53106107 54437515 55804662 57187216 58568478 59918441
8866E9918441J376747J342976J307827J296667J253875J165300J127518J055938
$$ 59918441 61295188 62638164 63945991 65242658 66496533 67661833 68789351 69845289
8858F9845289R59978Q63277P25091O42358N27513L32803J69750O6249o6408k20240
$$ 69845289 70805267 71668544 72393635 73035993 73563506 73896309 74066059 74132308 74065900 73845660
8848G3845660l67160m69040o80528p95813q67897j017070j081125j192576j267400
$$ 73845660 73478500 73009460 72328932 71533119 70665222 69648152 68567027 67374451 66107051
8839F6107051j321016j384779j391262j451339j464678j459754j489526j482966
$$ 66107051 64786035 63401256 62009994 60558655 59093977 57634223 56144697 54661731
8831E4661731j449157j438902j440379j422613j377835j364339j338008j330032
$$ 54661731 53212574 51773672 50333293 48910680 47532845 46168506 44830498 43500466
8823D3500466j260476j236941j129249j093701j162566j084292j059979j031593
$$ 43500466 42239990 41003049 39873800 38780099 37617533 36533241 35473262 34441669
8815C4441669r54864r43439r36829q79772q82032q13595p83997p68236p44259
$$ 34441669 33486805 32543366 31606537 30726765 29844733 29031138 28247141 27478905 26734646
8806B6734646p12717o98143p03168o57085o06123o24568n70791n45104n55811
$$ 26734646 26021929 25323786 24620618 23963533 23357410 22732842 22162051 21616947 21061136
8797B1061136n14400n06320m85606m69685m70852m50900m34341m04753l79121
$$ 21061136 20546736 20040416 19554810 19085125 18614273 18163373 17729032 17324279 16945158
8788A6945158m37877m15515l72068l43901l46725l29038l28315l03313l11896
$$ 16945158 16507281 16091766 15719698 15375797 15029072 14700034 14371719 14068406 13756510
8779A3756510k95391k68928k63750k88400l03852k21092k38987k30914k53402
$$ 13756510 13461119 13192191 12928441 12640041 12336189 12115097 11876110 11645196 11391794
8770A1391794k21102k19290k51546k15166k05636k03229j87269k00865k01186
$$ 11391794 11170692 10951402 10699856 10484690 10279054 10075825 9888556 9687691 9486505
8761I486505j64523j45747j38299j67089j95100j79301j31791j50864j62937j28631
$$ 9486505 9321982 9176235 9037936 8870847 8675747 8496446 8364655 8213791 8050854 7922223
8751G922223j32220j06569j21308j52979j48193j35785j04228j18083j06416j11657
$$ 7922223 7790003 7683434 7562126 7409147 7260954 7125169 7020941 6902858 6796442 6684785
8741F684785r3140j24880q5552j29440r2393p3710r4460r6337r6541p7395q6747
$$ 6684785 6591645 6466765 6381213 6251773 6159380 6085670 5991210 5894873 5798332 5720937 5634190
8730E634190p1758j20219q5807q3369r2700o0542p8962q3975p9596p6487l2292
$$ 5634190 5562432 5442213 5356406 5273037 5180337 5119795 5040833 4956858 4877262 4800775 4768483
8719D768483l8178p9839j15956n0777l4347m3819p2778o6397r2401p1946l0919
$$ 4768483 4730305 4650466 4534510 4483733 4449386 4405567 4332789 4266392 4173991 4102045 4071126
8708D071126n3698o9338m3070p2174m8631n6302p5658j1601m8163m932l6229m9310
$$ 4071126 4017428 3948090 3905020 3832846 3784215 3727913 3652255 3640654 3592491 3587559 3551330 3502020
8696C502020o6347m1344P172o3562o7074l4240m6942m7012m345k0924o9095l5365
$$ 3502020 3435673 3394329 3401501 3337939 3270865 3236625 3189683 3142671 3138326 3117402 3048307 3012942
8684C012942l9520k9142j6654r6l3894p0782k9809R362o4628m7802j8708l2251
$$ 3012942 2973422 2944280 2927626 2927530 2893636 2822854 2793045 2802407 2737779 2689977 2671269 2639018
8672B639018j7128j7718j2818o2773k5980K042l0222L482l0984n3668n0183l0279
$$ 2639018 2621890 2604172 2591354 2528581 2502601 2504643 2474421 2477903 2446919 2393251 2343068 2312789
8660B312789k2859l9144k2102P005k018j5699l6697o3327k1356j2411l7478Q650
$$ 2312789 2289930 2250786 2228684 2235689 2233671 2217972 2181275 2117948 2096592 2084181 2046703 2055353
8648B055353k0144k8820n819j4422k6416k1199l0694j8518J1206k6181k2453l7348
$$ 2055353 2035209 2006389 2000570 1986148 1959732 1938533 1907839 1889321 1900527 1874346 1851893 1814545
8636A814545j0212m0767o856k1067m8152j7112j9527O416q773l8763N064j6771
$$ 1814545 1804333 1763566 1756710 1735643 1687491 1670379 1650852 1657268 1648495 1609732 1614796 1598025
8624A598025j0995k7400j6094j1197K2491l9175k0134o7870Q759K6973l7407k1423
$$ 1598025 1587030 1559630 1543536 1532339 1554830 1515655 1495521 1427651 1436410 1463383 1425976 1404553
8612A404553Q362O527k429j0820j4734j1301l8251j8002k0485j807o488N29n1731
$$ 1404553 1412915 1419442 1417013 1406193 1391459 1380158 1341907 1323905 1303420 1301613 1295125 1295654 1243923
8599A243923O458o054M837j3104J541j8970k2901M457k8395J4715j8487k5638
$$ 1243923 1250381 1244327 1249164 1236060 1237601 1218631 1195730 1200187 1171792 1186507 1168020 1142382
8587A142382m080q560M235k9824J9756k2497r16j9416J1879k100k59l4012n3854
$$ 1142382 1138302 1129742 1133977 1104153 1123909 1101412 1100496 1081080 1092959 1090859 1090600 1056588 1002734
8574A002734M062k1754K1362k6873j9306J5463M9458m0678l9137J716k0679J1556
$$ 1002734 1006796 985042 1006404 979531 960225 975688 1025146 984468 945331 947047 926368 937924
8562I37924J3560k6675L2159K599n4179n088m1462l632M3842j1416k0721k9355
$$ 937924 951484 924809 956968 959567 905388 900300 858838 855206 899048 887632 866911 837556
8550H37556j306j4440l7670R373P779J8592l1377j0164K3052P445l5403k094l35
$$ 837556 836250 821810 784140 793513 801292 819884 788507 778343 801395 808840 773437 771343 771008
8537G71008J502j1252n045j2619j6659j6101j6431N767J7444j5456n244L411m2235
$$ 771008 772510 761258 756213 743594 726935 710834 694403 700170 717614 702158 696914 700325 658090
8524F58090J4356L4699j5500n724J4920j9281j1437k7747L7481q88m4877q546
$$ 658090 672446 707145 691645 685921 700841 681560 670123 642376 679857 678969 634092 625546
8512F25546l3600J1681K6907j0875N686j1885P516n804L833n446l6954M674R438
$$ 625546 591946 603627 630534 619659 625345 613460 620976 615172 619005 613559 576605 581279 590717
8499E90717j5377J8903m1990M262K3347j5846K3632j5550K5357j2783k0399j6412
$$ 590717 575340 594243 552253 556515 579862 564016 587648 572098 597455 584672 564273 547861
8487E47861k6101Q89L4106k0770l678k0178J0452N693j6472Q904k5480L619k0624
$$ 547861 521760 522649 556755 535985 532307 512129 522581 528274 511802 520706 495226 498845 478221
8474D78221n985K3923r293P488l718k5347o417J4954l52P324j5266q339J5187
$$ 478221 472236 496159 486866 494354 490636 465289 458872 473826 473474 480798 465532 457193 472380
8461D72380J3372N70l9308M5242j7706j8336j1774j477j1884N923j5134j6015
$$ 472380 485752 486322 447014 492256 474550 456214 444440 442963 431079 437002 421868 405853
8449D05853Q845K834J0996j3121Q289R638j8324j499L1348K089l0257J1636R449
$$ 405853 414698 417532 428528 415407 423696 433334 415010 413511 444859 446948 416691 428327 437776
8436D37776k8447m492o093j4918p681q559M478J8812N34l2909j1713k166M531
$$ 437776 409329 404837 398744 383826 376145 367586 372064 390876 391410 358501 346788 344622 349153
8423C49153o700J6897J405K4820K1026m7603l3544J5409Q869J6834N86J7996J6592
$$ 349153 342453 359350 360755 385575 406601 358998 325454 340863 349732 366566 367152 385148 401740
8410D01740k9612m0057p918J7321j5181k0027M0481M3082o2423r383j3042K8016
$$ 401740 372128 332071 324153 341474 326293 306266 346747 389829 327406 318023 304981 332997
8398C32997r230l2761J7594M431o3121K1957K3639l053k0424M7064M0411l1841
$$ 332997 323767 291006 308600 313031 249910 271867 295506 292453 272029 319093 359504 327663
8386C27663q738j5133k845n24K3849k8449r509L0164M656k8006k3999j7591L7233
$$ 327663 318925 303792 300947 300423 324272 295823 286314 316478 321134 293128 269129 251538 288771
8373B88771P608k2268j707J8027K5746m1226J9827K212o725j4464k547R326J1053
$$ 288771 296379 274111 272404 290431 316177 274951 294778 296990 290265 275801 273254 282580 293633
8360B93633j4600k5755K9433k3858k1403l430K2407k3765l3677K3497K118O730
$$ 293633 279033 253278 282711 258853 237450 234020 256427 232662 198985 222482 224600 231330
8348B31330J9201j2889m705K0716R265l9133N450j6598j2380K4582R613l3038
$$ 231330 250531 237642 232937 253653 262918 223785 229235 212637 200257 224839 234452 201414
8336B01414L667j2642P738N011P461L7901j559j0517l7013J0163m408J0923J6766
$$ 201414 205081 192439 200177 205188 212649 250550 248991 238474 201461 211624 207216 218139 234905
8323B34905r434o944K1244k7914m337L5288j4000j622j1438k1592J3307J1792
$$ 234905 225471 218527 239771 211857 207520 242808 228808 227186 215748 194156 207463 219255
8311B19255J8015p236k4923l7323P745j9366M7929J8707k6579j2654k2073N229
$$ 219255 237270 230034 205111 167788 175533 156167 204096 222803 196224 183570 161497 166726
8299A66726K1681K1828J1949j3925k9481K1827K076o517m4167M7745j8650K165
$$ 166726 188407 210235 222184 208259 178778 200605 202681 196164 151997 199742 181092 183257
8287A83257k304M428k2423k05n145q759K1636J3530l087j7060L887r565R633j2202
$$ 183257 180953 185381 162958 162753 157608 148849 170485 184015 180928 163868 167755 158190 167823 155621
8273A55621K1850j0613k1545L5471r338Q429K45l1460j5734j4490J4669J8450
$$ 155621 177471 166858 145313 180784 171446 179875 180120 148660 132926 118436 133105 151555
8261A51555J0416m2600L902q648n9J3735N211j0951n379K9408K4827k3438k6480
$$ 151555 161971 119371 123273 114625 114566 128301 133512 122561 117182 146590 171417 147979 121499
8248A21499L4673M6205n4397j2794q58K1783n702l7435k5408o307N2975R593K1610
$$ 121499 156172 202377 147980 135186 134328 156111 150409 112974 87566 81259 134234 143827 165437
8235A65437k6624n6158j6197K3357J1015j3147L3421j9724J1904j3473k4818M9238
$$ 165437 138813 82655 66458 89815 100830 87683 121104 101380 113284 99811 74993 124231
8223A24231K7915l1138J1751K4129m2472R478m4471k8872J6818N7301M0750m5183
$$ 124231 152146 121008 132759 156888 114416 123894 79423 50551 67369 124670 165420 120237
8211A20237p400m084J4694k9855L659L6637j9928P288J5229J8696j7796l9941
$$ 120237 112837 108753 123447 93592 97251 133888 113960 121248 136477 155173 137377 97436
8199I7436l8737L7134j2271l511k6794J8039j31569K87465J42701j73137o450
$$ 97436 58699 95833 83562 80051 53257 71296 -60273 227192 369893 196756 190306
8188A90306o7453j1074p347J909J133O4534l8253o115k4555J9118K5842j0634
$$ 190306 122853 111779 104432 106341 107474 172008 133755 127640 103085 122203 148045 137411
8176A37411J610p290m5843J5773K6891j7226k4291J0435j5398M708l468K195j0011
$$ 137411 139021 131731 85888 101661 128552 111326 87035 97470 82072 86780 83312 85507 75496
8163G5496M8256K934n0854M021j799P219L2781k7270M503J6303l3033k927m86
$$ 75496 123752 126686 75832 79853 78054 85273 118054 90784 95287 111590 78557 75630 75144
8150G5144K0280q21L40j6898k3567M3549J2508k6907J3288k2288k7818K6274J1803
$$ 75144 95424 94603 94943 78045 54478 98027 110535 83628 96916 74628 46810 73084 84887
8137H4887j8066j7269J2777J3366m740K3875k0399K9219K55L469l4511J5109K1732
$$ 84887 66821 49552 62329 75695 70955 94830 74431 103650 103905 107374 72863 87972 109704
8124A09704k3022J6478N567k7479q768q114P856n434O352K4111k2219m0004j5403
$$ 109704 86682 103160 108727 81248 72480 64366 72222 66788 73140 97251 75032 35028 19625
8111A9625J3797L3744J6170j2832K866m196j2079j8347L3997N28J6237j125M415
$$ 19625 33422 67166 83336 70504 73370 69174 57095 38748 72745 73273 89510 88385 92800
8098I2800Q675l1265m0441k641l357K9666o411M535O699j1925J329j3765L5840
$$ 92800 101475 70210 29769 27128 23771 53437 47026 51561 58260 46335 47664 33899 69739
8085F9739J0618J3476p251j2576K218k2035J1457L904j8470J556R69R695p852
$$ 69739 80357 93833 86582 74006 76224 54189 65646 69550 51080 52636 53605 63300 55448
8072E5448K703L697K409K3245q760R672j8661j8024R520k0630j8K2232q091o011
$$ 55448 58151 61848 64257 87502 78742 88414 69753 51729 61249 40619 40601 62833 54742 48731
8058D8731M843O672j1545j7916j8582K3915J2844N242q793P883K494K4521K119
$$ 48731 53574 60246 48701 30785 12203 36118 48962 54204 45411 53294 55788 80309 82428
8045H2428l8261K5542P10j6027L081J5607k1921k0451K6899j3528j3355J8581
$$ 82428 44167 69709 70419 54392 57473 73080 51159 30708 57607 44079 30724 49305
8033D9305M294j8922r398J5203m365J2462K3066k4144o720q466l3736N030M2938
$$ 49305 53599 34677 25279 40482 36117 48579 71645 47501 40781 32315 -1421 3609 46547
8020D6547N2807l6088Q048l2634k7691K9937K1785m9367o500K4850J6992k2618
$$ 46547 99354 63266 71314 38680 10989 40926 62711 13344 6844 31694 48686 26068
8008B6068j7664j9011Q881J5664K8755j8581k8064J2108J6811K0746J4916P053
$$ 26068 8404 -10607 -1726 13938 42693 24112 -3952 8156 24967 45713 60629 67682
7996F7682l3173q787J6589L074j4852j6992J7659k0888J560j0999j0971M3252
$$ 67682 34509 25722 42311 45385 30533 13541 31200 10312 11872 873 -10098 33154
7984C3154K6819J0787l2439k6640J9052j4998q971m336O501Q948J9370k109L477
$$ 33154 59973 70760 38321 11681 30733 15735 6764 2428 8929 17877 37247 35138 38615
7971C8615j3011q436M393l0705M7576J3412m0800j8524L5045k439j3406j0805
$$ 38615 25604 17168 21561 -9144 38432 51844 11044 -7480 27565 25126 11720 915
7959I15q383m667L5836J0506J5864Q72l4802j560J3735k4398L7498O723K30l6313
$$ 915 -7468 -12135 23701 34207 50071 50943 16141 14581 28316 3918 41416 48139 48369 12056
7945A2056K3996L642j3664j9954J5210j5937K3862J65r377Q850j6982L742l0104
$$ 12056 36052 39694 26030 6076 21286 5349 29211 29376 19999 28849 11867 15609 -14495
7932a4495J9377O02m513N1562j7161P130K9869l5893K1411k2719k8018m3586k0730
$$ -14495 4882 5484 971 52533 35372 42502 72371 36478 57889 35170 7152 -36434 -57164
7919e7164M0831L4292L354k4406n272J2115J420J043r446K051K0304J9298k4432
$$ -57164 -16333 17959 21313 -3093 -8365 3750 5170 6213 -3233 -1182 19122 38420 13988
7906A3988k8410K0703M4161J3796k2224j3004j0075J0466k4270K9869j4908N358
$$ 13988 -14422 6281 50442 64238 42014 29010 18935 29401 5131 35000 20092 25450
7894B5450j099j1190j0481l1389K4797j0883o505J9736P436n773J8008m948Q163
$$ 25450 24351 13161 2680 -28709 -3912 -14795 -21300 -1564 5872 99 18107 13159 21322
7881B1322j2406N230L1877J1308l3999r718J1889k4827k7174M8988m325j3220
$$ 21322 8916 14146 46023 57331 23332 13614 25503 676 -26498 22490 18165 4945
7869D945K203o265m1268R5K3158R131K2275j2257j7667M1962J4558j8953n709
$$ 4945 7148 883 -40385 -40290 -17132 -8001 14274 2017 -15650 26312 40870 21917 16208
7856A6208Q507L688k980r463J0451M15k8116J9856K7680n252j6088l0603j7710
$$ 16208 24715 28403 25423 15960 26411 26826 -1290 18566 46246 40994 24906 -5697 -23407
7843b3407l447K4367K265L8176J0405l0538l4723j2949M1018j5325m929J9117
$$ -23407 -26854 -2487 -222 37954 48359 17821 -16902 -29851 11167 -4158 -9087 10030
7831A0030N35P597J782n0602P934L3473o462R501k2924j9043J1349J2123j350
$$ 10030 10565 18162 19944 -30658 -22724 10749 4287 13788 -9136 -28179 -16830 -4707 -6057
7818f057K9453j5380J206k7305M6378k639n953m8887M3429j9455R2832j30660
$$ -6057 23396 8016 9222 -18083 28295 25656 19703 -29184 14245 -5210 87622 -43038
7806d3038n853J83941j20417N3247l0539K8970k1682R299l5969J0583j7174j3716
$$ -43038 -48891 135050 14633 67880 37341 66311 44629 53928 17959 28542 11368 -2348
7794b348j9624J1285k1862K7146J3608K3283j137k4791r693L84P60L87J8341J2843
$$ -2348 -21972 -10687 -32549 -5403 8205 31488 30351 5560 -4133 -3749 -2989 -2602 15739 28582
7780B8582l6821K890N1821k646j1710p584J196O494J0500j7561l0062o972K5188
$$ 28582 -8239 -5349 46472 43826 32116 24532 25728 32222 42722 25161 -4901 -11873 13315
7767A3315M507J1430L481K2925l2923j4423n978m491J8738K6598j2874k2882N361
$$ 13315 17822 29252 32733 55658 22735 8312 2334 -2157 16581 43179 30305 7423 12784
7754A2784L505p826l3882L1965K3017J0893p817j2299j3711K991J077j4199j1297
$$ 12784 16289 8463 -25419 6546 29563 40456 32639 20340 6629 9620 10697 -3502 -14799
7741a4799K904K5374N959l1529j0495J4822Q166j4280N113n874j5891M1672K4713
$$ -14799 -11895 13479 19438 -12091 -22586 -7764 402 -13878 -8765 -14639 -30530 11142 35855
7728C5855p70m5153m306K022k3987K1200L382O688K9576P077k673l004j6569J7392
$$ 35855 35085 -10068 -14374 -12352 -36339 -15139 -11757 -5069 24507 31584 28911 25907 9338 26730
7714B6730k6464j6862n439p407M3795k6327J8964j2701P718J3237K0941p263k2784
$$ 26730 266 -16596 -22035 -29442 14353 -11974 6990 -5711 2007 15244 36185 28922 6138
7701F138k419n749N060Q107j7836J6081j4606j5770N52J2619O838j8341j003J6005
$$ 6138 3719 -2030 3030 11137 -6699 9382 -5224 -20994 -20442 -7823 -985 -19326 -20329 -4324
7687d324j2489K7719J8955j9871r690n675O712N198m3538n718N0083n766P4O749
$$ -4324 -16813 10906 29861 9990 300 -5375 1337 6535 -37003 -42721 7362 1596 1670 8419
7673H419j8801k3056o721K1863K6145M58M955j9947J4599n778j2017M467j473
$$ 8419 -10382 -33438 -40159 -18296 7849 8307 13262 -6685 7914 2136 -9881 -5414 -6887
7660f887k2445M0299l0043k0951J4557J1198J3649Q316r342l529J6800j5131J0019
$$ -6887 -29332 10967 -19076 -40027 -25470 -14272 -623 7693 -1649 -5178 11622 -3509 6510
7647F510j4031J4105K1379k3962L971K6838j8143N835L121K541J920m8321o682
$$ 6510 -7521 6584 27963 4001 7972 34810 16667 22502 25623 28164 30084 -18237 -24919
7634b4919K0019j6093j950l0571j073K9435k108K7582O600r250L93J4295J2184
$$ -24919 -4900 -20993 -22943 -53514 -54587 -25152 -27260 322 6922 -2328 -1935 12360 24544
7621B4544j0048j5864M287K1021k257L657Q676k1264j1268J2490O189p547K274
$$ 24544 14496 -1368 2919 23940 21683 25340 34016 12752 1484 13974 20163 12616 14890
7608A4890p021j4284j7715L0098l6166k1301L43l612L1991K8949N270j8515o531
$$ 14890 7869 -6415 -24130 5968 -30198 -51499 -51156 -54768 -22777 6172 11442 -7073 -13604
7595a3604j2275P346O65j4771K315Q650J0203o55j6555J9076J9081j4184k2501
$$ -13604 -25879 -18533 -17868 -32639 -30324 -21674 -11471 -12126 -28681 -9605 9476 -4708 -27209
7582b7209N297J9386K080k8938L634J4079q963j502q708L4055k043j7358L8510
$$ -27209 -21912 -2526 -446 -29384 -25750 -11671 -20634 -22136 -30844 3211 1168 -16190 22320
7569B2320O729K080j6902j61n432k7056m0995L2262K1442p615k1814J9435j0989
$$ 22320 29049 31129 14227 14066 8634 -18422 -59417 -27155 -5713 -13328 -35142 -15707 -26696
7556b6696l7592L7394K6457J4947o089k2714J6351M138L454k7228p389J8035k47
$$ -26696 -64288 -26894 -437 14510 8421 -14293 2058 6196 9650 -17578 -24967 -6932 -7179
7543g179J9418o582l157O985k7004K189N1212l732l1046l9876k0945j039J6188
$$ -7179 12239 5657 2500 9485 -17519 -15330 35882 32150 1104 -38772 -59717 -60756 -44568
7530d4568M3106j2301k8958K6918k931k0017R876q249k0593K9182M1120J2120
$$ -44568 -1462 -13763 -42721 -15803 -18734 -38751 -28875 -37124 -57717 -28535 12585 24705
7518B4705j1180k3780m0448J0661K2755o389K2231k0567J7978J9259o973j527
$$ 24705 13525 -10255 -50703 -40042 -17287 -23676 -1445 -22012 -4034 15225 8252 6725
7506F725j8224K9435j6064j475j3079K137k3198n596K6525L4593K0311j7339k7994
$$ 6725 -11499 17936 1872 397 -12682 -10545 -33743 -39339 -12814 21779 42090 24751 -3243
7493c243J1407Q277J3291m9869K909k159r106J198j4272R921R96L7913L729p787
$$ -3243 8164 16441 29732 -20137 -17228 -19387 -28493 -27295 -41567 -31646 -30650 7263 10992 3205
7479C205j0663j3530J4001j0728l3845J2812j31p9J3972N053J9467j5127k0712
$$ 3205 -7458 -20988 -6987 -17715 -51560 -38748 -38879 -38958 -24986 -19933 -466 -15593 -36305
7466c6305J1235j763K2987j1217m940j1394M715K2662J2458p39j4382o032N336
$$ -36305 -25070 -26833 -3846 -15063 -20003 -31397 -26682 -4020 8438 7699 -6683 -12715 -7379
7453g379m2821J3079K4449J2113J1669r059l6317Q314K0797L0489j1561j9850
$$ -7379 -50200 -37121 -12672 -559 11110 2051 -34266 -25952 -5155 25334 13773 -6077
7441f077J9699O273j9156l0694L2327j2989l3232P470K4847k6262J8433J994K8962
$$ -6077 13622 19895 739 -29955 2372 -10617 -43849 -36379 -11532 -37794 -19361 -17367 11595
7428A1595L052k1467j067k0602j3769J2661K8817J8216k6974m2873L4569J0523
$$ 11595 14647 -6820 -7887 -28489 -42258 -29597 -780 17436 -9538 -52411 -17842 -7319
7416g319K397k9237k1603K2674M3327K2340k1078j6705L2845m1566j0659j9257
$$ -7319 -4922 -34159 -55762 -33088 10239 32579 11501 -5204 27641 -13925 -24584 -43841
7404d3841J5920o80j5224J6634j727J3469R506l0287R420J2285j39l3582N219
$$ -43841 -27921 -28601 -43825 -27191 -28918 -15449 -5943 -36230 -26810 -14525 -14664 -48246 -43027
7391d3027J0041K0434L3122j784k8031l2886J4281K806J5061l3183J6461j4521
$$ -43027 -32986 -12552 20570 18786 -9245 -42131 -27850 -25044 -9983 -43166 -26705 -41226
7379d1226J927j654L054j1433J3735J4001J0307j0086j472o28J6291q35j2460
$$ -41226 -39299 -40953 -37899 -49332 -35597 -21596 -11289 -21375 -22847 -23475 -7184 -8019 -20479
7366b0479J2970l3623j2039N777j2968K0210K8986l15p734j4443m861q76m327
$$ -20479 -7509 -41132 -53171 -47394 -60362 -40152 -11166 -11481 -19215 -33658 -38519 -39395 -43722
7353d3722J9251M742K0273m370k288m2k373j6972R006K3845k9270O711o910j13
$$ -43722 -24471 -19729 544 -3826 -6114 -6156 -8529 -25501 -16495 7350 -21920 -15209 -22119 -22232
7339b2232j3414P580J1234l543R742n043j2169j1783L1215J6195k9426N863p242
$$ -22232 -35646 -28066 -16832 -20375 -10633 -15676 -27845 -39628 -8413 7782 -21644 -15781 -23023
7326b3023R863J1523k2951j3559n527N3657k1748P2l711r6n811O619R673l6686
$$ -23023 -13160 -1637 -24588 -38147 -43674 9983 -11765 -11693 -15404 -15500 -21311 -14692 -5019 -41705
7312d1705O2436k077k0520n9j6171j2397J504M0094K1850m2698o481O5216l2742
$$ -41705 20731 18654 -1866 -1925 -18096 -30493 -28989 11105 32955 -9743 -16224 48992 16250
7299A6250k0933j132j1059k0173J7238J2428M962l720l3595K808L1032k559N55
$$ 16250 -4683 -5815 -16874 -37047 -19809 -7381 -2419 -6139 -39734 -36926 -5894 -8453 -7898
7286g898r360q898K1004m0057M8828j2711k973j8025J4870j095k4465J3224o884
$$ -7898 -17258 -26156 -5152 -45209 3619 -9092 -12065 -30090 -15220 -16315 -40780 -27556 -34440
7273c4440m93j1911j7185K2413O314K3581R08n5207L7296K3452j1542o903J7032
$$ -34440 -34933 -46844 -64029 -41616 -35302 -11721 -10813 -66020 -28724 -5272 -16814 -23717 -6685
7260f685K4470l3780k575J7518l077r893k65l0837J3788J9485J9607r81l352j793
$$ -6685 17785 -15995 -18570 -1052 -4129 -14022 -14287 -45124 -31336 -11851 7756 6775 3423 1630
7246A630l821K041j5376J6905j3252P755o803k0904k6892K2333L7540J7531J977
$$ 1630 -2191 -150 -15526 1379 -11873 -4118 -10921 -31825 -58717 -36384 1156 18687 20664
7233B0664j3883M330K192P555k5789J8209J5725Q14j3371k1673J2105Q415J0410
$$ 20664 6781 11111 13303 20858 -4931 13278 29003 29817 16446 -5227 6878 15293 25703
7220B5703r296k0116l4047J188L7553J29l1768J2955J3127R682l8254K4987Q58
$$ 25703 16407 -3709 -37756 -36568 985 1114 -30654 -17699 -4572 5110 -33144 -8157 -7299
7207g299k3946N727J192j057N249M0332j9792k3131K1092l631l545L5046p054
$$ -7299 -31245 -25518 -24326 -25383 -20134 20198 406 -22725 -1633 -5264 -8809 26237 19183
7194A9183j9345J6295q332j0009K4209J36k3968q481j1485j226O93M975J1639
$$ 19183 -162 16133 7801 -2208 22001 22137 -1831 -10312 -21797 -23023 -22330 -17355 -5716
7181e716j5834j5771m089P476r996j3917N233K4579K7965j9486q387O887N6519
$$ -5716 -21550 -37321 -41410 -33934 -43930 -57847 -52614 -28035 -70 -19556 -27943 -21056 35463
7168C5463n2298p837K7034q276j678l0360J3596K112p089J2368K1466r760L5951
$$ 35463 -16835 -24672 2362 -5914 -7592 -37952 -24356 -22244 -29333 -16965 4501 -5259 30692
7155C0692j4324r788q773k693J2357j7350j9697n502L0853k378r92m199l90j8163
$$ 30692 16368 6580 -2193 -4886 7471 -9879 -29576 -35078 -4225 -6603 -7595 -11794 -12184 -30347
7141c0347j0651N9037j3272l6166m710K0117K3074L381R738k0908l9570J5720
$$ -30347 -40998 18039 4767 -31399 -36109 -15992 7082 10463 20201 -707 -40277 -24557
7129b4557K3580r80R756K7963j3363k0581J1380m189k220j9966N59J2100O451
$$ -24557 -977 -1957 7799 35762 22399 1818 13198 9009 6789 -13177 -12618 -518 5933
7116E933P595k8799j4785r405J7488K3083N715Q317m540j8202K1491k6232l4242
$$ 5933 13528 -15271 -30056 -39461 -21973 1110 6825 15142 10602 -7600 13891 -12341 -46583
7103d6583J7028K1082k4933l1778M5601K304q469l612n930N720L9523j511l2228
$$ -46583 -29555 -8473 -33406 -65184 -19583 -17279 -25748 -29360 -35290 -29570 9953 8442 -23786
7090b3786j632l936j3492J7287J863J014k636J0275r622K1496O2298j9660k4715
$$ -23786 -25418 -29354 -42846 -25559 -23696 -22682 -25318 -15043 -24665 -3169 59129 39469 14754
7077A4754Q209k1328k1368k659N882J8707j8215l1794j859J2367K9858M6736J2588
$$ 14754 22963 1635 -19733 -22392 -16510 2197 -16018 -47812 -49671 -37304 -7446 39290 51878
7064E1878j6000J005k6636k6347J7961J9153J6859m3018J1804k2665k3783M3408
$$ 51878 35878 36883 10247 -16100 1861 21014 37873 -5145 6659 -16006 -39789 3619
7052C619Q015j2640J5707K2435k059k0750m8957L1828K6904J4970j7301l6314
$$ 3619 11634 -1006 14701 37136 35077 14327 -34630 -2802 24102 39072 21771 -14543
7040a4543K9722j049k8657l16L4121j6771J620o458k244n005J9996l94m9429K7734
$$ -14543 15179 14130 -14527 -14843 19278 2507 4127 -2331 -4575 -9580 10416 10022 -39407 -11673
7026a1673L7173j3908j3170K4756J4614k4816n889j0933l1088K5179J6284n52
$$ -11673 25500 11592 -1578 23178 37792 12976 7087 -3846 -34934 -9755 6529 5977
7014E977k6762j1016J0573J7911J9390n00J658O328l1412j0471J5443j7474K558
$$ 5977 -20785 -31801 -21228 -3317 16073 15573 17231 23559 -7853 -18324 -2881 -20355 -17797
7001a7797l68K092K564l468L1999j7352J0948K6681j6835k0827o296o510L260
$$ -17797 -18165 -16073 -13509 -16977 15022 -2330 8618 35299 18464 -2363 -8659 -15169 -11909
6988a1909p154J5898Q879j5271K1451n535K2319k4908J604j233n595J1718j7167
$$ -11909 -19063 -3165 5714 -9557 11894 6359 28678 3770 5374 4141 -1454 10264 -6903
6975f903P748k1414m2547J2170J7150J8858p350j7940M9965L2878j587k2889k9494
$$ -6903 845 -20569 -63116 -50946 -33796 -14938 -22288 -40228 9737 42615 41028 18139 -11355
6962a1355q00L0926P848l6963J0640K485L7209l766j8162J1330J8042m375l3948
$$ -11355 -12155 18771 26619 -10344 296 2781 39990 36224 18062 29392 47434 43059 9111
6949I111J7495J9480j740k7267j3757n385O914L1077j393r185L585q676J0349
$$ 9111 26606 46086 44346 17079 3322 -2063 4851 35928 34535 25350 28935 20259 30608
6936C0608l5402J5205J0676p279K0013J3297l6606j7758j1945J1152l1119J8830
$$ 30608 -4794 10411 21087 13808 33821 47118 10512 -7246 -19191 -8039 -39158 -20328
6924b0328L8849j3652k3662O460J9109k850J2268j2379q510P649M2193P176m6905
$$ -20328 18521 4869 -18793 -12333 6776 3926 16194 3815 -4695 2954 45147 52323 5418
6911E418N163n304J5600j2260j3269L0570O307J9180k1052j8481j8085j8829m98
$$ 5418 10581 5277 20877 8617 -4652 25918 32225 51405 30353 11872 -6213 -25042 -25540
6898b5540o349J4151j761K6738n423k0005j0096r26K6222l537K3724J1181P488
$$ -25540 -31889 -17738 -19499 7239 1816 -18189 -28285 -29211 -2989 -6526 17198 28379 35867
6885C5867j9032j6271L0834J1706m3435j7592O155K2774K3802k0739J515P63r595
$$ 35867 16835 564 31398 43104 -331 -17923 -11768 11006 34808 14069 15584 16347 6752
6872F752q496P5J9656q517j1163K367L4667J2119l3427k6113J8038p156k250q516
$$ 6752 -1744 -1669 17987 9470 -1693 674 35341 47460 14033 -12080 5958 -1198 -3448 -11964
6858a1964J3642n481j6565j4071M876J4447L7055L74j8810n578j2389K3911N0598
$$ -11964 1678 -3803 -20368 -34439 -29563 -15116 21939 22313 3503 -2075 -14464 9447 60045
6845F0045k4812l4861j2421K1797k8198J1265M580n716K5342l445M956j8524l12
$$ 60045 35233 372 -12049 9748 -18450 -7185 -2605 -8321 17021 13576 18532 8 -304
6832c04k1631K1356l4153n637M9747J9099j3100o029Q820j6922k4836J7187J0707
$$ -304 -21935 -579 -34732 -40369 9378 28477 15377 9348 18168 1246 -23590 -6403 4304
6819D304J6911J3392m2566O694J9114K7429o118j0671L765k108j2051k6148P882
$$ 4304 21215 34607 -7959 -1265 17849 45278 39160 28489 32254 30146 18095 -8053 -171
6806a71j7819J1430j1435K0367M015J3666j3097N751K1911j1966O142r340O123
$$ -171 -17990 -6560 -17995 2372 6387 20053 6956 12707 34618 22652 28794 19454 25577
6793B5577l799P728N129K3192J3220j7908j2955o858k4946J0594J5277l974J0765
$$ 25577 21778 29506 34635 57827 71047 53139 40184 33326 8380 18974 34251 30277 41042
6780D1042j2839K824l1815j0866K4998l824k8502J6628J5357k9233L7935k2255
$$ 41042 28203 31027 -788 -11654 13344 9520 -18982 -2354 13003 -16230 21705 -550
6768e50r038k3736k1019L8745J8182m840J3500K6283l345j4518Q51L742o838l0391
$$ -550 -9588 -33324 -54343 -15598 2584 -2256 11244 37527 34182 19664 20515 24257 17419 -12972
6754a2972M0057L184l9143k9904K3942L6169j3348J0023k5370J7055N960L7593
$$ -12972 27085 30269 -8874 -38778 -14836 21333 7985 18008 -7362 9693 15653 53246
6742E3246m4970n954K0984P406r214m532k3137j613K2610j4220p609J7071l033
$$ 53246 8276 2322 23306 30712 21498 16966 -6171 -7784 14826 606 -7003 10068 7035
6729G035J8590K776J1490k8103n280P912j0694K8731K295m375k0704J9770p056
$$ 7035 25625 28401 39891 11788 6508 14420 3726 32457 34752 30377 9673 29443 22387
6716B2387K4271Q812q962K876k8264q018M201O751J0572k4024j017j2258K4727
$$ 22387 46658 55470 46508 49384 21120 13102 17303 24054 34626 10602 9585 -2673 22054
6703B2054K4082m193m2958j504K6332K602Q936m389l612m534K1432l508j4897
$$ 22054 46136 41943 -1015 -2519 23813 26415 35351 30962 27350 22816 44248 40740 25843
6690B5843L648J4605j4420K1048j5654q876l276L696l727k9703M6994N664J1051
$$ 25843 29491 44096 29676 50724 35070 26194 22918 26614 22887 -6816 40178 45842 56893
6677E6893l1969k8212j62M5464n448j633j460k330k0279J3572J1288n874J651
$$ 56893 24924 -3288 -3450 42014 36566 34933 33473 31143 10864 24436 35724 29850 31501
6664C1501n294K9147M804l6738q152M3900l3107o740r429Q221m560k0296p517
$$ 31501 26207 55354 60158 23420 15268 59168 26061 19321 9892 18113 13553 -6743 -14260
6651a4260O0242J1180Q99n616j2053o284l7923J0009k56r477N1040k4697l3117
$$ -14260 45982 57162 58061 52445 40392 34108 -3815 6194 5938 -3539 47501 22804 -10313
6638a0313Q403k135L2843J9208K9186l7340q982R978j9814j6289M969J5968L438
$$ -10313 -1910 -4045 28798 48006 77192 39852 30870 40848 21034 4745 9714 25682 29120
6625B9120l116N901j4290N0245j7945j191J8145k2050K2500k4776J5833k5072
$$ 29120 26004 31905 17615 67860 49915 48724 66869 44819 67319 42543 58376 33304
6613C3304l5207K6627p710K6160j0859j2342J7L9241l7366m9117O533L1061J6434
$$ 33304 -1903 24724 17014 43174 32315 19973 19990 59231 21865 -27252 -20719 10342 26776
6600B6776R832J4911j3375Q410l3279P145Q45k804J9382P23o527q1q054j6955
$$ 26776 36608 51519 38144 46554 13275 20420 21265 18461 37843 38566 32039 31958 23904 6949
6586F949K2366J3317K9208j3548o143M3894l8675k3074q63R249o576o028K2308
$$ 6949 29315 42632 71840 58292 52149 96043 57368 34294 33431 42680 36104 30076 52384
6573E2384R646Q927k8823k3133K261j6006J9069O285M2210K250j9841p686J5106
$$ 52384 62030 70957 42134 19001 21262 5256 24325 30610 72820 75070 55229 47543 62649
6560F2649J2371r784j6260j3891J0127J4385r847r708k0725l817p180L195j4530
$$ 62649 75020 65236 48976 35085 45212 59597 49750 40042 19317 15500 8320 11515 -3015
6547c015J635J8601J7895K1694m317k9152k7824L1673P481j8370j3851P136J6627
$$ -3015 -1380 17221 35116 56810 52493 23341 -4483 27190 34671 16301 2450 9586 26213
6534B6213L6359P889k6320j9850L1284K2335j3335j4015j6235J0114N182J7507
$$ 26213 62572 70461 44141 24291 55575 77910 64575 50560 34325 44439 49621 67128
6522F7128J1948j9774o1431j5389L7464M7824j4307n247k4589j582r408N546R430
$$ 67128 79076 59302 -2129 -17518 19946 67770 53463 48216 23627 22045 12637 18183 27613
6509B7613O627Q29J0718n97n1526J7552L9285K2391j1968R650J3125k1412j5539
$$ 27613 34240 35069 45787 45190 -6336 11216 50501 72892 60924 70574 83699 62287 46748
6496D6748j6887k907Q359J2858K3840q518k1151j628K3256q527j4832K5847J1637
$$ 46748 29861 26954 35313 48171 72011 63493 42342 40714 63970 55443 40611 66458 78095
6483G8095J2276j4249m7805j6868J6517J4427j8214K1153K8411k2923J7008L380
$$ 78095 90371 76122 28317 11449 27966 42393 24179 45332 73743 50820 67828 71208
6471G1208m9290J0532L8694K006J2373J0866J2360K4733m8875P930j3907J4877
$$ 71208 21918 32450 71144 73150 85523 96389 108749 133482 84607 92537 78630 93507
6459I3507j4788L871p692m2025m0554J2793L980K8784L9726m698M217j5640J2501
$$ 93507 78719 82590 74898 32873 -7681 5112 9092 37876 77602 72904 77121 61481 73982
6446G3982m755q07K7522j3016J9439J3195l6050L200Q459j7735n809m464m712
$$ 73982 69227 68420 95942 82926 102365 115560 79510 82710 91169 73434 67625 63161 58449
6433E8449k728Q306J2852J0296j6271j6252M318l4111q931L9320j3875P239K9591
$$ 58449 55721 64027 76879 87175 70904 54652 58970 24859 15928 55248 41373 48612 78203
6420G8203m121j4148J3841q364L397P572m2187O151K6909l3933N079L0413N101
$$ 78203 74082 59934 73775 65411 68808 76380 34193 40344 67253 33320 38399 68812 73913
6407G3913r941m046J9507r247j3730j7279K0788j4297N0937J035j8868m174J3812
$$ 73913 63972 59926 79433 70186 56456 39177 59965 45668 96605 97640 78772 74598 88410
6394H8410l696J6296N558l2209r701J5298J9783k4037J6647R41K42J704P578J712
$$ 88410 84714 101010 106568 74359 64658 79956 99739 75702 92349 93290 93532 95236 102814 104526
6380A04526k0140L180L135k0221k005o734O833J7135N732q1k4407o297J6896J752
$$ 104526 84386 87566 90701 70480 68475 61741 68574 85709 91441 91360 66953 60656 77552 79304
6366G9304l8150O1085k3198j4160J0315k5170k733N1755k074J0265K012k3712
$$ 79304 41154 102239 79041 64881 75196 50026 47293 99048 96974 107239 109251 85539
6354H5539j4765L1898L6342n8552k0176L8971k7922k3320P403K3366J9448m604
$$ 85539 70774 102672 139014 80462 60286 99257 71335 48015 55418 78784 98232 93628
6342I3628O070j8604j6687Q462K2457k8955O028K5088p329J1697o653l9347P3712
$$ 93628 99698 81094 64407 72869 95326 66371 72399 97487 90158 101855 95202 55855 129567
6329A29567J969l8106j6010Q658J0342q55j9554M7710J9608j3068l2857L051J0782
$$ 129567 131536 93430 77420 86078 96420 95565 76011 123721 143329 130261 97404 100455 111237
6316A11237J2228K3042p969J2557m2799j8476Q430r018k0442p088N248j8002j1300
$$ 111237 123465 146507 138538 151095 108296 89820 98250 89232 68790 61702 66950 48948 37648
6303C7648O447M9525K6238k5451n879J0699j9065L248K0943j8654M7100n854L0826
$$ 37648 44095 93620 119858 94407 88528 99227 80162 83410 104353 85699 132799 126945 157771
6290A57771k024k2753k150k4945o845J5496j6916l271J2048j40l601q021K8325
$$ 157771 155747 132994 130844 105899 99054 114550 97634 94363 106411 106271 102670 94649 122974
6277A22974k8757K9664j5715L900p372K460j1777J5712p407q910O976j5073J3436
$$ 122974 94217 123881 108166 112066 104694 107154 95377 111089 103682 94772 101748 86675 100111
6264A00111R525P197P55J4678l6071L2035K1772m8809j0038K7771K4169k235L374
$$ 100111 109636 116833 117588 132266 96195 128230 150002 101193 91155 118926 143095 140860 144234
6251A44234k9488l1523K7152J2384k3924L009j1360O147j2934O093M3035Q430
$$ 144234 114746 83223 110375 122759 98835 101844 90484 96631 83697 89790 132825 141255
6239A41255J2851n2236L789K8336n028R391J556j8033j1456K1884p378k6990J0294
$$ 141255 154106 101870 105659 133995 128967 138358 139914 121881 110425 132309 124931 97941 108235
6226A08235j5633J5258m120q671J1109K3200k4340K6338K4095l2151j7166m573
$$ 108235 92602 107860 103740 95069 106178 129378 105038 131376 155471 123320 106154 101581
6214A01581K017L1701J2564m5930q717O035K3695J4607n1762q323L9740l041j7667
$$ 101581 103598 135299 147863 101933 93216 99251 122946 137553 85791 77468 117208 114167 96500
6201I6500N3315R356k9334l021k3122j5960K057J7776j5165K9499J9474j0257
$$ 96500 149815 159171 129837 126816 103694 87734 89791 107567 92402 121901 141375 131118
6189A31118k2240l601J2907J8231j5j0900O119K767o684k963J7965k8568j1615
$$ 131118 108878 105277 118184 136415 136400 125500 131619 134386 127702 124739 142704 114136 102521
6176A02521J0547P594K2148p015l1869j7259K1918J2630j7745J8424M2533n656
$$ 102521 113068 120662 142810 135795 103926 86667 108585 121215 103470 121894 164427 158771
6164A58771k1433l711j0620J8783O079l004J5456J9213J9012m9563N112k9818
$$ 158771 137338 133627 123007 141790 147869 144865 160321 179534 198546 148983 154095 124277
6152A24277k8467k5N292j0897J5833K418n930J8207J2007K8583p6292K3140L0808
$$ 124277 95810 95785 101077 90180 106013 108431 102501 120708 132715 161298 85006 108146 138954
6139A38954l0112J5268J0922k5396K0049J7836j5848K4180m153j2253J9185l0692
$$ 138954 108842 124110 135032 109636 129685 147521 131673 155853 151700 139447 158632 127940
6127A27940r614j536J353J6137n799Q559n789N993k4570l460N656L2134M495J8320
$$ 127940 118326 116790 118143 134280 128481 137040 131251 137244 112674 109214 114870 147004 151499 169819
6113A69819M417m894j5384J2050J8758r522N635j6432J2394k9889j2880K5052
$$ 169819 174236 169342 153958 166008 184766 175244 180879 164447 176841 146952 134072 159124
6101A59124O907l1780K0594K2073k0383K0717q860j5785J2236Q940k1877L4064
$$ 159124 166031 134251 154845 176918 156535 177252 168392 152607 164843 173783 151906 185970
6089A85970O382j7598k9140K7989J936j6529J8033j0670J0677K732m762k7699
$$ 185970 192352 174754 145614 173603 175539 159010 177043 166373 177050 179782 175020 147321
6077A47321N2915L1122k3479k7759j5397k168J4985K7810P450k5127Q445p409
$$ 147321 200236 231358 207879 180120 164723 162555 177540 205350 212800 187673 196118 188709
6065A88709O299p420j8745R151N054j8487j3267L0049K2191k096j6585J7156k0237
$$ 188709 195008 187588 168843 177994 183048 164561 151294 181343 203534 201438 184853 202009 181772
6052A81772j4677O669k2401M7295O306r285k1284j2000O828k6594j4236J8466
$$ 181772 167095 173764 151363 198658 204964 195679 174395 162395 169223 142629 128393 146859
6040A46859J1852J3572J6279m194l9158o058O2877j4226P813l9893M213K8968
$$ 146859 158711 172283 188562 184368 145210 139152 202029 187803 195616 155723 159936 188904
6028A88904k3987j1712m484K9079j9154k0686K4230K6344j3879L3964k9669J4357
$$ 188904 164917 153205 148721 177800 158646 137960 162190 188534 174655 208619 178950 193307
6016A93307P076l616J0711k5579j473j5127j3106J4382q137Q097M4197k8259J7433
$$ 193307 200383 196767 207478 181899 180426 165299 152193 166575 158438 166535 210732 182473 199906
6003A99906K8531k9454J5415j0643J2128J750l5731J1941n74J7L8800J4187l6091
$$ 199906 228437 198983 214398 203755 215883 217633 181902 193843 193269 193286 232086 246273 210182
5990B10182L526q013R578n881q219N911k9366K4472P856k762k482j5497L973j2162
$$ 210182 213708 205695 215273 209392 201173 207084 177718 202190 210046 207284 204802 189305 193278 181116
5976A81116L3843J6633j5092k319m311r186J2504j7928K1117p164k1125N586j3742
$$ 181116 214959 231592 216500 214181 209870 200684 213188 195260 216377 209213 188088 193674 179932
5963A79932J2865M3238P698l4480M223L5338p03k609n4744O136R978J0201K4140
$$ 179932 192797 236035 243733 209253 213476 248814 248111 245502 190758 196894 206872 217073 241213
5950B41213j7093P302K3997o451j5335J5844Q529l0729p725K2876j4990K728J4492
$$ 241213 224120 231422 255419 248968 233633 249477 258006 227277 219552 242428 227438 230166 244658
5937B44658k570n1594J4537N0587R9L398j6770K1704j28n5523L7829m223O9J6595
$$ 244658 242088 190494 205031 255618 255717 259115 242345 264049 263921 208398 246227 242004 242073 258668
5923B58668j0359L2496l4550r491M0110l437R541K0767k4541J042K3226j330L405
$$ 258668 248309 280805 246255 236764 276874 273437 282978 303745 279204 280246 303472 302142 305547
5910C05547l4475l4314Q912J6710R191N890J236k0699m3868J9146M4605J4493
$$ 305547 271072 236758 245670 262380 271571 277461 278697 257998 214130 233276 277881 292374
5898B92374k144k0043q817j0199L0875j1659k7577J1201O199j378j144J7311j452
$$ 292374 290230 270187 261370 251171 282046 270387 242810 254011 260210 258832 257688 274999 273547
5885B73547p249L25L1678L852N424p194j5914J4988J1738L6024m7006j639J4459
$$ 273547 266298 266623 298301 302153 307577 300383 284469 299457 311195 347219 300213 298574 313033
5872C13033R61J7439j3328l3385J3461L158J2645Q783k8084K3941j8873L481J3949
$$ 313033 313994 331433 318105 284720 298181 301339 313984 322767 294683 318624 299751 303232 317181
5859C17181K203o035k1027j9320L1680j4849L332J4932J3452k8329Q001l844Q023
$$ 317181 319384 313349 292322 273002 304682 289833 293165 308097 321549 293220 301221 297377 305400
5846C05400j9321L67L5623o035q075P972J8087J7414J3350k4012L0628N677q655
$$ 305400 286079 286446 322069 316034 307959 315931 334018 351432 364782 340770 371398 377075 368420
5833C68420j2006q868L2727l123j990J4011N282l3027L902K8060m08J0943q982
$$ 368420 356414 347546 380273 377150 375160 389171 394453 361426 365328 393388 392980 403923 394941
5820C94941l0467K2617J3997K273j663K281J7983k649n291N267j0010r148K6356
$$ 394941 364474 387091 401088 403361 401698 403979 421962 419313 414022 419289 409279 400131 426487
5807D26487L5581m2209J2099J7390j5599J3136J3901k668j6683O987K860N454
$$ 426487 462068 419859 431958 449348 433749 446885 460786 458118 441435 448422 451282 456736
5795D56736j6295L0914L695L656P216j7758N325J7582k5196Q964K7711J5732j5929
$$ 456736 440441 471355 475050 478706 485922 468164 473489 491071 465875 474839 502550 518282 502353
5782E02353M653p19M5176l1919K608N064R663k996K453M782o039k1297R735L7856
$$ 502353 507006 506287 551463 519544 522152 527216 536879 533883 536336 541118 535079 513782 523517 561373
5768E61373J7567J4801l7042L54J6088J7236R56R608j8522Q568K0968k681j7421
$$ 561373 578940 593741 556699 557053 573141 590377 591333 600941 582419 590987 611955 609274 591853
5755E91853L83J588J6723L2093p545j9210P108J1726K977o177O669J7671o497
$$ 591853 592236 593824 610547 642640 635095 615885 622993 634719 637696 631519 638188 655859 649362
5742F49362L2411K6891J258M0302o066k8087j1870J062J2079J7809O029j3835
$$ 649362 681773 708664 709922 750224 744158 716071 704201 705263 717342 735151 741180 727345
5730G27345J4213K5776r864j7767K6350J6722j641K479J4112J640k2531j9670
$$ 727345 741558 767334 757470 739703 766053 782775 781134 783613 797725 799365 776834 757164
5718G57164J9421L4281k0031K895L1997K1547j4034J5677j0729j448K2065J0335
$$ 757164 776585 810866 790835 793730 825727 847274 833240 848917 838188 836740 858805 869140
5706H69140j9567k6235N3173K880k3912q840J2088R079O730j6778L8828K2524
$$ 869140 849573 823338 876511 879391 855479 846639 858727 867806 874536 857758 896586 919110
5694I19110L2410M1140P646M909j6566p246J7583K7270O894Q720r097r220L1662
$$ 919110 951520 992660 1000306 1005215 988649 981403 998986 1026256 1033150 1041870 1032773 1023553 1055215
5681A055215J8600k3552n020J166K5803K5218K5184L842j3450J869q577J0290
$$ 1055215 1073815 1050263 1045243 1046409 1072212 1097430 1122614 1126456 1113006 1114875 1106298 1116588
5669A116588M1336j9365j0348L2873L4285J6414J8860j1153k395o022K621L0624
$$ 1116588 1157924 1138559 1128211 1161084 1195369 1211783 1230643 1219490 1217095 1211073 1213694 1244318
5657A244318J8315k14n704J6409K9217k1193j3123n858K7392N4061j1984K3428
$$ 1244318 1262633 1262419 1256715 1273124 1302341 1281148 1268025 1262167 1289559 1343620 1331636 1355064
5645A355064K7578j1216J2703O680j2137J7876R386P291M8326L540L2388J3660
$$ 1355064 1382642 1371426 1384129 1390809 1378672 1396548 1405934 1413225 1461551 1465091 1497479 1511139
5633A511139o760j9402N0108O4421j8151n750J5427K1339L5085P987L6308k998
$$ 1511139 1504379 1484977 1535085 1599506 1581355 1575605 1591032 1612371 1647456 1655443 1691751 1688753
5621A688753J6321M0085m435j891j0994M5836o40J3367J793K7283J1853l769J2800
$$ 1688753 1705074 1745159 1740724 1738833 1727839 1773675 1773035 1786402 1788195 1815478 1827331 1823562 1836362
5608A836362K0970O602K5925J3992L6793K5205K6618M6250K6202Q771k1764L2945
$$ 1836362 1857332 1863934 1889859 1903851 1940644 1965849 1992467 2038717 2064919 2073690 2051926 2084871
5596B084871o422P458L3387L4434Q729K5827j8464q209M4445K5004N4637K1548
$$ 2084871 2078449 2085907 2119294 2153728 2162457 2188284 2169820 2161611 2206056 2231060 2285697 2307245
5584B307245p944K7645O271L9959Q292j4401L3401O8975K9374J5009K1141L4022
$$ 2307245 2299301 2326946 2333217 2373176 2381468 2367067 2400468 2469443 2498817 2513826 2534967 2568989
5572B568989J6808L2620O1315o868O9135M2197Q252j3717K1469N8102M950M4910
$$ 2568989 2585797 2618417 2679732 2672864 2741999 2784196 2792448 2778731 2800200 2858302 2863252 2908162
5560B908162L2059K1548O5015J9839L6419J9894M3530J6251J4518O3727L6786
$$ 2908162 2940221 2961769 3026784 3046623 3083042 3102936 3146466 3162717 3177235 3240962 3277748
5549C277748K6725K0098L3260N0321J2455M2141K9596N8482M2525M0019K406O6198
$$ 3277748 3304473 3324571 3357831 3408152 3420607 3462748 3492344 3550826 3593351 3633370 3635776 3701974
5537C701974J9513K0814K7997M6706P1231L9621N6748P4808N7642M6206O3835
$$ 3701974 3721487 3742301 3770298 3817004 3888235 3927856 3984604 4059412 4117054 4163260 4227095
5526D227095N2092P0806O0477N7451R5426P2193N5050J11163N0842O0238P7776
$$ 4227095 4279187 4349993 4410470 4467921 4563347 4635540 4690590 4801753 4852595 4912833 4990609
5515D990609Q3874P8603M7911N4146Q0749O8781N0620M3503P6120N2481R3968
$$ 4990609 5074483 5153086 5200997 5255143 5335892 5404673 5455293 5498796 5574916 5627397 5721365
5504E721365Q3989Q9454P9585N9266Q0289J14967P2373M9758R9241J18796Q1375
$$ 5721365 5805354 5894808 5974393 6033659 6113948 6228915 6301288 6351046 6450287 6569083 6650458
5493F650458J11005J19896O6221R3636R1521R0765J51888Q5448J01147R3976R3462
$$ 6650458 6761463 6881359 6947580 7041216 7132737 7223502 7375390 7460838 7561985 7655961 7749423
5482G749423J37830J12638J22649J10982J18000J43914J16828J56979J55981J40562
$$ 7749423 7887253 7999891 8122540 8233522 8351522 8495436 8612264 8769243 8925224 9065786
5472I065786J38270J20018J56392J69580J45463J73372J47823J91025K13091J75522
$$ 9065786 9204056 9324074 9480466 9650046 9795509 9968881 10116704 10307729 10520820 10696342
5462A0696342K12756J78103K18770K24449K29170K31436K69377K51912K57564
$$ 10696342 10909098 11087201 11305971 11530420 11759590 11991026 12260403 12512315 12769879
5453A2769879K86980L06839K99646L11377K69457L32996L11696L31124L63818
$$ 12769879 13056859 13363698 13663344 13974721 14244178 14577174 14888870 15219994 15583812
5444A5583812L15163L65149L56151L83446L48741L81675M52047L87775L81387
$$ 15583812 15898975 16264124 16620275 17003721 17352462 17734137 18186184 18573959 18955346
5435A8955346M28752M56078M52042M26278M97460M73553N22649M80764N54615
$$ 18955346 19384098 19840176 20292218 20718496 21215956 21689509 22212158 22692922 23247537
5426B3247537N17973N44271N65281N68847O10683O05727O75891O55811O88948
$$ 23247537 23765510 24309781 24875062 25443909 26054592 26660319 27336210 27992021 28680969
5417B8680969P43256P84780P34982P62334Q66619Q64115R14231R77093J009439
$$ 28680969 29424225 30209005 30943987 31706321 32572940 33437055 34351286 35328379 36337818
5408C6337818J007451J027495J151432J169776J202473J197511J295462J341271
$$ 36337818 37345269 38372764 39524196 40693972 41896445 43093956 44389418 45730689
5400D5730689J376719J401332J506583J590788J669882J725773J796066J920662
$$ 45730689 47107408 48508740 50015323 51606111 53275993 55001766 56797832 58718494
5392E8718494J959124K058463K171450K316816K449107K536522K670943K852481
$$ 58718494 60677618 62736081 64907531 67224347 69673454 72209976 74880919 77733400
5384G7733400K978988L136829L341266L566613L793118M104418M352907M613547
$$ 77733400 80712388 83849217 87190483 90757096 94550214 98654632 103007539 107621086
5376A07621086M966426N352512N856098O269379O697066P275186P836307Q433201
$$ 107621086 112587512 117940024 123796122 130065501 136762567 144037753 151874060 160307261
5368A60307261R082879R614985J0231742J0894057J1318123J1657817J1834285
$$ 160307261 169390140 179005125 189236867 200130924 211449047 223106864 234941149
5361B34941149J1727639J1235432J0327628Q925181P020395M644212J878898j077834
$$ 234941149 246668788 257904220 268231848 277157029 284177424 288821636 290700534 289622700
5353B89622700l961999o629116q881057j0646915j1901570j2586751j2850660
$$ 289622700 285660701 279031585 270150528 259503613 247602043 235015292 222164632
5346B22164632j2803564j2444654j1878855j1317202j0592825r885223r171843
$$ 222164632 209361068 196916414 185037559 173720357 163127532 153242309 144070466
5339A44070466q483054p885849p250021o696111o272750n718983n303367m921768
$$ 144070466 135587412 127701563 120451542 113755431 107482681 101763698 96460331 91538563
5331I1538563m533713m224224l926468l689864l417825l177241k985278k809254
$$ 91538563 87004850 82780626 78854158 75164294 71746469 68569228 65583950 62774696
5323F2774696k645189k540776k357272k201744k080063j949949j840802j772866
$$ 62774696 60129507 57588731 55231459 53029715 50949652 48999703 47158901 45386035
5315D5386035j697967j586435j478429j420250j382586j284552j191394j145950
$$ 45386035 43688068 42101633 40623204 39202954 37820368 36535816 35344422 34198472
5307C4198472j111961j048204j006753r69935r05857q59726q50857q15987p94354
$$ 34198472 33086511 32038307 31031554 30061619 29155762 28296036 27445179 26629192 25834838
5298B5834838p93865p12467o86449o74735o12274o34501n87705n52938n41024
$$ 25834838 25040973 24328506 23642057 22967322 22355048 21720547 21132842 20579904 20038880
5289B0038880n50108n00696m84039m66192m56357m27033m38429m38583m06340
$$ 20038880 19488772 18988076 18504037 18037845 17581488 17154455 16716026 16277443 15871103
5280A5871103l75250l56470l71188l48060l25924l22553l10413k93050l13379
$$ 15871103 15495853 15139383 14768195 14420135 14094211 13771658 13461245 13168195 12854816
5271A2854816l01072k93578k31520k41985k62356k38477k47886k21659k22996
$$ 12854816 12553744 12260166 12028646 11786661 11524305 11285828 11037942 10816283 10593287
5262A0593287k05886j88168k10851k02526j69798j76232j77054j91547k02577
$$ 10593287 10387401 10199233 9988382 9785856 9616058 9439826 9262772 9071225 8868648
5253H868648j69915j33198j64134j82691j31548j33034j34971j51386j26645j57467
$$ 8868648 8698733 8565535 8401401 8218710 8087162 7954128 7819157 7667771 7541126 7383659
5243G383659j11484j00147j36792j68890j04416p9511j40295j40398q6333j22302
$$ 7383659 7272175 7172028 7035236 6866346 6761930 6682419 6542124 6401726 6315393 6193091
5233F193091j06127r5002j00398j19745r4148q6220o5256j26809p6586k5913p1798
$$ 6193091 6086964 5991962 5891564 5771819 5677671 5591451 5526195 5399386 5322800 5296887 5225089
5222E225089j09669j00658p1641r5873p9622r7671o6817n1648p8893o7336n0179
$$ 5225089 5115420 5014762 4943121 4847248 4767626 4669955 4603138 4551490 4472597 4405261 4355082
5211D355082p2063q8296p7880m7141k4423o9212o0105m0092o0479o0987p4871
$$ 4355082 4283019 4194723 4116843 4069702 4045279 3976067 3915962 3875870 3815391 3754404 3679533
5200C679533n9314j2198p6567n0689m5555l5444j8808l8747l2124o6426p6993
$$ 3679533 3620219 3608021 3531454 3480765 3435210 3399766 3380958 3342211 3310087 3243661 3166668
5189C166668l1676J024l4353k5059m7014J5897j7519k9584r17J0993k6801n9523
$$ 3166668 3134992 3136016 3101663 3076604 3029590 3045487 3027968 2998384 2997467 3008460 2981659 2922136
5177B922136o0836m4652j0937k0575p3246m3878n0381l1202k7290k3441m1573
$$ 2922136 2861300 2816648 2805711 2785136 2711890 2668012 2617631 2586429 2559139 2535698 2494125
5166B494125l0172o236n0869o5644J4940l1007m7181n7321k2291k5664j347m2559
$$ 2494125 2463953 2457717 2406848 2341204 2356144 2325137 2277956 2220635 2198344 2172680 2171333 2128774
5154B128774j8495n0554k3037k2997k9328k8791m5322J4430j5445K1597m1112
$$ 2128774 2110279 2059725 2036688 2013691 1984363 1955572 1910250 1924680 1909235 1930832 1889720
5143A889720o3526k0142J2829l1021N197N945l7378k1688l1663o600m924k3262
$$ 1889720 1826194 1806052 1818881 1787860 1793057 1799002 1761624 1739936 1708273 1701673 1696749 1673487
5131A673487o735j6012m2937l5649q947P314j1366l9509k5283J928n0206m3941
$$ 1673487 1666752 1650740 1607803 1572154 1563207 1570521 1559155 1519646 1494363 1496291 1446085 1402144
5119A402144K8356l7115J1671j7430l8420k579k1996l0500k5612P402J2861k7454
$$ 1402144 1430500 1393385 1405056 1387626 1349206 1346627 1324631 1294131 1268519 1275921 1288782 1261328
5107A261328q585k9124l2697L3835l4249m2524M525j2416L0783L027L970k7900
$$ 1261328 1252743 1223619 1190922 1224757 1190508 1147984 1152509 1140093 1170876 1173903 1177873 1149973
5095A149973k6573k3253k9399R117p550j4270o082N000j1176l5068l6615o526
$$ 1149973 1123400 1100147 1070748 1079865 1072315 1058045 1051963 1056963 1045787 1010719 974104 967578
5083I67578R704J8336j8105r532k4232r286M5571J2235k2737l5209l4732Q001
$$ 967578 977282 995618 977513 967981 943749 934463 980034 992269 969532 934323 899591 907592
5071I07592J5641l5674l628m1826j020j8088Q023R82j4901m4731M3851M966l5998
$$ 907592 923233 887559 883931 842105 841085 822997 831020 832002 817101 772370 816221 821187 785189
5058G85189k142M665K1058j2208k5974o806p285k4187j9121K1011K4895j2221
$$ 785189 783047 787712 808770 796562 770588 763782 756497 732310 713189 734200 759095 746874
5046G46874j2930k0283L49j7218J3112m0981q721r29j70l83R22m7955M44j2900
$$ 746874 733944 713661 714010 696792 709904 668923 660202 659273 659103 658720 659642 611687 612131 599231
5032E99231J6939J4698m0313n260k7438K2461L2678J7028j1503l1242n614r40
$$ 599231 616170 630868 590555 585295 557857 580318 612996 630024 618521 587279 581665 580725
5020E80725q182J7361k725k2717J4223J9134j9533l7441K3192k3867l6881J7973
$$ 580725 572543 589904 587179 564462 578685 597819 578286 540845 564037 540170 503289 521262
5008E21262k499k8085K3861p830K2036J1924o1708k4161Q304j3655K0269R122
$$ 521262 518763 490678 514539 506709 528745 540669 478961 454800 463104 449449 469718 478840
4996D78840j047l969Q129L568j7518l7442k649K2459K734j3781k0840K6169o539
$$ 478840 477793 473824 481953 485521 468003 430561 427912 450371 453105 439324 418484 444653 438114
4983D38114k7175J6046j5932j5824j7886j9679K0591J1015L3500k5062n9889L1150
$$ 438114 410939 426985 411053 395229 377343 357664 378255 389270 422770 397708 337819 368969
4971C68969J8455R246j0931k1694j414p153m163j5505o903J2526J2232j7733L2469
$$ 368969 387424 396670 385739 364045 362631 355478 351315 335810 328907 341433 353665 335932 368401
4958C68401J8505l4359L585j9369k5392j7252L295J9150Q539K8048K2326K308
$$ 368401 386906 352547 356132 336763 311371 294119 297414 316564 325103 353151 375477 377785
4946C77785q085J6442m0523M509m2347j8853K0251N4036n2479L1997M063m1143
$$ 377785 369700 386142 345619 350128 307781 288928 309179 363215 310736 342733 346796 305653
4934C05653R56k046R952L0559K646J347k6910m1468L7467m194j5775K5656J3291
$$ 305653 306609 304563 314515 345074 347720 349067 322157 280689 318156 313962 298187 323843 337134
4921C37134Q242k317j5867j7363k1723m3290L015L7847J1596m806k116J1568j2407
$$ 337134 345376 343059 327192 309829 288106 244816 247831 285678 297274 292468 290352 301920 289513
4908B89513p301j9722R683j7430j5543J5275K8667k5622m102L2628N12m4389J1057
$$ 289513 282212 262490 272173 254743 239200 254475 283142 257520 253418 286046 286558 242169 253226
4895B53226J7715J9344k934o2287k1642n680L4550M6231k1723j4705j3634K810
$$ 253226 270941 290285 287351 225064 203422 197742 232292 278523 256800 242095 228461 231271
4883B31271k4248M044J7134P443K1767N712k5202j3805j4979K6953k5857p20r430
$$ 231271 207023 211067 228201 235644 257411 263123 237921 224116 209137 236090 210233 209513 200083
4870B00083l945J814j4778K3031O422k9731K5536l7211K6529L2679J0039j009
$$ 200083 196138 197952 183174 206205 212627 182896 208432 171221 197750 230429 240468 239459
4858B39459J5517l2397m0218L425j1087r265k591J197J2762J5358k199n486Q561
$$ 239459 254976 222579 182361 185786 174699 165434 162843 164040 176802 192160 189961 184475 193036
4845A93036K3243Q659L2462j3709k9042k8406J09n49J2533m589K1691o743k3028
$$ 193036 216279 224938 257400 243691 214649 186243 186352 185803 198336 193747 215438 208695 185667
4832A85667k6953M523L0527J0674l0203J1460k8413L345m061J6797J0491l759
$$ 185667 158714 163237 193764 204438 174235 185695 157282 160627 156566 173363 183854 180095
4820A80095m0187j2585K9519L2696l4748j6549J1931m453j6575n024J9545J7530
$$ 180095 139908 127323 156842 189538 154790 138241 150172 145719 129144 124120 143665 161195
4808A61195L806J7267m8673j0748L351J2327K9649k7704J5111k2657J3019L4601
$$ 161195 165001 182268 133595 122847 126198 138525 168174 140470 155581 132924 145943 180544
4796A80544o674j2858P317j3157j3237j7560j2001O413M1189k1454j2027l874
$$ 180544 173870 161012 168329 155172 141935 124375 112374 118787 159976 138522 126495 122621
4784A22621J6790k2298k3235L8717j0935k3118o076J6163J7589J002j0707P069
$$ 122621 139411 117113 93878 132595 121660 98542 92466 108629 126218 127220 116513 123582
4772A23582J4839j8021J2893J2873k0316N77j8934J5216j050K3599q756l5120
$$ 123582 138421 120400 133293 146166 125850 126427 107493 122709 121659 145258 136502 101382
4760A01382j4037R058K4837K7344j2812j0364k771p664k6168J5086J5680o491
$$ 101382 87345 96403 121240 148584 135772 125408 122637 114973 88805 103891 119571 113080
4748A13080O609m239K0958q082P744j606M954l603l180o214n200j1902m710j1796
$$ 113080 119689 115450 136408 128326 136070 134464 139418 135815 132635 126421 121221 109319 104609 92813
4734I2813K0431k0025n24K1740J3605j251J3328l49M00o522k1523k1199r206J4244
$$ 92813 113244 93219 92695 114435 128040 126789 140117 139768 140168 133646 112123 90924 81718 95962
4720I5962K7603q901r359J097m840j5012k3311L3530J5778m4680J5802J8163j3442
$$ 95962 123565 114664 105305 106402 101562 86550 63239 96769 112547 67867 83669 101832 88390
4707H8390P860j5468L0935k789p106K625l5736M8268K8439n2041j7061K5913K6539
$$ 88390 96250 80782 111717 108928 101822 104447 68711 116979 145418 93377 76316 102229 128768
4694A28768k2289j4784K4734L7789k1747k1877L663Q220K4827m390L169k4215
$$ 128768 106479 91695 116429 154218 132471 110594 114257 122477 147304 142914 146083 121868
4682A21868L580K3635K518J454k9578j2858j6103L0531K0555m025r771n005P588
$$ 121868 125448 149083 151601 153055 123477 110619 94516 125047 145602 141577 131806 126801 134389
4669A34389k0447j2882o912K2208q467n469J3350l0965J4497k4106j7561K5763
$$ 134389 113942 101060 94148 116356 107889 102420 115770 84805 99302 75196 57635 83398
4657H3398P474J3676j3598J037M98J7872j1185L041j9640k7947J5172j9489k254
$$ 83398 90872 104548 90950 91987 92485 110357 99172 102213 82573 54626 69798 50309 48055
4644D8055L5105n43r481n223j3285j5560j4276L4892J8232o092O588l5695M997
$$ 48055 83160 82617 73136 67913 54628 39068 24792 59684 77916 71824 78412 42717 47714
4631D7714K4455k0758l8282K99J8680p522L9825K1755J777O559k7436n393k0874
$$ 47714 72169 51411 13129 13428 32108 24586 64411 86166 87943 94502 67066 61673 40799
4618D0799j5914L0464R949N259J67m6311K6134N0850l178l3836j1137L3408M496
$$ 40799 24885 55349 65298 70557 70724 24413 50547 101397 98219 64383 53246 86654 91150
4605I1150K0332l7431l388K2760j4245j9279K4832l885J6719l192k9841k2973
$$ 91150 111482 74051 70663 93423 79178 59899 84731 80846 97565 94373 64532 41559
4593D1559J2061K5615L305r825K0260P29k4830J4951k4898J8085j3832K0140J2878
$$ 41559 53620 79235 82540 72715 92975 93704 68874 83825 58927 77012 63180 83320 96198
4580I6198J3541J3570k3608j9032m463M568J850l5478l512K7859k2057L0382l3352
$$ 96198 109739 123309 99701 80669 76206 80774 82624 47146 43634 71493 49436 79818 46466
4567D6466O548K2644o807n857r771J4465j10J6931K5994k2400n0616n4215K0870
$$ 46466 53014 75658 68851 62994 53223 67688 67578 84509 110503 88103 37487 -16728 4142
4554D142J2934K2860J4462j6837p267J3566J9647j6545j2782K9937K0432K01j6151
$$ 4142 17076 39936 54398 37561 30294 43860 63507 46962 34180 64117 84549 84750 68599
4541F8599l3563l3809J4855Q090K2810R496M3190J548j0968j6519j0042J8519
$$ 68599 35036 1227 16082 24172 46982 56478 99668 101216 90248 73729 63687 82206
4529H2206j0334L1396l813J7522l0074p282l284j6474L0549o615r070J2667j4452
$$ 82206 71872 103268 99455 116977 86903 79621 76337 59863 90412 83797 74727 87394 72942
4516G2942J513J6971l2267q920O3198j4877O500j2287P630J9673R150k5261N928
$$ 72942 74455 91426 59159 50239 113437 98560 105060 92773 100403 120076 129226 103965 109893
4503A09893m5442Q183K1533J3765N808k0942J4278K9665k0588J5082j1730j3458
$$ 109893 64451 72634 94167 107932 113740 92798 107076 136741 116153 131235 119505 106047
4491A06047j1131K8191K3653j4103o060n570L3247Q95J543L425J4361Q433p347
$$ 106047 94916 123107 146760 132657 126597 121027 154274 155169 156712 160137 174498 182931 175584
4478A75584l1969O393m311j6280j8903J1547n330J7418q245M5557L5715k8143
$$ 175584 143615 150008 145697 129417 110514 122061 116731 134149 125904 171461 207176 179033
4466A79033N059K0454O025m6818K6871m917Q779J9655K095o61M4113j3885k6077
$$ 179033 184092 204546 210571 163753 190624 185707 194486 214141 216236 215575 259688 245803 219726
4453B19726J5159J521M6839K4631J5119n976L448j2948Q675R364J8458P65K1741
$$ 219726 234885 236406 283245 307876 322995 317019 320467 307519 316194 325558 344016 344781 366522
4440C66522j9958K5188K2350M389J2794K3921J0024J6157q685k8514L139J1745
$$ 366522 346564 371752 394102 398491 411285 435206 445230 461387 452702 424188 427327 439072
4428D39072L9206L6085Q902K1238K2991J8607j1391J2921K7871M8514K4646K6845
$$ 439072 478278 514363 523265 544503 567494 586101 574710 587631 615502 664016 688662 715507
4416G15507L9612o039L7732K5231k2390L8838K6667l298N6067L8103O1126K9462
$$ 715507 755119 749080 786812 812043 789653 828491 855158 851860 907927 946030 1007156 1036618
4404A036618M4182M1349M3665N8519L5692M1854N0708N5545J12927M9718P9918
$$ 1036618 1080800 1122149 1165814 1224333 1260025 1301879 1352587 1408132 1521059 1570777 1650695
4393A650695R9124Q9112J12940J21862J16706J83396K08171K59957L47561K90084
$$ 1650695 1749819 1838931 1951871 2073733 2190439 2373835 2582006 2841963 3189524 3479608
4383C479608L35331L51855L56191K63173K14836K18868L14517M08844N05352N46630
$$ 3479608 3814939 4166794 4522985 4786158 5000994 5219862 5534379 5943223 6448575 6995205
4373F995205M47219K16785O8653N662M0770J84186L00463M37129L85314J04218
$$ 6995205 7442424 7659209 7727862 7733524 7774294 7958480 8258943 8696072 9081386 9185604
4363I185604k28612m84798n15697l86983j77416m0375n3176j00924l43060m95343
$$ 9185604 8956992 8472194 7956497 7569514 7392098 7351723 7298547 7197623 6854563 6359220
4353F359220n56032n08275l93475l18594k04920k41063k75101l43246l63136l76307
$$ 6359220 5803188 5294913 4901438 4582844 4377924 4136861 3861760 3518514 3155378 2779071
4343B779071l20782k18366j85147j54865j07683j13403n4168n2568j15489r2336
$$ 2779071 2458289 2239923 2054776 1899911 1792228 1678825 1624657 1572089 1456600 1364264
4333A364264p5607r7142j07022o6765n4542l6560p7166n6112k2421k1820k3601
$$ 1364264 1288657 1191515 1084493 1017728 963186 926626 849460 793348 770927 749107 725506
4322G25506m1130k7646k049n0842p983l5813k1456j8824n0186K579l3042j6959
$$ 725506 684376 656730 654681 603839 595856 560043 538587 519763 469577 472156 439114 422155
4310D22155j1418R998L286l1625Q14l5574l2738j5693L3502j8504k3807j3154
$$ 422155 410737 420735 424021 392396 393210 357636 324898 309205 342707 324203 300396 287242
4298B87242j05p242k735l0693o1518J9298L5360l3892k3268j377J4078l734j1052
$$ 287242 287137 279895 277160 246467 184949 204247 239607 205715 182447 181070 195148 191414 180362
4285A80362O906L511J74j6364j067o349J5213J4448k3136j6529J4253j8653m1311
$$ 180362 187268 190779 190953 174589 173522 167173 182386 196834 173698 157169 171422 152769 111458
4272A11458L7596K204k0704J1937j2028j6468j7079M4653k4851j8621K2304J2860
$$ 111458 149054 151258 130554 142491 130463 113995 96916 141569 116718 98097 120401 133261
4260A33261J2727k2961m4060O0959M155n3439L490J1588J7190n403k0492L632
$$ 133261 145988 123027 78967 139926 144081 90642 94132 105720 122910 117507 97015 100647
4248A00647k0310k1347K3423o430O731K1151l1748m1257L102K2630J3804k2206
$$ 100647 80337 58990 82413 75983 82714 103865 72117 30860 33962 56592 70396 48190
4236D8190L495J3893R044l8925N313q055j2800J6621K3640p191J5911J4296k2015
$$ 48190 51685 65578 74622 35697 41010 32955 20155 36776 60416 53225 69136 83432 61417
4223F1417n32P977J389j5348J0891j5332P468J4547K1342l8733j7951m2754l204
$$ 61417 60885 68862 70251 54903 65794 50462 57930 72477 93819 55086 37135 -5619 -8823
4210h823L0832J8594L52R109K4868j8852k7549M997K2491j1028M284J419J1562
$$ -8823 22009 40603 40955 50064 74932 56080 28531 33528 56019 44991 49275 50694 62256
4197F2256K6615n155M153m616J4559L3773K4275M2436Q988N2544j480m2066n2935
$$ 62256 88871 83716 87869 83253 97812 131585 155860 198296 207284 259828 258348 216282 163347
4184A63347n710k2121m3755j1042P216k7347K123j7026j9021q809j543j4896N336
$$ 163347 157637 135516 91761 80719 87935 60588 62711 45685 26664 17855 16312 1416 6752
4171F752L383j7502N2315l8118k163J0932K0448j3955j7673j1199K4515n600K670
$$ 6752 10135 -7367 44948 6830 4667 15599 36047 22092 4419 -6780 17735 12135 14805
4158A4805Q255q252Q138M6891j0732j0789J2808l2654j7111l445M693j6254k537
$$ 14805 23060 14808 22946 69837 59105 48316 61124 28470 11359 7914 12607 -3647 -6184
4145f184P203J4221R914k4760j0482j2410J6687J0388j3409N569M436K567k2997
$$ -6184 1019 15240 25154 394 -10088 -22498 -5811 4577 -8832 -3263 1173 3740 -19257
4132a9257J4282K2302j8247j0343K4968R021M168K0838j2476k7366Q234m957L409
$$ -19257 -4975 17327 -920 -11263 13705 22726 26894 47732 35256 7890 16124 11167 14576
4119A4576j9229k7885N69k2241J9263K3001j917J911j1715j5584M1729K4941R51
$$ 14576 -4653 -32538 -31969 -54210 -34947 -11946 -13863 -11952 -23667 -39251 2478 27419 28370
4106B8370M267l2460r692n12K338p627p435P545M849J1055P17Q460N413M069r386
$$ 28370 32637 177 -9515 -10027 -7689 -15316 -22751 -15206 -10357 698 1415 9875 15288 19357 9971
4091I971j8817k524l3244n89L9196l048o482K1327k4000K7624J2846k5454J2698
$$ 9971 -8846 -11370 -44614 -45203 -6007 -9055 -15537 5790 -18210 9414 22260 -3194 9504
4078I504m998k0123L3962L598q983n150K2858m6932n886r03J6099K6519j0283
$$ 9504 4506 -15617 18345 21943 12960 7810 30668 -16264 -22150 -23053 -6954 19565 9282
4065I282q681K767J4245M115K740j3125K2462J6756n43O712l3879N760j1800k7594
$$ 9282 601 3368 17613 21728 24468 11343 33805 50561 50018 56730 22851 28611 16811 -10783
4051a0783L1408K4299k2063j3939J5479p638K9556J225K747J9814j9565q137k9161
$$ -10783 20625 44924 22861 8922 24401 16763 46319 47544 50291 70105 50540 42403 13242
4038A3242r207R100l3203J1409l2948o166K9679N92o136K3104J7130q184j8912
$$ 13242 4035 13135 -20068 -8659 -41607 -47773 -18094 -17502 -23638 -534 16596 8412 -10500
4025a0500j5918K5408L3290Q76J719l9826k3607J4523O763j5371O957l209k5262
$$ -10500 -26418 -1010 32280 33156 34875 -4951 -28558 -14035 -7272 -22643 -15686 -18895 -44157
4012d4157r594N8637J0879k9940p768j5138Q774j0639M3730K4012m5593m1347
$$ -44157 -53751 4886 15765 -14175 -21943 -37081 -28307 -38946 4784 28796 -16797 -58144
4000e8144K3759K3225j1542l821m681r244j3167K6378L676M4454K48j4749m61
$$ -58144 -34385 -11160 -22702 -26523 -31204 -40448 -53615 -27237 -23561 20893 21141 6392 5931
3987E931J1243j5392r823L3478l3640J8170j4324j2462J751L7069j6224L513L465
$$ 5931 17174 1782 -8041 25437 -8203 9967 -4357 -16819 -15068 22001 5777 9290 12755
3974A2755j5758l0401j4651J1131r377K4420m847K9998j1316O794J6567L023r801
$$ 12755 -3003 -33404 -48055 -36924 -46301 -21881 -26728 3270 -8046 -1252 15315 18338 8537
3961H537J4382J4825l3575l5598K0318K6758l7585j5004M258M1536N669n438m014
$$ 8537 22919 37744 4169 -31429 -11111 15647 -21938 -36942 -32684 8852 14521 9083 5069
3948E069q923j9500J1466L1252m4785J0490p540R686M8704j0094k6921J1966n430
$$ 5069 -3854 -23354 -11888 19364 -25421 -14931 -22471 -12785 35919 25825 -1096 10870 5440
3935E440l3574p571o683L4376M882m3219M330L7399K1752m8157L0199r666j1519
$$ 5440 -28134 -35705 -42388 -8012 -3130 -46349 -42019 -4620 17132 -31025 -826 -10492 -22011
3922b2011J3512l0475J2444J3121J3180J3064J3759k7114k1390n232j1111J4862
$$ -22011 -8499 -38974 -26530 -13409 -229 12835 26594 -520 -21910 -27142 -38253 -23391
3910b3391k7J5882K4288l224j3856j2243M906J7081j6282j0287k9462k991M7981
$$ -23391 -23418 -7536 16752 13528 -328 -12571 -7665 9416 -6866 -17153 -46615 -49606 -1625
3897a625k9061L559K0264j3443q059O975K0393J2719R858m1146l341j961l0043
$$ -1625 -30686 -27127 -6863 -20306 -28365 -21390 -997 11722 21580 -19566 -22907 -24868 -54911
3884e4911K0117J3271R301N991J3297M867p386l2250P750k408j2381L0518J9693
$$ -54911 -34794 -21523 -12222 -6231 7066 11933 4547 -27703 -19953 -22361 -34742 -4224 15469
3871A5469k4148O196p568M1519l523l3920M826Q27L148k456l0488R873K5401j3359
$$ 15469 -8679 -2483 -10051 31468 27945 -5975 -1149 -322 2826 370 -30118 -20245 5156 -8203
3857h203j4492k6432J7729J9055j811j9607J1878J0434j5564M101k9159Q818J7611
$$ -8203 -22695 -49127 -31398 -12343 -14154 -33761 -21883 -11449 -27013 -22912 -52071 -43253 -25642
3844b5642O862J0205j0077J0535l733K2169k5708J0452J3259j8346N0198J3861
$$ -25642 -18780 -8575 -18652 -8117 -11850 10319 -15389 -4937 8322 -10024 40174 54035
3832E4035j542l7492k0624Q207j2120j2533M060j5269L252L4004k076J8259k1839
$$ 54035 52493 15001 -5623 2584 -9536 -22069 -18009 -33278 -30026 3978 1902 20161 -1678
3819a678J8996K0129j8131l4849j8733J3708J3417j1997k4374M568K0542J0954
$$ -1678 17318 37447 19316 -15533 -34266 -20558 -7141 -19138 -43512 -38944 -18402 -7448
3807g448j0005Q850K1364j0232j6682J8783Q687j6023k2694p649n568J5954j5037
$$ -7448 -17453 -8603 12761 2529 -14153 4630 13317 -2706 -25400 -33049 -38617 -22663 -37700
3794c7700K3980k1909J204J3019N985P128m0199N347K0254j6035J5163K3164n592
$$ -37700 -13720 -35629 -34425 -21406 -15421 -8293 -48492 -43145 -22891 -38926 -23763 -599 -6191
3781f191l5598o207M386K45L810J1433J0672m0402K869J3422J6778K8340k443
$$ -6191 -41789 -47996 -43610 -43365 -39555 -28122 -17450 -57852 -54983 -41561 -24783 3557 1114
3768A114n5761M469J6652l63J169K4868o979m1108J4791J8510j501o991K8900
$$ 1114 -54647 -50178 -33526 -33889 -32720 -7852 -14831 -55939 -41148 -22638 -24139 -31130 -2230
3755b230J9984M45l3724l9025j876J5843L5604k7291J9247l83M190k2295L6069
$$ -2230 17754 18199 -15525 -54550 -56426 -40583 -4979 -32270 -13023 -13406 -9216 -31511 4558
3742D558L2453j5108j7219l249J0312k8440j0675J900l06J0385k8290J8526L4187
$$ 4558 37011 21903 4684 1435 11747 -16693 -27368 -25468 -25774 -15389 -43679 -25153 9034
3729I034J1221r609r793P572j7380K242P387m941R396j1868k1145K2286j4930
$$ 9034 20255 10646 853 8425 -8955 -6713 674 -4267 5129 -6739 -27884 -5598 -20528
3716b0528l953L816k095L1720r416j6360J4923l4066R295J3497k468j5907j5241
$$ -20528 -24481 -20665 -22760 8960 -456 -16816 -1893 -35959 -26664 -13167 -15635 -31542 -46783
3703d6783K1735J6352j3191k0842L0242J0087O163k451j0179j6309j0607j0256
$$ -46783 -25048 -8696 -21887 -42729 -12487 -2400 3763 1312 -8867 -25176 -35783 -46039
3691d6039L3879J0158j7789j3966p962K9926k3989L1247r059Q578j6537J0707
$$ -46039 -12160 -2002 -19791 -33757 -41719 -11793 -35782 -4535 -13594 -5016 -21553 -10846
3679a0846k048J451j993j8167J4290L5119l2129j9819m16P701m012J1151j0742
$$ -10846 -12894 -11443 -13436 -31603 -17313 17806 -14323 -34142 -34558 -26857 -30869 -19718 -30460
3666c0460m998K4568p308M94J6493k8097k1170l099J8432L0928J7226K0696l4686
$$ -30460 -35458 -10890 -18198 -17704 -1211 -29308 -50478 -53577 -35145 -4217 13009 33705 -981
3653i81L952j7335K4132j7827j7905L246J2964m1946M2909j1592J9274R535j975
$$ -981 2971 -14364 9768 -8059 -25964 -22718 -9754 -51700 -8791 -20383 -1109 8426 6451
3640F451J2639p845m1847N047P810J741K610j6671Q710q672L7251Q885k1016m2505
$$ 6451 19090 11245 -30602 -25555 -17745 -16004 -13394 -30065 -21355 -30027 7224 16109 -4907 -47412
3626d7412K1027Q958o614j586R77J3147r308j8124R561k494M4501O744K113l7216
$$ -47412 -26385 -17427 -24041 -25627 -24650 -11503 -20811 -38935 -29374 -31868 12633 19377 21490 -15726
3612a5726o074n493K5328m255O783j3099K0403J3449r24k6699q205K1771J1552
$$ -15726 -21800 -27293 -1965 -6220 563 -12536 7867 21316 20392 -6307 -14512 7259 18811
3599A8811K909j3898k257k250J2065j8816N872N716k2626k8619J7316k1128K5786
$$ 18811 21720 7822 5565 3315 15380 -3436 2436 8152 -14474 -43093 -25777 -46905 -21119
3586b1119J6759l07J1562P405j0171J5903j5786J9910L291n4514k5393M9643J5939
$$ -21119 -4360 -4667 6895 14300 4129 20032 4246 24156 27447 -27067 -52460 -2817 13122
3573A3122k337K3932k1290j0668P842k08j0610o822Q182j21j7334m900k5542J6253
$$ 13122 10785 34717 13427 2759 10601 10393 -217 -7039 1143 1022 -16312 -21212 -46754 -30501
3559c0501K0529K6049p541p805J7954j407L658Q140q237Q729k7055k083p017M979
$$ -30501 -9972 16077 8536 731 18685 17278 20936 29076 20839 29568 2513 430 -6587 -1608
3545a608n256R591K5264k952K7934k3228k6997n002K4936j1627m014l400J3860
$$ -1608 -6864 2727 27991 25039 52973 29745 2748 -2254 22682 11055 7041 3641 17501
3532A7501k4756r652J2366m076k102J3909r871L2457l2090l6535j2270P186K0683
$$ 17501 -7255 -16907 -4541 -8617 -10719 3190 -6681 25776 -6314 -42849 -55119 -47933 -27250
3519b7250k942M0027k359n276j4637p285M6861J3944j9239J0086J9998r178m2245
$$ -27250 -30192 9835 7476 2200 -12437 -19722 27139 41083 21844 31930 51928 42750 505
3506E05N194M1897k6413n1349K8116K2424k6039j9840P3591O490j9659l222j4702
$$ 505 5699 47596 21183 -30166 -2050 20374 -5665 -25505 48086 54576 34917 31695 16993
3493A6993j2210q813L7607k748o871j6759m3279J2242J7687L5529k5186j1436
$$ 16993 4783 -4030 33577 30829 23958 7199 -36080 -23838 -6151 29378 4192 -7244
3481g244n061m347K2989j9761K6770k0642J9656R43l482R261J0842J1635j9642
$$ -7244 -12305 -16652 6337 -13424 13346 -7296 12360 13303 9821 19082 29924 41559 21917
3468B1917K1495n5184j5171J8586k0860M0371M310j5618K2310o961j0001m3551
$$ 21917 43412 -11772 -26943 -8357 -29217 11154 15464 -154 22156 15195 5194 -38357
3456c8357l589J7149J7354N994k3447R935J7284P85J5344j9116j5837j0905J681
$$ -38357 -41946 -24797 -7443 -1449 -24896 -14961 2323 3108 18452 -664 -16501 -27406 -25725
3443b5725p222j6234K2900K0565l26q729M553K1169K0968k0056j7741j2483R955
$$ -25725 -32947 -49181 -26281 -5716 -6042 -14771 -10218 10951 31919 11863 -5878 -18361 -8406
3430h406Q711J9833l0628J6100k4856j577K6109K125m646k007J9939K0255k1468
$$ -8406 305 20138 -10490 5610 -19246 -20823 5286 7411 2765 758 20697 40952 19484
3417A9484k3184L985N474j9958K2608m782j061k0817R469N292j2795L825j3733
$$ 19484 -3700 285 5759 -14199 8409 3627 2566 -18251 -8782 -3490 -16285 -12460 -26193
3404b6193j6350J2946J0755l4300J5082J934M4026m5823J9271J5044K237L29J1836
$$ -26193 -42543 -29597 -18842 -53142 -38060 -36126 7900 -37923 -18652 -3608 -1371 -1042 10794
3391A0794l0233p732J9990L0287l631k5709J389J0621j2107p928k2106K0903j1388
$$ 10794 -19439 -27171 -7181 23106 19475 -6234 -4845 5776 -6331 -14259 -36365 -15462 -26850
3378b6850Q741K0321l4659P563O476q139R269J0627R630J1105q00l2107l0655
$$ -26850 -18109 2212 -32447 -24884 -18408 -26547 -17278 -6651 2979 14084 13284 -18823 -49478
3365d9478L4481J1268j5221J5993L8344k9760k2773J8013p440r048J0215K4213
$$ -49478 -14997 -3729 -18950 -2957 35387 5627 -17146 867 -6573 -15621 -5406 18807
3353A8807j2731Q968L689l3169J7336K0980r200n6732R926L0328J7543N266l0549
$$ 18807 6076 15044 18733 -14436 2900 23880 14680 -42052 -32126 -1798 15745 21011 -9538
3340i538J3543m783J351K8283j2779j2551K218m466R369K7595j7812P343l952
$$ -9538 4005 -778 573 28856 16077 3526 5744 1278 10647 38242 20430 27773 23821
3327B3821k9238l3221O4J8223Q22j2473K5559k720l852K5372j103j6187J9844
$$ 23821 -5417 -38638 -38574 -20351 -19529 -32002 -6443 -9163 -13015 12357 11254 -4933 14911
3314A4911O06k4383j0623K5183j6244M934k3773j7737P833j6662L7658n49j9904
$$ 14911 15517 -8866 -19489 5694 -10550 -5616 -29389 -47126 -39293 -55955 -18297 -18846 -38750
3301c8750L4092K0586j2393j7689L4518k5189m0368M2007K4217Q60J4426Q816
$$ -38750 -4658 15928 3535 -14154 20364 -4825 -45193 -3186 21031 21891 36317 45133
3289D5133l2762R944l4125j0936k160M674K0458L6711k0946k4513n359q373P607
$$ 45133 12371 22315 -11810 -22746 -24906 -20232 226 36937 15991 -8522 -13881 -22254 -14647
3276a4647J5660n340O880J0059r255k4912J8591L5519O62r59r580j2032l0240
$$ -14647 1013 -4327 2553 12612 3357 -21555 -2964 32555 33217 32258 22678 10646 -19594
3263a9594O051o893K628l5226J9797L9376r363L3545p924p406J4133j8803o153
$$ -19594 -13543 -20436 -17808 -53034 -33237 6139 -3224 30321 22397 14991 29124 10321 4168
3250D168r815K8935j719l863J2990j5463l009j0191j627n733m2529M715J9630
$$ 4168 -5647 23288 21569 17706 30696 15233 12224 2033 406 -5327 -47856 -43141 -23511
3237b3511K0114K2645J6835P043j9626J4344k1057J9049K5959K16k350J4260k9464
$$ -23511 -3397 19248 36083 43126 23500 37844 16787 35836 61795 62011 59661 73921 44457
3224D4457m6600P397O333K0505j2014J4109R472m408L8791k6696j9898L4668k5078
$$ 44457 -2143 5254 11587 32092 20078 34187 43659 39251 78042 51346 31448 66116 41038
3211D1038l1500K705L6745k0182j9998K3079J8224j6735k2965J3753K0143O997
$$ 41038 9538 12243 48988 28806 8808 31887 50111 33376 10411 24164 44307 51304
3199E1304k5360N4495m704l6449J719n491J7250Q965J7663J1266K817J3514j0496
$$ 51304 25944 80439 75735 39286 41005 35514 52764 61729 79392 90658 93475 106989 96493
3186I6493K1223j6446k2531M6151j4258Q68K881K6150L4005j7646J1648k0797
$$ 96493 117716 101270 78739 124890 110632 111500 114381 140531 174536 156890 168538 147741
3174A47741l5781j3648J5760J8332m8680Q313L3036m1874R556K1445m3933J1301
$$ 147741 111960 98312 114072 132404 83724 92037 125073 83199 92755 114200 70267 81568
3162H1568k1659k4226M4789Q610l854j1592k1906J2539j1967j3410L195j7118
$$ 81568 59909 35683 80472 89082 85228 73636 51730 64269 52302 38892 42087 24969
3150B4969q281J6347n884l1463J4063k4110N2005M8854j2852k3470r907J1156
$$ 24969 16688 33035 27151 -4312 9751 -14359 37646 86500 73648 50178 40271 51427
3138E1427L217l134k2503K1974m855R22k0112r050L0644l168j2228l1160K0501
$$ 51427 54644 51510 29007 50981 46126 47048 26936 17886 48530 45362 33134 1974 22475
3125B2475K3047J4992j1411p960q848M0575k4376j3027K862j888K0039N0305J6740
$$ 22475 45522 60514 49103 41143 32295 72870 48494 35467 38329 36441 56480 106785 123525
3112A23525o866J7402k7669m754j631r015K3533k4039k7058M2966J0797l0943
$$ 123525 116659 134061 106392 101638 100007 90992 114525 90486 63428 106394 117191 86248
3100H6248k0545K0394k6400m4810K8800k4819m2929j3619K6697J4910o522M3683
$$ 86248 65703 86097 59697 14887 43687 18868 -24061 -37680 -10983 3927 -2595 41088
3088D1088Q015R544m3447j7754j6154K1902P768m879q704K3751K88J9643l5577
$$ 41088 49103 58647 15200 -2554 -18708 3194 10962 6083 -2621 21130 21418 41061 5484
3075E484k6721L9018k0415k5191K0611k7616J1588M4605P787M413J4547k9989
$$ 5484 -21237 17781 -2634 -27825 -7214 -34830 -23242 21363 29150 33563 48110 18121
3063A8121k4423O455J4587O0370k3261o442l5667M142L5805k4058k4016m658J1285
$$ 18121 -6302 153 14740 75110 51849 45407 9740 13882 49687 25629 1613 -3045 8240
3050H240m381L120j8890j985K318N1165R537m7144j6362K6329k0875j6058J3142
$$ 8240 3859 6979 -11911 -13896 -11578 39587 49124 1980 -14382 11947 -8928 -24986 -11844
3037a1844K4864r97r473J576n934P174l724k6908j7885M3066j72k962J0322J1178
$$ -11844 13020 12023 2550 4126 -1808 5366 1642 -25266 -43151 -85 -257 -3219 7103 18281
3023A8281l5762n799O763J3916J5588J025l2113K287J2720K8581J9850k9957j7959
$$ 18281 -17481 -23280 -16517 -2601 12987 14012 -18101 -15814 -3094 25487 45337 15380 -2579
3010b579l144j1047p25r375J1658O3843j8271k0928j2547j6061P399J0261L2354
$$ -2579 -5723 -16770 -17495 -26870 -15212 48631 30360 9432 -3115 -19176 -11777 -1516 30838
2997C0838j1424q926M6852J3881k0042k4035O840k3802K0318R890r841k1794j3243
$$ 30838 19414 10488 57340 71221 51179 27144 33984 10182 30500 40390 30549 8755 -4488
2984d488k1776r859J8740j0698K3586K472j0980k3697J1472L3619P996r054q549
$$ -4488 -26264 -36123 -17383 -28081 -4495 -2023 -13003 -36700 -25228 8391 16387 7333 -1216
2971a216k2414K6555J2445j4619R140J5548j8531J3882P376k2104k387L5318j7234
$$ -1216 -23630 2925 15370 751 9891 25439 6908 20790 28166 6062 3675 38993 21759
2958B1759O630J3464j8382j4114L931k0195J9540Q283o946k4890l537j6658P475
$$ 21759 28389 41853 23471 9357 13288 -6907 12633 20916 13970 -10920 -14457 -31115 -23640
2945b3640M257r365K8083q905K3690j4285K0313L152m229m114L162k0365P156
$$ -23640 -19383 -28748 -665 -9570 14120 -165 20148 23300 19071 14957 18119 -2246 4910
2932D910j5853j643q362K1133J4374k0595K1285Q097J937J5132j2571L4R895l9734
$$ 4910 -10943 -12586 -20948 185 14559 -6036 15249 23346 25283 40415 27844 27878 37773 -1961
2918a961K5119j0640Q143r851j6228k822j0133K224O999J7633k8095k7533K2287
$$ -1961 23158 12518 20661 10810 -5418 -8240 -18373 -16149 -9150 8483 -19612 -47145 -24858
2905b4858K4836q235J4009j7644J0916J5603L819j3092M331j0360n73j0574j81
$$ -24858 -22 -8257 5752 -11892 -976 14627 18446 5354 9685 -675 -1248 -11822 -12003
2892a2003K7011r675J4519K9209n1946r170K1321J5296K0411l552J2339k0158
$$ -12003 15008 5333 19852 49061 -2885 -12055 9266 24562 44973 41421 53760 33602
2880C3602k0875K1742j8785j824J9998k602K039k3094P203O701k419o157J6890
$$ 33602 12727 34469 15684 13860 33858 31256 33295 10201 17404 24105 21686 15529 32419
2867C2419p894n760j9944J4992J262J2986Q648M567l9596q587l83K7079K2047
$$ 32419 24525 18765 -1179 13813 15075 28061 36709 41276 1680 -6907 -7290 19789 41836
2854D1836j5557K4292l3116j6882M7527J8000l1621k7183J24J0909K4460K6249
$$ 41836 26279 50571 17455 573 48100 66100 34479 7296 7420 18329 42789 69038
2842F9038J304l1759m0457m145n317K1022j579M8073n275k2022j8082R440J1185
$$ 69038 70342 38583 -1874 -6019 -11336 9686 8107 56180 50905 28883 10801 20241 31426
2829C1426j3030M6372k4412k6468J5482p364K4823K793k3530l0008l630J43J2699
$$ 31426 18396 64768 40356 13888 29370 22006 46829 49622 26092 -3916 -7546 -7403 5296
2816E296K411l556J261j3820J071K1346L2118l2353k9026K5169L598j1963J8573
$$ 5296 7707 4151 5412 -8408 -7337 14009 46127 13774 -15252 9917 13515 1552 20125
2803B0125k8194P27K6358J5274N782j7975J9116k6508J0909N081l3540m697j6757
$$ 20125 -8069 -7342 19016 34290 40072 22097 41213 14705 25614 30695 -2845 -7542 -24299
2790b4299J6980J2662j2347M083o748r078k4156M3630J6569o217J1418J3645k275
$$ -24299 -7319 5343 -7004 -2921 -9669 -18747 -42903 727 17296 11079 22497 36142 33867
2777C3867p563j5519N041J1091k0009n175j8230R925M076J3873j2158O21J6083
$$ 33867 26304 10785 15826 26917 6908 1733 -16497 -6572 -2496 11377 -781 -160 15923
2764A5923n097N550j936J2771r353J171j2565R712K8142p634j3684n356j5176
$$ 15923 10826 16376 14440 27211 17858 19029 6464 16176 44318 36684 23000 17644 2468
2751B468Q819O893m2543Q523K2443K4083k9732L475L021o555j433J3702p778P658
$$ 2468 11287 18180 -24363 -15840 6603 30686 954 4429 7450 895 -538 13164 5386 13044
2737A3044j41L008j2227J8337K0686n3683L464Q658Q766k6120j1711J0499K2150
$$ 13044 12903 15911 3684 22021 42707 -10976 -7512 1146 9912 -16208 -27919 -17420 4730
2724D730j7958p286J3289m2496J2382J8003M343o291l2295K4124J5620P756K6246
$$ 4730 -13228 -20514 -7225 -49721 -37339 -19336 -14993 -21284 -53579 -29455 -13835 -6079 20167
2711B0167j7233J5721p208k1248O271j0531j1281K5031j0108j5940K3230L7438
$$ 20167 2934 18655 11447 -9801 -3530 -14061 -25342 -311 -10419 -26359 -3129 34309
2699C4309k9915r768J5372j8073j7215J449K3557j9081j8278j453M806j0876L9171
$$ 34309 4394 -5374 9998 -8075 -25290 -23841 -284 -19365 -37643 -39096 -34290 -45166 -5995
2686e995p550j8049o2k3992K1567L7275O923k7438J1948j0790P584L267K179m114
$$ -5995 -13545 -31594 -31656 -55648 -34081 3194 10117 -17321 -5373 -16163 -8579 -5312 -3133 -7247
2672g247K1411k5486k3152K7711Q155L662M783J4767k5274L839K7184k3233k1566
$$ -7247 14164 -11322 -34474 -6763 1392 5054 9837 24604 -670 3169 30353 7120 -14446
2659a4446l333n696l240o622j1494K2596M638K7764k4907n533L8599j8351J2190
$$ -14446 -17779 -23475 -26715 -33337 -44831 -22235 -17597 10167 -14740 -20273 18326 -25 12165
2646A2165l0236N470Q780J0780O032j9135k2683N7078q327l2781M5514j9231k9611
$$ 12165 -18071 -12601 -3821 6959 12991 -6144 -28827 28251 19924 -12857 32657 13426 -16185
2633a6185Q585J3700J2501k5329O113L0904k9838l3281j0884j0171L805K5712
$$ -16185 -7600 6100 18601 -6728 -615 30289 451 -32830 -43714 -53885 -50080 -24368
2621b4368j8567j5774K0698m014J1814J4170L2755k3633j3223J4795j2886M834
$$ -24368 -42935 -58709 -38011 -42025 -30211 -16041 16714 -6919 -20142 -5347 -18233 -13399
2609a3399J8867L733j0368l0305K0193k705m795k578J8053r088l529l0600k2458
$$ -13399 5468 9201 -1167 -31472 -11279 -13984 -18779 -21357 -3304 -12392 -15921 -46521 -68979
2596f8979O042M6584L4660j6249K3378j5661k4885O432J3160k8076k3892k3669
$$ -68979 -62937 -16353 18307 2058 25436 9775 -15110 -8678 4482 -23594 -47486 -71155
2584g1155J168K1885K8612J8926j0077l5995L1681K5146j0072J6551k7418m0667
$$ -71155 -69987 -48102 -19490 -564 -10641 -46636 -14955 10191 119 16670 -10748 -51415
2572e1415M8593K533r878L1463p365l5493k222P295j1154L7520l5956N599J3990
$$ -51415 -2822 -289 -10167 21296 13931 -21562 -23784 -16489 -27643 9877 -26079 -20480 -6490
2559f490K954K80k1353K9925k4507J1970K7904k2371k6522J3538J8053K0417j4653
$$ -6490 -3536 -3256 -24609 5316 -19191 -7221 20683 -1688 -28210 -14672 3381 23798 9145
2546I145k8826n884l2l709j7708r487R443N5234m153j9625N211j8436k0581K5054
$$ 9145 -19681 -25565 -25597 -29306 -47014 -56501 -47058 8176 4023 -15602 -10391 -28827 -49408 -24354
2532b4354k28J537L1044l311p800q843K5822k093j0880Q824J730j6975k3564n861
$$ -24354 -24582 -23045 7999 4688 -3112 -11955 13867 11774 894 9718 11448 -5527 -29091 -34952
2518c4952J3190k655k3698l3913L4584K4545J5230l1254N804J4368j508r581R9
$$ -34952 -21762 -24417 -48115 -82028 -47444 -22899 -7669 -38923 -33119 -18751 -20259 -29840 -29741
2505b9741j666P513J3891k2540j1175L4601K565Q73K8418N957J890m89l1188j8894
$$ -29741 -31407 -23894 -10003 -32543 -43718 -9117 -6552 -5679 22739 28696 30586 30097 -1091 -19985
2491a9985j9133p227L7p663K9668K2461j6028k7030O528J5289L1051j8076J1860
$$ -19985 -39118 -46345 -46308 -53971 -24303 -1842 -17870 -44900 -38372 -23083 7968 -10108 1752
2478A752J9531k7562j4445n751K4306j037j4223j8401j9171J7323P854p052N525
$$ 1752 21283 -6279 -20724 -26475 -2169 -3206 -17429 -35830 -55001 -37678 -29824 -36876 -31351
2465c1351k0188k3305q925L4960K4794r315K7866j1174K1725k7513J7071j1357
$$ -31351 -51539 -74844 -83769 -48809 -24015 -33330 -5464 -16638 5087 -22426 -5355 -16712
2453a6712r014k1912j496L8212p767J165k972K2668j3348l7504L7685M760k9597
$$ -16712 -25726 -47638 -49134 -10922 -18689 -17524 -20496 2172 -11176 -48680 -10995 -6235 -35832
2440c5832K5743o397p896o651O18K6690R370J107K012k7287J5407J470m1646J3359
$$ -35832 -10089 -16486 -24382 -31033 -30415 -3725 5645 6752 8764 -18523 -3116 -1646 -43292 -29933
2426b9933r22K631R428Q499J4791j346l1480J5795J9605k6174O235q014K763j3937
$$ -29933 -30855 -28224 -18796 -10297 4494 3148 -28332 -12537 7068 -19106 -12871 -20885 -18122 -32059
2412c2059L910J8014L3906j6272k8251J2180l3691o560m466M2520K0585r507q105
$$ -32059 -28149 -10135 23771 7499 -20752 -8572 -42263 -48823 -53289 -10769 9816 309 -7796
2399g796J5047J7418j1983k5611k0036M0156J3824j6695j9127J0245p372K7777
$$ -7796 7251 24669 12686 -12925 -32961 7195 21019 4324 -14803 -4558 -11930 15847
2387A5847Q885j6604j7434j9698J6943J0264r374j1373Q365j6306k3556J928L3200
$$ 15847 24732 8128 -9306 -29004 -12061 -1797 -11171 -22544 -14179 -30485 -54041 -52113 -18913
2374a8913j3411k2660L4613K7644m325l991j7266p788m949j2660J4613R952R469
$$ -18913 -32324 -54984 -20371 7273 2948 -1043 -18309 -26097 -31046 -43706 -29093 -19141 -9672
2361i672O002Q791l9014L6700K0725N58k6741k1438J3903p102m692Q33K6742l1647
$$ -9672 -3670 5121 -33893 2807 23532 24090 -2651 -24089 -10186 -17288 -21980 -21147 5595 -26052
2347b6052k199l149K0519N21J1264j7464j010J1524j175J0533J6680k1340k4217
$$ -26052 -28251 -31400 -10881 -10360 904 -16560 -17570 -6046 -7221 3312 19992 -1348 -25565
2334b5565J4743J097K6729J951j9707L1635k9782m6328J2197J6086J1443k2123
$$ -25565 -10822 -9725 17004 18955 -752 30883 1101 -45227 -33030 -16944 -5501 -27624
2322b7624J3117J6063j7290j8121k722K7986m5384K7289K5728k1116K5733j1692
$$ -27624 -14507 1556 -15734 -33855 -36577 -8591 -53975 -26686 -958 -22074 3659 -8033
2310h033k2507K1993n0691J6998K4447j1051J4491j1175K9938k3321O9o645R676
$$ -8033 -30540 -8547 -59238 -42240 -17793 -28844 -14353 -25528 4410 -18911 -18842 -25487 -15811
2297a5811j6073L5639n86M100J6180k9643m491R208o549j3185J2613l0132M682
$$ -15811 -31884 3755 3169 7269 23449 -6194 -10685 -1477 -8026 -21211 -8598 -38730 -34048
2284c4048J2361J3987r895J6436J9645k4727r567r350M7629l6397j1949K6625
$$ -34048 -21687 -7700 -17595 -1159 18486 -6241 -15808 -25158 22471 -13926 -25875 750
2272G50M2710k2503p753j1890L771J2296k0350p649O481J9594J9226k1254j8221
$$ 750 43460 20957 13204 1314 5085 17381 -2969 -10618 -4137 15457 34683 13429 -4792
2259d792r266l722J5262j5546K81L6599L223n7204q448N2867J4204q861j8548
$$ -4792 -14058 -17780 -2518 -18064 -17783 18816 22039 -35165 -43613 9254 23458 14597 -3951
2246c951k813J7486n06K467L378J6605m0810l2151O160K1488M2522j9262k8647
$$ -3951 -6764 10722 10216 12683 16061 32666 -8144 -40295 -34135 -12647 29875 10613 -18034
2233a8034J9950Q112N00j5628P18r939R271k3500j3993L6770m5392J8788N157
$$ -18034 1916 10028 10528 -5100 -4382 -14321 -5050 -28550 -42543 -5773 -51165 -32377 -27220
2220b7220o474O238p054M6706j6837Q200l207J727j4260K070L957J0028j4645
$$ -27220 -33694 -27456 -34510 12196 -4641 3559 352 2079 -12181 -10111 -6154 3874 -10771
2207a0771k7392o15q851L5607J8488M134l0634J9646N2996m7856J9667j7585Q558
$$ -10771 -38163 -38778 -47629 -12022 6466 10600 -20034 -388 52608 4752 24419 6834 15392
2194A5392k8080J2720J9399j8623j092k5695J6839k306j2368j155j5773L7851
$$ 15392 -12688 32 19431 808 -284 -25979 -9140 -11446 -23814 -24969 -40742 -2891
2182b891n254J0592M909l4579Q137j6300J5786O327K821j1423K6527K6546p150
$$ -2891 -8145 2447 7356 -27223 -19086 -35386 -19600 -13273 -10452 -21875 4652 31198 24048
2169B4048m4350j8414K1773J9511J8656m468l0147k1662L275j4925j3348M6422
$$ 24048 -20302 -38716 -16943 2568 21224 16756 -13391 -35053 -31778 -46703 -60051 -13629
2157a3629N300m047N925L0239r984k4214J107J4898j6533j5661M4364N632l6218
$$ -13629 -8329 -12376 -6451 23788 13804 -10410 -9303 5595 -10938 -26599 17765 23397 -12821
2144a2821j2905J1034M277j4570J1939j6103K4754O652j1345J4922N839j0392
$$ -12821 -25726 -14692 -10415 -24985 -13046 -29149 -4395 2257 -9088 5834 11673 1281
2132A281q416j1613J8153K2322k7232o874l208l202l418O904M85K0591K2199j5776
$$ 1281 -7135 -18748 -595 21727 -5505 -12379 -15587 -18789 -22207 -15303 -14818 5773 27972 12196
2118A2196r618Q867k777O15Q056L1838k3455j6560k5079m468J9828m975P792K2675
$$ 12196 2578 11445 8668 9283 17339 49177 25722 9162 -15917 -20385 -557 -5532 2260 24935
2104B4935n853j5538k965J5018J0928J4568l2684k3871J4118j935K0455m6644
$$ 24935 19082 3544 579 15597 26525 41093 8409 -15462 -1344 -3279 17176 -29468
2092b9468m833K4368N6466m515n3211L0864p426k2331p709K3076O91J9976J0023
$$ -29468 -34301 -9933 46533 42018 -11193 19671 12245 -10086 -17795 5281 5972 25948 35971
2079C5971j0371Q157M851j7370K4195P566k8981j267j476K821o684Q398K9140
$$ 35971 25600 33757 38608 21238 45433 52999 24018 22751 21275 24096 17412 25810 54950
2066E4950j5814L398R39J0053N0872K8001l1643L184M2471M7854n009l4690l3816
$$ 54950 39136 42534 43473 53526 104398 132399 100756 103940 146411 194265 189256 154566 120750
2053A20750p1j6294m2912P351k4416k9797j8527K3029M0610o425l1577J7566r588
$$ 120750 120679 104385 61473 68824 44408 14611 -3916 19113 59723 53298 21721 39287 29699
2040B9699j0471k5034K4263J6454k1897j9632O6561k4487o544J8210m2202K315
$$ 29699 19228 -5806 18457 34911 13014 -6618 59943 35456 28912 47122 4920 7235
2028G235n169L6382L094k4299j7904K6095j7623j9347M5599l4164K0471K444m769
$$ 7235 2066 38448 41542 17243 -661 25434 7811 -11536 34063 -101 20370 22814 18045
2015A8045q729K0883j1504K773J9382l6683m894m825J3858J7339Q02k9736M9264
$$ 18045 9316 30199 18695 21468 40850 4167 -727 -5552 8306 25645 26447 -3289 45975
2002D5975r628k7949l0643m8850J6213K1031L8937J0121k3058J8910L7017k4629
$$ 45975 36347 8398 -22245 -71095 -54882 -33851 5086 15207 -7851 11059 48076 23447
1990B3447L347N032m8775J2630p908p88J2416J2515o263k5694l423j007J9723
$$ 23447 26794 31826 -16949 -4319 -12227 -13015 -599 11916 5653 -20041 -23464 -24471 -4748
1977d748K4775m4916j3754M4206J5417R051j333r479M990q316k2610j6006j9656
$$ -4748 20027 -24889 -38643 5563 20980 30031 28698 19219 24209 15893 -6717 -22723 -42379
1964d2379J3195K7692l6252k3232L2345K4467j968J2218K1769k1997k3576J3459
$$ -42379 -29184 -1492 -37744 -60976 -28631 -4164 -6132 6086 27855 5858 -17718 -4259
1952d259J1566J4129j2320k6276J4627r747P049l137O833J3085P90m0884j6899
$$ -4259 7307 21436 9116 -17160 -2533 -12280 -5231 -8368 -1535 11550 12340 -28544 -45443
1939d5443J2096J1748K2781m362K1296L600l3140m629P218r58J2611m689n210
$$ -45443 -33347 -21599 1182 -3180 18116 21716 -11424 -16053 -8835 -9793 2818 -1871 -7081
1926g081j4218n920j1055M0983J5817q268J4160k9474N647K6723L7397k7324M2
$$ -7081 -21299 -27219 -38274 2709 18526 10258 24418 -5056 591 27314 64711 37387 37429
1913C7429j3437j2305q918k4121J7940j615p987Q86P964k3297P74m677O0239k2285
$$ 37429 23992 11687 2769 -21352 -3412 -5027 -13014 -12128 -4164 -27461 -26687 -31364 28875 6590
1899F590k2735r532n475O991N858l643L2448l112K2767r733k1131J3786J0630
$$ 6590 -16145 -25677 -31152 -24161 -18303 -21946 10502 7390 30157 20424 -707 13079 23709
1886B3709k4740j576J9580k1265K0749q126K0935j3536J581M3066j2618J2402
$$ 23709 -1031 -2607 16973 -4292 16457 8331 29266 15730 17311 60377 47759 60161
1874F0161j2855m6454o567K387O7706N26l6291N674j7001k0280j57J9353L2880
$$ 60161 47306 852 -5715 -3328 64378 64904 28613 34287 17286 -2994 -3151 16202 49082
1861D9082k1242k2463j5992m257J7968J2005Q140J1379m814l8638J0844J4208
$$ 49082 27840 5377 -10615 -14872 3096 15101 23241 34620 29806 -8832 2012 16220
1849A6220j1439j3971r35R248J2715K8024k494j3546j6225m79J0280o299M088
$$ 16220 4781 -9190 -10125 -877 11838 39862 37368 23822 7597 7118 17398 11099 15187
1836A5187j7597n2539L2994j962j001J3596j3313J0434J488j120K826N563J5936
$$ 15187 -2410 -54949 -21955 -23917 -24918 -11322 -24635 -14201 -12713 -13833 -11007 -5444 10492
1823A0492j0132j1178J844K0865J8839k8727k0081j265Q999p491P904K2407j4448
$$ 10492 360 -10818 -8974 11891 30730 2003 -18078 -19343 -10344 -17835 -9931 12476 -1972
1810a972J3357r139j987p264K998J047R882k5552l360K0251j5871J2383O105J9116
$$ -1972 11385 2246 259 -7005 -4007 -2960 6922 -18630 -21990 -1739 -17610 -5227 878 19994
1796A9994k6104J8200J1320l4994K0318k3499k4409K7059M2032k1000M367r485
$$ 19994 -6110 12090 23410 -11584 8734 -14765 -39174 -12115 29917 8917 13284 3799
1784C799k2856J6014p906M773O981j788j5120K8161J5350n0903K1296R592L944
$$ 3799 -19057 -3043 -10949 -6176 805 -983 -16103 12058 27408 -23495 -2199 7393 11337
1771A1337k7040j3605j1490J1010K4138j1832L8875j8783j0818j1167K7533K1325
$$ 11337 -15703 -29308 -40798 -29788 -5650 -17482 21393 2610 -8208 -19375 8158 29483
1759B9483n224m1409j0304M2397J0510k2531j646o432l0030J7219j2799M530J9623
$$ 29483 24259 -17150 -27454 14943 25453 2922 1276 -5156 -35186 -17967 -30766 -26236 -6613
1746f613K6157n257J4612K5502m623k3340o706k4585Q590k2988p126Q210M2579
$$ -6613 19544 14287 28899 54401 49778 26438 19732 -4853 3737 -19251 -26377 -18167 24412
$$ [...]
##END NTUPLES=NMR SPECTRUM
##END=
