##TITLE=1H_EC-3389(II-4)
 200.13Hz, CDCl3.
 8 sc
 24.8.2026
##JCAMPDX= 6.0         $$ Bruker NMR JCAMP-DX V2.0
##DATA TYPE= NMR SPECTRUM
##DATA CLASS= NTUPLES
##ORIGIN= UXNMR, Bruker Analytische Messtechnik GmbH
##OWNER= pz
$$ XWIN-NMR		Version 3.5
$$ Mon Aug 24 13:40:56 2026 Russian Standard Time (UT+4h)  she@DPX200
##.OBSERVE FREQUENCY= 200.1313
##.OBSERVE NUCLEUS= ^1H
##.ACQUISITION MODE= SIMULTANEOUS
##.ACQUISITION SCHEME= undefined
##.AVERAGES= 8
##.DIGITISER RES= 18
##SPECTROMETER/DATA SYSTEM= spect
##.PULSE SEQUENCE= zg30
##.SOLVENT NAME= CDCl3
##.SHIFT REFERENCE= (INTERNAL, CDCl3, 0, 15.5199)
##AUDIT TRAIL= $$ (NUMBER, WHEN, WHO, WHERE, WHAT)
$$ ##TITLE= Audit trail, XWIN-NMR		Version 3.5
$$ ##JCAMPDX= 5.01
$$ ##ORIGIN= Bruker BioSpin GmbH
$$ ##OWNER= she
$$ F:/spectra/data/she/nmr/H-C/1/pdata/1/auditp.txt
$$ ##AUDIT TRAIL=  $$ (NUMBER, WHEN, WHO, WHERE, WHAT)
(   1,<2026-08-24 13:39:34.51 +0400>,<she>,<DPX200>,
      <created by zg, POWCHK disabled, PULCHK disabled
       configuration hash MD5:
       00 E9 B6 7A A2 85 ED C7 34 08 36 98 17 FE 4E 26
       data hash MD5: 16K
       26 98 A9 1E BD AF 7C B6 FD D3 FD 3C 21 C8 1F 5A>)
(   2,<2026-08-24 13:39:36.98 +0400>,<she>,<DPX200>,
      <Start of raw data processing
       efp BC_mod = 2 LB = 0.25 FT_mod = 6 PKNL = 1 PHC0 = -4578.926 PHC1 = 9.792299 SI = 16K 
       data hash MD5: 16K
       59 49 05 EB 2D D6 D5 A7 EA A2 8D C3 91 9D 38 8E>)
(   3,<2026-08-24 13:39:55.39 +0400>,<she>,<DPX200>,
      <pk PHC0 = 1.527629 PHC1 = -2.4 
       data hash MD5: 16K
       D5 A0 E7 5F 9B 50 97 DA 6C C3 A6 46 A3 D3 B4 4E>)
(   4,<2026-08-24 13:40:01.35 +0400>,<she>,<DPX200>,
      <abs ABSG = 5 
       data hash MD5: 16K
       99 EC 87 B4 C2 12 D7 6E 62 1C 17 2B 0A C3 27 D8>)
$$ ##END=
$$ 
$$ hash MD5
$$ 82 83 E3 67 31 0F 97 6D 8C 45 74 AC 39 6C 83 63
##$RELAX= 
##$RELAX= 
##$RELAX= 
##$RELAX= 
##$RELAX= 
##$RELAX= 
$$ Bruker specific parameters
$$ --------------------------
##$DU= <F:/spectra>
##$EXPNO= 1
##$NAME= <H-C>
##$PROCNO= 1
##$TYPE= <nmr>
##$USER= <she>
##$AMP= (0..31)
100 100 100 100 100 100 100 100 100 100 100 100 100 100 100 100 100 100 
100 100 100 100 100 100 100 100 100 100 100 100 100 100 
##$AQSEQ= 0
##$AQ_mod= 1
##$AUNM= <au_zg>
##$AUTOPOS= <>
##$BF1= 200.13
##$BF2= 200.13
##$BF3= 200.13
##$BF4= 200.13
##$BF5= 200.13
##$BF6= 200.13
##$BF7= 200.13
##$BF8= 200.13
##$BYTORDA= 1
##$CFDGTYP= 0
##$CFRGTYP= 5
##$CHEMSTR= <none>
##$CNST= (0..31)
1 1 145 1 1 1 1 1 1 1 1 1 1 1 1 1 1 1 1 1 1 1 1 1 1 1 1 1 1 1 1 1 
##$CPDPRG= <>
##$CPDPRG1= <>
##$CPDPRG2= <>
##$CPDPRG3= <>
##$CPDPRG4= <mlev>
##$CPDPRG5= <mlev>
##$CPDPRG6= <mlev>
##$CPDPRG7= <mlev>
##$CPDPRG8= <mlev>
##$CPDPRGB= <>
##$CPDPRGT= <>
##$D= (0..31)
0 0.7 0 0 0 0 0 0 0 0 0 0.03 0 0 0 0 0 0 0 0 0 0 0 0 0 0 0 0 0 0 0 0 
##$DATE= 1787564373
##$DBL= (0..7)
120 120 120 120 120 120 120 120 
##$DBP= (0..7)
150 150 150 150 150 150 150 150 
##$DBP07= 0
##$DBPNAM0= <>
##$DBPNAM1= <>
##$DBPNAM2= <>
##$DBPNAM3= <>
##$DBPNAM4= <>
$$ [...]
##$SUBNAM3= <"">
##$SUBNAM4= <"">
##$SUBNAM5= <"">
##$SUBNAM6= <"">
##$SUBNAM7= <"">
##$SUBNAM8= <"">
##$SUBNAM9= <"">
##$SW= 18.0517328524113
##$SWIBOX= (0..15)
0 0 2 0 0 0 0 0 0 0 0 0 0 0 0 0 
##$SW_h= 3612.71676300578
##$TD= 16384
##$TD0= 1
##$TE= 0
##$TE2= 300
##$TE3= 300
##$TEG= 300
##$TL= (0..7)
0 120 120 120 120 120 120 120 
##$TP= (0..7)
150 150 150 150 150 150 150 150 
##$TP07= 0
##$TPNAME0= <>
##$TPNAME1= <>
##$TPNAME2= <>
##$TPNAME3= <>
##$TPNAME4= <>
##$TPNAME5= <>
##$TPNAME6= <>
##$TPNAME7= <>
##$TPOAL= (0..7)
0.5 0.5 0.5 0.5 0.5 0.5 0.5 0.5 
##$TPOFFS= (0..7)
0 0 0 0 0 0 0 0 
##$TUNHIN= 0
##$TUNHOUT= 0
##$TUNXOUT= 0
##$USERA1= <user>
##$USERA2= <user>
##$USERA3= <user>
##$USERA4= <user>
##$USERA5= <user>
##$V9= 5
##$VALIST= <valist>
##$VCLIST= <CCCCCCCCCCCCCCC>
##$VD= 0
##$VDLIST= <DDDDDDDDDDDDDDD>
##$VPLIST= <PPPPPPPPPPPPPPP>
##$VTLIST= <TTTTTTTTTTTTTTT>
##$WBST= 1024
##$WBSW= 4
##$XGAIN= (0..3)
0 0 0 0 
##$XL= 0
##$YL= 0
##$YMAX_a= 764978
##$YMIN_a= -785435
##$ZGOPTNS= <>
##$ZL1= 120
##$ZL2= 120
##$ZL3= 120
##$ZL4= 120
##$ABSF1= 15.48797
##$ABSF2= -2.563879
##$ABSG= 5
##$ABSL= 3
##$ALPHA= 0
##$AQORDER= 0
##$ASSFAC= 0
##$ASSFACI= 0
##$ASSFACX= 0
##$ASSWID= 0
##$AUNMP= <proc_1d>
##$AZFE= 0.1
##$AZFW= 0.1
##$BCFW= 0
##$BC_mod= 2
##$BYTORDP= 0
##$COROFFS= 0
##$CY= -3
##$DATMOD= 1
##$DC= 0
##$DFILT= <>
##$DTYPP= 0
##$F1P= 0
##$F2P= 0
##$FCOR= 1
##$FTSIZE= 16384
##$FT_mod= 6
##$GAMMA= 0
##$GB= 0
##$INTBC= 1
##$INTSCL= 3.241238e-09
##$ISEN= 128
##$LB= 0.25
##$LEV0= 0
##$LPBIN= 0
##$MAXI= 10000
##$MC2= 0
##$MEAN= 0
##$ME_mod= 0
##$MI= 1.114404
##$NCOEF= 0
##$NC_proc= -5
##$NLEV= 6
##$NOISF1= 3.799351
##$NOISF2= 2.8
##$NSP= 0
##$NTH_PI= 0
##$NZP= 0
##$OFFSET= 15.51992
##$PC= 1
##$PHC0= -4577.398
##$PHC1= 7.392299
##$PH_mod= 1
##$PKNL= yes
##$PPARMOD= 0
##$PSCAL= 0
##$PSIGN= 0
##$REVERSE= no
##$SF= 200.130000357603
##$SI= 16384
##$SIGF1= 3
##$SIGF2= 2
##$SINO= 0.751879
##$SIOLD= 32768
##$SREGLST= <19F.Aceton>
##$SSB= 0
##$STSI= 16384
##$STSR= 0
##$SW_p= 3612.71676300578
##$SYMM= 0
##$S_DEV= 0
##$TDeff= 16384
##$TDoff= 0
##$TI= <>
##$TILT= no
##$TM1= 0
##$TM2= 0
##$TOPLEV= 0
##$USERP1= <user>
##$USERP2= <user>
##$USERP3= <user>
##$USERP4= <user>
##$USERP5= <user>
##$WDW= 1
##$XDIM= 16384
##$YMAX_p= 364599368
##$YMIN_p= -370637
$$ End of Bruker specific parameters
$$ ---------------------------------
##NTUPLES= NMR SPECTRUM
##VAR_NAME=  FREQUENCY,     SPECTRUM/REAL,   SPECTRUM/IMAG
##SYMBOL=    X,             R,               I
##VAR_TYPE=  INDEPENDENT,   DEPENDENT,       DEPENDENT
##VAR_FORM=  AFFN,          ASDF,            ASDF
##VAR_DIM=   16384,         16384,           16384
##UNITS=     HZ,            ARBITRARY UNITS, ARBITRARY UNITS
##FACTOR=    0.220516191357247, 1,           1
##FIRST=     3106.00166501957, 0,            0
##LAST=      -506.715097986206, 0,           0
##MIN=       -506.715097986206, -370637,     0
##MAX=       3106.00166501957, 364599368,    0
$$ Real data points
##PAGE= N=1
##DATA TABLE= (X++(R..R)), XYDATA
$$ [...]
6740D11624J0026L9185R922M6174M635J1772M3066j8240K5615k4188j6661m6854
6728D96076K2809J455L7651L5049k3923Q4050L5991n7483J1150M0587l74O1551
6716G44589N7014m1766r371j8052N8790Q374L9564N3714L068m0893M5011M2878
6704I42920J18708J3468k4732K6752J6401J4997N9693O5439j8646j3240J3027
6693A214787J11774k331R2866J1608K1543l852K6509N5109L4108M2855J0191K0239
6681A635406L6877M6293K7549L1436l8491M3520N9309l6544k642R2570N6519j5700
6669A936102J1477L8459l5773m8361K5182l9955k94O8085l6482j8672O2342j6296
6657A945814O694k7805O059j5203M1778P1370J1959k6781p5631L9148J5528j7553
$$ plain form
6740 411624 421650 460835 470757 516931 521566 533338 576404 558164 583779 559591 542930 496076
6728 496076 518885 520340 557991 593040 569117 653167 689158 631675 642825 683412 683038 744589
6716 744589 801603 759837 750466 732414 791204 799578 839142 892856 895924 855031 900042 942920
6704 942920 1061628 1075096 1050364 1077116 1093517 1108514 1168207 1233646 1215000 1201760 1214787
6693 1214787 1326561 1324230 1417096 1428704 1450247 1446395 1472904 1528013 1562121 1604976 1615167 1635406
6681 1635406 1672283 1718576 1746125 1777561 1739070 1782590 1841899 1805355 1802713 1895283 1951802 1936102
6669 1936102 1947579 1986038 1950265 1901904 1927086 1887131 1886837 1954922 1918440 1899768 1962110 1945814
6657 1945814 1952508 1924703 1930762 1915559 1957337 2028707 2040666 2013885 1938254 1977402 1992930 1975377
6645A975377K7345l5864j4030l2536P5375j7223k899J0170J0996m9772K3373P5534
6633B045846n97m2767J7152J6249k7087j1521r6109n918K4407N4844L5684K2975
6621B033158J1607m687k1820j0754n6492n0833K1246p419j9854m7384j8606l8834
6609A789328q923K1362k0943L8654k8614J237N357j4725l1033L8102N9073m9274
6597A799601m1843L191J5557n8927k4485J2525j8074o7457l906N8752k0992r441
6585A644501N6002M5000M315J1302o7783j939k5271N0596j0830K5027O4656J3957
6573A809533J328p8827P76N9477l1904L5243L5693l0347O2253O0935l779L3132
6561A953513K4478O6510N6770Q0603j4180j1873M0905J6108O8703P2403J3296
$$ plain form
6645 1975377 2002722 1966858 1952828 1920292 1995667 1978444 1975545 1985715 1996711 1946939 1970312 2045846
6633 2045846 2045249 2002482 2019634 2035883 2008796 1997275 1901166 1895248 1919655 1974499 2010183 2033158
6621 2033158 2044765 2040078 2018258 2007504 1951012 1900179 1921425 1914006 1894152 1846768 1828162 1789328
6609 1789328 1780405 1801767 1780824 1819478 1790864 1792101 1797458 1782733 1751700 1789802 1848875 1799601
6597 1799601 1757758 1760949 1776506 1717579 1693094 1705619 1687545 1620088 1616182 1674934 1653942 1644501
6585 1644501 1700503 1745503 1749818 1761120 1693337 1691398 1666127 1716723 1705893 1730920 1795576 1809533
6573 1809533 1810861 1732034 1732810 1792287 1760383 1795626 1831319 1800972 1863225 1924160 1920381 1953513
6561 1953513 1977991 2044501 2101271 2181874 2167694 2155821 2196726 2212834 2281537 2353940 2367236
6550B367236M0060O2778O3573O2693M9545M0851N5838J14338P4917M7805P9806
6539C059440P5392M2013R6529N4764Q9611J50235R7154K3889Q5010M5032j2485
6528C806584J9289n198l1403L1237k5253l4427o9741j2778o4732q8981n0276p6390
6516C397931q8457j62144o1982m7064j60530q4574j06205r4169q2544j16756r3162
6505B300344q2199l8377r2073j01649o4589p6596l1359o6255j28387m6486q073
6494A564301p7811j29593k271J5315j7230r4817p0265k1867k570o0879l61j3291
6482A088661n3411p7382k1241K5575k4047l2557j1781o582j3244o3433j9790P426
6470G98194k9478k7787O1404J0787j05452J4882n2280j0378n4569q291N931k578
$$ plain form
6550 2367236 2407296 2470074 2533647 2596340 2645885 2686736 2742574 2856912 2931829 2979634 3059440
6539 3059440 3134832 3176845 3273374 3328138 3417749 3567984 3665138 3689027 3774037 3819069 3806584
6528 3806584 3825873 3820675 3789272 3820509 3795256 3760829 3691088 3678310 3613578 3524597 3474321 3397931
6516 3397931 3309474 3147330 3085348 3038284 2877754 2793180 2686975 2592806 2510262 2393506 2300344
6505 2300344 2218145 2179768 2087695 1986046 1921457 1844861 1813502 1747247 1618860 1572374 1564301
6494 1564301 1486490 1356897 1354626 1369941 1352711 1257894 1187629 1165762 1163192 1102313 1101952 1088661
6482 1088661 1035250 957868 936627 962202 938155 905598 893817 887235 873991 810558 790768 798194
6470 798194 768716 740929 802333 813120 707668 722550 670270 659892 605323 597032 602963 600385
6458F00385J2909l4711l6626j3266k8443q309M2233n0196k7302k0855P8659K1550
6446E36028k8703n5971m2133M7982J6369K1669j9890l1196j7302q750M6683k9644
6434D35142K1324L8967r2250K2690n9490M3774j9331J2220M3544J5476J4033l2114
6422D43985k6371k2358o0463m223L5555l8519K901P296J6163o902q4409N2277
6410C14932L4372k0073p299l2516l6896Q309l9074M2672m488j627j6002j2385
6398B29925K8800j1344J7367J5013l2488M6836K4176k2377L4868L090N7348m3476
6386C47738j4514l3575R021L0893n4308K578P0436K9173J1587p7548J947o523
6374C16905k1972q366K178k327j5430M9851l5306m2832j7788l3584L9526M6473
$$ plain form
6458 600385 613294 578583 541957 528691 500248 491939 534172 483976 456674 435819 514478 536028
6446 536028 507325 451354 409221 457203 473572 495241 475351 444155 426853 418103 464786 435142
6434 435142 456466 495433 403183 425873 366383 410157 390826 403046 446590 462066 476099 443985
6422 443985 417614 395256 334793 330570 366125 327606 330507 337803 353966 347064 262655 314932
6410 314932 349304 329231 321932 289416 252520 260829 221755 264427 259939 258312 242310 229925
6398 229925 258725 247381 264748 279761 247273 294109 318285 295908 330776 333866 391214 347738
6386 347738 333224 299649 308670 339563 285255 287833 358269 387442 399029 321481 323428 316905
6374 316905 294933 286567 288745 286418 270988 320839 285533 242701 224913 191329 230855 277328
6362B77328Q0105J498J4119n4989o4303K9185K9485O0220L7437k7543j5873j0470
6350C56199P5411O695l4017m3115l5484L600Q8954K4276j3002m2497P8632L6853
6338E02505l4020M3138m4647L4410l9417Q613J0938O377L153j1089N4209n636
6326E28534L8569O4362l1435j5768j5923P877J06166O7434q3958q0598P8900P7996
6314G42156P7508j6248n7263K3075J7603o0963J5946j0440l2154o868o1524j8656
6302F12172j4550J605M1487O3794K4365M9908N8658J9741J577K7637J6584P9968
6290I82946N944j7419P0520O9927Q9694K8315J9343R953R915J9805m3880l5486
6278A209577p0177j4365p1289l3576q8453J1940P8708n2670o163m8202o7734O9056
$$ plain form
6362 277328 357433 358931 373050 318061 253758 282943 312428 372648 410085 382542 366669 356199
6350 356199 431610 438305 404288 361173 325689 329289 418243 442519 429517 387020 465652 502505
6338 502505 468485 511623 466976 501386 461969 470582 481520 487897 491050 479961 534170 528534
6326 528534 567103 631465 600030 584262 568339 576216 682382 749816 665858 585260 664160 742156
6314 742156 819664 803416 746153 769228 786831 725868 741814 731374 699220 692352 630828 612172
6302 612172 597622 599227 640714 704508 728873 778781 837439 857180 858757 886394 902978 982946
6290 982946 988890 971471 1041991 1111918 1201612 1229927 1249270 1259223 1269138 1288943 1245063 1209577
6278 1209577 1139400 1125035 1053746 1020170 931717 943657 1022365 969695 963532 915330 847596 916652
6266I16652J7159R096l2930J0496R2069K3307M9332j8166M3234J5599L7137N2049
6254A215034K6408P1936R742M859n928j205m3692J4882P556q843j26311p1860
6242A092578m8515k8323L7786l4071l9597l1274l367p3047R1616k0914o491K7066
6230I63447K6824L4913K5442j6168j6974Q7460l7418j7260O5113p655O3540m198
6218A167066k4437K5501o7405j0520l063q642n0398j8331R138N215m4347K7609
6206A007386K8792J7349P382K2430K523n5450N314L2390M7864m8259j511M2645
6194A108855N6092N4071J5575m2564m5767M8965N378R406R6412M3535J1685R3955
6182A455598o4982l112R2111n9767o522J3043Q355n4010K1099O2458l0611p6603
$$ plain form
6266 916652 933811 942907 909977 920473 1012542 1035849 1085181 1067015 1110249 1125848 1162985 1215034
6254 1215034 1241442 1313378 1323120 1327979 1322051 1320846 1277154 1292036 1299592 1290749 1164438 1092578
6242 1092578 1044063 1015740 1053526 1019455 979858 948584 945217 872170 963786 942872 936381 963447
6230 963447 990271 1025184 1050626 1034458 1017484 1104944 1067526 1050266 1115379 1107724 1171264 1167066
6218 1167066 1142629 1168130 1100725 1090205 1087142 1078500 1028102 1009771 1018909 1024124 979777 1007386
6206 1007386 1036178 1053527 1060909 1083339 1085862 1030412 1035726 1068116 1115980 1067721 1066210 1108855
6194 1108855 1164947 1219018 1234593 1192029 1146262 1195227 1200605 1210011 1306423 1349958 1361643 1455598
6182 1455598 1390616 1387504 1479615 1419848 1413326 1426369 1434724 1380714 1401813 1464271 1433660 1357057
6170A357057o5449K3391K4823R645K4355k1800k4870L0163k8159J0086o2385j3942
6158A262915L5288n397j6842J361M9803k2237L1711K1006K2791k8206l6936n6800
6146A258457M7692K2233m271N8036M7734k3982l2079N975L9480J2973P158P7586
6134A516992N5457N232K5647O7476K6218R6758J1264K7471M0469M0705P5095R7504
6122B086288n1925Q4634R9591Q6240J44346L8986L3901J38546J67613J39489M5930
6111C013639J39908J88380J9205O6288J68269J61980J41634J50155J03423J21841
6101D274722J10395J83643J61803R7867J73357J17275P7718J58462P9741J42235
6091E577218J39285N5671J08068J42125J33572J47632P3363J44449P0965J29492
$$ plain form
6170 1357057 1291608 1314999 1339822 1349467 1373822 1352022 1327152 1357315 1329156 1339242 1276857 1262915
6158 1262915 1298203 1292806 1275964 1277325 1327128 1304891 1336602 1357608 1380399 1352193 1315257 1258457
6146 1258457 1306149 1328382 1324111 1382147 1429881 1405899 1373820 1379795 1419275 1432248 1439406 1516992
6134 1516992 1572449 1577681 1603328 1670804 1697022 1793780 1805044 1832515 1872984 1913689 1988784 2086288
6122 2086288 2034363 2118997 2218588 2304828 2449174 2488160 2522061 2660607 2828220 2967709 3013639
6111 3013639 3153547 3341927 3361132 3427420 3595689 3757669 3899303 4049458 4152881 4274722
6101 4274722 4385117 4568760 4730563 4828430 5001787 5119062 5196780 5355242 5434983 5577218
6091 5577218 5716503 5772174 5880242 6022367 6155939 6303571 6376934 6521383 6592348 6721840
6081F721840Q4678P5576L6013L3018J2883p6502l5049n5280K9936q776j27994
6070F690343j34288r5540j34168j64779k17329j74749k20935j64457j14817j98106
6060E071175k18709j98267k12685j61488j49611j25615m3906j59741j59148j12774
6050C529231r4654o0199j20061j46453m3929l920k6837j48425r4083j5566j5269
6039B759835j7410j05668n1456K1957J9387Q936p7473r6536Q8881K2211j12332
6028B460332k5943Q925q1169L7933n797l1255K4757r3806J3819P2652j8491l0538
6016B331419N8691K057j519q3748l517N2265k6515n1631j4125K6789P1800L1082
6004B393048L3792K2462K2116J10658M8056N3110M3663L3143j9901K4888N9169
$$ plain form
6081 6721840 6806518 6882094 6918107 6951125 6964008 6887506 6852457 6797177 6827113 6818337 6690343
6070 6690343 6556055 6460515 6326347 6161568 5944239 5769490 5548555 5384098 5269281 5071175
6060 5071175 4852466 4654199 4441514 4280026 4130415 4004800 3960894 3801153 3642005 3529231
6050 3529231 3434577 3374378 3254317 3107864 3063935 3060015 3033178 2884753 2790670 2775104 2759835
6039 2759835 2742425 2636757 2585301 2607258 2626645 2635581 2558108 2461572 2550453 2572664 2460332
6028 2460332 2434389 2443314 2362145 2400078 2394281 2363026 2387783 2293977 2307796 2380448 2361957 2331419
6016 2331419 2390110 2392167 2390648 2306900 2303383 2355648 2329133 2277502 2263377 2290166 2361966 2393048
6004 2393048 2426840 2449302 2471418 2582076 2630132 2683242 2726905 2760048 2740147 2765035 2824204
5993B824204K1081p5976J2782j1448J0693j7202n9590J2098k2518p7150k1225
5982B595749k0504l5771O4988K5337n1928q0109K3950L1357m704N2143K1636j7448
5970B604696j9288L4159J3448k829K4358L7430N3087L842J2825J02365M5659J8495
5958B928247J9429K7164K8977J06970N3766L9434L2774O4526Q2415L6732M7761
5947C468195N7709P1481M3161R0462P0448J8684R6030J47579J00878Q3370J34469
5936D382466J13184N7219K28392J26322J45878J19680J33213K13852J58807K35793
5926E914806J84948J98203K49526L28220K99820K75717L38942M25467L64218M30442
5916I010309N39139N95996N30358O60095O65170O21317O41390O90258N52796M19524
$$ plain form
5993 2824204 2845285 2769309 2782091 2770643 2781336 2764134 2704544 2716642 2694124 2616974 2595749
5982 2595749 2575245 2539474 2604462 2629799 2577871 2497762 2521712 2553069 2548365 2600508 2622144 2604696
5970 2604696 2585408 2619567 2633015 2630186 2654544 2691974 2745061 2748903 2761728 2864093 2909752 2928247
5958 2928247 2947676 2974840 3003817 3110787 3164553 3203987 3236761 3301287 3383702 3420434 3468195
5947 3468195 3525904 3597385 3640546 3731008 3801456 3820140 3916170 4063749 4164627 4247997 4382466
5936 4382466 4495650 4552869 4781261 4907583 5053461 5173141 5306354 5520206 5679013 5914806
5926 5914806 6099754 6297957 6547483 6875703 7175523 7451240 7790182 8215649 8579867 9010309
5916 9010309 9549448 10145444 10675802 11335897 12001067 12622384 13263774 13954032 14506828 14926352
5906A4926352M44745M19798K00058J60811J6878p1886p2615k53694k57963k79569
5896A5232915k09472k25616k86741k72647j97091k34013k92582k88653k25654
5887A3000446k86773l18375l00976j61112j48724j38883n8763k3614k8332J29030
5877A1663924J63604J86293K41942K80831L45864L63422K28908K94688K59631
5868A4029107L06641K35037K02436K37005M23995M44582N77654O67725P51986
5859A7876168R66832J182107J432320J729583K067860K569205L191143L884679
5851C4899897M709829N372644N520219N101775M054099K635037R70084p32819
5843F2530765k123401l101189l776844m065639m175383m129941l773818l432012
$$ plain form
5906 14926352 15371097 15790895 15990953 16151764 16168642 16096756 16024141 15770447 15512484 15232915
5896 15232915 15023443 14797827 14511086 14238439 14041348 13807335 13514753 13226100 13000446
5887 13000446 12713673 12395298 12094322 11933210 11784486 11645603 11586840 11563226 11534894 11663924
5877 11663924 11827528 12013821 12255763 12536594 12882458 13245880 13474788 13769476 14029107
5868 14029107 14335748 14570785 14773221 15010226 15434221 15878803 16456457 17124182 17876168
5859 17876168 18843000 20025107 21457427 23187010 25254870 27824075 31015218 34899897
5851 34899897 39609726 44982370 50502589 55604364 59658463 62293500 63263584 62530765
5843 62530765 60407364 57306175 53529331 49463692 45288309 41158368 37384550 33952538
5835C3952538l079944k744060k223681j877679j625193j409757j173764j092905
5827A8725555r09748q26063o98832o23710o32484n36161m38966m56617l72068
5818A3230906m02328l02526l36639k89009k18899j54286j61806j76032j88874
5809A1000507j42718j31608n7650J7653j2146J45596J43853J31287J00956N4446
5799A1250176k432m3877p1273q4591j37332j01812j35883j60807j03016j58399
5789A0250754j63472r8642k8351j0819j8463L3436k5603N7734K1262q4653j1477
5778I921706m6043l6901q7826j4013q3676o8558j1862q7841p2599n7335l1019
5767I324033j2123j7819K9351L5537K4828K7280k2162k0891L739m3316O5249R1654
$$ plain form
5835 33952538 30872594 28128534 25904853 24027174 22401981 20992224 19818460 18725555
5827 18725555 17815807 16989744 16290912 15667202 15034718 14498557 14059591 13602974 13230906
5818 13230906 12828578 12526052 12189413 11900404 11681505 11527219 11365413 11189381 11000507
5809 11000507 10857789 10726181 10668531 10686184 10674038 10819634 10963487 11094774 11195730 11250176
5799 11250176 11247744 11203867 11132594 11048003 10910671 10808859 10672976 10512169 10409153 10250754
5789 10250754 10087282 9988640 9960289 9949470 9931007 9964443 9938840 9996574 10017836 9933183 9921706
5778 9921706 9875663 9838762 9750936 9736923 9653247 9584689 9572827 9484986 9412387 9355052 9324033
5767 9324033 9311910 9294091 9323442 9358979 9383807 9411087 9388925 9368034 9371773 9328457 9393706 9485360
5755I485360J4128K1171o08J32335K5104J04166Q8896R1620L3361O373J5547j1540
5743A0005913m1504k3966k9612n3946j10598j71655p9875j13550j53703n3821
5733I173683o4656j08806m5138j23718l4083j19022n414l5526q4158p2514q2393
5722H398255l2977k9714l682j7890j12390L9310M1693q4774j9731L6190k1524
5711H192766q3155m0079l6667n1120p487K9833j10971o1267k1252l9420j0190
5700G760991K366n1679K3832L8453M5961K3484J9545J01634O6826R4755J28239
5689H254407J30198K12257J41840L5090R5022Q4690J2598p156j4270O7006K0632
5678I032314r1094n0426l6641p3516j21424o2187n030M8346m6973k3036M2631
$$ plain form
5755 9485360 9499488 9520659 9520051 9652386 9677490 9781656 9870552 9962172 9995533 10001906 10017453 10005913
5743 10005913 9964409 9940443 9910831 9856885 9746287 9574632 9494757 9381207 9227504 9173683
5733 9173683 9109027 9000221 8955083 8831365 8797282 8678260 8672846 8637320 8553162 8480648 8398255
5722 8398255 8365278 8335564 8331882 8313992 8201602 8240912 8282605 8197831 8178100 8214290 8192766
5711 8192766 8109611 8069532 8032865 7981745 7974258 8004091 7893120 7831853 7810601 7771181 7760991
5700 7760991 7763357 7711678 7735510 7773963 7819924 7843408 7862953 7964587 8031413 8126168 8254407
5689 8254407 8384605 8596862 8738702 8773792 8868814 8953504 8966102 8958946 8944676 9011682 9032314
5678 9032314 8941220 8890794 8854153 8780637 8659213 8597026 8591996 8640342 8593369 8570333 8612964
5667H612964J7052J9596P8140J16485J40396J98360K10422K67760L32025M12034
5657A0405234M61386M93343N21932O94344O87836N35884N40527M51854L41960
5648A5134300K17453P8848K8945q0964r3533j47475j68990k68475l64894l65961
5638A3969254m66434n09315m74107m12943m59557m53605l69871m31656l39573
5629A0052193l26899l46970l33532l31600k19101k12104k84126j99065k19679
5620G579117j51101j56502k01164j58895j21907j10304j45885j31953j17200r1534
5610F192672o1936p5074p4462j50817o8571p7643m8736l8901l7886r0628o6693
5599E401325k404p5875n0184r0215j30124j11426o8960q7771q4272o2328j62231
$$ plain form
5667 8612964 8630016 8649612 8727752 8844237 8984633 9182993 9393415 9661175 9993200 10405234
5657 10405234 10866620 11359963 11881895 12576239 13264075 13799959 14340486 14792340 15134300
5648 15134300 15351753 15430601 15459546 15378582 15285049 15137574 14968584 14700109 14335215 13969254
5638 13969254 13502820 12993505 12519398 12106455 11646898 11193293 10823422 10391766 10052193
5629 10052193 9725294 9378324 9044792 8713192 8494091 8281987 7997861 7798796 7579117
5620 7579117 7428016 7271514 7070350 6911455 6789548 6679244 6533359 6401406 6284206 6192672
5610 6192672 6130736 6055662 5981200 5830383 5761812 5684169 5635433 5596532 5558646 5468018 5401325
5599 5401325 5398921 5323046 5272862 5182647 5052523 4941097 4872137 4784366 4700094 4637766 4475535
5588D475535p8493q2528j12334n3732r8390n3483j4276L4766j3381P189k0961
5577C989912N5717k0953n8902o3845O795M3504J0497M8205l0898q5378l2574o1515
5565C800565p011J477n1456j10238J537j4086l2787j8535k4126k1193J1504K0266
5553C555917J4668k8691N2604J7215N0285J2584J448J4146N1720N3497M1263K5763
5541C862419K7480m312L2078M0811K2404M1535n555L5020n2864N8192R1303l0193
5529D118318m3642k2827o4093p3397o1703J0895o4732N4909k6317N5850P8861
5518C962122p6717L751P4583R0813p85L056R4124O2962N7451p329K9277K4051
5506D317359R574L5371Q099K5991J856m2088K4752K2833P259n1161j5533J7307
$$ plain form
5588 4475535 4397042 4314514 4202180 4148448 4050058 3996575 3982299 4017065 4003684 4010873 3989912
5577 3989912 4045629 4024676 3965774 3901929 3908724 3952228 3962725 4010930 3980032 3894654 3862080 3800565
5565 3800565 3793554 3795031 3743575 3633337 3634874 3620788 3588001 3569466 3545340 3524147 3535651 3555917
5553 3555917 3570585 3541894 3594498 3611713 3661998 3674582 3676030 3690176 3741896 3795393 3836656 3862419
5541 3862419 3889899 3885587 3917665 3958476 3980880 4022415 4016860 4051880 3999016 4057208 4148511 4118318
5529 4118318 4074676 4051849 3987756 3914359 3852656 3863551 3798819 3853728 3827411 3883261 3962122
5518 3962122 3885405 3889156 3963739 4054552 4053767 4056823 4150947 4213909 4271360 4264031 4293308 4317359
5506 4317359 4326933 4362304 4370403 4396394 4398250 4356162 4380914 4403747 4411006 4359845 4344312 4361619
5494D361619j8363J05511k9147l7993M6531M4709O7705O1655N5706M6895M3574
5483D748402N9027p694J30771J40202Q7196P7399M8109J21234Q5285R4120Q0559
5472E664610J18007M2403J86246J68736J38124K16223K10866K84153K72193K78976
5462G580537L41956L77093M11605M35490L89604L79332L07281L36548K97210J78293
5452A1034949L17267L32019M00470M81822N89334O82150O47734M77854L08250
5443A5271849J96200m8207j93456k65240l27825n05757l77252l83649l45336k30178
5433A2791149j60895o9686p9282J0589J03211J79152K88768K55725L73221N56302
5423A4248254O02288O04775O64365Q28791R53685J069630J128895J250396J448075
$$ plain form
5494 4361619 4343256 4448767 4419620 4381627 4428158 4472867 4540572 4602227 4657933 4704828 4748402
5483 4748402 4807429 4799735 4930506 5070708 5157904 5235303 5283412 5404646 5489931 5584051 5664610
5472 5664610 5782617 5825020 6011266 6180002 6318126 6534349 6745215 7029368 7301561 7580537
5462 7580537 7922493 8299586 8711191 9146681 9536285 9915617 10222898 10559446 10856656 11034949
5452 11034949 11352216 11684235 12084705 12566527 13155861 13838011 14485745 14963599 15271849
5443 15271849 15468049 15419842 15226386 14961146 14633321 14127564 13750312 13366663 13021327 12791149
5433 12791149 12630254 12560568 12481286 12491875 12595086 12774238 13063006 13318731 13691952 14248254
5423 14248254 14850542 15455317 16119682 16948473 17902158 18971788 20100683 21351079 22799154
5414B2799154J673660J804001J986216K184941K356036K487060K690573K724237
5406D0705878K780547K779373K551800K355624K113697J811509J493905J214898
5398E7807231Q84319O45357M28258K16380j99810n09896o67146j170994j583693
5389E5850006j847794k115363k353623k582226k652539k760951k715124k619976
5381C6202410k476352k326233k229409k028512j923805j734480j525195j422714
5373B0535710j346035j245733j056160r35469r12678q57160p00321o85793o14400
5364A2181961n38213n36082n22891m60584m49414l93295l81421l65240k81116
5355H253705k81183k90607l06052k67432k34580k02650j83807k16125j90243j31775
$$ plain form
5414 22799154 24472814 26276815 28263031 30447972 32804008 35291068 37981641 40705878
5406 40705878 43486425 46265798 48817598 51173222 53286919 55098428 56592333 57807231
5398 57807231 58691550 59336907 59765165 59981545 59781735 59271839 58604693 57433699 55850006
5389 55850006 54002212 51886849 49533226 46951000 44298461 41537510 38822386 36202410
5381 36202410 33726058 31399825 29170416 27141904 25218099 23483619 21958424 20535710
5373 20535710 19189675 17943942 16887782 15952313 15039635 14182475 13482154 12796361 12181961
5364 12181961 11643748 11107666 10584775 10124191 9674777 9281482 8900061 8534821 8253705
5355 8253705 7972522 7681915 7375863 7108431 6873851 6671201 6487394 6271269 6081026 5949251
5345E949251k26517k00841j62625q5912j03779j36415j80781j09229q0568j18215
5335D544369o5361j77795j04215j39210j44640n8788p6496k7998j37560n9810
5325C552496n3883m6666j45515l4067k8071J2176k250j00697n4630o4770j11429
5314B922694o5353O708p6985n4747K8387o4661r8524q6337O457r726q6563n1069
5302B370281K3756p5129q9322m843l9858J801l4920p7424q4827j838K6421K4050
5290B038148r7634q3908J0252k0957n2586N3561k5066M084l9958o6783J8485l1308
5278A706330k8703J5149m9082m800o9038n5596L2587L765N12p8446l0535J0977
5266A453120l2941p726l1728O491L5204Q043N4903o2513o914J7333p5551M1030
$$ plain form
5345 5949251 5722734 5521893 5359268 5273356 5169577 5033162 4852381 4743152 4662584 4544369
5335 4544369 4479008 4301213 4196998 4057788 3913148 3854360 3777864 3749866 3612306 3552496
5325 3552496 3498613 3451947 3306432 3272365 3244294 3256470 3254220 3153523 3098893 3034123 2922694
5314 2922694 2857341 2864049 2787064 2732317 2760704 2696043 2597519 2511182 2517639 2507913 2421350 2370281
5302 2370281 2394037 2318908 2229586 2224743 2184885 2186686 2151766 2074342 1989515 1987677 2014098 2038148
5290 2038148 1940514 1856606 1866858 1845901 1793315 1846876 1821810 1825894 1785936 1719153 1737638 1706330
5278 1706330 1677627 1692776 1643694 1638894 1569856 1514260 1546847 1550612 1551124 1472678 1442143 1453120
5266 1453120 1420179 1412453 1380725 1387216 1422420 1430463 1485366 1422853 1415939 1433272 1357721 1398751
5254A398751J1772J32q5153l4000m3337K0887k0540M2439J4348k7348K2266o2335
5242A237882m405R784k7714j9315r33L8734J187j8122q9256K1089L1260L975k5690
5229A158476K0558M731P162j2092q428K1149J8698j1613j65k9034l4444K8827
5217A163825m5074K8483J5766K1128n6270r568J0839K134L0719p333j7428J7632
5205A154853j8055p839M821j4663M7122l257l0994P3467J0416Q172l9495k0874
5193A163674n9723j6788N8455M5572j6542k1081L2631j7018l5681M8797o2053
5182A120243K9516J3938K9325p1473j951K4710j348O5670M6230j9080o4167n3448
5170A118165J9958O3677L3028j9601M4384n140j3228M6862q537K6426q133j2712
$$ plain form
5254 1398751 1410523 1410655 1325502 1291502 1248165 1269052 1248512 1290951 1305299 1277951 1300217 1237882
5242 1237882 1233477 1243261 1215547 1196232 1195299 1234033 1235220 1217098 1127842 1148931 1180191 1184166 1158476
5229 1158476 1179034 1183765 1190927 1178835 1170407 1191556 1210254 1198641 1198476 1169442 1134998 1163825
5217 1163825 1118751 1147234 1163000 1184128 1127858 1118290 1129129 1131263 1161982 1154649 1137221 1154853
5205 1154853 1136798 1128959 1133780 1119117 1166239 1162982 1131988 1205455 1215871 1224043 1184548 1163674
5193 1163674 1103951 1087163 1145618 1191190 1174648 1153567 1186198 1169180 1133499 1182296 1120243
5182 1120243 1149759 1163697 1193022 1121549 1119598 1144308 1142960 1208630 1254860 1235780 1171613 1118165
5170 1118165 1138123 1201800 1234828 1215227 1259611 1254471 1241243 1288105 1279568 1305994 1297861 1285149
5158A285149J2410N6162l5205j7268J00321J9143l8590P8456M1997K5396J1236
5147A539207K9010J9129Q119N0353k5592J9082K5587M5567M3170M5879o5218m168
5135A730125L1912p092K4569k294Q946o514N381N4997J8232K0329R306k1070Q7298
5122A954125L0727j4300k5337l6201M2464J13218P9115j6105M4125j2337j9472
5111B140022J05222j7857l7657K9429j8852M1962m1267o6896R7211m8334M9368
5100B232351m3861l7854L8528Q9434l1081j05171L9381P1522n734K4186K0769
5089B292470L61L6351p1604L1387M8158j9980j4955k1807K764o7283l3836n5668
5077B126358L9438O3583m806m3831m3664l5161P0061J6325r5582o5801k4309j5936
$$ plain form
5158 1285149 1297559 1353721 1318516 1301248 1401569 1420712 1382122 1460578 1502575 1527971 1539207
5147 1539207 1568217 1587346 1595465 1645818 1620226 1639308 1664895 1710462 1753632 1799511 1734293 1730125
5135 1730125 1762037 1754945 1779514 1777220 1786166 1779652 1785033 1840030 1858262 1878591 1887897 1866827 1954125
5122 1954125 1984852 1970552 1945215 1909014 1951478 2064696 2143811 2127706 2171831 2159494 2140022
5111 2140022 2245244 2227387 2189730 2219159 2200307 2242269 2201002 2134106 2231317 2182983 2232351
5100 2232351 2188490 2150636 2189164 2278598 2247517 2142346 2181727 2253249 2247515 2271701 2292470
5089 2292470 2292831 2329182 2257578 2288965 2337123 2317143 2302188 2280381 2283145 2215862 2182026 2126358
5077 2126358 2165796 2229379 2224573 2180742 2137078 2101917 2171978 2188303 2092721 2026920 2002611 1986675
5065A986675L4805J2870P2772k8248q3312m4512M3563P2320p481L602K148p4732
5053A990470l287l8258l7561K7350l527P0159M8631K5532l9583k4076K6551N9190
5041B101591k5489p29J9796L0969m3088K0291N2894o7559N5960M9009l6908j7244
5029B139493M0453j287N6771J7129p1086J1996j2419k9439N2051M1642l345O4278
5017B306237l8749M2040M2158n5608m1942J4533j9565m183o4286M1022l635M0718
5005B258740n55L3998L0264n3134m821K336o4645K4458K2040j9791j4288p091
4993B207511J9971j099N1039N8103O5656K1535P745m1170O7493j2314o0963n3217
4981B330290J532j5377r6306J3087Q211M3087m7715o8447L4542J7487P942k4873
$$ plain form
5065 1986675 2021480 2034350 2107122 2078874 1995562 1951050 1994613 2066933 2059452 2063054 2065202 1990470
5053 1990470 1987183 1948925 1911364 1938714 1935187 2005346 2053977 2079509 2039926 2015850 2042401 2101591
5041 2101591 2076102 2075373 2095169 2126138 2083050 2103341 2156235 2088676 2144636 2193645 2156737 2139493
5029 2139493 2179946 2178659 2235430 2252559 2181473 2193469 2181050 2151611 2203662 2245304 2241959 2306237
5017 2306237 2267488 2309528 2351686 2296078 2254136 2268669 2249104 2244921 2180635 2221657 2218022 2258740
5005 2258740 2258185 2292183 2322447 2269313 2264492 2266828 2202183 2226641 2248681 2228890 2214602 2207511
4993 2207511 2227482 2226383 2277422 2335525 2401181 2422716 2430461 2389291 2456784 2444470 2383507 2330290
4981 2330290 2331822 2316445 2220139 2233226 2241437 2284524 2236809 2168362 2202904 2220391 2228333 2203460
4969B203460l5936M5286P268L2671J153M5546m6509k8782j1577n610M9309M236
4957B260515K2168L8987J824k2570J16493K8801l0136n0132k967J3868O2041N478
4945B444370l22M717M5912J2745M6930M1633k4173K3553M8821L2742k2797l2829
4933B621302J6808K0461N4689K9685J043J2323K4629O5694J4637O8129K7167M2369
4921B998936N8371R620J32472R3579K813M1091K7370n4472j2447M7436L8209j6893
4909C366085N8335L4945J1178n8808O5470Q7275q723N4616j5695O8514R6757O8639
4897C828588N9566N3433K1208j5512L3000N6849J11518P2790R9379N3348Q2615
4886D456782J36976N9710R7704J45331J03959P7522J25436N3034J43114K05849
$$ plain form
4969 2203460 2167524 2212810 2220078 2252749 2253902 2299448 2252939 2224157 2212580 2206970 2256279 2260515
4957 2260515 2282683 2321670 2323494 2300924 2417417 2446218 2416082 2365950 2362983 2376851 2438892 2444370
4945 2444370 2444048 2448765 2494677 2507422 2554352 2595985 2571812 2595365 2644186 2676928 2654131 2621302
4933 2621302 2638110 2658571 2713260 2742945 2743988 2756311 2780940 2846634 2861271 2929400 2956567 2998936
4921 2998936 3057307 3066927 3199399 3292978 3295791 3336882 3364252 3309780 3297333 3344769 3382978 3366085
4909 3366085 3424420 3459365 3470543 3411735 3477205 3564480 3555757 3610373 3594678 3663192 3759949 3828588
4897 3828588 3888154 3941587 3962795 3947283 3980283 4037132 4148650 4221440 4320819 4374167 4456782
4886 4456782 4593758 4653468 4751172 4896503 5000462 5077984 5203420 5256454 5399568 5605417
4876E605417J31303J41494K10847J70721J78479J83935J70366J55574K30808L20828
4866G499772K25208K47858L36030K89666K08482L16015L71931L33358L39060L50471
4856A0517851L93461L47537M42673L57681L05772L37110L38870K97927L05465
4847A3644347L75077L27595K25312L00332L37194L18865L31461L22005L41444
4838A6523632L46592L28783L76173M40282M33613M30266L94917M29693M30214
4829B0134165L82705L48333L84361K74772L02397K26912J37837J33338L2382L5079
4819B2392281j0730o2074j51045k02922k30834j78848k13878k78363k28730k34477
4809B0600380k51288k06610k17181j45787k07188j59099j65972l28489k78342
$$ plain form
4876 5605417 5736720 5878214 6089061 6259782 6438261 6622196 6792562 6948136 7178944 7499772
4866 7499772 7724980 7972838 8308868 8598534 8807016 9123031 9494962 9828320 10167380 10517851
4856 10517851 10911312 11258849 11701522 12059203 12364975 12702085 13040955 13338882 13644347
4847 13644347 14019424 14347019 14572331 14872663 15209857 15528722 15860183 16182188 16523632
4838 16523632 16870224 17199007 17575180 18015462 18449075 18879341 19274258 19703951 20134165
4829 20134165 20516870 20865203 21249564 21524336 21826733 22053645 22191482 22324820 22357202 22392281
4819 22392281 22381551 22319477 22168432 21965510 21734676 21555828 21341950 21063587 20834857 20600380
4809 20600380 20349092 20142482 19925301 19779514 19572326 19413227 19247255 18918766 18640424
4800A8640424k23400j92081k28097k16229k49079k96922l05559l04517k08972
4791A6415568k48215k69081j35851k15574j54732j34450j14324j32658n02m485
4781A5005696m1113M6965J6828Q3412O2459Q3267J96046J77530J68873K39359
4771A6039322K45775K02661K10876K92906L44105L49970L59598L53711L64952
4762A8763876M40955N32779M51156M65639N19732M59263N17460N62657M67976
4753B3181493N23211M85938M92305M40035L79891M58796M08569L10283L64143
4744B7044664M15410L17031L41487L83433L71061K82926K39054K75615K71713
4735B9942394K59746K66345N6865O0970Q8143J03696J8654j61847j62087j91406
$$ plain form
4800 18640424 18417024 18224943 17996846 17780617 17531538 17234616 16929057 16624540 16415568
4791 16415568 16167353 15898272 15762421 15546847 15392115 15257665 15143341 15010683 15010181 15005696
4781 15005696 14964583 15011548 15028376 15111788 15174247 15257514 15453560 15631090 15799963 16039322
4771 16039322 16285097 16487758 16698634 16991540 17335645 17685615 18045213 18398924 18763876
4762 18763876 19204831 19737610 20188766 20654405 21174137 21633400 22150860 22713517 23181493
4753 23181493 23704704 24190642 24682947 25122982 25502873 25961669 26370238 26680521 27044664
4744 27044664 27460074 27777105 28118592 28502025 28873086 29156012 29395066 29670681 29942394
4735 29942394 30202140 30468485 30525350 30586320 30674463 30778159 30796813 30634966 30472879 30281473
4725C0281473k48257k97688m07879m20541m31846m51084m79104n56884n29786
4716B6458404m68275m99686n15891n11748m71696m89007m43540l72400l86843
4707B2299318l74349l37066l71102l21356l73229l51193l59427l28213l17776
4698A9165607l28617l87356l77623l91836m31604l36667k98386l37487l35703
4689A5940328l22974l72318k24250k46478k93051k77652k05256j59584j35929
4680A3702836j50462o9828j11974o8889o53o5127q9054p794N3057O3828j5220
4669A3240720L867J41492K3490l1215Q1712P8359N9752R4221J53668R8401N5962
4658A4000429P5603R8602Q2966M5952R6706L5169J05310J34661M4597M1770O9543
$$ plain form
4725 30281473 30033216 29735528 29327649 28907108 28475262 28024178 27545074 26988190 26458404
4716 26458404 25990129 25490443 24974552 24462804 23991108 23502101 23058561 22686161 22299318
4707 22299318 21924969 21587903 21216801 20895445 20522216 20171023 19811596 19483383 19165607
4698 19165607 18836990 18449634 18072011 17680175 17248571 16911904 16613518 16276031 15940328
4689 15940328 15617354 15245036 15020786 14774308 14481257 14203605 13998349 13838765 13702836
4680 13702836 13552374 13482546 13370572 13301683 13301030 13235903 13146849 13139055 13192112 13255940 13240720
4669 13240720 13244587 13386079 13409569 13378354 13460066 13538425 13598177 13692398 13846066 13944467 14000429
4658 14000429 14076032 14174634 14257600 14303552 14400258 14435427 14540737 14675398 14719995 14761765 14831308
4647A4831308O81N7550J06619l7837O6603M1686P695j1955p3801K9832K73o86
4635A5017968m4271l4005q0249j28770o0236r245m4261j32732j61078o0262j45204
4624A4117655j45064r6212k09582n8998j96494k17223k06603k19140j52575j36090
4614A2479674j29314j75441k41535j12774j22034k31029j23975j98560j98571
4605A0946441j62639j29246j55531j15979r5874j67743j77237p9045j77451j62999
4595I522697j58541q1044j39382j55136j00568o1265o0007j43484j23334m3392
4585H456544j24999j44393J5217j15132j26752n032q1355r7563l9647j4446J6395
4574G738837j2696p5741o0916r385p6170k884l7507p3947l3897j7137k7391K2045
$$ plain form
4647 14831308 14831989 14889539 14996158 14958321 15024924 15066610 15074305 15062350 14988549 15018381 15018654 15017968
4635 15017968 14973697 14939692 14859443 14730673 14670437 14661192 14616931 14484199 14323121 14262859 14117655
4624 14117655 13972591 13876379 13666797 13607799 13411305 13194082 12987479 12768339 12615764 12479674
4614 12479674 12350360 12174919 11933384 11820610 11698576 11467547 11343572 11145012 10946441
4605 10946441 10783802 10654556 10499025 10383046 10287172 10119429 9942192 9863147 9685696 9522697
4595 9522697 9364156 9283112 9143730 8988594 8888026 8826761 8766754 8623270 8499936 8456544
4585 8456544 8331545 8187152 8202369 8087237 7960485 7955453 7874098 7776535 7736888 7722442 7738837
4574 7738837 7726141 7650400 7589484 7580099 7503929 7501045 7463538 7389591 7355694 7338557 7311166 7333211
4562G333211m4236k7570j1974J0188r6214p3720k9305j1671o137l6375l9592n3994
4550F912611N2902L8097l3081K6308m5741J9173j9628l6241j748n0321M222j9090
4538F847463N783l537r0105J9592J4834J501l1691k9518J0337P0534O0426l1025
4526F844594p949o2074P3484Q8406M101k3396p802K6157O3368k0721J3339L3981
4514G025488K3828j7876Q1239N9170K8590M4698K868O8398N8235O9510Q4688P4932
4502G603768K7687O5565J3575R5514R1355M3195Q1904J57921R5851J07896J12888
4491H497119J09652J5912M7808J18784N8211M3226m6701M4499J03112K1576P9110
4480I092308N0286L0304Q9756q049J09161R9537J12514J11553J84415P2999O2662
$$ plain form
4562 7333211 7288975 7261405 7249431 7259619 7163405 7089685 7060380 7048709 7042572 7006197 6966605 6912611
4550 6912611 6965513 7003610 6970529 6996837 6951096 6970269 6950641 6914400 6912652 6862331 6866553 6847463
4538 6847463 6853246 6849709 6759604 6779196 6794030 6795531 6763840 6734322 6744659 6815193 6875619 6844594
4526 6844594 6836645 6774571 6848055 6936461 6940562 6917166 6909364 6935521 6998889 6978168 6991507 7025488
4514 7025488 7049316 7031440 7112679 7171849 7200439 7245137 7248005 7316403 7374638 7444148 7528836 7603768
4502 7603768 7631455 7697020 7710595 7806109 7897464 7940659 8022563 8180484 8276335 8384231 8497119
4491 8497119 8606771 8622683 8670491 8789275 8847486 8890712 8844011 8888510 8991622 9013198 9092308
4480 9092308 9142594 9172898 9262654 9254605 9363766 9463303 9575817 9687370 9871785 9944784 10007446
4469A0007446N1900J02259Q1407J71091R9125R6454Q6473J31665J62754R0928
4459A1081502P5244Q4632J19012J44249J09449P2494P1049R9292P4708P3955N0586
4448A2056172n102K7688L3901L1112n0082O5576O5051k4521l4796O4164j1118
4437A2218045m2443J29143k4251N0166O0663j2495Q2570R5539J49837O4176R8116
4426A2869066J39852J62760K13309K62770J95874K67046K60019K33364K34709
4417A4838769K87540L31047K67148K48009K52841K82952J73337J37751J94459
4408A7013853Q7894J34467J69713K05879J94858K03399K50693K99503L06730L92678
4398A9259667M38372M65561M69507N58744O22126O49408P51498R11645R05838
$$ plain form
4469 10007446 10059346 10161605 10243012 10414103 10513228 10609682 10696155 10827820 10990574 11081502
4459 11081502 11156746 11241378 11360390 11504639 11614088 11686582 11757631 11856923 11931631 12005586 12056172
4448 12056172 12051070 12078758 12112659 12143771 12093689 12159265 12224316 12199795 12164999 12229163 12218045
4437 12218045 12175602 12304745 12280494 12330660 12391323 12378828 12461398 12556937 12706774 12770950 12869066
4426 12869066 13008918 13171678 13384987 13647757 13843631 14110677 14370696 14604060 14838769
4417 14838769 15126309 15457356 15724504 15972513 16225354 16508306 16681643 16819394 17013853
4408 17013853 17101747 17236214 17405927 17611806 17806664 18010063 18260756 18560259 18866989 19259667
4398 19259667 19698039 20163600 20633107 21191851 21813977 22463385 23214883 24126528 25032366
4389B5032366R96030J055307J066717J102275J066651J032964J137913J087019
4381C3577242R76292R07932R01229Q76538Q38933Q31154O85137N88023N30053
4372D0712533M54788L18481K72875J03381L7338j3813j63733l39891l72643m87010
4362D0522306n27388n89912n86308n67325n53280n38269n52426l81576l81048
4353C5844774l58126k26711k09681j34400p1684k6310R486K4605M1490J46933
4343C5040376J67982J61475J90443J81228J70269J42165J16509J60999J72315
4334C6503761J33647M5927O4501J9253l6307k5674m3414j36771j51561r6005k02453
4323C6074904k54335k38658k75493k87446l14093k56627j72738j32702j04567
$$ plain form
4389 25032366 26028396 27083703 28150420 29252695 30319346 31352310 32490223 33577242
4381 33577242 34553534 35461466 36362695 37239233 38078166 38909320 39594457 40182480 40712533
4372 40712533 41167321 41485802 41758677 41862058 41899396 41885583 41721850 41381959 41009316 40522306
4362 40522306 39994918 39405006 38818698 38251373 37698093 37159824 36607398 36225822 35844774
4353 35844774 35486648 35259937 35050256 34915856 34844172 34817862 34827348 34851953 34893443 35040376
4343 35040376 35208358 35369833 35560276 35741504 35911773 36053938 36170447 36331446 36503761
4334 36503761 36637408 36683335 36747836 36767089 36730782 36705108 36661694 36524923 36373362 36277357 36074904
4323 36074904 35820569 35581911 35306418 35018972 34704879 34448252 34275514 34142812 34038245
4314C4038245O0101K25757L39568N95677P93251J179220J426000J554194J694285
4305D1906298J612779J390658J226397J006124R35352J007395J215188J433664
4297E1733855J810677J984253J911385J465842Q52361J90942l93888r18814j314887
4288E7321726j383366j379045j194632j127731j017412j063545j159922j360223
4280D7635850j534379j642598j693801j655883j622481j443763j303647j151776
4272C5587522r37165p69694o37181m60154l72105k12529j67516j06613m6231L6233
4262C1914567N7553L1776R4498J24753J35534R4596R3193J20674J91176J42944
4252C3001264O1481O5555J57052J62859O2968K03295J40138J11189J67568J31864
$$ plain form
4314 34038245 34098346 34324103 34663671 35259348 36052599 37231819 38657819 40212013 41906298
4305 41906298 43519077 44909735 46136132 47142256 48077608 49085003 50300191 51733855
4297 51733855 53544532 55528785 57440170 58906012 59758373 59949315 59555427 58636613 57321726
4288 57321726 55938360 54559315 53364683 52236952 51219540 50155995 48996073 47635850
4280 47635850 46101471 44458873 42765072 41109189 39486708 38042945 36739298 35587522
4272 35587522 34650357 33880663 33243482 32783328 32411223 32198694 32031178 31924565 31878334 31914567
4262 31914567 31972120 32003896 32098394 32223147 32358681 32453277 32546470 32667144 32858320 33001264
4252 33001264 33062745 33128300 33285352 33448211 33511179 33714474 33854612 33965801 34133369 34265233
4242C4265233J83024J71929J91959K50296K58308J73359K94791L61805L18052
4233C6468756L29229M29828M18734M70450N21961O32593N76383O48794O98005
4224D1194733P28742P84347Q50582R88685J012708J016237J131172J164973J232253
4215E0104432J330267J434762J368163J398458J533053J559138J579637J592260
4207F1900170J696457J705278J684574J705795J740049J772354J749779J789710
4199G5744166J781058J751937J653584J651234J495192J349441J347484J269790
4191H8043886J211240J048107R04114R32389P08452O61111N29651L33462K00239
4182I4572651J4359k17229m03866n48111p23117q44884j005937j169818j279698
$$ plain form
4242 34265233 34448257 34620186 34812145 35062441 35320749 35494108 35788899 36150704 36468756
4233 36468756 36797985 37227813 37646547 38116997 38638958 39271551 39847934 40496728 41194733
4224 41194733 41923475 42707822 43558404 44547089 45559797 46576034 47707206 48872179 50104432
4215 50104432 51434699 52869461 54237624 55636082 57169135 58728273 60307910 61900170
4207 61900170 63596627 65301905 66986479 68692274 70432323 72204677 73954456 75744166
4199 75744166 77525224 79277161 80930745 82581979 84077171 85426612 86774096 88043886
4191 88043886 89255126 90303233 91207347 92139736 92848188 93509299 94038950 94372412 94572651
4182 94572651 94587010 94369781 93965915 93417804 92694687 91849803 90843866 89674048 88394350
4173H8394350j315544j510827j563324j661745j830465j927212j899346k111366
4165G4574521k102294k160943k259984k323426k219369k214522k156937k185392
4157E6951654k135612k128008k081505k006554j919060j822435j815637j791829
4149D1251014j650188j535888j478587j395177j292630j279551j102503j097400
4141C0419090j010718q77041q80852r02539q37815q15008p92292o89458p07238
4132B2906129o76828o14151n31329n12778n23533m60572l64575n01550l65647
4123A8355166m36589l79936l74073m09816l36657l42716l17363l28117l21804
4114A5108095k15905j73820j62668j78005j85611j41073k01170j50706j40330
$$ plain form
4173 88394350 87078806 85567979 84004655 82342910 80512445 78585233 76685887 74574521
4165 74574521 72472227 70311284 68051300 65727874 63508505 61293983 59137046 56951654
4157 56951654 54816042 52688034 50606529 48599975 46680915 44858480 43042843 41251014
4149 41251014 39600826 38064938 36586351 35191174 33898544 32618993 31516490 30419090
4141 30419090 29408372 28531331 27650479 26747940 25910125 25095117 24302825 23613367 22906129
4132 22906129 22229301 21615150 21083821 20571043 20047510 19586938 19222363 18720813 18355166
4123 18355166 17918577 17538641 17164568 16754752 16418095 16075379 15758016 15429899 15108095
4114 15108095 14892190 14718370 14555702 14377697 14192086 14051013 13849843 13699137 13558807
4105A3558807q4045p5595r8749o7169o6814j05817p8985l5257K6049n3978k7034
4094A2891413L6430L317O9264P1022N6244J0623l1924K5866N1138l0818n053J3447
4082A3160969p4739k0827O3510O2833N910m4452n3448J9641L5295j0401l3609
4071A3110682m7029O7067N7837p729J2658L2917Q2299J72632J09621J80358K42797
4060A4014110K99043K88997L24131K58849L59538K47755K78412J49919J13472
4051A6334226J14118r827K3610N3559N3453j0777o129m6603K0004K8229K1050
4040A6574913p8149n9116j42971j91098k20143k29948k57952k86476k42275j75963
4030A4690822j46878j35265j72598j20939j32305m1299j02700P697Q9234m9382
$$ plain form
4105 13558807 13474762 13399167 13300418 13233249 13166435 13060618 12981633 12946376 12972425 12918447 12891413
4094 12891413 12927843 12931160 13000424 13071446 13127690 13138313 13106389 13132255 13183393 13152575 13147522 13160969
4082 13160969 13086230 13065403 13128913 13191746 13197656 13153204 13099756 13119397 13154692 13144291 13110682
4071 13110682 13063653 13130720 13188557 13180828 13193486 13226403 13308702 13481334 13590955 13771313 14014110
4060 14014110 14313153 14602150 14926281 15185130 15544668 15792423 16070835 16220754 16334226
4051 16334226 16448344 16438517 16462127 16515686 16569139 16558362 16552233 16505630 16525634 16553863 16574913
4040 16574913 16496764 16437648 16294677 16103579 15883436 15653488 15395536 15109060 14866785 14690822
4030 14690822 14543944 14408679 14236081 14115142 13982837 13941538 13838838 13846535 13935769 13886387
4020A3886387O9002O3662O7997R4854P6234J03324J36412J12136J41123J69008
4010A4920139J80735Q0939J53377J94137K40855J99390J79518K30462J49484J86261
4000A6715297K60152K59169J68791K80996L29026K78921L01042L62679L72876
3991A9328949L04291M12819L54282L98236M84398N48291N96544N85725P31569
3982B3745104N83579O36595P11400P12833O51607O02688O30819O14992O28787
3973B9518404N85809O15170O87176P00942P03595P69181Q13177P70696O94007
3964C5858157P53007O71576O58740O24549O19895O10031O51509P04369O79583
3955D1831416Q15450Q48080R11029R56649J008779J003826J099809J050979R71585
$$ plain form
4020 13886387 13955389 14019051 14087048 14181902 14258136 14361460 14497872 14610008 14751131 14920139
4010 14920139 15100874 15181813 15335190 15529327 15770182 15969572 16149090 16379552 16529036 16715297
4000 16715297 16975449 17234618 17403409 17684405 18013431 18292352 18593394 18956073 19328949
3991 19328949 19633240 20046059 20400341 20798577 21282975 21831266 22427810 23013535 23745104
3982 23745104 24328683 24965278 25676678 26389511 27041118 27643806 28274625 28889617 29518404
3973 29518404 30104213 30719383 31406559 32107501 32811096 33580277 34393454 35164150 35858157
3964 35858157 36611164 37282740 37941480 38566029 39185924 39795955 40447464 41151833 41831416
3955 41831416 42646866 43494946 44405975 45362624 46371403 47375229 48475038 49526017 50497602
3946E0497602R96654R31108J016996Q86040R13582Q94713R32143Q76010Q39311
3937E8784159Q12529P56595O46237N58028M21541L11925K66993P1569K6639l3496
3927F2622719k1056r4547j06911k20012j99571j74507k02519k55042k74258k40551
3917F0833745l15375k96517k66810l26481k69636j70696j20272j67737j00036
3908E8800185K9352Q1921J44563R4893O3389K17520J62333K19658K57234K16660
3898F0287708J90063K63022K74586K68532K83375K87622K07860K20908K85709
3889F2569385K71178K74420K46812K95550K54320K40810L10951K59041K86275
3880F5008742L03800L58410L55242L24202M75048M52152M83335N34647N58835
$$ plain form
3946 50497602 51494256 52425364 53442360 54328400 55241982 56136695 57068838 57944848 58784159
3937 58784159 59596688 60353283 60999520 61557548 61979089 62291014 62558007 62629576 62656215 62622719
3927 62622719 62601663 62507116 62400205 62180193 61980622 61806115 61603596 61348554 61074296 60833745
3917 60833745 60518370 60221853 59955043 59628562 59358926 59188230 59067958 58900221 58800185
3908 58800185 58829537 58911458 59056021 59150914 59214303 59431823 59594156 59813814 60071048 60287708
3898 60287708 60477771 60740793 61015379 61283911 61567286 61854908 62062768 62283676 62569385
3889 62569385 62840563 63114983 63361795 63657345 63911665 64152475 64463426 64722467 65008742
3880 65008742 65312542 65670952 66026194 66350396 66825444 67277596 67760931 68295578 68854413
3871F8854413P19857P93215R24956R49909J010547J103245J141883J228250J295808
3862G8022083J337973J331595J535985J600288J741470J754868J940898K112544
3854I1377704K020325K014059J918275J877522J737291J593937J482474J188800
3846A05210387R35058P48831N63253M77943L40766K36752J20506N7817O4320r8567
3836A08657066j79680l14239m00961m39127m61787l88760m01474l74687k22671
3827A05473680k1649K67035M60724P05960J064615J528514J965050K499809L119730
3818A17063468L760109M433785N504154O463728P618952R050126J0590148J2367939
3810A76852409J4184388J5931592J7382048J8237845J8166384J7299361J5784303
$$ plain form
3871 68854413 69574270 70367485 71292441 72242350 73252897 74356142 75498025 76726275 78022083
3862 78022083 79360056 80691651 82227636 83827924 85569394 87324262 89265160 91377704
3854 91377704 93398029 95412088 97330363 99207885 100945176 102539113 104021587 105210387
3846 105210387 106145445 106894276 107457529 107935472 108276238 108512990 108633496 108691313 108755633 108657066
3836 108657066 108477386 108163147 107762186 107323059 106861272 106472512 106071038 105696351 105473680
3827 105473680 105452031 105719066 106179790 106885750 107950365 109478879 111443929 113943738 117063468
3818 117063468 120823577 125257362 130761516 137225244 144844196 153894322 164484470 176852409
3810 176852409 191036797 206968389 224350437 242588282 260754666 278054027 293838330
3803B93838330J3841955J1652039R433340P488208N916628M749944L988692L430945
3795C54340081L142043K774211K204993J576014N62026r05445k574531m490961
3787C56628431o547317q697172j0574510j2126310j3309050j3922522j4143950
3780B77307600j3805424j3082308j2365949j1392700j0345602r381420q497792
3773A98436405p660036o974431o481414o060684n703197n489863n379271n343080
3765A49344429n189584n161065n082764n011710n019299m845327m607510m457273
3757A09969897m260919m139013m100973l931512l896271l979144l969355l911662
3749G7781048l841879l715410l574085l451704l201702k908594k761816k473136
$$ plain form
3803 293838330 307680285 319332324 328765664 336253872 342170500 346920444 350909136 354340081
3795 354340081 357482124 360256335 362461328 364037342 364599368 363693923 361119392 356628431
3787 356628431 350081114 341383942 330809432 318683122 305374072 291451550 277307600
3780 277307600 263502176 250419868 238053919 226661219 216315617 206934197 198436405
3773 198436405 190776369 183801938 177320524 171259840 165556643 160066780 154687509 149344429
3765 149344429 144154845 138993780 133911016 128899306 123880007 119034680 114427170 109969897
3757 109969897 105708978 101569965 97468992 93537480 89641209 85662065 81692710 77781048
3749 77781048 73939169 70223759 66649674 63197970 59996268 57087674 54325858 51852722
3741E1852722k154523j934543j732350j431192j301723j095351r09096p75168
3733D0518776p55093n42390m36655m53927l94686m05527l47010l58885l83952
3724C6440651k82965l45256l14101k64191k80903k12005j46499j63107j35614
3715C4296010k27149l07456l21912m56998n27545n60079n98978p43597p95087
3706B9757209p56725p96791p69394p40436p05280o84889p62285o84743o76326
3697B3180340p02496p55256p85645p38364p37536p38958p30397o56524o61358
3688A6673806o89740o44550n67623m35972m68538m02415m55971l31966k72102
3679A2404929l16758l09640k93115k93879k37934j88575k39480k02915j03350
$$ plain form
3741 51852722 49698199 47763656 46031306 44600114 43298391 42203040 41293944 40518776
3733 40518776 39763683 39221293 38784638 38330711 37936025 37530498 37183488 36824603 36440651
3724 36440651 36157686 35812430 35498329 35234138 34953235 34741230 34594731 34431624 34296010
3715 34296010 34068861 33761405 33439493 32982495 32454950 31894871 31295893 30552296 29757209
3706 29757209 29000484 28203693 27434299 26693863 25988583 25303694 24541409 23856666 23180340
3697 23180340 22477844 21722588 20936943 20198579 19461043 18722085 17991688 17335164 16673806
3688 16673806 15984066 15339516 14771893 14335921 13867383 13464968 13008997 12677031 12404929
3679 12404929 12088171 11778531 11485416 11191537 10953603 10765028 10525548 10322633 10219283
3670A0219283k11357j32798j10296j78120k07078j77121j07238j86295j31699
3661H777281j12792j32082n4583j04647j00389j34460j77844j06829k8796r2866
3651G731993j15377q3758p5091r2854p3121m2707j29322j20444o2804n2090o5796
3640F818629k3262p4470j07045j3278k7662m6683n3709n0088o9630n2091j04348
3629F196363o6502j6490n6953q5755r258K7966r2260p3625M329K1906j6813Q084
3617E840992P79m8376j5159J1760L4722J515J4193M0357k8350K2463j8993P2919
3605E928822k5206p4370k5058N2595N1087M497q1133J6361L6471j8291m5288k2775
3593E797712r4988o4855l1996L4588P18m0773j05609K3146L6126n211O4762N6182
$$ plain form
3670 10219283 10007926 9875128 9764832 9586712 9379634 9202513 9095275 8908980 8777281
3661 8777281 8664489 8532407 8477824 8373177 8272788 8138328 7960484 7853655 7824859 7731993
3651 7731993 7616616 7532858 7457767 7364913 7291792 7249085 7119763 6999319 6936515 6884425 6818629
3640 6818629 6795367 6720897 6613852 6600574 6572912 6526229 6472520 6422432 6352802 6300711 6196363
3629 6196363 6129861 6113371 6056418 5970663 5961405 5989371 5897111 5823486 5827815 5849721 5832908 5840992
3617 5840992 5841771 5793395 5778236 5789996 5824718 5826233 5840426 5880783 5852433 5874896 5855903 5928822
3605 5928822 5903616 5829246 5804188 5856783 5907870 5912367 5831234 5847595 5884066 5865775 5820487 5797712
3593 5797712 5702724 5637869 5605873 5640461 5641179 5600406 5494797 5517943 5554069 5548858 5613620 5669802
3581E669802O8467R5152J45148K1367l5163n4180M1453J2451j7860m1438M1680
3570E946879N0898K0398L3797P6147L187L0397p508r7612p5824m6259o8170j05705
3558E760625k3452j4341o0819m3622k7063j8140N8800o250p820M32m2417J2413
3546E588346J7333J36391O7202m0759K8746N909L205J9011K0667P297K1949Q9532
3534E964829N9870J2799N9295J9067l0991J8293K5340k0182J8142P3811Q7000
3523F287273Q1133L8743J46110J16175R2819J02622J22228J18752P3186J51350
3513G330391K4544R0490O4138K6176J51527Q0410P896Q2395M6613J35285J21639
3502H161504L5901K1615M0186Q3474m3079N4760J03300J4776M7630M5225P2147
$$ plain form
3581 5669802 5738269 5833421 5978569 5999936 5964773 5910593 5952046 5964497 5946637 5905199 5946879
3570 5946879 5997777 6018175 6051972 6128119 6131306 6161703 6154195 6056583 5980759 5934500 5866330 5760625
3558 5760625 5737173 5722832 5662013 5618391 5591328 5573188 5631988 5625738 5617918 5618350 5575933 5588346
3546 5588346 5605679 5742070 5809272 5768513 5797259 5803168 5806373 5825384 5846051 5853348 5875297 5964829
3534 5964829 6024699 6037498 6096793 6115860 6084869 6103162 6128502 6108320 6126462 6200273 6287273
3523 6287273 6368406 6407149 6553259 6669434 6762253 6864875 6987103 7105855 7179041 7330391
3513 7330391 7354935 7445425 7509563 7535739 7687266 7767676 7775572 7857967 7904580 8039865 8161504
3502 8161504 8197405 8219020 8259206 8342680 8299601 8354361 8457661 8472437 8520067 8565292 8637439
3491H637439R5734j6631k0724M4237O4420J06296Q6426J10193M6096N760R7152
3480I256398J26671Q3468N4602J23519J08536J66080N7790Q7893J84099J84778
3470A0433834J31304J53901J44932J47606J10021J70944J59915K59447K29635
3461A1941539J82703K25445K63456L39897M17090M57410M64349N57325N89504
3452A5438718N84533O69985O66080P31057P83680Q04567Q51360Q70395J107800
3443B2508175J118453J212398J223978J344679J274580J229135J077462R49226
3435C1938086P05025M26667K09571n5171k40146l50853n00043n96718o93793q90104
3425B9952521r92701j085868j038163j109524j151368j158974j193893j216947
$$ plain form
3491 8637439 8733173 8716542 8695818 8740055 8804475 8910771 8997197 9107390 9153486 9159246 9256398
3480 9256398 9383069 9466537 9521139 9644658 9753194 9919274 9977064 10064957 10249056 10433834
3470 10433834 10565138 10719039 10863971 11011577 11121598 11292542 11452457 11711904 11941539
3461 11941539 12124242 12349687 12613143 12953040 13370130 13827540 14291889 14849214 15438718
3452 15438718 16023251 16693236 17359316 18090373 18874053 19678620 20529980 21400375 22508175
3443 22508175 23626628 24839026 26063004 27407683 28682263 29911398 30988860 31938086
3435 31938086 32643111 33069778 33279349 33224178 32984032 32633179 32133136 31536418 30842625 29952521
3425 29952521 28959820 27873952 26835789 25726265 24574897 23415923 22222030 21005083
3417B1005083j233474j315682j172989j127003j047356j089156j009883q25020
3409A2184520p69612o62132o23069m97714m72192m07716m10220k91199k57914
3400G792752k52257j90842k93301j38469j42662j00231j30077j51758p2398r1418
3390F229339p1830k3244P760r4631j48100p5478k18387j39401j33144j59822j92666
3379D980396k05971k07869k66224j34646j01535q6331j46629r8786q6523j06534
3369C539348o4249j11490o6131l8035j01335j09139j11089K1666O272n0799j07338
3358B807681j2401r039n6683o9114p5885m7285q350m1259j8144o1818r8836r013
3346B299854k1979m570j8895j15459K1226o9704O32n4821k600k7346m9436K5190
$$ plain form
3417 21005083 19771609 18455927 17282938 16155935 15108579 14019423 13009540 12184520
3409 12184520 11414908 10752776 10129707 9631993 9159801 8752085 8341865 8050666 7792752
3400 7792752 7540495 7349653 7056352 6917883 6775221 6674990 6544913 6393155 6320757 6229339
3390 6229339 6157509 6134265 6142025 6047394 5899294 5823816 5605429 5466028 5332884 5173062 4980396
3379 4980396 4774425 4566556 4300332 4165686 4064151 3977820 3831191 3732405 3645882 3539348
3369 3539348 3475099 3363609 3297478 3259443 3158108 3048969 2937880 2959546 2965818 2915019 2807681
3358 2807681 2795280 2786241 2729558 2660444 2584559 2537274 2528924 2487665 2469521 2407703 2308867 2299854
3346 2299854 2277875 2273305 2254410 2138951 2160177 2090473 2091105 2036284 2033684 2006338 1956902 1982092
3334A982092M858m2048p0598J4170n1531o397o2220n2591P401O4943k9556o7295
3322A691228J2209J9872n2805n52k3758k9410N6410K3011j3270m7123l6610k7058
3310A572144j0827l9325M2572p638p4130n2048j1146M949J9528J7208j3403K7327
3298A475211o5966n961j113k6129o5366K1573L3510J8854k4169m1353q257K7807
3286A338641p0895P548K5063m7271K9766j2244l2140j3078p0561m1667P5457M2317
3274A230936o6417q159O2110n1775n5518k5867L6322L1393k83k2129k3893N6331
3262A163051M7703r7468K7819j3250o1761k7029M0570L6965k7965P2391k6839
3251A134187p4210P79M904o932l5423p19k5884l7058O6935L2533k9535n7509K5729
$$ plain form
3334 1982092 1986950 1944902 1874304 1888474 1836943 1830546 1768326 1715735 1723136 1788079 1758523 1691228
3322 1691228 1703437 1723309 1670504 1669952 1646194 1616784 1673194 1696205 1682935 1635812 1599202 1572144
3310 1572144 1561317 1521992 1564564 1556926 1482796 1430748 1419602 1424551 1444079 1461287 1447884 1475211
3298 1475211 1409245 1403284 1402171 1376042 1310676 1332249 1365759 1384613 1360444 1319091 1310834 1338641
3286 1338641 1267746 1275294 1300357 1253086 1282852 1270608 1238468 1225390 1154829 1113162 1188619 1230936
3274 1230936 1164519 1156360 1218470 1166695 1111177 1085310 1121632 1153025 1152742 1130613 1106720 1163051
3262 1163051 1210754 1113286 1141105 1127855 1066094 1039065 1079635 1116600 1088635 1161026 1134187
3251 1134187 1059977 1060756 1065660 1058728 1023305 1022586 996702 959644 1026579 1059112 1029577 972068 997797
3238I97797k2177m0850O3349K4293m657L7589k2492j3481J7276J2734M5585l0178
3226A064788q6378m0278J4766N5352l8726j1557M0331K1824k5519N6717k7741
3215A023579o2494M7916q6k5679q398k7264M2129L5255o050o7617j2976M2813
3203I81128p0567O2314P3353J1491l8995J3460M5220l3021J2645L1976k6143K5551
3191A088412K3982k0095K3546P3024j1079k3543k886L3581L9012R647p5706q2212
3179A075683O0819P0202J5109o9014j5959j1290O7926J5804J5335L6444J3665
3168A274724j2806O7034J7309k2855R665O8451L4884o5631L0434j1349N1686K9684
3156A471230L0437Q5600K7424k9508J39L0030m5591k782J7418l809J1591o3491
$$ plain form
3238 997797 975620 934770 998119 1022412 1017755 1055344 1032852 1019371 1036647 1049381 1094966 1064788
3226 1064788 978410 938132 952898 1008250 969524 957967 998298 1020122 994603 1051320 1023579
3215 1023579 961085 1009001 1008915 983236 974838 947574 989703 1024958 1018908 951291 938315 981128
3203 981128 910561 972875 1046228 1057719 1018724 1032184 1077404 1044383 1057028 1089004 1062861 1088412
3191 1088412 1112394 1092299 1115845 1188869 1177790 1154247 1151361 1184942 1223954 1233601 1157895 1075683
3179 1075683 1136502 1206704 1221813 1152799 1136840 1125550 1193476 1209280 1224615 1261059 1274724
3168 1274724 1261918 1328952 1346261 1323406 1333071 1401522 1436406 1370775 1401209 1389860 1441546 1471230
3156 1471230 1501667 1587267 1614691 1585183 1585322 1615352 1569761 1566979 1584397 1580588 1592179 1528688
3144A528688K4271J11193J55217N7708K2183K1257K5047J01379Q6969P6934J14999
3133B325845J05280J06496J22353O0122P5792J82928J15435Q2603J09471R5885
3123C382210J07546Q8636J212l691K705M8608k9388N1277O125o59K504Q748R9726
3110C765559N5760J07191L5672K4251J00147J80457J32524J53732K77960K54393
3100E087646K70680K09000K34763K42928J46613L5434k08290k02737k30578k60352
3090E325107k96664l06770j86699k47179k28315j34160r5150q2078m8079j21400
3080C578613p6056j3529K583K2688M2685O3153Q8856J0756J3549O2293L9483N675
3068C840749L0265M573o778l4343j72978j06305p0663j43800j81424j17999j06966
$$ plain form
3144 1528688 1552959 1664152 1819369 1877077 1899260 1920517 1945564 2046943 2133912 2210846 2325845
3133 2325845 2431125 2537621 2659974 2720096 2795888 2978816 3094251 3176854 3286325 3382210
3123 3382210 3489756 3578392 3579604 3575913 3578618 3627226 3597838 3649115 3655240 3654581 3657085 3665833 3765559
3110 3765559 3821319 3928510 3964182 3988433 4088580 4269037 4401561 4555293 4833253 5087646
3100 5087646 5358326 5567326 5802089 6045017 6191630 6227064 6018774 5816037 5585459 5325107
3090 5325107 5028443 4721673 4534974 4287795 4059480 3925320 3830170 3748092 3700013 3578613
3080 3578613 3502557 3489028 3491611 3514299 3556984 3620137 3708993 3719749 3733298 3795591 3835074 3840749
3068 3840749 3871014 3875587 3868809 3834466 3661488 3555183 3484520 3340720 3159296 3041297 2934331
3057B934331j48059j28417j14772p6896m4144r3989q5708n2174q6582j20965o843
3046A975782n2448l422r6536m1065l9438p4870j7750j15407q1595o9388K3228
3035A407091n1279j13844n5486o6008P89n0325n7032j7401j5459n0559M2681n6002
3023I17166l8609k1687K311R506r6065j5028j5977l2081K9639J0163l0526O076
3011G24888p3520q2450K4697j892m288n020k5022l7573o753L3678m9447j8202
2999D79096k0192m8710M6579L7634o6882o9842L8798K7547m711J8378o179K5254
2987D56770j6174p4238Q8Q524l6302K7459O7095l8808m6932o7577L2911O5190
2975C78006j8350p656m9654J5749J4856n6638K913O6552m4937n1665P2048l2676
$$ plain form
3057 2934331 2786272 2657855 2543083 2466187 2422043 2328054 2242346 2190172 2103590 1982625 1975782
3046 1975782 1923334 1919912 1823376 1782311 1742873 1668003 1650253 1534846 1453251 1383863 1407091
3035 1407091 1355812 1241968 1186482 1120474 1121263 1070938 1013906 996505 981046 930487 973168 917166
3023 917166 878557 856870 859181 868687 772622 757594 741617 709536 739175 749338 718812 724888
3011 724888 651368 568918 593615 591723 587435 582415 557393 519820 513067 546745 497298 479096
2999 479096 458904 410194 456773 494407 427525 357683 396481 424028 419317 437695 431516 456770
2987 456770 440596 366358 366446 374970 338668 366127 433222 394414 347482 279905 312816 378006
2975 378006 359656 352000 302346 318095 332951 276313 279226 345778 300841 249176 321224 288548
2963B88548m0665L2789L5857m6675O75M592k6359k0418J257J5920n9147M2945
2951B29319L1177k585n4732P1770k6594R619J714n4264O404N487K0902o7898o247
2938A64072L9254p6897L1696K3821M3845j5013p3318l193L2542k2393k2534O1847
2926A83729O56m8536k8679m5330J8036K3829K3596k9404l5280L78P1017k8805
2914A05207k5235Q2254N7990l1124k8885k3676j3317P3259J3135k3668n8760Q4314
2902B11494m9361k6583k93m8272m1388q1M8576M9762m3088k0707P447J0507l6195
2889F1818p720O809J6470k068l9974K504M2650M655j5064j1626j3031m479n944
2876C5000q047L0727q651n5280P4124L008n5827N2885K2712j8462J1609m0379
$$ plain form
2963 288548 247883 280672 316529 269854 270529 275121 248762 228344 229601 245521 186374 229319
2951 229319 260496 257911 203179 274949 248355 257974 259688 205424 211828 217315 238217 170319 164072
2938 164072 203326 126429 158125 181946 225791 210778 137460 134267 166809 144416 121882 183729
2926 183729 184385 135849 107170 61840 79876 103705 127301 97897 62617 62995 134012 105207
2914 105207 79972 162226 220216 189092 160207 136531 123214 196473 209608 185940 127180 211494
2902 211494 162133 135550 135257 86985 45597 45516 94092 143854 100766 80059 87506 98013 61818
2889 61818 54098 60907 77377 75309 35335 37839 80489 85144 70080 58454 45423 40944 35000
2876 35000 26953 57680 49029 -6251 67873 70881 15054 67939 90651 72189 83798 43419
2864D3419l727k0731l3765n540K0863O587j5532O8926L7301l1429j6674l5231
2852A4467J396K466J9293M0894l5073j7261L0546r667n7628k9583k5909J1803
2840e4256P0432J9855J254j1840K9642J1022L8583m7866k2473K4093J0529j4466
2828E4509J9928K9228k693m4440j06935J0141k419J1173j876N5295J3679l1934
2816C656J6104L7153j6715k0843O0020k7335j2386m5834q704j0891l3719J611
2804e7883O7860J6777M1063j4898p1624n49k6684k0665M4393O6696n871N7689
2792I6304o7296j8888j3935M8746J3187L8161L349j3130J533l9085m8188j3965
2780a3207M5366J5537k4225j9134M6389L3243R052n5431N539J549j1384j3975
$$ plain form
2864 43419 39692 18961 -14804 -20344 519 7106 -8426 60500 97801 66372 49698 14467
2852 14467 15863 18329 37622 78516 43443 26182 56728 47061 -10567 -40150 -66059 -54256
2840 -54256 16176 36031 37285 25445 55087 66109 104692 56826 34353 58446 68975 54509
2828 54509 74437 103665 100972 56532 -50403 -40262 -42681 -31508 -33384 21911 35590 3656
2816 3656 19760 56913 40198 19355 79375 52040 39654 -6180 -14884 -25775 -59494 -57883
2804 -57883 9977 26754 67817 52919 -18705 -19254 -45938 -66603 -22210 44486 38615 96304
2792 96304 29008 10120 -3815 44931 58118 96279 99628 86498 88031 48946 758 -13207
2780 -13207 32159 47696 23471 4337 50726 83969 93021 37590 43129 44678 33294 19319
2768A9319k5383N8295J6166n7867n0275L0191J6703l9319O842N910J433J7850
2756a35Q09J9654J337j1322j0159K1243L6544p9371n1353K6863J8966q247l7720
2743g2891L7133O7010k3402j1461Q55q28m8306K5924M5235m6695k0830r870l3377
2730i1503Q4040J6101m1345K8109k14q5810K491P7024l589J4340l2677O397l4899
2717f1535k8872l906N0375J2542k4789K2906m8016k597p868M3200k6105k3490
2705i8155L6591J3884J892M0969j317J2937l8138L9310k2869k5786p561M9168
2693I25p859k8479P2069r8552L0934J4922M4733k2262n3096j3892j107P929l9595
2680i3330M0029L6384k2421m8593n935N6216J456O707K1113k6425l7591N1685
$$ plain form
2768 19319 -6064 52231 68397 10530 -39745 -9554 7149 -32170 -25328 -19418 -17985 -135
2756 -135 674 20328 21665 10343 184 21427 57971 -21400 -72753 -45890 -26924 -35171 -72891
2743 -72891 -35758 31252 7850 -3611 -2756 -3584 -51890 -25966 19269 -27426 -48256 -58126 -91503
2730 -91503 -7463 8638 -32707 -4598 -4812 -90622 -88131 -11107 -14696 -356 -33033 -26636 -61535
2717 -61535 -90407 -94313 -43938 -31396 -56185 -33279 -81295 -83892 -91760 -48560 -74665 -98155
2705 -98155 -61564 -47680 -45788 -4819 -6136 6801 -31337 7973 -14896 -40682 -48243 925
2693 925 -6934 -35413 36656 -61896 -30962 -16040 28693 6431 -46665 -60557 -61664 -53735 -93330
2680 -93330 -53301 -16917 -39338 -87931 -93866 -37650 -36194 -29487 -8374 -34799 -72390 -20705
2668b0705K0804J5779j9055j9109k5613k7683K4385K8194j6362o2602O0084o2908
2656a04791p135J17660n9924O1567m8779n2021Q8362o4578N89J1245L57o29R129
2643d8948k6820L1188n3o292N586K9759r761p7122j9247j1819O4525N2436J8670
2630B102o024j3359q8017L5039J1784l4045k1347J7598Q0051J8955l4688k4066
2618e6017n1861K0363K3480L4993l9380n3460J5111p160N4778j0566j0784q521
2606h9024r262L2586L5754j3489L4854M5505J1018m4734p0205j3595L287O940
2594g0365J7919o6808j0216K921N5798K4532j2529L7466n102l3764J6816J7591
2582b5741L2410l3627m2712M1590R085j6771j1555j6517l2854L4306K8418O8593
$$ plain form
2668 -20705 99 15878 -3177 -22286 -47899 -75582 -51197 -23003 -39365 -101967 -41883 -104791
2656 -104791 -111926 5734 -54190 7377 -41402 -93423 -5061 -69639 -69050 -57805 -57448 -58077 -48948
2643 -48948 -75768 -44580 -44633 -50925 -45339 -15580 -25341 -102463 -121710 -133529 -69004 -16568 2102
2630 2102 -3922 -17281 -105298 -70259 -58475 -92520 -113867 -96269 -16218 2737 -31951 -56017
2618 -56017 -107878 -87515 -64035 -29042 -68422 -121882 -106771 -113931 -59153 -69719 -80503 -89024
2606 -89024 -98286 -65700 -29946 -43435 -8581 36924 47942 3208 -66997 -80592 -77305 -70365
2594 -70365 -52446 -119254 -129470 -126549 -70751 -46219 -58748 -21282 -26384 -60148 -43332 -25741
2582 -25741 6669 -26958 -69670 -28080 -18995 -35766 -47321 -63838 -96692 -62386 -33968 34625
2570C4625k8654N3182O9846j0917J0137k7608l0403P489j6004K1829l7276j04765
2558e8519K1775o0790R457M231J0807O064n5752j0570Q0856N8570m5349K4720
2546a4500L667k3677l4409k9435L8831j896p026m026n7130L7172K5471K767M836
2533e9355L7382K088l6524k2439L3054L2916m7028j4032l2088o95O7915P4888
2521C6082q179n5385k7005j2278n91J6499n1585J2592O0648n4048o9084M0926
2509a11408O1290M5179n5764l6884N4543q406L2930K3320j6121p009j1799Q109
2497b2020m2930o882L9142l4010K434O9271r149p2687j3276L7492p276L2669O604
2484b0618n573L1789K7430l9305n0163N653r831o468J2576N6597J7702q6026k3941
$$ plain form
2570 34625 5971 59153 128999 118082 128219 100611 70208 77697 61693 83522 46246 -58519
2558 -58519 -36744 -97534 -88077 -83846 -73039 -66975 -122727 -133297 -52441 6129 -39220 -14500
2546 -14500 -10833 -34510 -68919 -98354 -59523 -61419 -68445 -72471 -129601 -92429 -66958 -64191 -59355
2533 -59355 -21973 -19885 -56409 -78848 -45794 -12878 -59906 -73938 -106026 -106721 -38806 36082
2521 36082 27903 -27482 -54487 -66765 -67356 -50857 -102442 -89850 -29202 -83250 -152334 -111408
2509 -111408 -50118 -4939 -60703 -97587 -43044 -51450 -18520 4800 -11321 -18330 -30129 -22020
2497 -22020 -64950 -71832 -32690 -66700 -64266 5005 -4144 -76831 -90107 -52615 -59891 -27222 -20618
2484 -20618 -26191 5598 33028 -6277 -56440 -50787 -60618 -67086 -54510 2087 19789 -66237 -90178
2471i0178N2862l7550K5800j2641L5360k8649l744L9113n2654K0346O903j8410
2459f3442K0561k7695L5845J9947L8438M420j5504J3088p2224K3516K5561M5740
2447D8251l7717n0649j8129k6171L3718J3818q216j1691M9429r152j1859M9177
2435B0809m9945R196J7239q35L2808n3471O036N3142k6931m5672m961k2835J5817
2422d9603J8849O9916M0277l6104j2702m6206k2571j1876M1411L230N550O0928
2410F1099k6491J6832L4577l2843k6034m6909k0124N8014K734j5251j6250m3300
2398e3946L5820J0672Q290Q2263K6083q1692j4089L8051J6652M3158n330Q263
2386A14195m396J1474j9256q011M5864l7434M3981M8035j7743l9480j4259K9187
$$ plain form
2471 -90178 -37316 -74866 -49066 -61707 -26347 -54996 -58740 -19627 -72281 -51935 -45032 -63442
2459 -63442 -42881 -70576 -34731 -14784 23654 28074 12570 25658 -46566 -23050 2511 48251
2447 48251 10534 -40115 -58244 -84415 -50697 -36879 -45095 -56786 -7357 -16509 -28368 20809
2435 20809 -29136 -19940 -2701 -3536 29272 -24199 -18163 34979 8048 -37624 -42585 -65420 -49603
2422 -49603 -30754 39162 79439 43335 30633 -15573 -38144 -50020 -8609 -5379 171 61099
2410 61099 34608 51440 86017 53174 27140 -19769 -39893 18121 20855 5604 -10646 -53946
2398 -53946 -18126 -7454 836 83099 109182 27490 13401 51452 68104 111262 105932 114195
2386 114195 109799 121273 102017 94006 139870 102436 146417 194452 176709 137229 122970 152157
2374A52157O587m6433K6481L0832N6308k1979j9744k6975n880M3886m9462r812
2362A35966K5761L8506Q324K0422m4017M889J3997N8408k981l215M3014j2018
2350B87056N3747j3858J1135j3873Q631n2232K8074L6125J1920M3023J0727L9618
2338D50093L2320J4458j5477l7347l2174O8811Q0327j6679O1535P0570K946M6517
2326G25900J9061L7379M7469O7056J18762R4808Q3589J26461K38331K18036K80710
2315B057562K95503K00632K36698J49328J77978L01766K97363L90613O50070Q19040
2305E576553J248511K079447L615586M927289M894146L985603K115924R9774j068872
2296B7473961k496918l183393k888042k836189k712775k428031k007197j668445
$$ plain form
2374 152157 158744 112311 138792 169624 225932 203953 184209 157234 151354 195240 145778 135966
2362 135966 161727 200233 208557 228979 184962 189851 203848 262256 259275 256060 299074 287056
2350 287056 340803 326945 338080 324207 332838 280606 308680 344805 356725 399748 410475 450093
2338 450093 482413 496871 481394 444047 411873 480684 561011 544332 605867 676437 679383 725900
2326 725900 744961 782340 829809 896865 1015627 1110435 1194024 1320485 1558816 1776852 2057562
2315 2057562 2353065 2553697 2790395 2939723 3117701 3419467 3716830 4107443 4757513 5576553
2305 5576553 6825064 8904511 12520097 17447386 22341532 26327135 28443059 28542833 27473961
2296 27473961 24977043 21793650 18905608 16069419 13356644 10928613 8921416 7252971
2288G252971j350754j016855o19688l95557l65434m04759l39656k78587k26347
2279B255334j65863k30879j62341j13929j72479j48165q7638o3296l9161m9137
2269A022446n3687l9088M8846j02238l0714m3648o5214m7173N335O657n6034o3667
2257E81821o5752J9233J1092J9070k8581l3868l9798p3967l3665R034k0721o371
2245C37527m7953l6107l4901Q335L5310M8802j5113p5795P456K4307J9380r232
2233B62016O0903m1477p6235L729O2316m1524o4548O73O289J7396m295m4961q4248
2220E6034J27643P7543l3210l1041o9713n5538P831n739j3276k4295J9482l5148
2208B0573Q6613J3593k6153n7537q905J6555k3014L6680N5937k8191l1191l959
$$ plain form
2288 7252971 5902217 4885362 4265674 3870117 3504683 3099924 2760268 2481681 2255334
2279 2255334 2089471 1858592 1696251 1582322 1409843 1261678 1174040 1110744 1071583 1022446
2269 1022446 968759 929671 978517 876279 845565 801917 736703 689530 694865 701522 645488 581821
2257 581821 516069 535302 546394 565464 536883 503015 463217 389250 355585 364619 343898 337527
2245 337527 289574 253467 218566 226901 262211 311013 295900 220105 227561 251868 271248 262016
2233 262016 322919 281442 205207 208936 271252 229728 165180 165853 172142 189538 185243 140282 56034
2220 56034 183677 261220 228010 196969 127256 71718 79549 73810 60534 36239 55721 20573
2208 20573 107186 120779 94626 37089 28184 44739 21725 58405 114342 86151 54960 51001
2196E1001k1218J2125k3483M0345J2228l0789l3048q633J9482K9100k3581R876
2184C3405M650n9297L8142J9496o221l4342l3561N9089k2423N8729J2739l630
2172F6776k4003m5242j09684L5650M5957k9683J03981q112m5059M8906J592k341
2160C8738o1122J28O9489k6606J0518l728P762J5885r8272R118L7559K9941j5477
2147A3933k9620k3112R987P334j1799L631l8598o259n4255J5555M2260k4961l850
2134i9754P1285l599m6702J4381K7397L3327l503o7106j4703J4055K3106K8629
2122b3187L6214m7481J4961N3325j8407k2461l3085M7360k4825k3019L4460l6388
2110d2533J8107j603m0230k6401L7290Q479M9800j0099o4415M892K0085k8340
$$ plain form
2196 51001 29783 41908 18425 58770 70998 40209 7161 -1472 18010 47110 23529 33405
2184 33405 38055 -21242 16900 36396 30175 -4167 -37728 21361 -1062 57667 70406 66776
2172 66776 42773 -2469 -112153 -76503 -30546 -60229 43752 35640 -9419 39487 41079 38738
2160 38738 -22384 -22256 47233 20627 31145 27417 35179 51064 -47208 -38090 -531 29410 13933
2147 13933 -15687 -38799 -28812 -21478 -33277 -29646 -68244 -74503 -128758 -113203 -70943 -95904 -99754
2134 -99754 -28469 -32068 -78770 -64389 -36992 -3665 -7168 -74274 -88977 -74922 -51816 -23187
2122 -23187 13027 -34454 -19493 33832 15425 -7036 -40121 7239 -17586 -40605 -6145 -42533
2110 -42533 -24426 -26029 -66259 -92660 -55370 -46891 2909 -7190 -71605 -66713 -46628 -74968
2098g4968k6601R291R907k3604K784J7660L7046K8240m7825m110k6796L0855L7916
2085c0205m4945J6696L3816O961k2956J8608l692l935k6748m248j0372k4150j3165
2072a08335M2241l053k5105j154M8038j7624o5903N3445K7257j93l4263P7204
2060g445m833q7723M9195j0860l010m723p1770K8845k1509L0795m5218O9886k842
2047h1212L9314L8648j5993K6151J5570p1742k0031L7592o7996L7062m5851j1246
2035a19734R0776P6476j8013k4314M0585k2261n9987J19988O082j4076l7325k9557
2023H640O098J472n0152k2352L0457k8449j6876L4960L1669l5121j4288k7015
2011h0957N280j9394o231L5414j5744K7039m443M8932Q0060r6058J499J9500k5195
$$ plain form
2098 -74968 -101569 -92278 -82371 -105975 -103191 -85531 -48485 -20245 -68070 -72180 -98976 -68121 -30205
2085 -30205 -75150 -58454 -24638 -17677 -40633 -22025 -25717 -29652 -56400 -60648 -71020 -95170 -108335
2072 -108335 -66094 -69147 -94252 -95406 -47368 -64992 -130895 -77450 -50193 -50386 -84649 -7445
2060 -7445 -12278 -100001 -50806 -61666 -64676 -69399 -141169 -112324 -133833 -103038 -148256 -78370 -81212
2047 -81212 -41898 -3250 -19243 6908 22478 -49264 -69295 -31703 -99699 -62637 -108488 -119734
2035 -119734 -28958 47518 29505 5191 45776 23515 -36472 83516 89598 75522 38197 8640
2023 8640 14738 16210 -33942 -56294 -25837 -54286 -71162 -36202 -4533 -39654 -53942 -80957
2011 -80957 -75677 -95071 -101302 -65888 -81632 -54593 -59036 -10104 69956 -26102 -24603 -5103 -30298
1998c0298o7724K30O6885J7510k1489L6208N41Q501m5854n9616J7149J9305n5508
1985a14160K7683K5135L1546K1906k1128j3338J8937o9324k3044M4083L9624j9558
1973e1638K004L2051k0702O112l3738l324j7370L8573r919L4246P310O170j3664
1960b3889N2153Q974n9390J1664L7149l1555k4347J1397k9553J4433k1706n8771
1948a13441L6001o8583M2454N5213m7687N5603J0354k378n4891K1917K0695k2491
1936f7234n6036K8469J6989L1569j3824j2072k9610N0372J885o7052O1236M364
1924e0944l0936N2221m8154l0047M7604r919l8414l6406N4363L6997M1204l9308
1912e1739j7596k2390K2224M4235K3689n5738p2672K5664j4658N2547J203j7088
$$ plain form
1998 -30298 -98022 -97792 -30907 -13397 -34886 1322 1863 10364 -35490 -95106 -77957 -58652 -114160
1985 -114160 -86477 -61342 -29796 -7890 -29018 -42356 -23419 -92743 -115787 -71704 -32080 -51638
1973 -51638 -49634 -17583 -38285 -32173 -65911 -69235 -86605 -48032 -57951 -23705 -16395 -10225 -23889
1960 -23889 28264 37238 -22152 -10488 26661 -4894 -29241 -17844 -47397 -32964 -54670 -113441
1948 -113441 -77440 -146023 -103569 -48356 -96043 -40440 -30086 -32464 -87355 -65438 -44743 -67234
1936 -67234 -123270 -94801 -77812 -46243 -60067 -72139 -101749 -51377 -49492 -116544 -55308 -50944
1924 -50944 -81880 -29659 -77813 -107860 -60256 -70175 -108589 -144995 -90632 -53635 -12431 -51739
1912 -51739 -69335 -91725 -69501 -25266 -1577 -57315 -129987 -104323 -118981 -66434 -65231 -82319
1900h2319K7142L0960N3209q6167M8222l706m0635r104M8420q1404k1575Q6131
1888c0826K7786k9167j4470l257J2044n1273N1314j3334K5354Q023m605n4720
1876g7131M6460L7902p9875l4371N9210K9124J1753J607p704n8163J1829L7705
1864b1654l9654l4461K2393o417k9590N6984j5719O7761L492n3524J038J6747
1852c2604n5179m9491N6720N7450o9857K2983k1098K5336K8275R152p625M042
1840c1896k4359N4020m9286J4884J0635k2126J4031N6798l7656n258l1222J4857
1828c6578J5236p3867K2756J7722k0481K3832J5632M079k266m2087K5379m0560
1816i1203l5361J7390M8305N529K1723l3156l5763P2336j2390j5053p4589N7092
$$ plain form
1900 -82319 -55177 -24217 28992 -57175 -8953 -12659 -53294 -62398 -13978 -95382 -116957 -30826
1888 -30826 -3040 -32207 -46677 -49934 -37890 -89163 -37849 -51183 -25829 -17806 -22411 -77131
1876 -77131 -30671 7231 -72644 -107015 -47805 -18681 -6928 -5321 -13025 -71188 -59359 -21654
1864 -21654 -61308 -95769 -73376 -79793 -109383 -52399 -68118 -357 3135 -50389 -49351 -32604
1852 -32604 -87783 -137274 -80554 -23104 -92961 -69978 -91076 -65740 -37465 -28313 -35938 -31896
1840 -31896 -56255 -2235 -51521 -36637 -26002 -48128 -34097 22701 -14955 -20213 -51435 -36578
1828 -36578 -21342 -95209 -72453 -54731 -75212 -51380 -35748 -31669 -33935 -76022 -50643 -91203
1816 -91203 -126564 -109174 -60869 -55340 -33617 -66773 -102536 -30200 -42590 -57643 -132232 -75140
1804g5140K9564J39l5801k1500N0907J6749j2843j2302M733J5746k4955M828L9437
1791b0438M3703l5475K831m3731m5236P9994P503m1828j4556m8425K4914P6680
1779a4064p423j8801M7884k2465n3605K3996n5934P905N9851k1520L2056J2935
1767i185k4879j91l2045M095K4258j5714K4354J2964l6739l5665L4498M1266R831
1754c152q301l0761k7582j7484L0075l8819J1877M2156p469l5384L2458M080k6585
1741g4891J9029j597p753O8678j9327K1132l6799k6595j2943m921n8956k0444
1729a55387J6762R1060k2563Q057k0526k1304M388K8107K0330L0188n6573L3894
1717d3567M9210q164l6134o6976J0576Q2768r173l6825k0023k6468L4451L198
$$ plain form
1804 -75140 -45576 -45437 -81238 -102738 -51831 -35082 -47925 -60227 -55494 -39748 -64703 -59875 -20438
1791 -20438 23265 -12210 -9379 -53110 -98346 -18352 -10849 -52677 -67233 -115658 -90744 -14064
1779 -14064 -21487 -40288 7596 -14869 -68474 -44478 -100412 -92507 -32656 -54176 -22120 -9185
1767 -9185 -34064 -34255 -66300 -62205 -37947 -53661 -29307 -16343 -53082 -88747 -54249 -12983 -3152
1754 -3152 -11453 -42214 -69796 -87280 -57205 -96024 -84147 -41991 -49460 -84844 -52386 -48306 -74891
1741 -74891 -55862 -57459 -65212 3466 -15861 5271 -31528 -58123 -71066 -75987 -134943 -155387
1729 -155387 -138625 -47565 -70128 -62071 -82597 -103901 -99513 -71406 -51076 -20888 -77461 -43567
1717 -43567 5643 -2521 -38655 -105631 -95055 -12287 -21460 -58285 -78308 -104776 -70325 -67127
1705f7127j414J3857l7595N1242N571m6715m3256N931O0472n8748J2104N332l3110
1692a33456K464K0732J6809Q6199k7181L0228M9182n2096j2448o3747q4597K0821
1680a47090N3509J23371o2945m5318R158L9511o0447n5011L8630M6307J1988K9834
1668a8503n3197P979O5243j0734m803K5154m5050J6954M173o3030O2089N3870
1656D0145k3175o7531m8345L7863Q9493k9972k5790k2156o9421L380o46r107P0322
1643e4940N570J361K7384P2220k1494n0644m8554l2934M9071K8016P061q227J9624
1630f486K6731k4294L1075m5549J2970L383j5112j2581o5321P2282j050K3210
1618g42M312p5732p47O3350o291j06049R903P6668L9802K9352q5409l3471K6432
$$ plain form
1705 -67127 -68541 -54684 -92279 -41037 -35466 -82181 -125437 -119506 -59034 -117782 -105678 -100346 -133456
1692 -133456 -130992 -110260 -93451 -7252 -34433 -4205 44977 -7119 -19567 -83314 -167911 -147090
1680 -147090 -93581 29790 -33155 -78473 -69315 -29804 -90251 -145262 -106632 -60325 -48337 -18503
1668 -18503 -71700 -63721 1522 -9212 -14015 11139 -33911 -16957 -12784 -75814 -13725 40145
1656 40145 16970 -50561 -98906 -61043 28450 -1522 -27312 -49468 -118889 -115509 -116155 -125262 -54940
1643 -54940 -49370 -48009 -20625 51595 30101 -20543 -69097 -102031 -52960 -24944 -17883 -26110 -6486
1630 -6486 20245 -4049 27026 -18523 -5553 -2170 -17282 -29863 -95184 -22902 -23952 -742
1618 -742 3570 -72162 -72909 -9559 -15850 -121899 -111996 -35328 4474 33826 -51583 -85054 -58622
1605e8622R3306N5264q559r4624m8682O890k0441J7972J4190J4376M4211K2351
1593C7632j4760k6056j2143k2769M4631p031q173p676q268J2855P541j478J0029
1580D334j6938N822k0190L5934K439j6118l4412j455K1517J4081k7802K2058j5755
1567b6485m9842P2407K8828o3670j0457q473n1346L330k0772N0133K2916l601
1555e7032o791P6123q324K3256m0501l9377n88L5888n268j2094m1748K6800K0662
1542b8994m3700l8251N4284R732j3179k0468j0829q680L9755L9174m3013q224
1530g2393K968M2753l2548J1713L2609j9749K8886j6624k4230k5593N4647p415
1518b4976j5170k2728L5377N0415q6801k3999Q1172k8616O055M307j7618m0980
$$ plain form
1605 -58622 34684 89948 81389 -13235 -61917 -55027 -75468 -57496 -43306 -28930 15281 37632
1593 37632 22872 -3184 -15327 -38096 6535 -496 -8669 -16345 -24613 -11758 -4217 -5695 4334
1580 4334 -12604 -6782 -26972 8962 11401 -4717 -39129 -40584 -19067 -4986 -32788 -10730 -26485
1567 -26485 -76327 -3920 24908 -38762 -49219 -57692 -109038 -105708 -126480 -76347 -53431 -57032
1555 -57032 -63823 12300 3976 27232 -13269 -52646 -53234 -17346 -22614 -34708 -76456 -49656 -28994
1542 -28994 -72694 -110945 -56661 -46929 -60108 -80576 -91405 -100085 -60330 -21156 -64169 -72393
1530 -72393 -69425 -26672 -59220 -47507 -14898 -34647 -5761 -22385 -46615 -72208 -17561 -24976
1518 -24976 -40146 -62874 -27497 22918 -63883 -87882 -6710 -35326 -29271 -24964 -42582 -83562
1506h3562M9134K3346l6808M9759o6075N320K5305O745j0525J5387l3546q33j1953
1493f8306J7598k2822L0856N2929l0417n837M2535L797m3729j9293K3781l6988
1481e5896M1924m6150m4901M7933P46P4474j6983l7212O4717J6476n7547K1832
1469I413p012l5433J7785K5838K0179k2006J9069l2408N847m1786j3355j0369
1457f4238j9205K686p808j316k5159j2656N7021L2082k6776Q924P628P121M963
1444c6733k9088J9010k8601k0565J8278M2124o101j11884K9272O6004O3285K4791
1432B9792j1163j12391M5160K4873q305L4638M2552r188J6321k8631r2809K5561
1420d3590P1993m8171J2118j0956K7478j78k2219N5437j3547n1675l8957K4790
$$ plain form
1506 -83562 -34428 -11082 -47890 1869 -64206 -58886 -33581 -26836 -37361 -21974 -55520 -56353 -68306
1493 -68306 -50708 -73530 -42674 10255 -20162 -25999 16536 20333 -23396 -42689 -18908 -55896
1481 -55896 -13972 -60122 -105023 -57090 -56344 18130 1147 -36065 28652 45128 -12419 9413
1469 9413 2401 -33032 -15247 10591 30770 8764 27833 -4575 1272 -40514 -53869 -64238
1457 -64238 -83443 -80757 -88565 -89881 -115040 -127696 -70675 -38593 -65369 -56445 -48817 -41696 -36733
1444 -36733 -65821 -46811 -75412 -95977 -77699 -35575 -41676 -153560 -124288 -58284 5001 29792
1432 29792 18629 -93762 -48602 -23729 -32034 2604 45156 35968 52289 23658 -69151 -43590
1420 -43590 28403 -19768 -7650 -18606 8872 8694 -13525 41912 28365 -23310 -62267 -37477
1408c7477l562K8429M7896l8850o1899o4734N230J31559P67j3453m0048k2067
1396f8209n1131N3399M251L5144M1526n9134o3893J9596L6762j5059L0036L0556
1384f156k726K5355k07m2421j0094K88Q5691J4984j7212o2697N435k3340n1637
1371h4737O9536N7178l1458J1957m0783N2241l2747q5768O4698j0872k3890K7005
1359b7640k8902p804M7354k927p032m8414K4093O429j9266J3149N53j3205N5054
1346h558M3736r3349K92N1260N055P386l9744m7227O6632M1621j6389j253k7728
1333a8266r812l6577M0649J8557J6210j5047k7485n5994L9983J6633n26j8051
1321d9726M8415r905J6230l8388p261m4080O5240P1937k3033l1259m7146P985
$$ plain form
1408 -37477 -41039 -12610 35286 -3564 -65463 -130197 -124967 6592 7359 -6094 -46142 -68209
1396 -68209 -119340 -65941 -61690 -26546 14980 -44154 -108047 -88451 -51689 -66748 -36712 -6156
1384 -6156 -8882 16473 16266 -26155 -36249 -35961 49730 64714 47502 -15195 -9760 -33100 -84737
1371 -84737 -15201 41977 10519 22476 -18307 33934 1187 -84581 -19883 -30755 -54645 -27640
1359 -27640 -56542 -64346 -16992 -19919 -26951 -75365 -51272 -44843 -64109 -50960 -50407 -63612 -8558
1346 -8558 35178 -58171 -57879 -6619 -1564 5822 -33922 -81149 -14517 27104 10715 9462 -18266
1333 -18266 -28078 -64655 -24006 -5449 10761 -4286 -31771 -87765 -47782 -31149 -31675 -49726
1321 -49726 -1311 -11216 5014 -33374 -40635 -84715 -19475 52462 29429 -1830 -48976 -40991
1309d0991j6318P5061M5164R729j8161m5824N869J0012J0530M311p8685J9466
1297a9837l0365M0060J3726p252M1448m469q2496J2720O8810J4479l1632M430
1285A9622o5377n4822L6424L972Q9651k8433m1591L5904m957N3082K4918j0742
1273E7651p5124P1055K938n1968k9294m4984K4521k4905J080K6128N3582L4154
1261D4834p0758p34L0521j4307l2385j577j875J5922N0099k341n401J1626m1455
1248a7831j6185M6330P1065q3944M7907K520l2297k8832K3218K3613l3616j4840
1236a2892J0125q980K2143Q798n5306K3897K3235P887p7214j7753m456J2559K0929
1223d7028L7817j1365M7127l6504j0528J4736K0843J6523o4985r18j310M636J3583
$$ plain form
1309 -40991 -57309 17752 62916 72645 54484 8660 14529 24541 35071 39382 -39303 -19837
1297 -19837 -50202 -10142 3584 -3668 37780 33311 -49185 -36465 32345 46824 15192 19622
1285 19622 -45755 -100577 -64153 -60181 29470 1037 -40554 -4650 -9607 43475 68393 57651
1273 57651 -17473 53582 56520 4552 -24742 -69726 -45205 -70110 -69030 -42902 10680 44834
1261 44834 -25924 -26658 3863 -10444 -42829 -44406 -46281 -30359 19740 17399 11998 23624 -17831
1248 -17831 -34016 12314 83379 -565 47342 49862 17565 -11267 11951 35564 1948 -12892
1236 -12892 -2767 -11747 10396 19194 -36112 -12215 11020 18907 -58307 -76060 -80516 -67957 -47028
1223 -47028 -9211 -20576 26551 -9953 -20481 -5745 15098 31621 -33364 -34282 -35592 -30956 -17373
1210a7373o1268j3941M5979K3211l4804R606J0386K329L0992l5661k6114n275
1198g1933N4066L3769K9788L0558Q191l1022k4581J1790o0579k6177L2037J9189
1186E096j5767L1124k1696J5130m8362J4655M8146L961k0945J0532L8135k3372
1174C6637j09r7178J2103O1840N2328N9780j3162j1470p6415n035K0358p443l193
1161B9041n954P585p0391L3446o6l0876M3528L380p9735O9281M4527l9262k211
1148B293O3720j2322p9286L2013K3078L0958q1247L3308N9768o0737r806O1503
1136F3243l5127m1033n514N176p643j4866M9718M791J701m1763K1739k8991l9315
1123f7884N9553p3635K0862J07287J1359j0399K7527K8558m044l7335n5985p7297
$$ plain form
1210 -17373 -78641 -92582 -46603 -23392 -58196 -48590 -38204 -35875 -4883 -40544 -66658 -71933
1198 -71933 -17867 15902 45690 76248 84439 53417 28836 40626 -19953 -46130 -14093 5096
1186 5096 -10671 20453 -1243 13887 -34475 -19820 28326 32287 11342 21874 60009 36637
1174 36637 36528 -60650 -48547 13293 65621 125401 112239 100769 24354 19319 39677 32234 29041
1161 29041 23087 30672 -39719 -6273 -6339 -37215 6313 9693 -70042 -761 43766 4504 2293
1148 2293 66013 53691 -25595 6418 29496 60454 -20793 12515 72283 11546 1740 63243
1136 63243 28116 -12917 -18431 -13255 -20898 -35764 13954 18745 20446 -21317 422 -28569 -67884
1123 -67884 -8331 -81966 -61104 46183 57542 47143 74670 103228 99184 61849 5864 -71433
1111g1433O3335M5593J7841j2568L4692L6910j02128n6146N186J003M0370l4097
1099c1442K5168J9226j3268m8668l4751N7702L0599R211n6836P8415k4235l9275
1087b8154l0100M2424J5409n801j6029K8071k6827J2694M3653K1028N8429n8165
1075E6632K3281J5084o1835L84n9308J455P9376q485n6029n555O2191k2048k0766
1062D377k1320J4845m576M0335o3145K4234M1738n9613N2462L9949m6321K6208
1050D9173J8011j1919j859P447k4395j7693m700q42K2066k8660R364R260K3448
1037D8701K7552o243k4298k1426n1556r778j3658K9911m8693K8023N9241j47n196
1024A2433n8492K6512P1123N4197l6534j8487q766m4259l0165R525M1994J0415
$$ plain form
1111 -71433 -8098 37495 55336 42768 77460 114370 12242 -43904 -38718 -37715 2655 -31442
1099 -31442 -6274 12952 -316 -48984 -83735 -26033 4566 13777 -43059 35356 11121 -28154
1087 -28154 -58254 -15830 -421 -6222 -22251 5820 -21007 -8313 35340 56368 114797 56632
1075 56632 79913 94997 33162 33546 -25762 -24307 55069 46584 -9445 -15000 47191 25143 4377
1062 4377 -16943 -2098 -6674 33661 -29484 -5250 36488 -23125 29337 69286 22965 49173
1050 49173 67184 55265 53406 60853 36458 18765 14065 13223 35289 6629 15993 25253 48701
1037 48701 76253 70010 45712 24286 -27270 -37048 -50706 -20795 -69488 -41465 17776 17629 12433
1024 12433 -46059 -19547 51576 105773 69239 50752 41986 -2273 -32438 -22913 19081 29496
1012B9496j6501J0599K141m7819J5898K9616k7902l5814p028K653O9464k024K271
999B5050o1707n573N7677J0752k0626p147K2894R826j9428n751O4073M1765o5762
986D6043o7191o4061K5760N2894K1501K8620o796J2887J3751k2562m2566m768
974f488K9291m6927N5114K2478n336p779m7151N7564k5256l221m9905J238K4971
961a407O577m3787m5968P6690M7258p558M0413p1195m608P2332m1488K7552p86
948E4025l6964o8667R310L2221L6643O699J8932l7489K6894O411J3678L1204l7598
935E5299J2888k9672k7996O391O2491n4321M4245J3597K7737n674k7053o6938
923A0994j2259p6365L5386K4788l561J1271j1222K6995P552P0245K962l6515q70
$$ plain form
1012 29496 12995 23594 25735 -22084 -6186 23430 -4472 -40286 -47314 -44661 24803 22779 25050
999 25050 -36657 -42230 15447 26199 5573 -1574 21320 31146 11718 5967 70040 111805 46043
986 46043 -21148 -85209 -59449 -6555 14946 43566 36770 49657 63408 40846 -1720 -6488
974 -6488 22803 -24124 30990 53468 48132 40353 -6798 50766 25510 22289 -27616 -26378 -1407
961 -1407 5170 -38617 -84585 -7895 39363 31805 72218 1023 -3585 68747 27259 54811 54025
948 54025 17061 -51606 -42296 -10075 26568 33267 52199 14710 41604 48015 61693 92897 55299
935 55299 68187 38515 10519 16910 79401 25080 69325 82922 110659 104985 77932 10994
923 10994 -1265 -77630 -42244 -17456 -21017 -9746 -20968 6027 13579 83824 86786 50271 49401
910D9401n180J6421m8821j3160j4221N743M2486K4296k084j938p6475l3607k9008
897h6147j2718N7445K9710N7484N2737r744m7509N691n466L7642Q793m6787n287
884C5844l5200J2736J1862j5996n0575K2775J4943J7405M1791l1598j6904m2840
872c5757J3638K1588J07614n42j8136o7588j319N239J326L2563P638o0275j6123
859a0134K3910Q426l5181m4715L5183N4312l6330k3580M5191O785J2653L1234
847F7754l2768n43l9153r742J9937j2149r921L2932l1008M3820l3234Q54K060
834a161J1698K061M4831j7304q6166N0085j5674K7849n0390L500j5516L2680Q610
821d897M8635j9139j3507J5720m3515O2727J6325l8796J2467l5211n2747K3146
$$ plain form
910 49401 44221 60642 11821 -1339 -15560 -9817 32669 56965 54881 52943 -23532 -57139 -86147
897 -86147 -98865 -41420 -11710 45774 98511 88767 41258 46949 41483 79125 87918 41131 35844
884 35844 644 13380 25242 9246 -41329 -18554 -3611 13794 55585 23987 7083 -35757
872 -35757 -22119 -531 107083 106541 88405 20817 19498 24737 26063 58626 66264 5989 -10134
859 -10134 13776 22202 -12979 -57694 -22511 31801 -4529 -28109 17082 23867 36520 67754
847 67754 34986 34443 -4710 -14452 5485 -6664 -16585 16347 -14661 29159 -4075 -3221 -1161
834 -1161 10537 12598 57429 40125 -46041 4044 -11630 16219 -34171 -30671 -46187 -13507 -4897
821 -4897 43738 24599 11092 26812 -16703 46024 62349 23553 36020 809 -51938 -28792
809b8792k8611O5171K2671r669L7571q2062m8026J3169K7728J3172P1469n9606
797e815Q455M5162j9032j1378j7371O1937P2902k3330l6434p5020p731j1388M7025
784B7982O228j5466K7959K5798j5360M1016R171p3981L2010k1967k3207j3343
772F840K8711K852j9132j784n144l726J0503Q184Q215l4013L9380m1593j1617
759a2324p719R5378L6171m2797m3615m4446k0722L9345M8400J567K7032J5588
747I1858k4082M6740r5386k2921j6992k6695N7860J1204N3544j7105l2373n699
735A9953J9567q382j5373l3116o348M6895P4278K8532m5610p6300O994m6154O2439
722B7375Q2330M065j26344O898J27003o5254l6158K8750m8132K3783j5986K0000
$$ plain form
809 -28792 -57403 7768 30439 20770 58341 -23721 -71747 -58578 -30850 -17678 53791 -5815
797 -5815 2640 47802 28770 17392 21 61958 134860 111530 75096 76 -7655 -19043 27982
784 27982 34210 18744 46703 72501 57141 98157 107328 33347 65357 43390 20183 6840
772 6840 35551 38403 19271 17487 12343 8617 19120 27304 35519 1506 40886 -707 -12324
759 -12324 -20043 75335 111506 68709 25094 -19352 -40074 -729 47671 49238 76270 91858
747 91858 67776 114516 19130 -3791 -20783 -47478 10382 21586 75130 58025 25652 19953
735 19953 39520 31138 15765 -17351 -23699 23196 97474 126006 80396 4096 11090 -35064 27375
722 27375 109705 113770 -12574 -5676 121327 56073 19915 48665 533 24316 8330 28330
710B8330M1370n3122J9652m1439M833r400K0452Q5392j3909l9635N9652j7606
698H4570j45929O2141Q5174l5200K4652p673l5150K0612m2975M3131k935m8198
686B220o0663Q5732O470p4937N8958J1467J1460j3050p3392N6116N8006k1896
674D6491L4794j3724j6802L9095J2276j2027J8886j5641L4970j32932j4138O8353
662D9601l6553L048P858p179O1757N8389o0283n7134j6291N4214m0521Q590L4196
649E9692k8343M787N335l967J3887K6061q1414J1470Q0912j8953m947j3174k018
636D9328j0263n6567m5542l3376J01076P3477o0305L6195J0174k478m082q482
624D9155j5556Q745r395o900l8521k8306K1986N2749M2577n8983k1603K5156k6345
$$ plain form
710 28330 69700 16578 36230 -5209 -376 -9776 10676 96068 82159 42524 102176 84570
698 84570 -61359 782 85956 50756 75408 67735 32585 53197 10222 53353 50418 2220
686 2220 -58443 27289 33759 -41178 17780 29247 40707 27657 -45735 10381 68387 46491
674 46491 81285 67561 50759 89854 102130 90103 108989 93348 128318 -4614 -18752 49601
662 49601 13048 16096 23954 16775 78532 136921 76638 19504 3213 57427 16906 25496 59692
649 59692 31349 36136 41471 37504 51391 77452 -3962 7508 88420 69467 64520 51346 49328
636 49328 39065 -17502 -63044 -96420 4656 78133 17828 54023 64197 61719 57637 49155
624 49155 33599 42344 32949 26049 -12472 -40778 -18792 33957 76534 17551 -4052 21104 -5241
611e241M536j9378N8121L0113N103L8696p990l5240m6068k2173N1394L616J8876
598G4365P9099m0729l7950j8137m7626l8143N3923r815L6506L9730L485m7378
586D7330k8460K2192J3074m7394j260l0078J3236M8993N4385m8641k4760N2947
574G1564M29m8143l1261M3673l2456O0081L7789j6831K2046q2269K3383N785j4502
561C9288P371n6870j6807N189L2609R2875l0869o3551L9906K6529q170p688j8023
548D1789N1047o567q0499L3947L8469j1703L2285p5109k6725j967q502k2198J8910
535a6823M1017r146K0943J3177M2192k883k0932m6535J1412J8575m5139N534P707
522A9099l0030M5167j8309l4773j5875P114N4051K1527L4553L450m2279O3919
$$ plain form
611 -5241 -705 -20083 38038 68151 73254 111950 103960 68720 22652 479 51873 55489 74365
598 74365 153464 112735 74785 56648 9022 -29121 24802 14987 51493 91223 94708 47330
586 47330 18870 41062 54136 6742 5482 -24596 -11360 37633 92018 43377 18617 71564
574 71564 71993 23850 -7411 36262 3806 63887 101676 84845 106891 24622 48005 53790 39288
561 39288 46659 -10211 -27018 -21829 10780 103655 72786 9235 49141 75670 67500 59812 41789
548 41789 92836 86269 5770 39717 78186 66483 98768 23659 -3066 -5033 -13535 -35733 -16823
535 -16823 24194 15048 35991 49168 91360 88477 67545 21010 32422 50997 5858 11392 19099
522 19099 -10931 34236 15927 -18846 -34721 -27607 26444 47971 82524 85974 43695 107614
510A07614M4625o3019p8540J2376k0006K1143P5650m2719l7785k7425J6101M4051
498E2066l2955j0717r0042M3831K8798j0008j2987M5977O2669l1230K3800J3794
486H2996l0385k9105o28M7457j3217K4792m1546k7429O6336O546l9179n4336l654
473a1352J1172M3765R615j8101l8982L1589k9510m2596P6599M1720k1643Q04n8475
460e395J8636K2923K1550P5499n9391n1333J4645K9545l1246m9603J9417N9458
448F4705k6887m2555O876N9258m2816N3468P946j04119K1387M7371l8741m1241
$$ plain form
510 107614 152239 89220 10680 23056 3050 24193 99843 57124 19339 -8086 8015 52066
498 52066 19111 8394 -81648 -37817 -9019 -19027 -32014 13963 76632 45402 69202 82996
486 82996 52611 23506 22878 70335 57118 81910 40364 12935 79271 85817 46638 -7698 -11352
473 -11352 -180 43585 53200 35099 -3883 27706 -1804 -44400 32199 73919 52276 53080 -5395
460 -5395 13241 36164 57714 133213 73822 22489 37134 66679 35433 -14170 5247 64705
448 64705 37818 -4737 2139 61397 18581 72049 79995 -24124 -2737 44634 5893 -35348
$$ [...]
##END NTUPLES=NMR SPECTRUM
##END=
