##TITLE=1H_EC-3389(II-3)
 200.13Hz, CDCl3.
 8 sc
 24.8.2026
##JCAMPDX= 6.0         $$ Bruker NMR JCAMP-DX V2.0
##DATA TYPE= NMR SPECTRUM
##DATA CLASS= NTUPLES
##ORIGIN= UXNMR, Bruker Analytische Messtechnik GmbH
##OWNER= pz
$$ XWIN-NMR		Version 3.5
$$ Mon Aug 24 13:50:24 2026 Russian Standard Time (UT+4h)  she@DPX200
##.OBSERVE FREQUENCY= 200.1313
##.OBSERVE NUCLEUS= ^1H
##.ACQUISITION MODE= SIMULTANEOUS
##.ACQUISITION SCHEME= undefined
##.AVERAGES= 8
##.DIGITISER RES= 18
##SPECTROMETER/DATA SYSTEM= spect
##.PULSE SEQUENCE= zg30
##.SOLVENT NAME= CDCl3
##.SHIFT REFERENCE= (INTERNAL, CDCl3, 0, 15.4902)
##AUDIT TRAIL= $$ (NUMBER, WHEN, WHO, WHERE, WHAT)
$$ ##TITLE= Audit trail, XWIN-NMR		Version 3.5
$$ ##JCAMPDX= 5.01
$$ ##ORIGIN= Bruker BioSpin GmbH
$$ ##OWNER= she
$$ F:/spectra/data/she/nmr/H-C/1/pdata/1/auditp.txt
$$ ##AUDIT TRAIL=  $$ (NUMBER, WHEN, WHO, WHERE, WHAT)
(   1,<2026-08-24 13:49:07.09 +0400>,<she>,<DPX200>,
      <created by zg, POWCHK disabled, PULCHK disabled
       configuration hash MD5:
       00 E9 B6 7A A2 85 ED C7 34 08 36 98 17 FE 4E 26
       data hash MD5: 16K
       3B 54 83 32 7E C6 78 CE 80 B4 3D 91 9A D1 57 8C>)
(   2,<2026-08-24 13:49:09.28 +0400>,<she>,<DPX200>,
      <Start of raw data processing
       efp BC_mod = 2 LB = 0.25 FT_mod = 6 PKNL = 1 PHC0 = -4576.736 PHC1 = 7.992299 SI = 16K 
       data hash MD5: 16K
       E6 B4 A1 18 1F 05 A2 B6 DA 3D 7C 01 C6 3C 93 EE>)
(   3,<2026-08-24 13:49:27.31 +0400>,<she>,<DPX200>,
      <pk PHC0 = -1.033416 PHC1 = 0 
       data hash MD5: 16K
       A6 F5 F1 00 4D F9 A0 7D 60 5C FF A3 98 03 8F 04>)
(   4,<2026-08-24 13:49:31.18 +0400>,<she>,<DPX200>,
      <abs ABSG = 5 
       data hash MD5: 16K
       46 DE B5 40 B0 43 A6 6A 0B 83 2B FC 2C 15 94 ED>)
$$ ##END=
$$ 
$$ hash MD5
$$ 20 4F D7 4A FE 08 E4 01 17 58 47 D7 DE 2E 38 BA
##$RELAX= 
##$RELAX= 
##$RELAX= 
##$RELAX= 
##$RELAX= 
##$RELAX= 
$$ Bruker specific parameters
$$ --------------------------
##$DU= <F:/spectra>
##$EXPNO= 1
##$NAME= <H-C>
##$PROCNO= 1
##$TYPE= <nmr>
##$USER= <she>
##$AMP= (0..31)
100 100 100 100 100 100 100 100 100 100 100 100 100 100 100 100 100 100 
100 100 100 100 100 100 100 100 100 100 100 100 100 100 
##$AQSEQ= 0
##$AQ_mod= 1
##$AUNM= <au_zg>
##$AUTOPOS= <>
##$BF1= 200.13
##$BF2= 200.13
##$BF3= 200.13
##$BF4= 200.13
##$BF5= 200.13
##$BF6= 200.13
##$BF7= 200.13
##$BF8= 200.13
##$BYTORDA= 1
##$CFDGTYP= 0
##$CFRGTYP= 5
##$CHEMSTR= <none>
##$CNST= (0..31)
1 1 145 1 1 1 1 1 1 1 1 1 1 1 1 1 1 1 1 1 1 1 1 1 1 1 1 1 1 1 1 1 
##$CPDPRG= <>
##$CPDPRG1= <>
##$CPDPRG2= <>
##$CPDPRG3= <>
##$CPDPRG4= <mlev>
##$CPDPRG5= <mlev>
##$CPDPRG6= <mlev>
##$CPDPRG7= <mlev>
##$CPDPRG8= <mlev>
##$CPDPRGB= <>
##$CPDPRGT= <>
##$D= (0..31)
0 0.7 0 0 0 0 0 0 0 0 0 0.03 0 0 0 0 0 0 0 0 0 0 0 0 0 0 0 0 0 0 0 0 
##$DATE= 1787564946
##$DBL= (0..7)
120 120 120 120 120 120 120 120 
##$DBP= (0..7)
150 150 150 150 150 150 150 150 
##$DBP07= 0
##$DBPNAM0= <>
##$DBPNAM1= <>
##$DBPNAM2= <>
##$DBPNAM3= <>
##$DBPNAM4= <>
$$ [...]
##$SUBNAM3= <"">
##$SUBNAM4= <"">
##$SUBNAM5= <"">
##$SUBNAM6= <"">
##$SUBNAM7= <"">
##$SUBNAM8= <"">
##$SUBNAM9= <"">
##$SW= 18.0517328524113
##$SWIBOX= (0..15)
0 0 2 0 0 0 0 0 0 0 0 0 0 0 0 0 
##$SW_h= 3612.71676300578
##$TD= 16384
##$TD0= 1
##$TE= 0
##$TE2= 300
##$TE3= 300
##$TEG= 300
##$TL= (0..7)
0 120 120 120 120 120 120 120 
##$TP= (0..7)
150 150 150 150 150 150 150 150 
##$TP07= 0
##$TPNAME0= <>
##$TPNAME1= <>
##$TPNAME2= <>
##$TPNAME3= <>
##$TPNAME4= <>
##$TPNAME5= <>
##$TPNAME6= <>
##$TPNAME7= <>
##$TPOAL= (0..7)
0.5 0.5 0.5 0.5 0.5 0.5 0.5 0.5 
##$TPOFFS= (0..7)
0 0 0 0 0 0 0 0 
##$TUNHIN= 0
##$TUNHOUT= 0
##$TUNXOUT= 0
##$USERA1= <user>
##$USERA2= <user>
##$USERA3= <user>
##$USERA4= <user>
##$USERA5= <user>
##$V9= 5
##$VALIST= <valist>
##$VCLIST= <CCCCCCCCCCCCCCC>
##$VD= 0
##$VDLIST= <DDDDDDDDDDDDDDD>
##$VPLIST= <PPPPPPPPPPPPPPP>
##$VTLIST= <TTTTTTTTTTTTTTT>
##$WBST= 1024
##$WBSW= 4
##$XGAIN= (0..3)
0 0 0 0 
##$XL= 0
##$YL= 0
##$YMAX_a= 213433
##$YMIN_a= -215866
##$ZGOPTNS= <>
##$ZL1= 120
##$ZL2= 120
##$ZL3= 120
##$ZL4= 120
##$ABSF1= 15.48025
##$ABSF2= -2.571599
##$ABSG= 5
##$ABSL= 3
##$ALPHA= 0
##$AQORDER= 0
##$ASSFAC= 0
##$ASSFACI= 0
##$ASSFACX= 0
##$ASSWID= 0
##$AUNMP= <proc_1d>
##$AZFE= 0.1
##$AZFW= 0.1
##$BCFW= 0
##$BC_mod= 2
##$BYTORDP= 0
##$COROFFS= 0
##$CY= -3
##$DATMOD= 1
##$DC= 0
##$DFILT= <>
##$DTYPP= 0
##$F1P= 0
##$F2P= 0
##$FCOR= 1
##$FTSIZE= 16384
##$FT_mod= 6
##$GAMMA= 0
##$GB= 0
##$INTBC= 1
##$INTSCL= 3.241238e-09
##$ISEN= 128
##$LB= 0.25
##$LEV0= 0
##$LPBIN= 0
##$MAXI= 10000
##$MC2= 0
##$MEAN= 0
##$ME_mod= 0
##$MI= 1.114404
##$NCOEF= 0
##$NC_proc= -7
##$NLEV= 6
##$NOISF1= 3.799351
##$NOISF2= 2.8
##$NSP= 0
##$NTH_PI= 0
##$NZP= 0
##$OFFSET= 15.49017
##$PC= 1
##$PHC0= -4577.769
##$PHC1= 7.992299
##$PH_mod= 1
##$PKNL= yes
##$PPARMOD= 0
##$PSCAL= 0
##$PSIGN= 0
##$REVERSE= no
##$SF= 200.130006310604
##$SI= 16384
##$SIGF1= 3
##$SIGF2= 2
##$SINO= 0.751879
##$SIOLD= 32768
##$SREGLST= <19F.Aceton>
##$SSB= 0
##$STSI= 16384
##$STSR= 0
##$SW_p= 3612.71676300578
##$SYMM= 0
##$S_DEV= 0
##$TDeff= 16384
##$TDoff= 0
##$TI= <>
##$TILT= no
##$TM1= 0
##$TM2= 0
##$TOPLEV= 0
##$USERP1= <user>
##$USERP2= <user>
##$USERP3= <user>
##$USERP4= <user>
##$USERP5= <user>
##$WDW= 1
##$XDIM= 16384
##$YMAX_p= 292650326
##$YMIN_p= -901820
$$ End of Bruker specific parameters
$$ ---------------------------------
##NTUPLES= NMR SPECTRUM
##VAR_NAME=  FREQUENCY,     SPECTRUM/REAL,   SPECTRUM/IMAG
##SYMBOL=    X,             R,               I
##VAR_TYPE=  INDEPENDENT,   DEPENDENT,       DEPENDENT
##VAR_FORM=  AFFN,          ASDF,            ASDF
##VAR_DIM=   16384,         16384,           16384
##UNITS=     HZ,            ARBITRARY UNITS, ARBITRARY UNITS
##FACTOR=    0.220516191357247, 1,           1
##FIRST=     3100.04772481989, 0,            0
##LAST=      -512.669038185889, 0,           0
##MIN=       -512.669038185889, -901820,     0
##MAX=       3100.04772481989, 292650326,    0
$$ Real data points
##PAGE= N=1
##DATA TABLE= (X++(R..R)), XYDATA
$$ [...]
14281 107365 203625 -127115 -135707 127908 225595 164952 -66974 -7526 -208281 -207543 -176349
14270 -176349 -56308 87881 -53068 -111691 -242540 -155080 -88263 -104784 -113320 -61362 -53343
14259 -53343 -2934 -70758 -200036 -170944 7128 -107971 -8315 -121655 -113238 -89314 -128707
14248 -128707 -245975 -94784 -100279 -108037 -13919 7361 -188921 59581 -158124 -32124 -14168
14237 -14168 -193899 -178986 -99490 -20621 -166489 -185570 -159790 -4517 100010 -18397 -51689
14226 -51689 29763 -2835 63844 43834 -55496 -183981 -302466 -149692 37768 147085 235804
14215 235804 41405 198627 267283 212773 137673 -20039 -281899 -56912 -122623 70874
14205 70874 51120 42354 257323 296950 321793 260405 326357 295039 199291 103447 168067 -4496
14193 -4496 -64458 -95409 112956 151567 143043 202559 232171 -112841 -271242 -74830 326157
14182 326157 72313 -129151 -97583 -272407 -130867 -150263 -55111 -153357 -126374 -188280 -172705
14171 -172705 -166405 -8235 155761 203525 24304 -153156 -117305 -22494 141546 -112760
14161 -112760 -372819 -156623 102288 278332 88712 -51257 -172343 -106502 259330 187406
14151 187406 -4671 -73308 -83145 -310956 -40161 118125 -84050 -5138 76349 20593 72504
14140 72504 190317 -124036 55561 156101 140481 208177 -40823 340 -84929 7254 134135
14129 134135 9750 -98487 -4103 68295 -172714 -184302 -290193 -374260 -365171 -225342 -172451
14118 -172451 -38828 -161834 -182851 -37450 257033 164959 23852 130745 348928 456838
14108 456838 -15928 -177128 -174318 -167106 -79898 178818 143452 86148 -21234 -97064 -67
14097 -67 -264994 -440490 -44833 167677 428413 409103 231274 160982 138049 163012 188078
14086 188078 176703 143110 222595 43849 100189 183020 442367 333224 184953 -130392
14076 -130392 -232196 79071 294618 265468 -96234 -117746 -172870 -135309 14338 68328
14066 68328 -52815 353964 205456 72002 205163 185040 123751 256905 292491 357127
14056 357127 123996 113551 218119 206969 293912 76808 205667 427932 -6095 -55001
14046 -55001 98978 -52900 -9863 272340 94357 296065 286669 62705 -252142 -67609
14036 -67609 223928 30512 150967 45795 -11893 181582 96375 -9614 -131 282090
14026 282090 494877 527878 366408 194631 176685 -2727 142110 176334 173189 24156
14016 24156 284882 125930 -68664 -89980 61444 238488 91661 35922 85250 -13841
14006 -13841 418483 470062 460678 312960 128422 -39570 127434 33827 131590 -27925 155148
13995 155148 393128 269188 -14380 -173249 3172 103960 28347 284400 615866 677532
13985 677532 300720 152016 206422 488392 391739 213853 154809 205448 220950 42763
13975 42763 97083 -18326 366865 614408 597811 564531 756855 347521 299845 190986
13965 190986 228260 418696 448757 366323 311530 347985 262798 136130 17795 230856 299754
13954 299754 305157 249563 268595 237050 148800 197996 406132 302341 194405 374862 514131
13943 514131 659558 519308 426166 367056 784967 783929 719161 809128 913518 833256 794262
13932 794262 538323 385716 412590 393415 411410 452938 398019 438605 551800 568807 499588
13921 499588 582672 428164 182166 486643 635501 591668 504262 509427 473621 327016 318912
13910 318912 174967 43333 72288 124951 49545 214796 120134 70083 177625 272152 372392
13899 372392 398234 573825 571289 393279 267092 248816 451159 456901 564787 391960 423934
13888 423934 337638 49996 73449 56472 290899 386400 -60197 -57282 121257 25283 165817
13877 165817 163177 399924 365703 347069 317966 196149 558567 736027 673828 493032 402690
13866 402690 384594 251098 512332 408937 413025 462617 424067 423794 388373 434840 471896
13855 471896 214339 357342 533885 484132 470120 823390 1093338 990193 854448 852866
13845 852866 961687 926953 1129842 1200725 1283362 1486033 1385719 1342482 1223363 1254366
13835 1254366 1361358 1298821 1351886 1283732 1107195 1108079 1014466 718347 915528 937398 553540
13824 553540 483306 733380 679463 547252 498810 556131 646322 821602 957401 735777
13814 735777 564232 423082 563713 564676 606718 564649 457992 415431 309442 414933 472782
13803 472782 637123 593598 469989 752015 794234 752901 724261 762547 704980 759762 576695
13792 576695 723967 781427 524333 577591 568784 631778 498944 551340 816468 690873 605489
13781 605489 543131 348709 426702 675123 860114 759935 752803 798817 554674 716063
13771 716063 490337 627179 835479 817683 672989 666797 668840 649348 898974 954731 1040470
13760 1040470 964184 822106 700587 762597 907734 948792 848044 1066162 860688 1008433
13750 1008433 1179356 1206321 974639 955094 1165748 1308594 1517064 1284060 1181824 994908
13740 994908 1105818 1025600 991482 1025814 896776 1079234 1207264 1074003 979329 907247
13730 907247 949288 971382 663117 580722 492197 682439 643271 502343 882141 903269 588440
13719 588440 1052999 932462 815236 695688 733199 772775 732175 661948 914744 997006
13709 997006 714945 697648 752933 878311 894046 581890 463697 671227 597971 562233
13699 562233 386757 342011 466627 364020 282957 413315 649551 823952 440731 581750
13689 581750 593907 397928 448254 231646 230366 389113 373283 382802 344871 195224 436113
13678 436113 535986 331955 216003 252810 288803 267532 266207 624388 565755 146125 128703
13667 128703 348449 297050 227923 290433 447380 531622 518083 592555 433835 245330 90307
13656 90307 215881 100169 -27893 45203 371063 405647 420272 273313 494109 575967
13646 575967 396479 542792 313532 218510 493763 568250 275954 272962 478169 663842
13636 663842 645446 588598 167907 190197 348669 243621 300376 395655 616333 519130 603643
13625 603643 717488 753114 613601 452913 479138 420663 317174 513233 423581 505856
13615 505856 418564 437168 294079 268141 236674 170329 257941 -40420 57645 358259 309980
13604 309980 198647 97028 6803 152222 165982 294483 187326 98834 115282 195313
13594 195313 29597 -96365 32244 294207 363254 306835 376976 446534 525914 466692 428010
13583 428010 199540 270602 387801 353642 273603 126125 360451 520378 459339 418032
13573 418032 411056 416672 282725 311704 413872 364789 665666 535438 423423 431951 417101
13562 417101 435943 241439 277935 285486 278047 247958 446807 390098 469669 364941 225336
13551 225336 591888 352249 392979 605948 737217 727834 712274 809763 631525 612999 589459
13540 589459 806158 699470 713805 595290 822278 970110 908608 1120559 1077468 1351603
13530 1351603 1590981 1643315 1712797 1803239 1965250 2616334 2539606 2609309 3032837 3104728
13520 3104728 3326436 3374445 3450995 3049922 3003767 2903332 2616680 2508808 2426835 2370702
13510 2370702 2163162 2057531 1965524 1612035 1156256 1219742 1276025 1130920 954523 1033380
13500 1033380 1056584 951671 750365 701162 806090 1016610 617362 599530 741751 632145
13490 632145 576035 431766 580374 761180 677329 529116 100575 209540 492809 381417
13480 381417 516469 498483 363073 298887 447279 454292 339813 253072 103409 220508
13470 220508 320301 362267 413987 434140 368389 316186 504573 451794 264760 321344 248294
13459 248294 342366 466071 489757 212449 17342 98824 218863 298798 262202 409098
13449 409098 591134 448445 211151 91602 -57473 136225 209909 327852 221563 187899
13439 187899 261874 368765 668257 699034 454729 450258 249898 353928 267492 373641
13429 373641 531852 397831 271679 54970 440165 515835 492802 406679 471017 505624
13419 505624 378420 763189 713438 578514 480353 490830 463717 180668 306411 353674
13409 353674 437226 407222 535010 561153 448857 374812 212182 389716 577948 753383
13399 753383 649900 650841 493172 222314 261816 407342 288798 297340 280679 299284 507277
13388 507277 387192 397835 117329 119460 385251 438763 160780 127190 331719 109644
13378 109644 116122 137356 339559 420700 373010 503797 597932 574144 295661 190370 249849
13367 249849 171746 -36587 91909 96788 123959 385882 278060 144527 -59898 -56314 97513
13356 97513 102050 218220 248686 472922 292799 235582 111031 -180813 -66065 27725 108386
13345 108386 -64655 -79467 -6286 120932 55538 -10517 35012 107219 6200 -172630 -149135
13334 -149135 115331 20535 -110701 -208424 -162777 10032 131988 182639 195664 87022
13324 87022 52521 145134 132915 306800 236279 279411 152285 316102 379409 299158 362423
13313 362423 407169 207177 132468 233211 217369 90693 -13041 18462 88149 -105375
13303 -105375 -171677 292953 343781 194352 206599 -61853 -113439 -107037 59259 147303 54549
13292 54549 137011 54283 75153 55828 272293 380773 271698 157339 464717 214987
13282 214987 329098 358109 328449 193809 52482 105199 -47485 -8508 -35492 426918
13272 426918 46706 -110285 8955 -18592 -37972 -113333 72261 73929 -40465 127832
13262 127832 95303 -49046 16733 -51991 50506 -147037 -166329 5874 -91870 78372
13252 78372 200672 188674 76568 70860 179603 183411 244675 81822 159907 97816 -122578
13241 -122578 192583 104635 26261 -127712 -113673 81632 -58089 -117840 -38192 -73008 -174407
13230 -174407 -295233 -229304 -103565 -117600 -172626 -19314 218054 335577 276794 243673
13220 243673 399089 276087 -61817 -126588 122803 -113031 -145770 103458 -223998 -190061
13210 -190061 -247082 -89409 -19873 -3724 -205640 -400840 -438334 -365062 -146875 -158894 -34485
13199 -34485 6825 84254 1866 126831 160368 -114337 -194769 -189473 -332982 -197219 24161
13188 24161 103821 189879 143211 -129487 -87221 -91456 -244781 -120410 -279810 -155869 -62144
13177 -62144 -86876 -262038 -151592 -3633 142833 316500 202444 179907 -156094 -310685
13167 -310685 -278560 -108724 90458 201856 43930 -114045 35927 -71240 -280321 41098
13157 41098 -11234 -315963 -341884 -212677 -205275 -215901 -49750 116697 33316 147175 51694
13146 51694 -23747 -235687 -273373 -160944 -12438 -45369 -372540 -353081 -186463 -136916 -113750
13135 -113750 -140188 -305189 -394163 -52702 -90392 -51766 -70504 -44071 -75525 -191658 -286315
13124 -286315 -146964 -111997 -169467 -124886 -213759 -436326 -353269 27449 -108861 -395301
13114 -395301 -212299 -33376 102679 66051 -22281 -190295 -412597 -206439 -149538 -191341
13104 -191341 -202826 -87441 4484 -39247 -237230 -137908 -64113 -172177 -245645 -260395 -232640
13093 -232640 -65119 -38118 70393 24846 -87811 -243495 -325737 -279213 27169 -25519
13083 -25519 64942 169464 81057 -184888 -218012 -237069 -329193 -334859 -47676 -233649 -301288
13072 -301288 -108355 -157979 -249516 -214271 -435841 -289178 -199600 -188423 -506742 -594566 -422976
13061 -422976 -256211 -107799 -90559 -229360 -422494 -325987 63801 -103897 -250247 -217726
13051 -217726 -186598 -76854 -290013 -295856 79296 -88946 -276871 104188 182626 184123 -265113
13040 -265113 -183235 -312900 -192864 -206083 -356440 -647356 -264948 -311621 -324121 -605880
13030 -605880 -546180 -354214 -128906 -88965 -108414 -121890 -43033 -23047 -243742 -168165 -175974
13019 -175974 -57405 -148570 -66813 -255287 -136576 124683 54145 -170657 -119177 -290480
13009 -290480 -117972 -125883 -104119 6906 28717 134307 -231935 -311012 -141293 -10251
12999 -10251 -68552 -97049 3118 -107776 -212205 -70750 -55428 -20814 -244793 -181560 -31818
12988 -31818 32112 46425 55694 178722 -125701 -99751 174479 295426 -23323 -53546 27197
12977 27197 83501 196179 62001 140066 100983 -23730 -48444 -62092 -127272 -157510 -225029
12966 -225029 -185637 -147724 -219092 -39505 18340 -157607 -435480 -83048 63408 -275180
12956 -275180 -269669 -316842 -118314 -230521 -642151 -479900 -128304 -164511 74475 133510
12946 133510 178362 11915 -198311 -114849 70442 -9346 -12252 -63656 -268076 -202589 -160923
12935 -160923 193221 133105 -5443 9447 93725 -58381 -661 -243366 12388 -17333
12925 -17333 14909 41348 -241772 -55740 123835 -58369 -274171 -219871 -70690 -165297
12915 -165297 -120555 -154067 -212794 -147903 -56638 -70860 -230770 -189117 -53623 -203900 -224381
12904 -224381 73687 -41775 35813 -61171 60552 222876 113421 -42946 -192644 -114716
12894 -114716 -34061 -183214 -97511 -196188 -233156 -146692 -66700 -289515 -118286 -43837 101767
12883 101767 292589 77714 -1834 -108712 -223221 -193828 6715 -23058 -122993 -383555
12873 -383555 -309710 -154149 -129984 -288396 -202913 -175818 -165729 -29110 40034 129043 70668
12862 70668 59608 3507 -18626 -128586 118994 -26027 -374021 -376961 -328986 -334233 -257500
12851 -257500 -210165 -160970 111468 100983 -142469 -36278 145417 203906 59935 694
12841 694 -21210 -108165 -107535 151391 41037 64737 -242427 -384941 -415379 -523939 -401523
12830 -401523 -384488 -89171 36571 104496 281756 -65072 -147439 -51541 -8652 -115470
12820 -115470 -125372 -197671 -143604 7212 68952 -187527 -187500 -81372 -24790 -76702 59381
12809 59381 -152546 -614514 -314969 -159588 71151 242844 261866 281554 486037 82675
12799 82675 284502 90098 18780 7055 131086 67289 43979 65759 98728 147638 401263
12788 401263 232136 128306 126882 206091 33444 126544 79298 53449 304441 268319 165673
12777 165673 61452 -45327 98479 116531 115605 135562 -88119 -39122 -53322 -174069 115588
12766 115588 277411 304090 413018 329745 366933 465774 410593 251597 162185 109032 -39847
12755 -39847 167251 550305 464781 574519 572997 785777 544421 300212 481503 658783
12745 658783 630353 665814 618462 595570 720526 933709 1096287 1200894 1176265 1175196 1154261
12734 1154261 1451031 1562681 1468203 1135760 1023442 1099809 880007 948867 932276 995110
12724 995110 903262 886091 794640 663679 779681 525899 604461 694840 548796 324598
12714 324598 395434 184400 489728 582275 518766 513187 475189 739396 813224 795118 846459
12703 846459 798155 569809 441298 604391 588573 658007 752109 778363 788383 1064925 928580
12692 928580 631973 893553 1115852 1085761 985281 1143389 1251173 1449822 1440509 1360599
12682 1360599 1455740 1665010 1910428 1824104 2026773 2129399 1956114 2036412 2459546 2639922
12672 2639922 2673674 2945381 3129668 3398942 3780538 4641769 5151771 5769334 6092439 6469505
12662 6469505 6963392 7527334 8121191 8773526 9487067 10097148 10482751 10774964 11166357
12653 11166357 11239567 10938039 10821004 10254999 9567789 9045847 8780422 8177788 7539018
12644 7539018 6962040 6235580 5712940 5200036 4761600 4368477 4086593 4026449 3889667 3304035
12634 3304035 3003728 2914690 2806442 2695310 2842279 2605327 2475402 2329685 2090877 1894116
12624 1894116 1659492 1744110 1552478 1761721 1995655 2014062 2279509 2265919 2316730 2163438
12614 2163438 2079404 2228353 2367565 2352977 2340767 1922411 1818474 1987222 1856027 1797932
12604 1797932 1608952 1558110 1653084 1702589 1500051 1316463 1367538 1362007 1094301 672686
12594 672686 627208 800418 868068 1040172 1188505 932997 894844 963562 702171 678389
12584 678389 846049 781858 909361 877787 388242 339433 502807 477143 393829 292519
12574 292519 132531 333262 483812 514001 459944 502773 271612 177465 182103 210075 151957
12563 151957 180807 121915 586814 450855 435543 462003 553675 425833 276566 570418
12553 570418 481498 369144 232058 355955 388496 397844 232809 105701 141089 102173 5720
12542 5720 34361 171397 238383 -18211 9592 124943 366076 399696 357097 354495 173389
12531 173389 307899 365023 287366 401040 237007 109306 30864 334245 313637 113981
12521 113981 347338 281909 207811 270394 388710 692315 712109 393369 290744 409217
12511 409217 360495 176919 234999 408550 543251 318870 234885 390376 97258 237696
12501 237696 343122 495192 482613 218801 86956 175497 334828 356279 283862 271939
12491 271939 277781 512245 280051 293835 215819 120678 209963 307265 466058 369674 346957
12480 346957 174498 157910 441667 525472 424929 456465 681074 550852 691269 741448
12470 741448 722105 767634 793580 944175 1138655 945761 947634 1116264 932385 908211 855717
12459 855717 1060652 1173388 1357068 1336573 1268729 1251455 1252310 1266553 1243025 1410887 1305201
12448 1305201 1520615 1603947 1494642 1614940 1378134 1267511 1480566 1431879 1267294 1184229
12438 1184229 970439 1050800 1062092 1134089 982871 1063024 894911 738508 810766 960331
12428 960331 632178 516656 710358 612399 623265 708870 472933 573819 885655 1008670
12418 1008670 953099 601475 433338 643319 700173 846263 922001 861593 580907 608819
12408 608819 855131 722488 751986 633541 641847 565578 689393 906234 827155 803918 584063
12397 584063 714513 742060 757509 572203 691149 873616 645415 841986 776121 740887
12387 740887 799820 869436 979327 1006893 1181899 1266804 991454 1043922 1042577 1032306 659210
12376 659210 485701 613040 763956 943262 873584 775073 510031 467426 530071 489009
12366 489009 926221 932510 730842 806828 479958 766263 850544 770833 822608 711752 657038
12355 657038 853560 854342 821688 671226 619570 790518 871398 732736 414542 428049 466086
12344 466086 512976 522486 251073 534009 618123 371851 558384 561552 662848 702525 551118
12333 551118 736250 866487 878360 1061122 930218 756593 659918 630743 697419 776712
12323 776712 700821 635722 909386 1142106 1007891 866106 822865 712640 515766 553156
12313 553156 783470 573174 321154 478834 354920 506774 767713 713334 828581 819331
12303 819331 482674 858434 804213 424585 394032 412402 585777 581247 549624 447610 473416
12292 473416 516236 545852 526074 589160 661608 430359 388043 556633 530126 312807 305092
12281 305092 357598 462632 410730 503849 534252 544402 487692 543013 595016 703078 729839
12270 729839 820806 892393 1082402 863645 889272 1177731 1196873 1308388 1414894 1307276
12260 1307276 1030957 1569568 1944911 2128209 2088720 2004358 2314579 2244180 2140955 2320754
12250 2320754 2381399 1976895 1812002 1958932 1922400 1720851 1742065 1960910 1891419 1376453
12240 1376453 1245597 1504593 1527824 1352271 1340344 1176096 1045148 832831 773130 962191
12230 962191 1114353 1383921 1362874 1310115 1399032 1252821 1490096 1793690 1738499 1989575
12220 1989575 1811163 1920205 2059374 1942246 1635159 1564980 1518577 1500186 1546936 1279397
12210 1279397 1041234 1268103 1081887 1090138 820563 699498 784174 834901 676717 651442
12200 651442 594727 827959 1024214 813177 685379 874995 536833 447813 619711 820014
12190 820014 866241 863126 919653 1042500 1098645 807115 853745 949827 1009642 742052 850881
12179 850881 942842 725255 638696 439503 419296 522393 539509 629754 649003 570347 669244
12168 669244 602001 678966 545205 369786 647765 688380 697704 656835 679271 468685 191640
12157 191640 118271 198671 446619 656612 53018 -91605 136649 132740 108121 155503 105649
12146 105649 208249 245615 78172 159689 419355 305456 -5414 -116144 32217 219695
12136 219695 116159 3671 -11176 4873 403318 132819 -1064 -20376 313059 452977
12126 452977 129275 47515 217871 259730 -51404 2580 21840 -275129 24638 249134
12116 249134 157839 -103859 -159874 133080 -70497 -116619 -3238 153546 -198248 -282668
12106 -282668 -116311 -170709 -366743 -58887 95784 -804 143531 82892 -144404 -172501
12096 -172501 -140174 -153939 92526 152357 -208387 -398406 -90389 111613 -198845 -250715
12086 -250715 142411 180833 248203 -52356 -253018 -87838 24446 -198994 -388942 -454885
12076 -454885 -144944 186633 225604 -87508 -113143 -98810 -189439 -48839 -117713 -149469 -243414
12065 -243414 -172100 9551 -28875 -62412 -142438 -174547 109879 -12330 -157951 -133711 -271028
12054 -271028 -199228 246493 232236 116287 108447 9361 -126852 -164182 -188913 -357781 -409773
12043 -409773 -345654 -299214 -288832 -196412 -19954 116233 -53928 -24642 -67169 -157701 -9211
12032 -9211 -195240 -313204 -223238 179514 -125712 -305772 -333220 -187462 -257845 -274749 2828
12021 2828 -171569 57540 -22096 -15426 -28765 -225707 -270547 -30831 -36555 -148634 -257511
12010 -257511 -283832 -299938 -120519 -9910 -78334 -57452 -28685 -126090 -150409 67543 -139634
11999 -139634 -168269 61463 53542 13868 -131758 -255015 -168233 -157321 -132818 -225390 56279
11988 56279 114997 120676 34107 -183838 -125190 143758 -110263 -8065 -26457 3683 63134
11977 63134 -67709 201191 10713 3726 -3135 -3736 -202128 -397628 -322146 -274382 -382344
11966 -382344 -88543 196479 46256 -250273 -259500 -156924 -126710 197268 169879 -119558
11956 -119558 -98374 -67546 4720 76209 138346 249126 -95886 16692 -26043 -101402 90310
11945 90310 285632 93171 -189623 -266450 -152165 -2367 -174826 -180412 -187358 70516 241424
11934 241424 127790 208324 186686 52853 -97027 -136384 -97293 -54368 122845 23649 -105293
11923 -105293 -318812 -182135 -202377 -291697 61571 155969 126343 146872 209569 76133 -159002
11912 -159002 -59842 -128649 -139921 74668 263554 341899 379364 317987 176749 122311 -95029
11901 -95029 66212 129357 -47985 -128783 -251452 41167 238773 285417 160124 296502
11891 296502 613772 263759 326613 288146 118119 183647 241116 242103 105308 -40522 -138729
11880 -138729 -14678 262991 391405 99889 222363 443953 278311 405054 461650 386040
11870 386040 211696 152804 275855 69028 188809 70890 81284 205221 243149 257853
11860 257853 396166 215891 413722 548907 433186 291608 318833 123895 100416 385389
11850 385389 167005 -65559 -66341 -116223 -48591 76525 40538 -25538 -49744 44428 4150
11839 4150 -196982 -355963 -417677 -382061 -267924 105852 103338 66682 11971 -36123 -149818
11828 -149818 -169790 -125669 -177884 -256195 -322029 9339 -31249 -188396 -177313 -312016 -348455
11817 -348455 -212165 -54449 -49217 -434785 -442789 -201794 -114989 -27498 -166265 38876 -33076
11806 -33076 -130035 -138649 -340796 -135449 -61054 -37993 -200359 -51066 -34031 -314616 -429613
11795 -429613 -226456 -501493 -284418 -450093 -342356 -246864 -337321 -322829 -5798 -20988
11785 -20988 -227602 -171779 -196017 -258100 -260526 11525 11792 -208066 -192947 -196983 -133904 26905
11773 26905 -105173 -199742 -101090 -379042 -241024 -213082 -200120 -79996 -50333 -219480 -157026
11762 -157026 -151951 -381242 -463509 -239313 -2079 -149900 -104889 -385207 -377376 -272494 -334487
11751 -334487 -476438 -419083 -177474 -375673 -419675 -182773 138673 26124 -121342 54320
11741 54320 -69545 -152136 -254270 -407861 -373630 -353527 -331245 -12986 -337170 -565659
11731 -565659 -530252 -320481 -164664 -232322 -120669 -13710 -225988 -308489 -636804 -573796
11721 -573796 -159971 -67410 -25571 -225761 -348140 -127200 -177480 -210642 -275728 -394884
11711 -394884 -415174 -343637 -394285 -99306 -136672 -277219 -169124 32576 48357 -78621
11701 -78621 -223873 -127702 -336903 -455523 -406769 -355150 -345991 -421482 -117778 -51594 -282805
11690 -282805 -205370 -255229 -349750 -206053 -173647 -134311 -165347 -140880 -425257 -252303 21118
11679 21118 -131322 -101026 -101701 -457052 -407874 -456435 -395900 -298128 -338412 -89748 -130799
11668 -130799 -271983 -275839 -345339 -565261 -428611 -532495 -369722 122526 146286 -3184
11658 -3184 -194192 -269919 -324749 -374711 -241288 -165618 -22215 -16633 -206184 -226819 -273668
11647 -273668 -259137 -327615 -540408 -250454 -35743 -267742 -302254 -339448 -383928 -534203
11637 -534203 -365545 -218860 -170994 -208451 -200358 -44714 145050 -121009 -375358 -487989
11627 -487989 -493500 -152337 -78534 156500 219472 -9974 79521 -59046 -215027 -268695 -476013
11616 -476013 -594997 -518374 -255387 -477370 -540018 -240156 -108105 -87065 -195918 -46364
11606 -46364 -42895 -70468 -208842 -336008 -355424 -403828 -396830 -183752 -100922 -181694 -174723 -314271
11594 -314271 -326624 -63636 90028 56970 -166897 -295824 -509453 -432850 -315721 -227007
11584 -227007 -83239 -312354 -88502 -132938 -132301 -15442 -168206 -352424 -652547 -305580
11574 -305580 -43259 -224833 -203520 -352950 -99616 -135213 -129599 -177976 -300298 -102080
11564 -102080 -208282 -97664 -94891 -155453 -320319 -368043 -401172 -182947 51587 6224 -51191
11553 -51191 -376590 -416618 -294725 -459136 -494568 -378822 -303817 -320449 -187781 24767
11543 24767 206195 358557 488194 670484 741338 594228 540292 828167 426227 141302
11533 141302 291163 33783 345728 268084 43267 71288 -209808 -57226 -61193 -185806
11523 -185806 -46013 -344914 -523697 -418951 -374631 -291939 -289841 -70289 78328 -75098
11513 -75098 -168481 -164746 -184779 -240099 -189649 -192328 -82525 93968 1176 -477365 -523377
11502 -523377 -272538 -126283 -78592 -224107 -185065 -126347 -143212 112901 138 49137
11492 49137 -20364 -142547 -103119 -203387 -212528 -314040 -149918 -110358 -230032 -423157 -416286
11481 -416286 -463214 -322030 -211915 -311254 -161777 -15136 -32818 -53577 -331758 -435704
11471 -435704 -182380 109762 -144683 -165402 -136078 -272414 -119394 -139752 -84457 -357627
11461 -357627 -419365 -3481 -24087 10523 -3965 37617 -109918 -161330 -156464 36701 -295365
11450 -295365 -247913 -118212 70916 -226118 -414420 -337080 -213429 -224200 -245886 -37255
11440 -37255 -122941 103071 -68561 -14426 -202226 -528902 -518659 -313390 -274972 -481502
11430 -481502 -647984 -256930 130404 102299 -398030 -228442 -212343 -216591 358 -179885
11420 -179885 -542432 -600797 -412295 -262917 -272558 -400339 -306241 -256179 -473345 -356536
11410 -356536 -223223 -195353 -190318 -79297 182608 -160685 -466837 -452363 -147610 -324968
11400 -324968 -472151 -337690 -301795 -119836 157334 -43397 -124325 -229326 -426019 -69254
11390 -69254 -234117 -481976 -370601 -149189 -278204 -370429 -354187 -85069 -165625 -363536
11380 -363536 -245360 -149500 -432729 -178671 42341 -268379 -102772 182314 125814 -110825
11370 -110825 -95637 -334309 -259505 -157309 -152783 -421549 -717832 -461301 -436437 -336378
11360 -336378 -367978 -274617 -357010 -458011 -495395 -101546 -415547 -424395 -77380 -87626 -60095
11349 -60095 -206958 -198260 -229731 -89756 -185459 -243328 -212947 -251063 -298574 -208436 -225016
11338 -225016 -48679 -305963 -516425 -364588 -154955 -385857 -285699 -224701 -213915 -407405
11328 -407405 -577103 -303846 -198082 -368479 -91044 -263053 -517423 -500451 -489596 -528885
11318 -528885 -246178 -56456 -201422 -302530 -386863 -175094 110002 -303313 -356276 -330998
11308 -330998 -444173 -347338 -341554 -309112 -308479 -131159 -129591 5369 -26874 -53144 -315125
11297 -315125 -113857 -124902 -68670 -235616 -116224 -89590 -173218 -11181 -161504 -614087
11287 -614087 -540566 -278638 -254919 -269427 -228387 -175921 -273405 -162869 -284622 -192695 41737
11276 41737 -175477 -257734 -389890 -275608 -326153 -255674 -159986 -398180 -243955 40791
11266 40791 -277102 -369079 -202000 -269694 -91665 4329 189351 141738 -15849 134823
11256 134823 -37093 -221916 -215953 -278336 -177120 -212966 -47941 -185409 -274262 53326
11246 53326 12121 -159520 -238530 -15018 -43977 -542051 -625526 -454404 -481327 -448534 -400118
11235 -400118 -407477 -144872 -205315 -45652 -64887 -251110 -374693 -111544 22687 -128981
11225 -128981 -461176 -251280 -191609 -621826 -474182 -281098 12651 46112 -285077 -323315
11215 -323315 -323826 -341062 -492292 -676385 -403561 -354970 -435463 -413559 -374331 -199182 -233493
11204 -233493 -223389 -260263 -262581 -128932 -320926 -420864 -273916 -46229 -156670 -319669
11194 -319669 -380145 -261690 -231155 -327061 -258833 -27797 -13766 -177222 -149989 -382139 -269891
11183 -269891 507 -21389 36900 -11612 -90241 -21000 79958 176034 -156468 -235521 63371
11172 63371 -127024 -175435 -323466 -489912 -98281 -40939 -182328 -351949 -211246 -301593
11162 -301593 -399008 -362574 -330338 -127027 -122190 -229774 -292182 -273063 41556 84648 34047
11151 34047 -116455 -170768 131804 65852 -75310 -102710 -257638 -490479 -471366 -462814 -206842
11140 -206842 -62517 -271285 -328390 -356853 -254756 -114868 -57433 -75640 -77486 102548 -20824
11129 -20824 -100859 6451 -68723 -220927 -362135 -446833 -133868 -523966 -683682 -468771
11119 -468771 -423761 -447427 -255026 -418839 -245222 -245650 -93655 -55753 -258916 -22363 -151366
11108 -151366 -290483 -206092 -156523 -158155 -116920 -229790 -210291 -182968 -176579 151034 -109348
11097 -109348 -191570 -109137 -262218 -326866 -291655 -217273 -146617 118651 -12106 -11966 -149558
11086 -149558 -417700 -408189 -369041 -183843 -215901 -535299 -329623 -417653 -88081 106022
11076 106022 -56484 62615 -81677 -339510 -536212 -383811 -316235 -238124 -430589 -342578
11066 -342578 -177536 -21011 -117682 -245168 -174424 -246901 80 -150892 -204224 -126537
11056 -126537 -100067 -148359 -172794 -206740 -136446 -143876 -222676 -426904 -458424 -568809 -333800
11045 -333800 -285511 -327147 -328532 -315131 -270557 -301191 -261272 -297737 -211736 -189553 -215335 -271967
11033 -271967 -326402 -318586 -465551 -303711 -205303 -327845 -250604 -76289 -93196 -195496 -178097
11022 -178097 -188670 -296009 -157383 -123634 -17312 -5162 -89997 47714 2231 -428967
11012 -428967 -446643 -12587 -91951 -175589 -267148 -306033 -334625 -189563 -108829 -230501 -192284
11001 -192284 45409 100624 -218103 -238835 -80152 -217719 -473919 -384370 100808 207844
10991 207844 51440 -216325 -415647 -571721 -372106 -236889 -280293 -198937 -276757 -413102
10981 -413102 -376245 -175992 -143071 -140052 -66373 -242792 -108098 -341885 -323759 -417578 -361850
10970 -361850 -358072 -421271 -316506 -398461 -176431 -90881 -170609 -270562 -317824 -371860 -262376
10959 -262376 -214324 -61742 -235099 -466858 -322629 -290857 -203741 -156186 -293147 -587828
10949 -587828 -732504 -470626 -391075 -190291 -231173 -302047 -452854 -350207 -661387 -901820
10939 -901820 -586759 -369132 -164943 -42912 -23019 -22915 111403 77858 11238 -325546 -308455
10928 -308455 -271016 -175421 -119605 -63682 -331289 -562865 -229885 -110394 -146143 -187584 -287921
10917 -287921 -306464 -459622 -645623 -163786 41718 -10154 124292 -73924 22973 -134872
10907 -134872 -179425 -29817 -207070 -396058 -709664 -419193 -423237 -439180 -188629 -25829
10897 -25829 -45682 -175055 -144507 -229447 -63640 -64514 -179525 -306186 -453761 -373408 -268428
10886 -268428 -396775 -407780 -118628 -269571 -180123 -24781 40674 -116351 -177103 -233004
10876 -233004 -277303 -76756 -41914 -43816 53858 -243466 -316138 -196206 -144350 -106317 -51498
10865 -51498 13135 -72032 -129543 -25225 -12296 -196668 -213045 -30317 15291 -95524 46470
10854 46470 -137155 -96379 -115229 -350416 -102273 -91638 -291045 -127029 -278518 -141092
10844 -141092 -165196 29134 3094 -184789 -209862 -177699 -250121 -301495 -29776 -146252 -88399
10833 -88399 -86556 -112404 -323812 -115349 -965 -170058 -175737 -207452 -324134 -195554 -45022
10822 -45022 -170279 -367406 -303369 -210821 -88215 23911 -114230 -117592 30007 60739 -33864
10811 -33864 -166694 -348472 -246678 -147571 -149521 -201790 -160966 -414569 -432654 -245596 -257520
10800 -257520 -457453 -242157 -147278 -72357 -287200 54021 6502 -253145 -313641 -238851
10790 -238851 -308490 -243140 -451255 -397304 -102688 46786 82262 -153231 -162098 -155028 -6079
10779 -6079 -396137 -319314 -144864 -238050 -384470 -231422 -111710 12479 -32932 -46105 79599
10768 79599 -41139 -34728 -39334 -438774 -453128 -254350 -180193 -228819 -341355 -407353 -397379
10757 -397379 -92375 -98651 -317834 164688 -63051 -240888 -315819 -400786 -440725 -283701
10747 -283701 -169298 -79411 -71630 -159506 -196037 -305401 -440516 -433749 -409010 -410783 -314854
10736 -314854 -319703 -94049 25151 -198225 -226515 -379281 -374936 -221292 -261690 -316448 -514045
10725 -514045 -252337 -161414 -397484 -89808 -146848 -48568 -17635 -249156 -323881 -282950 -375468
10714 -375468 -400164 -332479 -197890 -187531 -333458 -35316 -14000 -300158 -232570 -35054
10704 -35054 -100406 -304483 -408083 -319019 -209398 -59572 -123562 -149232 -159212 -314867 -570637
10693 -570637 -684148 -453269 -334400 -482013 -381756 -442635 -609027 -407471 -525470 -689990
10683 -689990 -506140 -539678 -439987 -313947 -449101 -406065 -331418 -192384 23065 -240565
10673 -240565 -227123 -159518 -270588 -273703 -169307 -178394 -165005 -155269 -85347 -67803 -32894 35897
10661 35897 -208950 -118853 10852 -307838 -370696 -187087 -83719 -152234 -141036 -88031 -261310
10650 -261310 -371396 -251831 -366595 -141590 87493 -135345 19439 9809 -91672 -372190
10640 -372190 -305916 -196835 -355995 -201251 -228608 -364831 -552449 -543031 -462930 -380399 -568810
10629 -568810 -513677 -651887 -520744 -406681 -325397 -379721 -295039 -553626 -656893 -432560
10619 -432560 -34144 -127380 -306306 -74986 -64349 11628 -90065 -97252 180100 -113106
10609 -113106 -136414 -90020 -426165 -293644 -119580 27630 -189068 -541155 -580840 -315294
10599 -315294 -418257 -379097 -284155 -218708 -299776 -319372 -346279 -426240 -285309 -104366 -175205
10588 -175205 -301915 -281672 -244293 -305785 -283089 -155628 -232980 -123820 9005 -101673
10578 -101673 -187516 -121532 56310 10827 -43805 -21532 -60712 -168931 -332546 -381920 -417342
10567 -417342 -170170 -156031 -260962 -115740 -64792 261179 -168841 -500617 -528328 -184044
10557 -184044 -163080 -323426 -309791 -297619 -184684 1062 -132166 -347689 -51191 9756
10547 9756 -26418 -227769 -402234 -458354 -286920 -53763 48011 -221950 -399332 -247037
10537 -247037 -39525 -52698 -155829 4670 -264722 -182056 35587 115924 58339 219027
10527 219027 64040 -124467 -375561 -309896 -248928 102031 165722 187765 337632 350593
10517 350593 518665 326757 64513 18821 207977 413443 261566 413807 376758 309954
10507 309954 337647 368097 197253 -34000 -12759 -135259 -124286 11145 -143080 47509
10497 47509 232624 77113 342923 320402 109621 188563 447882 312905 186181 74993
10487 74993 463473 314409 41152 35336 199653 86882 110570 296642 407676 340865
10477 340865 47244 68741 -65902 30057 -84894 -132561 140353 86952 170901 73561 -32186
10466 -32186 -261214 -46817 -262065 -247674 48776 248692 107574 -166442 -41727 -261851
10456 -261851 -309815 -961 -60219 10460 7749 113715 200040 122285 20369 -248529 -254055
10445 -254055 -87491 160349 91006 -126952 168121 232687 354553 393439 388050 515895
10435 515895 594960 710631 746656 1001002 1449422 1541672 1799917 1939414 2026951 1828222
10425 1828222 1743370 1853159 1663237 1443719 1127853 972953 1005362 872710 739786 899971
10415 899971 819699 678644 413372 94783 48790 257827 338194 122035 -61291 156444
10405 156444 229611 265159 25770 -48047 -214603 -103343 -125314 -111603 -104629 -164755 -171363
10394 -171363 -45642 249739 291639 -111286 -16142 132087 -51811 -140848 -331926 -189594
10384 -189594 -55038 89206 57991 272091 85717 -121271 -200962 -156646 -152447 -297879
10374 -297879 -286888 59633 164200 -62926 -189637 -343908 -261656 -153451 -139911 -328140
10364 -328140 -288364 -431473 -504395 -323919 -182073 3199 -202182 -94120 -112401 -349270
10354 -349270 -278666 -223642 -72407 -35572 -31361 30653 47201 -82526 -211427 -265007 -20702
10343 -20702 14636 275331 455262 249683 94392 86335 49730 39812 48635 118029 282796
10332 282796 -16093 -398895 -227195 51669 -67290 -160164 81731 -136359 -232885 -103752
10322 -103752 -27953 10052 156749 75953 -106040 -255077 -384653 -223599 109294 185637
10312 185637 246457 222192 -55827 -179444 -118568 -282187 -178504 -172986 -313183 -473072
10302 -473072 -117975 37030 -33419 -164179 -294383 -271652 -218759 -45057 -9950 -254683
10292 -254683 -255862 -417463 -345697 -342306 -446561 -420056 -114191 -156719 -189385 -60242 -287313
10281 -287313 -222297 -271883 -169520 -232235 -229980 -377072 -305313 -232189 -115606 -139437 -21938
10270 -21938 -251402 -355977 -324415 -388734 -496274 8805 258960 146935 -141792 -184473
10260 -184473 -188811 -88460 -277381 -317907 -334444 -318725 -413810 -81036 22318 -156503 -233032
10249 -233032 -224974 -246114 -436613 -240056 -53001 -81990 -174856 -182530 122810 185220 -63471
10238 -63471 -122843 -124051 -216864 -351365 -317785 -166164 -138651 -4745 -49638 -121073 -11667
10227 -11667 -333306 -218806 -116202 116185 139453 -192331 -230833 5878 -213868 -76629
10217 -76629 -73434 -191614 -10355 -89652 -354117 -548831 -439833 -343403 -227415 -399842
10207 -399842 -487628 -562624 -412134 -472954 -292877 -22889 -126115 -270534 -215559 -107512
10197 -107512 132175 110998 184042 -67314 -475972 -473746 -610534 -332005 -487028 -408003
10187 -408003 -145609 -405252 -671964 -521195 -643022 -585465 -269574 -36831 -94667 -248059
10177 -248059 -200822 -249993 -281722 -595255 -613279 -467247 -553881 -456245 -512886 -333639 -280870
10166 -280870 -276409 -203244 -165589 -375434 -426962 -301170 -280932 -358210 -380862 -354615 -135833
10155 -135833 -244207 -308530 -234119 -370730 -249589 -246316 -378392 -181056 -376742 -347687
10145 -347687 -136947 -114086 -333522 -520588 -653445 -397015 -315174 -457084 -281628 -264498
10135 -264498 -377088 -433065 -639157 -553990 -534625 -713694 -505619 -400903 -510497 -553715
10125 -553715 -366833 -319027 -425159 -476191 -364705 -395391 -197708 -48514 -64833 -466872
10115 -466872 -673800 -526305 -421359 -297247 -464834 -476544 -420286 -379819 -131065 -249439
10105 -249439 -1907 -179318 -166202 -391999 -463036 -330775 -518473 -398795 -192272 -271961
10095 -271961 -167419 66339 63636 -21157 -308525 -179444 -46367 -93534 25686 10415
10085 10415 -72401 -150131 40544 68393 134930 -62674 -129852 -91025 -162301 596 -866
10074 -866 6676 -128030 -108025 -266924 -202960 -97170 132170 184607 -219593 -500673 -525740
10063 -525740 -259740 -51181 -187373 -89968 -168361 -180175 -335534 -432353 -342312 -185706
10053 -185706 -351773 -395293 -16714 120051 -70609 -380834 -121776 16616 115223 -65378
10043 -65378 74928 163671 -56142 -91366 -402193 -310502 -165240 -27314 -358437 -111037
10033 -111037 -17854 -263814 -60970 102950 17742 180765 254588 9965 -2452 16678
10023 16678 -133797 206347 266276 262637 442091 345112 261297 380740 563716 227713 416046
10012 416046 691820 650501 777404 720940 679517 727733 690245 800153 697999 918234
10002 918234 935132 1104302 1356816 1811639 2329096 3092910 3786999 4264514 4544108 4609319
9992 4609319 4427622 4218738 3870346 3412179 2632950 2007988 1795231 1458967 1021377 914525
9982 914525 772359 741294 473491 459183 426089 526989 234973 135820 437513 292468
9972 292468 148472 -218876 -112402 -151377 8801 49960 -126948 -54592 -157119 -132511
9962 -132511 -145790 -289521 -203180 -165742 -288236 -375346 -386599 -272118 174924 423116 395722
9951 395722 6145 -13191 7011 -146911 124614 275598 117301 -25835 -133124 -294587
9941 -294587 123708 281842 67234 146758 190116 39743 268677 164264 -2493 71981
9931 71981 -5393 -15884 -90415 2797 -29293 9889 -434022 -498521 -317593 -209883 -443809
9920 -443809 -395981 -287174 -36134 240842 23277 -391445 -279892 -126353 -462923 -349762
9910 -349762 -438145 -474874 -168816 -375352 -250041 53273 -114393 -395887 -89836 -260672
9900 -260672 -279567 159987 393121 203351 16939 -159017 -337638 -226080 -165423 -96326
9890 -96326 5176 -76111 -266785 -324058 -58441 67692 160004 40024 -194103 -294385
9880 -294385 -217247 -111002 -164078 -266918 -224605 -336788 -453649 -324956 -292950 -229910 -131123
9869 -131123 68727 123019 951 147505 152440 -185285 -270239 -198460 -240183 -320907 10372
9858 10372 -200840 -201519 -7060 104621 27117 -58822 -230627 -379563 -323535 -240804 -398740
9847 -398740 -213189 -162821 -75013 -378608 -471099 -468366 -156531 -159237 -332368 -262798 -277615
9836 -277615 -379316 -367612 -222880 -416536 -453356 -431681 -326180 -352745 -333587 -400339 -462349
9825 -462349 -348772 -218749 -164419 -215566 -209780 -79909 -21432 -247857 -398010 -207103 38480
9814 38480 -37414 -204989 -261605 -384732 -163694 -229237 -340239 -108618 36563 -86429
9804 -86429 -207217 -183289 -136063 -171782 -164473 -227387 -119492 -9045 47002 -224617 29658
9793 29658 189907 88017 281853 183084 206548 251869 443558 235727 242646 206772 337552
9782 337552 540587 547225 597049 342973 357247 501695 591543 511137 657189 752202 876583
9771 876583 1082357 1108702 1092061 1232356 1389166 1280998 1286878 984100 876001 936847 963847
9760 963847 1063045 870346 848340 925627 814548 908224 1187846 1174580 1119875 1486114 1797267
9749 1797267 1856377 1858100 2089920 2373866 2527584 2660416 2800706 2699242 2533760 2571075
9739 2571075 2419060 1996887 1760661 1673329 1582113 1443995 1062057 759350 259897 375773
9729 375773 453734 365744 391408 628458 505214 416064 567516 485975 372821 159131 216603
9718 216603 500833 390711 349755 425800 510734 305198 270812 330888 316996 216776 20533
9707 20533 -39504 -29267 164274 198175 316602 115149 164732 137368 -66977 232101 365857
9696 365857 164070 238227 68573 218049 636034 396666 266627 271025 44436 15811
9686 15811 191965 239582 304900 304620 95331 -53770 -81847 107457 -45060 31874 223869
9675 223869 221962 89356 104898 299089 259930 2621 23717 16956 -217842 13342 -86556
9664 -86556 31696 256450 79861 252702 233884 -97123 -129016 74644 -42288 -79215
9654 -79215 -42211 -267730 -215220 169206 425744 63386 -277019 -278882 -153065 -56182 -205938
9643 -205938 -25561 42695 68363 257166 129480 -8542 -91612 -880 -32664 -126101 49732
9632 49732 175792 144761 -61894 137337 215088 -28621 42599 153285 20373 -25987 -71300
9621 -71300 306160 431475 448460 603246 561864 717641 777511 910143 954210 1357382 1374347
9610 1374347 1188961 1152026 1250443 1237927 1412394 1438446 1197880 1167740 734175 662485 421524
9599 421524 373855 498951 297568 210204 223788 453804 311067 317161 355384 344811 181549
9588 181549 82642 612 -87096 -97172 31393 -39388 61093 57089 -35171 -122736 -133825
9577 -133825 -48027 -265064 -84034 -155560 159493 -90450 130110 286482 248474 87584
9567 87584 55595 100577 168459 265600 -57785 80931 130844 89223 -14369 -163293 -131458
9556 -131458 183332 57327 -20888 -26457 -4440 -212132 -113038 -189048 -155098 51786 249664
9545 249664 112617 93868 -103685 -114917 -27685 43517 28455 16944 -24199 -122791 43261
9534 43261 -49303 -119852 -656 -12609 -293061 -74162 -195132 -198214 -140977 -23010 -20797
9523 -20797 140566 -33208 -37049 -198684 -184409 -89116 12972 43143 -191677 -58905 23753
9512 23753 170568 -240433 -429221 -322466 -27720 148669 206636 89502 -156724 -183661
9502 -183661 -252093 -182831 103242 51008 -140033 -173711 -56518 34737 212837 285977 47759
9491 47759 142812 -236596 -227881 -109848 37166 -364 58090 47536 22927 -94771 -169105
9480 -169105 146857 -115765 -293284 -301686 -277377 -361595 -329178 -68716 33943 -44444 21630
9469 21630 -227648 -223866 -173524 -85899 -27941 -265476 -373042 -384757 -406946 -246887 -108235
9458 -108235 -292759 -118864 113724 177944 11452 -129569 -18509 -90216 -136633 -245357
9448 -245357 -140120 -60415 -96351 -187257 -61908 -55265 -327811 -325459 -231270 43455 -56775
9437 -56775 -164611 15694 54899 32884 -70854 176103 276932 85320 -96049 -191884
9427 -191884 -117065 -30193 -97284 -128112 114465 70882 -48079 -161174 -304182 -83627 385664
9416 385664 297102 143971 290831 322296 306952 141384 145280 -14600 75701 273331 151058
9405 151058 127716 319150 221091 308469 220747 440299 962009 1382776 1788961 1548534
9395 1548534 1474237 1447123 1077103 1100078 880415 870492 1122194 805630 497286 398609 241699
9384 241699 240682 573311 750302 820721 657790 314758 404998 492228 347408 340403 330290
9373 330290 404474 293769 516977 532631 514241 408747 619330 786880 681670 806086
9363 806086 627273 756904 890299 964509 928192 1126438 1293356 1222460 1290278 1356554 1493751
9352 1493751 1421443 1399290 1325023 1263927 957098 853271 1049519 925067 859927 561535
9342 561535 374037 591489 890255 1141387 1108744 838062 807622 643689 559877 774545
9332 774545 660054 444013 376520 628256 632920 629620 612357 530472 737291 866871 552952
9321 552952 715630 685375 605206 515380 635802 669329 756392 634621 358331 309339 469824
9310 469824 573968 340668 425179 552835 594174 620303 622577 732125 584953 476038 577002
9299 577002 669131 532046 294245 472992 178106 179427 249212 350032 281381 447279 295488
9288 295488 -20626 -55681 73064 214401 71795 -11652 131817 -89093 -41355 126680
9278 126680 146946 35517 -189462 -34627 113820 -113974 -29647 190235 181374 135129 171596
9267 171596 68367 136687 287741 276240 537459 358111 87532 106659 94470 364619
9257 364619 535460 288149 381666 387930 301311 370589 576880 747861 650128 295273 233223
9246 233223 341576 184015 64890 85036 211335 450647 426209 495213 382386 374393 438271
9235 438271 329868 273339 206378 220737 327972 437005 396192 228640 196811 273825 341657
9224 341657 602277 406334 479196 390444 460708 411174 460316 491646 560973 499428 484929
9213 484929 523623 277094 35625 235268 513844 395851 189399 276631 645212 570489
9203 570489 672462 654196 579583 489766 523788 257444 141282 304359 355645 271043 507394
9192 507394 638634 665519 535466 519290 504960 469048 417108 724081 780603 609390 813442
9181 813442 647871 700587 759245 450171 362600 390083 546563 579662 702675 718841 475551
9170 475551 476866 442458 434128 519982 711799 549046 487013 577262 398597 588521 765352
9159 765352 810158 558359 543763 721820 537371 531376 656411 653173 721759 881589 1104826
9148 1104826 852373 707389 1054909 929126 703397 739378 987966 1025164 934593 961573
9138 961573 1042384 919199 626004 539851 774025 750037 693923 544603 640264 842278 863344
9127 863344 1081579 1119195 993661 957894 1047839 935224 865667 944721 1090848 845427 963392
9116 963392 1128057 1214358 1386393 1548180 1593955 1795848 1889722 1910096 1923021 1507227 1736650
9105 1736650 1791598 1569493 1577739 1330078 1143504 1162471 1151391 1241269 1106880 1075952 860339
9094 860339 1183020 1336951 1213995 1293707 1518484 1531507 1350859 1282593 1174607 1309350
9084 1309350 1425809 1533460 1629154 1737160 1662917 1461011 1500905 1541939 1844828 2248965
9074 2248965 2454332 2431259 2468563 2812152 3150485 3490280 3688168 3668266 3679536 3644494
9064 3644494 3454933 3126506 2922603 2560757 2311851 2371171 2490576 2219781 1837865 1797425
9054 1797425 1935802 2100316 2171061 2088999 2138858 2204026 2346299 2435694 2535390 2638404 2900052
9043 2900052 3038062 2855701 2765776 2759319 2655428 2795757 2340212 2253450 2445597 2533536
9033 2533536 2414299 2354938 2408539 1998875 2049411 2116015 2191611 1991601 2078439 1996523 1876384
9022 1876384 2065039 2054469 2040043 1879085 2078599 2307563 2431067 2624874 2405616 2595689
9012 2595689 2692365 2932128 2751527 2987686 2898849 2821312 2767985 2794654 2940715 3032203 2815312
9001 2815312 2758782 2595043 2616761 2650443 2731207 2757852 2513312 2753581 2754275 2916185 2951506
8990 2951506 3036136 3128418 3432143 3635188 3824648 3969979 4223348 4528913 4538111 4705500
8980 4705500 4662243 4569362 4477824 4544897 4640218 4412025 4595815 4659195 4738233 4920393 4934108
8969 4934108 4954359 4895817 5210146 5269663 5408724 5655460 6079852 6205423 6233103 6066512
8959 6066512 6187424 6325994 6875507 7144314 7426851 7689696 7953946 8078043 8449779 8938526
8949 8938526 9200626 9414125 9647271 10423908 11148467 11905915 12605974 13580914 14691089
8940 14691089 16441311 18227154 20777170 23677205 27168762 30985355 35603767 40927151
8932 40927151 47898084 58040227 74509299 103059484 149494350 204597560 252592268
8925 252592268 283163657 292650326 281646752 253135367 217524001 182424868 150381396
8918 150381396 123618101 99903962 79097740 63105633 51916443 43685533 37819611
8911 37819611 33257311 29715181 27129439 24999725 22945132 21318508 19878773 18514214
8903 18514214 17558750 16530631 15167212 14293636 13577737 12726326 12251451 11411332 10906579
8894 10906579 10129859 9824965 9526533 9096864 8911745 8511857 8172953 7936667 7499798
8885 7499798 7096018 6990884 7070786 6768988 6965564 6923753 6527520 6391548 6407783 6336203
8875 6336203 5941969 5733398 5444009 5025771 5166867 4827528 4684278 4783583 4729497 4616329
8865 4616329 4515279 4174071 4108100 4215661 4201468 4018219 3929994 3894516 3593262 3407312
8855 3407312 3145294 3091214 3028601 2908754 3039631 2958623 2715623 2765270 2610314 2561475
8845 2561475 2633859 2315735 2483222 2663871 2525587 2496647 2393376 2158701 2223971 2156068
8835 2156068 1955681 2142272 2183429 2148283 2398656 2372836 2163305 2349956 2274944 2080386
8825 2080386 2191761 2143192 2230618 2254969 2048628 1913761 1865474 2040245 1914611 2082536
8815 2082536 2135041 2003801 2016348 1980037 2009323 2077961 2193129 2078697 1876216 1981095
8805 1981095 1665025 1382878 1755010 1796364 1777934 1852355 1936476 1666506 1672413 1851444 1902615
8794 1902615 1936173 1746461 1583895 1422519 1452456 1840876 1944044 1725158 1928268 1920263
8784 1920263 1873285 1951085 1972251 1891966 1755940 1900098 1832049 1697399 1552825 1617858 1598493
8773 1598493 1319850 1436978 1374161 944404 845076 950600 841425 905274 870911 845952
8763 845952 1182599 1033483 809607 888269 880692 830663 958111 807956 730903 737838 981359
8752 981359 944529 876277 925591 759332 1036810 659494 548437 439009 465928 438850 357189
8741 357189 654345 820142 486079 467363 604134 347763 417886 663027 500627 369465
8731 369465 623193 712439 609712 663179 603452 595243 506118 460164 532208 400458 483713
8720 483713 602705 663521 596904 453574 318116 243686 543616 553828 664347 595224 586904
8709 586904 738495 700416 855387 753388 702994 467682 133818 131785 -74957 -85315 46208
8698 46208 141857 53858 89960 311593 179049 436067 465463 512967 271325 430912 310047
8687 310047 418115 358229 355417 375090 547630 977197 787413 555859 549127 820693 917395
8676 917395 511538 371120 680162 399301 365895 484311 755719 608733 379610 404766
8666 404766 481596 548126 721641 809129 709741 732791 546175 664127 673468 584525 347218
8655 347218 540073 451551 102062 381908 425590 396274 293921 410747 237349 234667 304246
8644 304246 474741 605561 473911 421683 444047 491545 788318 719680 391503 115929
8634 115929 131599 370693 272028 204135 136407 332160 529787 309000 302930 479461 596596
8623 596596 308729 586878 763924 279860 118553 304462 252715 332872 216904 62604
8613 62604 283444 201976 307867 422509 218777 533341 713498 594039 712836 472349
8603 472349 312998 240633 279574 252829 375925 534060 445008 354550 236928 375301 412344
8592 412344 415076 351560 475133 357351 318901 310066 428121 236522 -84346 149622 33656
8581 33656 373448 315937 495914 544061 143062 33427 123251 76729 230267 216146 355938
8570 355938 301906 205300 233579 -47232 -148815 85518 164276 -106874 114445 250200
8560 250200 104733 325509 166865 200463 9123 143758 79047 19432 -222834 -275893
8550 -275893 -313241 -251852 61300 -520 -24855 11432 -94223 57331 -67532 -323362 -226130
8539 -226130 -45135 145360 3006 260327 149699 265163 360028 138461 119679 -75353
8529 -75353 -9249 13942 204151 377304 94742 100514 -77130 -197303 -156540 33480 92617
8518 92617 73566 115152 65997 -193072 -244732 20987 341836 80745 40042 -171121 -94317
8507 -94317 -53651 59945 105153 65953 208323 273275 53074 -100350 -30422 -265985 -136019
8496 -136019 8887 90941 140363 -154667 -234928 -338297 -329630 -322324 -248704 -52684 21308
8485 21308 -70850 -95355 -110046 30525 250513 261070 235775 70805 -212092 -105856 -167415
8474 -167415 -426264 -311700 -50837 -191012 -151020 -210880 -238480 25729 -19813 -40297 25062
8463 25062 110799 230929 102618 -58479 -162682 -119937 194542 269509 361752 187726 272527
8452 272527 557064 676412 823070 1187330 1347451 1564714 1598093 1458990 1121285 927423
8442 927423 566456 575630 587318 276502 256211 298118 232644 18556 131417 -210734 -271585
8431 -271585 -28067 -58841 -63927 140386 71127 -84321 13832 -286423 19090 225732 -10202
8420 -10202 -50324 -300244 -463723 -329101 -338028 -391206 -331145 -182600 42004 177146 -32030
8409 -32030 -108350 -40142 -264856 -47989 -118510 -213962 -297001 -355360 -96266 112742 195068
8398 195068 -44157 -189637 -9184 -110297 -130331 73178 -62902 42378 -44439 -129937
8388 -129937 -194782 -271238 -213180 687 -91170 -141055 -215177 -111874 -154321 -45663 -68881
8377 -68881 -549319 -559694 -232629 -322853 -267099 -149516 -340147 -413518 -452561 -324363 -354894
8366 -354894 -504481 -431605 -313752 -409750 -433517 -140780 -273047 -569353 -606439 -576791 -594429
8355 -594429 -245161 -154770 -409517 -233718 -278535 -315135 -268412 -59589 -338121 -445633
8345 -445633 -363210 -179216 32963 -56369 -184260 -184840 -127711 -71302 -357142 -287011 -189629
8334 -189629 -395919 -246425 -210778 -290880 -256147 -155798 -139983 -308733 -562178 -492940 -101561
8323 -101561 -127364 -244220 -60576 -109500 -270179 -69360 -237853 -332712 -228707 -124975
8313 -124975 -95334 -321235 -457693 -233050 -174152 -346402 -180526 -213598 -345221 -415075
8303 -415075 -416906 -371106 -316033 -221897 -433500 -377622 -451866 -131912 -193674 -603088 -479959
8292 -479959 -310287 31413 159114 280306 -267626 -286513 -296092 -273151 -241852 -422470 -455097
8281 -455097 -368407 -273861 -247321 -314707 -408699 -285175 -392033 -481900 -250088 -275973 -303441
8270 -303441 -275771 -35595 -25803 -174771 -298880 -240855 96650 -198303 -13526 80309 -166405
8259 -166405 -386807 -416167 -481519 -115614 181701 -154525 -269196 -463874 -485986 -192088
8249 -192088 -28939 -112888 -325114 -297696 -450191 -595294 -632799 -716928 -796194 -477712 -81238
8238 -81238 -78457 -240772 -357627 -326400 -292026 -245063 84496 947 -246821 -377138 -354588
8227 -354588 -65368 -262136 -241756 -114457 25492 -232178 -260608 -361557 -251588 117348
8217 117348 132137 -71449 -95752 -72756 -176157 -183866 -120149 -46562 -74237 12244 -294860
8206 -294860 -329943 -160392 -304108 -347506 -274146 -42755 -140973 -393021 -152637 -223492 -25722
8195 -25722 155078 -188146 -284766 83729 79858 -152836 -134099 -191611 -133707 -336373 -222112
8184 -222112 -250178 -207412 -154568 -54699 30035 41095 -31266 -282045 -349977 -181697 -132218
8173 -132218 -461447 -304305 -258746 19149 -149894 -109537 8550 100579 506525 421979
8163 421979 286100 215452 21405 142630 95185 96373 88248 -80281 -3808 34187 265746
8152 265746 237840 234929 151892 71530 96383 103893 66837 -155933 -230868 -133731 -45187 -111938
8140 -111938 -214554 -183704 -282970 -432337 -565739 -198003 -254369 -266049 97374 -26797
8130 -26797 29770 185643 109682 64401 50455 -1172 46844 170909 18729 105469 492646
8119 492646 410449 364430 243711 257426 468517 581472 442648 704549 658174 497872
8109 497872 603173 687093 786321 668207 676615 735965 1142211 1107394 1064981 1011498 877504
8098 877504 792598 624402 552653 744885 903596 807131 759442 848774 678600 667359 764769
8087 764769 698133 713142 621495 272670 384581 581434 479273 555806 420744 249547
8077 249547 -22361 185949 376763 230574 126345 51000 275573 301104 -8664 169494
8067 169494 127854 269508 448978 265360 76148 164380 175615 281592 298656 298635 488179
8056 488179 463249 369164 521208 604173 565211 258328 147801 335947 467798 634393
8046 634393 360050 439120 571417 667089 565120 556209 597456 580215 351037 599061 475040
8035 475040 330540 281835 191945 435419 622313 616482 271746 188338 383351 496993 617806
8024 617806 427033 565089 420637 571019 457732 284634 332629 289311 585455 875418
8014 875418 1014702 908165 633139 447957 455796 449639 358840 430500 365109 24212 139582
8003 139582 62874 77071 438755 508885 253934 415278 471563 108542 -27471 231415
7993 231415 233602 159049 172538 365712 273664 452109 486934 551573 296441 360525 157076
7982 157076 37080 242851 312989 210518 287834 216635 58009 150905 402075 282074
7972 282074 -2850 138484 176165 -2410 -140658 47616 212116 -42188 107075 363833
7962 363833 167479 236448 149407 -74730 97405 26937 -71351 8181 95465 208192 68555
7951 68555 247862 234460 125236 207601 234220 337861 243589 523455 741982 548872 598754
7940 598754 388312 262362 350216 386662 150508 196033 425592 724836 644956 345629
7930 345629 512742 896949 686216 550587 730084 700457 735604 887239 714382 452440
7920 452440 676987 733451 887463 946033 892920 1065442 884498 1036561 1093779 1019965 1346540
7909 1346540 1229636 759550 571971 863105 876341 1039429 1231845 1152987 879272 824514
7899 824514 1058509 1323147 1296411 946070 914123 721941 839371 790449 942015 726912
7889 726912 836086 1045313 798153 687608 635511 244836 273808 391025 468882 453823
7879 453823 565879 559405 587215 503559 484227 472368 623658 789402 750331 939607 542909
7868 542909 455061 330803 448684 522077 794622 925127 831476 662889 685669 1018504
7858 1018504 665023 550512 530286 451342 476007 517254 443860 494917 598582 948719 912139
7847 912139 760818 612494 362856 376689 542832 559752 271578 165377 116175 355352
7837 355352 467324 541276 361433 291530 277172 451175 504625 788193 631209 281547
7827 281547 481884 652741 700503 480828 533246 628754 515143 476581 540452 566081 270585
7816 270585 514086 681148 530907 382372 461771 472170 370869 297298 311233 560791
7806 560791 446088 580098 955486 943582 831789 793082 618424 327777 273867 122557
7796 122557 227428 488383 488689 380218 413716 500660 603896 715686 502169 728095 855425
7785 855425 692410 545986 595695 638516 563316 564478 572821 699678 729610 626146 443528
7774 443528 532837 386219 560034 530011 552052 877612 739963 441007 322409 441134
7764 441134 582918 807003 646824 666297 834666 601952 528672 459848 141010 121106
7754 121106 301074 309182 234463 502063 665774 339009 347406 436000 420163 542158 552323
7743 552323 418525 257381 286402 320765 273903 578583 484676 355042 418236 520709 636228
7732 636228 596323 633351 551784 452578 481458 460430 531864 749041 403493 296319 337741
7721 337741 271696 375573 272868 189778 466780 584037 433560 392433 404021 225086
7711 225086 344795 461441 341318 109254 232454 293143 440432 578900 356478 154189
7701 154189 316038 331194 168971 330759 251926 417911 627403 612721 431814 163666
7691 163666 261958 509489 426529 354811 253811 76896 86387 74091 8802 117136 267917
7680 267917 477061 312530 390642 671147 324299 214242 312977 223112 227170 282991 394616
7669 394616 220426 218058 399675 395002 436305 80034 99982 176244 169396 300960 326216
7658 326216 341683 59601 57265 16465 -129794 -95918 32552 239914 290964 406597 335321
7647 335321 385097 144290 327977 213400 214788 205764 313633 265888 244761 131224 298204
7636 298204 427157 434068 334791 473455 518177 440650 497032 401893 640140 543794 631764
7625 631764 445724 513585 369443 554256 491401 341001 440308 379186 273415 331394 638862
7614 638862 710375 378142 325174 402030 435704 355095 359470 323931 360436 60410 126522
7603 126522 339462 424855 392198 192554 250212 185358 -129043 122882 228844 2990
7593 2990 22778 40422 154649 151990 225446 379974 497552 179213 147034 336544 556119
7582 556119 492930 486841 521823 363684 -66308 -141576 81156 194297 359832 273087 40188
7571 40188 216063 327615 420363 657417 511546 481197 387148 310051 227148 119131 -75582
7560 -75582 -100890 41571 163975 89218 7272 -12128 67087 174774 451446 480411 530945
7549 530945 573707 379485 812 19519 77932 234029 401129 516023 320741 26061
7539 26061 -284 150912 362434 252683 326965 411605 345272 264043 -151180 -46204 28371
7528 28371 235514 635321 557179 353331 80290 -42904 -12771 95609 42955 -11693 148151
7517 148151 780 -94743 53819 -40852 53911 64579 -83901 -131550 194797 272498 202792
7506 202792 144808 257386 304808 205882 327889 192294 78920 226355 146727 105789 -36239
7495 -36239 53207 46888 -53689 26743 188151 98216 150145 505299 514521 286527 92719
7484 92719 -140071 -86197 -80907 -46815 -58553 -32981 132455 271211 -17309 -248449 -43841
7473 -43841 114027 -71249 -159908 -248374 -170158 26129 20406 109649 166147 207148 96738
7462 96738 -56451 -10538 188505 97639 -273715 -223920 -279247 -214219 -107383 47471 73530
7451 73530 75174 45607 -75080 -94776 -145351 -265758 -4419 215733 253942 -2483 2452
7440 2452 306064 343103 266104 362441 481059 307876 138933 22334 -76338 -114327 9209
7429 9209 -29597 52794 -38023 -187746 -247682 -247648 -149152 -48744 -102026 -252758 -217623 -223115
7417 -223115 -135025 -27 -31725 -22840 -149999 -180992 -360935 -363928 -467647 -343568 -477453
7406 -477453 -128496 -194417 -151887 -181180 -168207 -74708 -204630 9890 86993 133217 300596
7395 300596 294543 88242 174751 47687 7263 760 -192341 11185 -30917 -220877 -102953
7384 -102953 -63140 -130746 -168936 -104653 116451 -60293 -217798 -151377 -225583 -250985 -318688
7373 -318688 -56484 75890 157176 -124547 -215050 -209451 -85304 -86976 -70040 -21243 -158062
7362 -158062 28517 2716 -139027 -397936 -323631 -223503 -104576 -438646 -671945 -381237
7352 -381237 -67039 6981 -24580 63318 -115699 -134048 -71601 -5593 1517 -322337 -208071
7341 -208071 -219202 -128685 -77902 -274544 -210285 -453044 -241333 -164033 -231458 -302037 -519121
7330 -519121 -429038 -391946 -395510 -269143 -347805 -169638 -172371 -246289 -310979 -127250 -199273
7319 -199273 -238204 -190691 -407402 -388752 -197649 -248810 -283540 -300882 -234842 -246508 -445508
7308 -445508 -318239 -473160 -341750 -262703 -312053 -36304 -58443 -224141 -367602 -377952
7298 -377952 -373408 -305883 -115964 -97074 -258153 -318751 -388897 -263208 -136290 -36778 -155966
7287 -155966 -310348 -430278 -468655 -454184 -372347 -303742 -423314 -414344 -549764 -566328 -584445
7276 -584445 -519313 -327936 -105192 28350 -141673 -356877 -272718 -383738 -426361 -199070
7266 -199070 -218856 -347454 -396096 -592572 -500073 -440082 -307236 -167088 91058 -35096
7256 -35096 -97234 254705 -72465 5296 -3782 -362451 -132394 -145650 -85507 23292 245191
7245 245191 130969 -128073 -176924 -207784 -379756 -480622 -213466 -286497 -222153 -305764 -302110
7234 -302110 -167448 -104588 -324518 -312142 -210250 -104547 -136059 -50979 -9875 -91905 -121163
7223 -121163 -182562 -79121 21352 178150 122712 86212 85812 99808 71646 -185629 -247789
7212 -247789 -426590 -494216 -159666 -166020 70380 64691 104721 -76531 -142296 198003 14185
7201 14185 -171380 -167308 -95588 27744 222003 207347 186463 -21325 107903 193667 43011
7190 43011 58642 -112375 -311721 -338743 -174484 153683 59039 -119623 -135501 -235843 -579252
7179 -579252 -259204 -30083 -154570 -83661 -153798 32900 -112978 -183812 -82080 -46000
7169 -46000 34531 176637 -9121 -94345 -52349 -15090 57842 55881 -81165 71783 167052
7158 167052 61057 80566 30445 -382379 -508295 -292249 -69665 -128799 -23310 42992
7148 42992 79758 36446 -104831 -250248 -244574 4616 47278 216697 296503 336430 294474
7137 294474 255271 110094 -53911 -81000 4571 2771 -212173 -65493 13003 -177397 -316532
7126 -316532 -487629 -279737 -294619 -343589 -92628 -212436 -304517 -481081 -612261 -284070
7116 -284070 -405920 -442106 -627115 -644706 -386875 -431350 -490774 -207872 -230643 -626344 -524607
7105 -524607 -452618 -288103 -247990 -374790 -161475 -136897 -144748 -446923 -578326 -721366 -567572
7094 -567572 -518993 -238196 -225854 -493861 -327044 -353966 -355528 -231473 -164445 -403431 -380002
7083 -380002 -339223 -404233 -377220 -350120 -267569 -298286 -452301 -395168 -230275 -367419 -331531
7072 -331531 13692 -135292 -385052 -210571 -9458 -242361 -377892 -284720 -537316 -492268
7062 -492268 -369190 -421676 -482035 -426306 -161000 -156705 -143737 -176161 -237789 -64108 2808
7051 2808 -269754 -371360 -304263 -227312 -306102 -298338 -314403 -373268 -262152 -327446 -484768
7040 -484768 -232029 -77380 -81504 -446303 -262980 -60130 10825 -248833 -322640 -194003
7030 -194003 -264744 -650237 -480011 -161556 108321 118731 -228241 -161487 13742 -62380
7020 -62380 94616 -14958 -64809 -36732 -214764 76576 1423 -164516 -66908 -18488 -50091
7009 -50091 -100495 -319646 -279110 -317414 -190703 101044 -208994 -306956 -11472 -44067 -188291
6998 -188291 -407519 -271389 -177043 -20461 -234435 -198550 -119354 -321069 -433964 -365238
6988 -365238 -69685 -56588 -188925 -202447 -432032 -543410 -439227 -481629 -305883 -286954
6978 -286954 -205842 -151417 -190294 -304439 -417379 -172355 -437715 -565763 -334323 64857
6968 64857 -261835 -370446 -436547 -33005 74693 -99110 133749 90772 -2414 -121158
6958 -121158 -349974 -438855 -334985 -328477 -156536 -236548 -389853 -270070 -72329 -69112 -244187
6947 -244187 -189031 -393699 -381742 -278001 -221525 -66437 -232677 -240256 -334845 -303667 -343673
6936 -343673 -533168 -527247 -374355 -439981 -426260 -402919 -197902 -191668 -130673 7355 -118792
6925 -118792 -173659 -220922 -240023 133580 84044 16170 6490 -13531 -29677 -135333 -524974
6914 -524974 -532868 -270810 -88096 -250193 -262430 71341 -43749 -211543 -263751 -146994
6904 -146994 -242756 -168068 -192547 -115815 -109207 -87647 -30911 -10704 -394350 -420447 -166574
6893 -166574 -156829 -144933 -187424 -166499 -402088 -457938 -392439 -383090 -74566 -15646 -224346
6882 -224346 -228929 -303855 -201082 41844 -245214 -203713 -89442 -112521 -134726 -148919 -226870
6871 -226870 28034 123579 5405 10448 -185101 -148703 -172544 -322111 -229887 -401523 -257376
6860 -257376 95765 223226 33109 91364 12862 -253608 -200672 -227834 -61636 -123262 -50567
6849 -50567 -237461 -69699 -203442 -147598 -21326 -62479 -37688 35191 -40066 -115714 -78377
6838 -78377 64598 274112 464353 -140781 -156254 19063 -32658 -262077 -321426 -296647 -182235
6827 -182235 234288 183897 -66366 -58563 171673 -31406 48732 125884 53830 -31543 3445
6816 3445 230581 110631 365755 297781 173133 244877 363616 433225 155621 151923 288753
6805 288753 194213 129404 136478 198197 380647 164210 311252 591143 397534 73219 103858
6794 103858 312937 303912 2192 79334 353346 338033 690539 734678 632644 463503 464150
6783 464150 537015 333141 463611 256501 440270 619766 738223 610887 434554 515780
6773 515780 535851 548854 576071 361603 241005 323712 648348 570290 411762 603191 736692
6762 736692 687924 444022 335459 284812 494647 499938 456772 391391 214775 348586 167390
6751 167390 348832 602664 477590 160528 219115 491625 656535 460887 486919 527807
6741 527807 563320 763147 787247 547689 393601 308750 597016 749080 794097 673784
6731 673784 773796 742377 656429 951677 1006276 1054795 1027840 1103000 1152709 1208580 1270239
6720 1270239 1556747 1602595 1648863 1910548 1933474 1821649 1884340 2353854 2480113 2377638
6710 2377638 2616531 2704110 2772223 2711811 2545566 2536903 2511061 2329904 2037654 2171607 2272975
6699 2272975 2089130 1933917 1922562 1980909 1832304 1593838 1533969 1665339 1670754 1697264 1649286
6688 1649286 1512069 1515541 1489334 1304302 1375402 1156897 1306521 1537294 1458208 1565409
6678 1565409 1390710 1340287 1344739 1374983 1367852 1491918 1794920 1508944 1555125 1324819 1278710
6667 1278710 1377483 1574533 1698829 1533824 1476903 1521769 1422823 1551432 1681557 1472266
6657 1472266 1418043 1459261 1575803 1483868 1497693 1429236 1250381 1201281 970759 869729 1281428
6646 1281428 1390604 1372202 1446495 1112532 1239629 1259238 1343643 1304081 1088766 1434332
6636 1434332 1615450 1479028 1471909 1435697 1294886 1375164 1374598 1563178 1664662 1807935 1943121
6625 1943121 1637540 2018454 2177956 2188963 2033471 2036649 2299248 2372216 2452948 2680154
6615 2680154 2783767 2904053 2862817 3099601 3290866 3311198 3314593 3259044 3292870 3454343 3395719
6604 3395719 3500800 3629576 3837777 3935477 4128055 4156273 4101901 4039466 3843836 3814279
6594 3814279 3715153 3773735 4113579 4003948 3864152 4033205 3526609 3539609 3584408 3532845
6584 3532845 3610795 3395153 3585615 3352925 3121892 3411293 3121618 3184933 3086236 3091292
6574 3091292 3121656 3185232 3085123 3584741 3628088 3591394 3342312 3521247 3699970 3620356
6564 3620356 3598740 3562057 3762004 4178380 4236355 4262335 4121477 4421111 4652548 4341756
6554 4341756 4221416 4268471 3958975 3902155 3763065 3405528 3139232 2946607 2683545 2461315
6544 2461315 1933286 1869417 1861732 1674708 1939591 2023019 1668604 1248550 1309237 1263874 1467815
6533 1467815 1556498 1307387 1011173 1041565 1230008 1079239 920790 1112522 879431 1018878
6523 1018878 962977 1085544 758583 515453 369931 435856 536102 556258 479449 674499
6513 674499 705437 644435 571147 482884 615789 421552 405155 404659 464782 414560 283681
6502 283681 123645 182214 -108966 45773 335458 171828 183088 252040 461297 416828
6492 416828 432791 394949 438643 508372 396228 189977 -59087 56512 107998 305764 309908
6481 309908 354450 321854 242240 203941 252194 253079 371636 313449 73148 118842 144265 341235
6469 341235 154341 89844 53838 41892 30505 292914 364862 357712 228836 207432 354250
6458 354250 146408 227321 254042 10555 -156303 128859 229165 344508 384733 276671
6448 276671 215586 307139 155112 186108 354298 215496 458537 521167 437237 416293 398688
6437 398688 497967 373522 192246 187981 231655 277736 -34730 309334 211230 98869 212718
6426 212718 257159 117581 136665 256181 15859 -146040 -31944 -57105 -14632 -24220 210524
6415 210524 188556 529645 349002 176980 247073 436262 405847 262704 110375 287285
6405 287285 316547 159775 348942 548322 665000 616803 643342 571139 619979 465212 588498
6394 588498 575475 509048 652407 1111205 851384 610773 461443 558723 566477 508505 397381
6383 397381 569378 634398 529153 521795 559029 395803 556867 717266 768021 715744 929944
6372 929944 816224 729091 597662 743554 628189 534095 697715 892609 909079 892673
6362 892673 857851 797319 719319 929147 832296 841151 833580 683192 804182 833985 890460
6351 890460 773410 808863 988217 854856 1105009 1282473 982731 1107674 1197189 1081402
6341 1081402 1006446 963914 1064439 1067966 1122670 873041 950134 1049439 1220839 1326181 1036576
6330 1036576 1143438 1068813 1214686 1311862 1716554 1578778 1596848 1609609 1834710 2111699
6320 2111699 2203219 2078599 1984913 2042783 1911683 1635453 1592316 1793125 1755084 1587171
6310 1587171 1823112 1743399 1583989 1577660 1734508 1483986 1414879 1331209 1288817 1505651 1620132
6299 1620132 1507599 1487198 1604165 1836495 1897035 1696039 1648840 1920784 2071386 2135470
6289 2135470 2207118 2009948 2016426 2175382 2118839 1858238 2256808 2380970 2364601 2108393
6279 2108393 1948427 2043532 1727480 1830730 1561474 1570770 1749407 1639699 1629026 1580928
6269 1580928 1912199 1838198 1651477 1625653 1596185 1509206 1415030 1652139 1704817 1543917 1542529
6258 1542529 1651476 1668962 1917437 1804020 1875128 1933265 1781989 1590158 1486152 1679476
6248 1679476 1836016 1847656 1945935 1891358 1719400 1882036 1942598 2142678 1795397 1921323
6238 1921323 1790717 1750475 1926410 1879533 1685990 1479868 1382959 1577883 1941552 2035673
6228 2035673 1596469 1340606 1598727 1795173 1727913 1730040 2048395 1958684 1813969 1760557
6218 1760557 1923616 2191549 2368819 2458920 2522418 2699572 2726588 2747521 2721543 2488290
6208 2488290 2400178 2507765 2201893 1795205 1835983 2004349 1960425 2049801 2167412 1946677
6198 1946677 1877326 2026634 1977660 2152120 2323691 2322978 2295385 2127761 2200550 2582250 2554462
6187 2554462 2388063 2572100 2384281 2323809 2646199 2463392 2324611 2394298 2627546 2499580
6177 2499580 2555330 3005931 2809051 2732602 2804006 2882204 3022794 2969767 3112230 3133582 3095919
6166 3095919 3204899 3338394 3471632 3492060 3845910 4000900 4052857 4283164 4389917 4825250
6156 4825250 5065225 5089603 5555410 5705920 5795619 6134923 6575912 7265203 7876027 8429528
6146 8429528 9412773 10390500 11062369 12284880 13661313 15254649 17265599 19185338 21171760
6137 21171760 22859151 24403812 24992519 25357193 25994830 26105227 26081282 26472061 26695037
6128 26695037 27392141 28140613 28498912 28449456 28192467 27510178 26350944 24922639 23151080
6119 23151080 21587074 20329113 18996850 17587949 16576689 15863856 15120186 14508931 13671038
6110 13671038 13074766 12616747 12322011 11944951 11777299 11637628 11494140 11170861 10913891
6101 10913891 10576873 10259735 10297739 10030452 9888375 9499259 9359412 9245350 9004247 8642072
6091 8642072 8443982 8378830 8127468 7878990 7753050 7422542 7433182 7550942 7265020 7226140
6081 7226140 7194011 6896598 6884660 7073483 6839930 6880496 7269723 7380912 7775035 8455966
6071 8455966 9166253 9580795 10370456 10314410 10190159 10060107 9572393 9184468 8658589 8276682
6061 8276682 8435908 8871149 9464978 9517040 9541793 9268714 8905217 8301119 7633899 6940730
6051 6940730 6365015 5669457 5148597 4788884 4183467 4045752 3921239 3711794 3439455 3422204
6041 3422204 3252900 3339749 3278695 3104077 3127831 3208018 2991150 3049709 2997092 3043074 2960251
6030 2960251 2939037 2849645 2743570 2894106 2851544 3039311 2862438 2657643 2666401 2642059 2599749
6019 2599749 2850678 2772289 2640508 2871509 2918063 2898114 2819937 2878172 2883022 2865754 2639971
6008 2639971 2594502 2653699 2644694 2717873 2926399 3026138 2962759 2911580 3081809 3069158 2839009
5997 2839009 2954179 3015192 3119636 3062142 3061038 3170316 3198591 3188590 3357532 3561662 3535028
5986 3535028 3604395 3645657 3656938 3602017 3965645 3894010 3779606 3787470 3732774 3922450 3844635
5975 3844635 3792686 3928257 3891316 3986771 3931877 3798680 4163924 4166448 4455101 4519365 4478863
5964 4478863 4434680 4372070 4665068 4751162 4817020 5067747 5238856 5416704 5457139 5554178 5705157
5953 5705157 5989844 6183663 6227857 6354517 6427402 6494825 6720318 6915511 7224730 7462446
5943 7462446 7653332 7996007 8123120 8730081 8868630 9341335 10113056 10607119 10821369 10987795
5933 10987795 10825564 10855820 10981721 11001822 10816200 10605697 10708119 10926697 11219469 11651048
5923 11651048 11977973 12044775 12353805 12758416 12789302 12710358 12724068 12708713 12836005 12943521
5913 12943521 12838332 12660748 12670374 12916338 13592464 14126138 14671002 15339835 16047791 16721246
5903 16721246 17263987 18231220 18907059 19704797 20824770 21449322 21851570 21869714 22158548
5894 22158548 22531190 22880193 23420189 23836908 24922987 26462136 28312849 30555325 33589122
5885 33589122 38396722 45728942 55473143 66119638 75411675 81572061 84535877 84276614
5877 84276614 80932066 75588105 69730051 63597332 57411192 51702267 46513667 42057127
5869 42057127 38525427 35930089 34350773 33080266 32619132 32301447 31925298 31370283 30545633
5860 30545633 29380685 28062070 26625232 25370000 24045773 23109170 22479980 22113440 21884120
5851 21884120 21797854 21830726 21248162 20900555 20325706 19662505 19195908 18372322 17669650 17034066
5841 17034066 16140167 15807363 15628269 15277072 14938053 14903904 14898724 14904562 14927284 14951746 15045995
5830 15045995 15127944 15037787 15196736 15265233 15373099 15425086 15370199 15211917 15105445 15136544
5820 15136544 15052934 15350346 15439268 15231842 15366371 15557670 15649089 15865693 15948018 15932498
5810 15932498 15866542 15897199 16065165 16124301 16215397 16586050 17136672 17625430 17919617 18208016
5800 18208016 18649434 19000070 19095674 19324767 20170966 21612360 23589668 25975049 28359939
5791 28359939 30527949 31217152 31050098 30008383 28104937 26018626 23745599 21838356
5783 21838356 20110985 18354748 16978476 15943461 15178359 14391573 14138631 13750991 13396876
5774 13396876 13069313 12698632 12804223 12482896 12075526 11755848 11501679 11226142 11147578 11181821
5764 11181821 11168126 11227271 11489142 11689743 11883644 11913391 12020135 11903747 11516055 11299505
5754 11299505 11107274 10886597 10951760 10812697 10961872 11188599 11258772 11170819 10955789 10876265
5744 10876265 11304751 11307383 11241490 11347186 11328661 11191100 10996206 10944024 10947894 10926650 11167352
5733 11167352 11259547 11512862 11807754 11779005 12000968 12068018 12347285 12535192 12718942 12856794
5723 12856794 12957316 13605967 13952883 14232912 15325276 16609147 18527580 20635850 23034631
5714 23034631 24763762 25402111 25379923 24596375 23525158 22153135 20761897 19679179 18928475
5705 18928475 18320873 17726101 17291218 16953899 16882048 16284188 15406267 14945065 14307780 13458027
5695 13458027 12776196 12145289 11775673 11280812 10855847 10803121 10709941 10556484 10511891 10591534
5685 10591534 10765226 11099603 11090254 11057895 11614594 12334861 12849518 13868278 14893161 15957735
5675 15957735 16721217 17161498 16997024 16706488 16611304 16264491 16044998 15583888 15513334 15551348
5665 15551348 16003816 17010263 18155234 19940564 22732340 25786164 28516567 30213602
5657 30213602 30844413 30022438 28202225 25649072 23141684 20766618 18499925 16478247
5649 16478247 14460412 12918011 11814659 11106037 10325515 9749474 9209694 8769717 8492435
5640 8492435 8326239 8027741 7763038 7771766 7971640 8282895 8225856 8312661 8933548 9075156
5630 9075156 9552383 9603225 9674017 10064956 10432038 10195322 9946218 9460409 9389007 9096206
5620 9096206 8511528 8128176 7805707 7483194 7030135 6877737 6534921 6239047 6127338 6109781
5610 6109781 6213299 6114374 6258996 6520744 6525795 6855210 7107406 7478007 8003707 8583242
5600 8583242 9127437 9747400 9881049 9775393 9805934 9314593 8861585 8238858 7574569 7268878
5590 7268878 6815259 6502450 5873137 5725546 5399951 5330966 5169534 5156802 5256755 5181388
5580 5181388 5029993 4967755 4858982 4948073 4981391 4855682 4796468 4664354 4862674 5125526
5570 5125526 5558395 6212612 6413825 6598903 6780444 7031447 6984733 7207084 7690440 7533529
5560 7533529 7378799 7429086 7357776 7096877 6671706 6783473 6565342 6103628 5724320 5596619
5550 5596619 5385270 5122160 4915244 4823493 4830563 4662476 4487640 4532447 4623705 4544810 4768784
5539 4768784 5227487 4880508 4689699 4804537 4638954 4438721 4302374 4312239 4149562 4101455
5529 4101455 3937285 3814683 3633710 3493130 3636101 3689733 3402146 3183420 3017845 3351647
5519 3351647 3346253 3554978 3308718 3175688 2970287 2966919 2923766 2777582 3009891 3236095
5509 3236095 3152563 3002709 2970929 3012929 3164515 3268917 3103717 3136994 3293837 3278248
5499 3278248 3379058 3380948 3409454 3398923 3328616 3182837 3314535 3286715 3237839 3265514 3154805
5488 3154805 3269290 3233482 3075871 3035028 3073768 3054785 3078942 3108209 3244547 3312818 3370160
5477 3370160 3415981 3613613 3624845 3795823 3651372 3625358 3229678 3191065 3086741 3094194 3055017
5466 3055017 2977158 2966931 2787091 2762169 2794364 2650112 2775758 2944642 2742046 2496330
5456 2496330 2453157 2375715 2319192 2305674 1964423 2243480 1947768 1921953 2036337 2112971 2231591
5445 2231591 2243265 2072568 1872139 1696043 1745333 1791218 1692467 1761268 1791004 1785398 1748714
5434 1748714 1787871 1753459 1948947 2440082 2218923 2225933 2059590 1983325 1955015 1928906 1767239
5423 1767239 1758314 1677420 1692018 1763314 1694444 1650754 1606146 1609589 1617306 1785924 1592823 1571027
5411 1571027 1392883 1614254 1568051 1354397 1502410 1667988 1586732 1374572 1329250 1173855
5401 1173855 1126735 1183920 1160096 1259885 1363074 1288582 1306091 1184949 1264829 1022703 983504
5390 983504 946578 868911 935369 965821 881534 887362 972878 828904 837599 821975 843340 964531
5378 964531 871954 1148665 1222852 1126072 701970 1011881 970439 732305 646262 761703 918894
5367 918894 734002 871750 870700 734610 690143 1028289 827162 643795 844344 742757
5357 742757 785652 800483 774067 832324 672255 723086 972218 894349 1067426 1011683 780089
5346 780089 906881 819379 440323 382349 817063 916750 994640 932477 890927 811008 855562
5335 855562 898739 884503 935926 746887 697289 543023 594491 805191 581167 715217 926290
5324 926290 874425 734681 667329 740211 737686 778029 986274 747729 583970 812475 740097
5313 740097 461259 536099 550851 595381 552330 745987 644072 753461 694560 835802 625799
5302 625799 646496 522419 609363 591825 619006 853723 940123 1000744 762642 817064 895207
5291 895207 1273794 1085831 918319 668861 466114 776309 1015365 851368 829094 920200
5281 920200 584334 493134 589034 512059 757003 686281 627204 613808 711452 820973 713095
5270 713095 860177 746364 683835 828283 779266 780512 702563 778344 709555 948811 1112396
5259 1112396 1060731 1083513 999512 919965 879823 818499 490050 531198 631280 866928 824248
5248 824248 1010147 1227660 1325732 1134605 1068472 768977 838773 938446 1106758 1194740 1009791
5237 1009791 1112436 1068189 1167279 952164 998943 841560 1000571 1199292 894154 750882
5227 750882 871436 800080 897406 756642 1075058 1223564 1032443 949625 1059357 1370813
5217 1370813 1228852 1346308 1176697 918582 1049358 987363 1107874 1128974 1375201 1325068
5207 1325068 1230781 1434084 1351090 1464761 1573330 1521811 1452613 1310492 1125402 1064208
5197 1064208 1120217 1406298 1551458 1747875 1738699 1677462 1785577 1660011 1490346 1671528
5187 1671528 1398195 1345889 1528882 1250889 1584194 1659522 1734279 1834727 1868311 1922499
5177 1922499 1836010 1986356 2004001 1803948 1914511 2186701 2204583 1873614 1975641 1943247
5167 1943247 2042138 2250067 2426758 2370801 2285519 2322137 2231065 2277621 2380341 2410532 2669484
5156 2669484 2982057 2765677 2472845 2565814 2993879 2893647 2671652 2798355 2856589 3176082
5146 3176082 3386344 3458963 3236843 3395672 3633723 3533047 3494379 3808565 3994401 3743112
5136 3743112 3713119 4001553 4119602 4162792 4363670 4767794 4714682 4987619 5276857 5367202
5126 5367202 5526953 5864763 6463505 6834289 7524732 8177573 8734100 9443217 10161368 10546101
5116 10546101 11028075 11358858 11585300 11259966 11007321 10929824 10485218 9876115 9576597 9659817
5106 9659817 9501453 9269955 9318900 9390782 9608016 9609962 10022448 10439913 10960540 11693806
5096 11693806 12272305 12808358 13906497 15076817 16312839 17578173 18740438 19503546 19892879
5087 19892879 19717130 19774441 19234248 18068183 16880391 15732682 15043887 13517367 12455583
5078 12455583 11888879 11446395 10810099 10507124 10400214 10238299 10219042 10282115 10396612 10432134
5068 10432134 10659117 10824459 11448444 12109956 12782940 13196631 13497934 13423215 13379307 13533351
5058 13533351 13012386 12265052 11610731 10867683 10081917 9381298 8686538 8302177 7573443
5049 7573443 7009978 6810117 6368710 5941163 5641396 5371662 5224255 5364037 4968787 4869247
5039 4869247 4824731 4854629 4846378 4721218 4396846 4507626 4645974 4589324 4210779 4262414 4443651
5028 4443651 4117113 3921292 3741066 3673413 3904099 3987741 3739705 3750098 3872599 3779284
5018 3779284 3475417 3700757 3639522 3490646 3423834 3685071 3533095 3386300 3231929 3241904
5008 3241904 3198816 3493146 3458168 3441602 3414124 3148837 3357946 3526375 3416601 3346078
4998 3346078 3333780 3341443 3466317 3218881 3076375 3048420 3039509 3002882 2919097 2975870 3209249
4987 3209249 3394853 3375576 3265496 3037643 3040525 3087331 3105710 3085611 2905041 2929789 3089088
4976 3089088 3296123 3380467 3313668 3139085 3189462 2985035 3070667 3284387 3251620 3655852
4966 3655852 3620591 3633986 3502862 3711040 3503539 3503396 3804204 3763626 3586121 3577852 3850237
4955 3850237 3964256 3983000 3848333 3756208 3868841 3858050 3968433 4273660 4178965 4315852
4945 4315852 4408646 4436732 4527047 4506781 4813597 4844472 4839906 4814838 4823574 5092882 5270173
4934 5270173 5417063 5472584 5724300 5909694 5848637 5640093 5864749 5894650 5802509 5803794 5727707
4923 5727707 5598263 5544768 5969721 6132966 6043793 6036410 6116207 6225740 6268475 6507073 6637849
4912 6637849 7112002 7110581 7158525 7416056 7454959 7773878 8064468 8341034 8338810 8331645 8546368
4901 8546368 8867663 9074422 8948368 9090929 9165327 9060934 9335546 9864961 10058089 10132919
4891 10132919 10481372 10860427 11157492 11127390 11355045 11596521 11711768 12001634 12652275 12949334
4881 12949334 12955586 13370382 13757020 14133227 14491498 14948147 15298510 15478380 15832521 16121304
4871 16121304 16375929 16662611 16718005 16578127 16819283 17420425 17963877 18050327 18195364 18591950
4861 18591950 18717550 19270584 19730027 19978470 20217425 20562691 20716399 21198983 21565521
4852 21565521 21451843 21725475 22186172 22528789 22651366 22693787 23121163 23364933 23123585 23275692
4842 23275692 23428909 23314437 23242600 23118316 23085336 23273808 23292981 23084541 23342588 23517779
4832 23517779 23242123 23128085 23133413 23407545 23549901 23653486 23913085 23680377 23781252 23870660
4822 23870660 23508973 23375040 23368069 23183080 23313286 23347909 23051788 22938736 22978888 22925479
4812 22925479 22693374 22464108 22540721 22622054 22815695 22738453 22544830 22617795 22891257 23017115
4802 23017115 22945862 22895611 23233853 23471463 23708867 24207268 24055458 24290608 24753143 24866289
4792 24866289 25039765 25387813 25539773 25982853 25995032 25998064 26139897 26264683 26403830 26523498
4782 26523498 26957800 27119245 27486012 27461393 27523166 27904213 28246340 28448390 28682389 29049554
4772 29049554 29486215 29672898 29598694 29780425 29954250 30301472 30495174 30592042 30630119 30714189
4762 30714189 30946345 30819379 30604681 30759300 30799604 30682573 30570659 30273133 29872513 29839842
4752 29839842 29605032 29116344 28837579 28762400 28540254 28332363 28220031 27831197 27596247 27731747
4742 27731747 27445833 27252989 26926944 26564650 26250427 26248208 26213759 25885289 25638955 25653677
4732 25653677 25434106 25029192 24752431 24407130 24197609 23811289 23654398 23811825 23771659 23508687
4722 23508687 23493877 23409978 23235762 22754978 22006646 21741744 21282332 21157059 20342573 19831905
4712 19831905 19461214 19263724 18937816 18802014 18670335 18147230 18151526 17904066 18018270 17968101
4702 17968101 17826528 17860519 17470149 17053100 17105195 17130127 16986791 16802249 16751838 16502139
4692 16502139 16202613 16124556 16497762 16388087 16335971 16310755 16363422 16386122 16320908 16563490
4682 16563490 16667533 16669499 16535165 16523193 17070373 16931428 16725206 16918246 16939080 17253389
4672 17253389 17504889 17222740 17299379 17595985 17831376 18045520 18094765 18419524 18852138 19253564
4662 19253564 19583590 20138679 20877359 21771099 22179053 22319472 22706386 22952649 23034399 22885554
4652 22885554 22433336 21920028 21278881 20850604 20561839 20385241 20107738 19807208 19650178
4643 19650178 19466935 19397897 19162685 19398605 19312367 19261155 19479886 19506606 19888410 20754123
4633 20754123 21565940 22665151 23684222 24599221 25052367 25359781 25430310 25112996 24916803
4624 24916803 24609990 24398037 24019773 23360368 22443627 21556239 20605585 19800942 18657847
4615 18657847 18093189 17741347 16898823 16646630 16448077 16437132 16079022 16110717 16031113 16163134
4605 16163134 16344061 16833048 17244271 17682422 18398640 18928195 19669395 20331012 20474258
4596 20474258 20159732 19908274 19454610 18689008 17865517 16859982 16109053 15241658 14436608
4587 14436608 13652462 13099183 12694811 12066935 11907233 11431913 11148143 10751575 10549244
4578 10549244 10432802 10406919 10217418 9889991 9608435 9780626 9603948 9218523 8865816 8961637
4568 8961637 8904639 8890555 8819862 8750917 8645829 8585635 8674740 8612487 8725890 8510518 8168786
4557 8168786 8152660 8296443 8283150 8211867 8147274 8005708 7810218 7783573 7647904 7842569
4547 7842569 7787956 7651021 7637911 7673550 7854680 7996130 8080585 8112620 8030514 7813757 7806621
4536 7806621 7920247 7986543 8152366 8275950 8161626 8242392 8304349 8308376 8345850 8434198 8261833
4525 8261833 8546661 8818485 9044377 8875207 8818695 8909008 9228780 9350125 9456192 9583456
4515 9583456 9552383 9732903 10113166 10402616 10571423 10796213 10893379 11137682 11621652 11988211
4505 11988211 12087214 12247972 12840468 13800401 14679450 15756944 16669425 17548762 18221727
4496 18221727 18810676 19450427 19923676 20578227 21024123 21711818 22895399 24134294 25580073
4487 25580073 26407816 26882236 27127429 26973401 26312706 25858189 25498322 24802645 24574843
4478 24574843 24395764 24400543 24250077 23932052 23588723 23257379 22963953 22601944 22184213 21741873
4468 21741873 21171352 20872660 20742998 20298138 20201366 19932880 19859500 19641864 19289706 19241194
4458 19241194 19112559 19003172 18715326 18669815 19108855 19125867 19400385 19448844 19407309 19558795
4448 19558795 19604538 19698966 20175346 20410691 20838529 21070588 21258475 21748080 22326009 22516481
4438 22516481 22787884 23356556 23938983 24354118 24997921 25521862 26343613 27040928 28042308
4429 28042308 29172548 30608785 32160324 33284163 34863471 36654063 38614551 40775171
4421 40775171 43404021 46338453 49605199 53008878 57133945 61761201 66517586 71402346
4413 71402346 76418242 81219474 85795148 89866379 93423698 96885532 99666172 101843403
4405 101843403 103933906 105883420 107608886 109579352 111482140 113226981 114927258 116230571
4397 116230571 116946227 117024990 116350604 114321833 111513242 108034446 104418099 100057770 95489336
4388 95489336 91405390 87274943 83157768 79609739 76196378 73030399 70506463 68389681
4380 68389681 65762882 63191977 61060837 59155922 57600274 55960540 54366909 53226566
4372 53226566 52250588 51312022 50352670 49676596 49111540 48424759 47914698 47364476 46762778
4363 46762778 46408228 45912116 45354017 45056941 44731574 44161628 43598972 43145670 42841451
4354 42841451 42333875 41679083 41050898 40549737 39942220 39289721 38665063 38301547 37797071
4345 37797071 37478289 37090266 36511864 36146799 35868266 35676474 35751222 35822236 35885310 35844799
4335 35844799 35865212 36010244 36092827 36103422 36493618 36732295 36924688 37326441 37681499 38381497
4325 38381497 38941115 39900077 40719971 41480576 42270511 43015545 43840997 44567734 45126342
4316 45126342 46105476 46759536 47591752 48732472 49874367 51126759 52480482 54080958 55405259
4307 55405259 56436460 57452883 57883038 58471484 59080247 59543345 60124524 60872656 61706650
4298 61706650 62447292 63244978 64111868 65160005 66123649 67037415 67930348 69146327 69800830
4289 69800830 70578586 71312413 71405494 71210605 71050126 70827000 70303866 69714336 69154721 68716298
4279 68716298 68108445 68367466 68154011 67884868 67718916 67241878 66871587 66446665 65979637
4270 65979637 65459430 64916110 64479098 64399554 64121360 63830040 63607373 63240265 62680942 61946463
4260 61946463 60914932 60104107 59365503 58083656 56859917 55457452 54360886 53212935
4252 53212935 52082958 50877420 49487512 48364001 47526290 46901592 46036306 45305350 44548845
4243 44548845 43912352 43368784 42948625 42734040 42532444 42127042 41754839 41183106 40812710
4234 40812710 40558382 39962196 39559224 38960754 38240027 37580842 36715538 35711379 35034347
4225 35034347 34231679 33141159 32407037 31510367 30694365 29925942 29456370 29029557 28377498
4216 28377498 27796555 27407783 27085008 26798101 26388312 25997189 25791202 25490063 25266636
4207 25266636 24899809 24605630 24267156 24017871 23521097 23053515 22745081 22193965 21971657
4198 21971657 21504015 21097974 20629540 19980388 19710859 19519324 19606854 19410185 19004909 18782333
4188 18782333 18690626 18460690 18244971 17944335 17713383 17711903 17520421 17260902 17029730 16784835
4178 16784835 16593104 16723045 16570760 16462503 16385893 16315168 16276694 16273029 16545984 16427629
4168 16427629 16428302 16528352 16673393 16311716 16265008 16861231 17109291 17235997 17802540 18466653
4158 18466653 19205424 20194068 21206008 22446145 23459248 24725282 25675909 26464065 27252522
4149 27252522 27902243 27959552 27961391 27819985 27791465 27589245 27148038 27055371 27100693 27077705 27005815
4138 27005815 27246545 27202127 26924662 26794657 26423693 25803372 25052264 23781255 22741520
4129 22741520 21771765 20854476 20141906 19424228 18858446 18349998 17872724 17556383 17342013
4120 17342013 17173237 17093115 16779233 16724178 17071709 16865165 16517063 16702211 16725721 16613739
4110 16613739 16653714 16616913 16550921 16711327 16509726 16626852 16685819 16457278 16380734 16506548
4100 16506548 16322489 16463320 16563019 16351922 16291693 16009379 16152866 16267929 16300504 16313280
4090 16313280 16225545 16040358 16181237 16193034 16244870 15997278 16063359 16102454 15909471 15932041
4080 15932041 16035306 15829914 15942246 16195637 16171455 16103309 16005930 15906034 15923232 15900341
4070 15900341 16131310 16434767 16341947 16153517 16312590 16682007 16818958 16756663 16861542 16863857
4060 16863857 17068475 17177711 17226737 17526856 17423013 17348643 17415366 17769940 17981648 17996262
4050 17996262 18122975 18137960 18539183 18482927 18503868 18967917 19215520 19314813 19440787 19691457
4040 19691457 19987841 20108941 20256563 20725241 20981437 21356939 21661077 22270348 22800703
4031 22800703 23716585 24145362 24434063 25050698 26054567 27080636 27604662 28507084 29609826
4022 29609826 30426402 31400922 32268938 33189805 33782449 34254220 34964233 35271749 35810450
4013 35810450 36327104 36724528 37067291 37677391 38472732 38995582 39269211 39675245 40101930
4004 40101930 40562963 40960649 41329845 41511729 41707821 42023224 42289078 42636873 42823250
3995 42823250 43178410 43484753 44235751 45064890 45664179 46539570 47500413 48401117 49352837
3986 49352837 50399843 51950318 53166723 54365251 55798045 57200433 58819510 59911227
3978 59911227 61307649 62655897 63829939 65325335 66610009 67719359 69008092 70474593
3970 70474593 71838093 73108122 74203899 75443450 76579368 77444165 78713247 79511636
3962 79511636 80099705 80528312 80907463 81213668 81407833 81634630 81854322 82165711 82327043
3953 82327043 82332686 82612607 82932061 82940602 83161691 83228066 83036019 82971719 82896358 82558194 82328721
3942 82328721 82455576 82635556 82554517 82770382 82626962 82698789 83079243 83236595 83378361 83674544
3932 83674544 84016631 84715097 85347555 85724075 86460130 87396576 88460904 89736605 91311005
3923 91311005 92509089 93840050 95186179 96414639 97486088 98894616 99846403 100912903
3915 100912903 102266887 103403383 104886785 105885405 106966478 108028364 108982832 109921550
3907 109921550 110992276 111792390 112471287 113278020 113762763 114457206 115205825 115896931 116618381
3898 116618381 117251394 118118734 119424585 121067924 122755762 124560136 126695719 128662211
3890 128662211 130957285 132587125 133685168 134533695 135099640 135201253 135251653 134684194 134237338
3881 134237338 134258364 134344258 134326867 134577400 134826340 134830705 134741314 134157535 133586391 132251719
3871 132251719 130645380 128190412 125860366 123252677 120332937 117475399 114624729 111923491
3863 111923491 109410393 106733471 104244169 101927457 99920795 97957754 95592762 93465543
3855 93465543 91533260 89471198 87437825 85584171 83528511 81550043 79362754 77679836
3847 77679836 76415456 74964400 73537816 72448656 71429647 70457036 69563587 68545909
3839 68545909 67632946 66860204 66077779 65453650 64651158 63803092 63369330 62872454 62228474
3830 62228474 61760260 61506867 61016339 60623075 60249788 59944695 59595510 59192158 58888080
3821 58888080 58456927 57929059 57477213 57141221 56815041 56617293 56237895 55886141 55546846
3812 55546846 55186209 55125735 55006348 54890649 54953832 54841770 54556400 54512894 54165056 54001991
3802 54001991 53939294 53802059 53763560 53498953 53449599 53042769 52764072 52492831 51978752 51096089
3792 51096089 50527345 50011137 49473015 48682674 48044878 47664913 46862707 46272437 45573649
3783 45573649 44812240 43805902 42793649 41407313 40472336 39228098 37912556 36766085
3775 36766085 36001158 35033193 33958254 33052650 32224127 31333916 30384509 29460464 28696016
3766 28696016 27860175 26770201 26195401 25286566 24690294 24304352 23606477 22833557 22245577
3757 22245577 21782850 21479711 21174551 20522961 20145391 20083630 19645194 19441339 19396294 19259197
3747 19259197 18799180 18517875 18516543 18466063 18254108 18046552 17771018 17662660 17755904 17743242
3737 17743242 17472299 17160375 16914430 16642770 16553940 16648789 16783415 16514153 16356143 16431360
3727 16431360 16179985 15828127 15770014 15660490 15318126 15297438 15222036 15152570 14972525 15055369
$$ [...]
##END NTUPLES=NMR SPECTRUM
##END=
