##TITLE=1H_EC-3389(II-2)
 200.13Hz, CDCl3.
 8 sc
 24.8.2026
##JCAMPDX= 6.0         $$ Bruker NMR JCAMP-DX V2.0
##DATA TYPE= NMR SPECTRUM
##DATA CLASS= NTUPLES
##ORIGIN= UXNMR, Bruker Analytische Messtechnik GmbH
##OWNER= pz
$$ XWIN-NMR		Version 3.5
$$ Mon Aug 24 13:44:40 2026 Russian Standard Time (UT+4h)  she@DPX200
##.OBSERVE FREQUENCY= 200.1313
##.OBSERVE NUCLEUS= ^1H
##.ACQUISITION MODE= SIMULTANEOUS
##.ACQUISITION SCHEME= undefined
##.AVERAGES= 8
##.DIGITISER RES= 18
##SPECTROMETER/DATA SYSTEM= spect
##.PULSE SEQUENCE= zg30
##.SOLVENT NAME= CDCl3
##.SHIFT REFERENCE= (INTERNAL, CDCl3, 0, 15.4803)
##AUDIT TRAIL= $$ (NUMBER, WHEN, WHO, WHERE, WHAT)
$$ ##TITLE= Audit trail, XWIN-NMR		Version 3.5
$$ ##JCAMPDX= 5.01
$$ ##ORIGIN= Bruker BioSpin GmbH
$$ ##OWNER= she
$$ F:/spectra/data/she/nmr/H-C/1/pdata/1/auditp.txt
$$ ##AUDIT TRAIL=  $$ (NUMBER, WHEN, WHO, WHERE, WHAT)
(   1,<2026-08-24 13:43:20.20 +0400>,<she>,<DPX200>,
      <created by zg, POWCHK disabled, PULCHK disabled
       configuration hash MD5:
       00 E9 B6 7A A2 85 ED C7 34 08 36 98 17 FE 4E 26
       data hash MD5: 16K
       35 7A C1 6D 83 6C DF 71 F2 4A 2D 61 A0 FF BD 0B>)
(   2,<2026-08-24 13:43:22.37 +0400>,<she>,<DPX200>,
      <Start of raw data processing
       efp BC_mod = 2 LB = 0.25 FT_mod = 6 PKNL = 1 PHC0 = -4577.398 PHC1 = 7.392299 SI = 16K 
       data hash MD5: 16K
       FE 3C 63 AE 6E 53 5B 75 D6 DA 32 7C 21 7A B1 E6>)
(   3,<2026-08-24 13:43:45.40 +0400>,<she>,<DPX200>,
      <pk PHC0 = 0.6614796 PHC1 = 0.5999999 
       data hash MD5: 16K
       71 7F 4C E6 7A AA A2 97 CA A5 6F 46 19 96 0E 26>)
(   4,<2026-08-24 13:43:48.76 +0400>,<she>,<DPX200>,
      <abs ABSG = 5 
       data hash MD5: 16K
       B5 01 6F 41 77 FA AA 80 B0 8A CE 19 5E 35 BD 1C>)
$$ ##END=
$$ 
$$ hash MD5
$$ 5C E5 7A 76 EA 47 C6 79 BF B5 F6 A0 7D 86 05 99
##$RELAX= 
##$RELAX= 
##$RELAX= 
##$RELAX= 
##$RELAX= 
##$RELAX= 
$$ Bruker specific parameters
$$ --------------------------
##$DU= <F:/spectra>
##$EXPNO= 1
##$NAME= <H-C>
##$PROCNO= 1
##$TYPE= <nmr>
##$USER= <she>
##$AMP= (0..31)
100 100 100 100 100 100 100 100 100 100 100 100 100 100 100 100 100 100 
100 100 100 100 100 100 100 100 100 100 100 100 100 100 
##$AQSEQ= 0
##$AQ_mod= 1
##$AUNM= <au_zg>
##$AUTOPOS= <>
##$BF1= 200.13
##$BF2= 200.13
##$BF3= 200.13
##$BF4= 200.13
##$BF5= 200.13
##$BF6= 200.13
##$BF7= 200.13
##$BF8= 200.13
##$BYTORDA= 1
##$CFDGTYP= 0
##$CFRGTYP= 5
##$CHEMSTR= <none>
##$CNST= (0..31)
1 1 145 1 1 1 1 1 1 1 1 1 1 1 1 1 1 1 1 1 1 1 1 1 1 1 1 1 1 1 1 1 
##$CPDPRG= <>
##$CPDPRG1= <>
##$CPDPRG2= <>
##$CPDPRG3= <>
##$CPDPRG4= <mlev>
##$CPDPRG5= <mlev>
##$CPDPRG6= <mlev>
##$CPDPRG7= <mlev>
##$CPDPRG8= <mlev>
##$CPDPRGB= <>
##$CPDPRGT= <>
##$D= (0..31)
0 0.7 0 0 0 0 0 0 0 0 0 0.03 0 0 0 0 0 0 0 0 0 0 0 0 0 0 0 0 0 0 0 0 
##$DATE= 1787564599
##$DBL= (0..7)
120 120 120 120 120 120 120 120 
##$DBP= (0..7)
150 150 150 150 150 150 150 150 
##$DBP07= 0
##$DBPNAM0= <>
##$DBPNAM1= <>
##$DBPNAM2= <>
##$DBPNAM3= <>
##$DBPNAM4= <>
$$ [...]
##$SUBNAM3= <"">
##$SUBNAM4= <"">
##$SUBNAM5= <"">
##$SUBNAM6= <"">
##$SUBNAM7= <"">
##$SUBNAM8= <"">
##$SUBNAM9= <"">
##$SW= 18.0517328524113
##$SWIBOX= (0..15)
0 0 2 0 0 0 0 0 0 0 0 0 0 0 0 0 
##$SW_h= 3612.71676300578
##$TD= 16384
##$TD0= 1
##$TE= 0
##$TE2= 300
##$TE3= 300
##$TEG= 300
##$TL= (0..7)
0 120 120 120 120 120 120 120 
##$TP= (0..7)
150 150 150 150 150 150 150 150 
##$TP07= 0
##$TPNAME0= <>
##$TPNAME1= <>
##$TPNAME2= <>
##$TPNAME3= <>
##$TPNAME4= <>
##$TPNAME5= <>
##$TPNAME6= <>
##$TPNAME7= <>
##$TPOAL= (0..7)
0.5 0.5 0.5 0.5 0.5 0.5 0.5 0.5 
##$TPOFFS= (0..7)
0 0 0 0 0 0 0 0 
##$TUNHIN= 0
##$TUNHOUT= 0
##$TUNXOUT= 0
##$USERA1= <user>
##$USERA2= <user>
##$USERA3= <user>
##$USERA4= <user>
##$USERA5= <user>
##$V9= 5
##$VALIST= <valist>
##$VCLIST= <CCCCCCCCCCCCCCC>
##$VD= 0
##$VDLIST= <DDDDDDDDDDDDDDD>
##$VPLIST= <PPPPPPPPPPPPPPP>
##$VTLIST= <TTTTTTTTTTTTTTT>
##$WBST= 1024
##$WBSW= 4
##$XGAIN= (0..3)
0 0 0 0 
##$XL= 0
##$YL= 0
##$YMAX_a= 234949
##$YMIN_a= -255048
##$ZGOPTNS= <>
##$ZL1= 120
##$ZL2= 120
##$ZL3= 120
##$ZL4= 120
##$ABSF1= 15.51992
##$ABSF2= -2.531929
##$ABSG= 5
##$ABSL= 3
##$ALPHA= 0
##$AQORDER= 0
##$ASSFAC= 0
##$ASSFACI= 0
##$ASSFACX= 0
##$ASSWID= 0
##$AUNMP= <proc_1d>
##$AZFE= 0.1
##$AZFW= 0.1
##$BCFW= 0
##$BC_mod= 2
##$BYTORDP= 0
##$COROFFS= 0
##$CY= -3
##$DATMOD= 1
##$DC= 0
##$DFILT= <>
##$DTYPP= 0
##$F1P= 0
##$F2P= 0
##$FCOR= 1
##$FTSIZE= 16384
##$FT_mod= 6
##$GAMMA= 0
##$GB= 0
##$INTBC= 1
##$INTSCL= 3.241238e-09
##$ISEN= 128
##$LB= 0.25
##$LEV0= 0
##$LPBIN= 0
##$MAXI= 10000
##$MC2= 0
##$MEAN= 0
##$ME_mod= 0
##$MI= 1.114404
##$NCOEF= 0
##$NC_proc= -7
##$NLEV= 6
##$NOISF1= 3.799351
##$NOISF2= 2.8
##$NSP= 0
##$NTH_PI= 0
##$NZP= 0
##$OFFSET= 15.48025
##$PC= 1
##$PHC0= -4576.736
##$PHC1= 7.992299
##$PH_mod= 1
##$PKNL= yes
##$PPARMOD= 0
##$PSCAL= 0
##$PSIGN= 0
##$REVERSE= no
##$SF= 200.130008295882
##$SI= 16384
##$SIGF1= 3
##$SIGF2= 2
##$SINO= 0.751879
##$SIOLD= 32768
##$SREGLST= <19F.Aceton>
##$SSB= 0
##$STSI= 16384
##$STSR= 0
##$SW_p= 3612.71676300578
##$SYMM= 0
##$S_DEV= 0
##$TDeff= 16384
##$TDoff= 0
##$TI= <>
##$TILT= no
##$TM1= 0
##$TM2= 0
##$TOPLEV= 0
##$USERP1= <user>
##$USERP2= <user>
##$USERP3= <user>
##$USERP4= <user>
##$USERP5= <user>
##$WDW= 1
##$XDIM= 16384
##$YMAX_p= 396389646
##$YMIN_p= -725524
$$ End of Bruker specific parameters
$$ ---------------------------------
##NTUPLES= NMR SPECTRUM
##VAR_NAME=  FREQUENCY,     SPECTRUM/REAL,   SPECTRUM/IMAG
##SYMBOL=    X,             R,               I
##VAR_TYPE=  INDEPENDENT,   DEPENDENT,       DEPENDENT
##VAR_FORM=  AFFN,          ASDF,            ASDF
##VAR_DIM=   16384,         16384,           16384
##UNITS=     HZ,            ARBITRARY UNITS, ARBITRARY UNITS
##FACTOR=    0.220516191357247, 1,           1
##FIRST=     3098.06263268525, 0,            0
##LAST=      -514.654130320526, 0,           0
##MIN=       -514.654130320526, -725524,     0
##MAX=       3098.06263268525, 396389646,    0
$$ Real data points
##PAGE= N=1
##DATA TABLE= (X++(R..R)), XYDATA
$$ [...]
12021I5539r8412j67798j24549R0700n7880J19170J12930j6251L9340N4441r7138
12010d9908m7757K8794K1168j6599m7J00836J34089J18411l19384K3907K61147
11999B54657j69184p7014J09699J22857M6563k35972j74344L04783J9791j37049
11989F4787j76804Q9762J39908j67270p3735J36199R264K955L2475j92648m7983
11978a83090Q5r4610J56487M9013j62617p7922J28486N4841J5029J24569P2462
11967H2733k72489L45801K16264l83529P459r6807o8599m954K37359K4323l8935
11956D8626P2877j88928K82992J01425k89810j01332p4756K4267r2481p6184J8345
11945b74959L30157k7782j46955p237j31494k3380K38017o4880r0271M1167K52865
$$ plain form
12021 95539 -2873 -170671 -295220 -204520 -262400 -143230 -30300 -46551 -7211 47230 -49908
12010 -49908 -97665 -68871 -47703 -64302 -64349 36487 170576 288987 -30397 -6490 254657
11999 254657 85473 8459 118158 241015 287578 51606 -122738 182045 201836 64787
11989 64787 -112017 -22255 117653 -49617 -123352 12847 22111 25066 57541 -135107 -183090
11978 -183090 -183005 -277615 -121128 -72115 -234732 -312654 -184168 -129327 -114298 10271 82733
11967 82733 -189756 156045 372309 -11220 -3761 -100568 -169167 -174121 63238 87561 48626
11956 48626 121503 -67425 215567 316992 27182 -74150 -148906 -124639 -217120 -293304 -274959
11945 -274959 55198 27416 -119539 -126776 -258270 -281650 -43633 -108513 -198784 -157617 95248
11934I5248o9627p8845K8117J95092l7048l3683k03120j1724K45652R2780R9042
11923C21884k2898k6942k05009j2904J49043l5190k48880j92360M08880l1648
11913A03976j41729K07323k41163O1009K83675r0990k74453K5966K40636k9753
11903A44497j58188O1311J62271k6176k37603R7555K9743q1186o1341K490m7160
11892a13787j2343L753O5046J41961l18379l5911Q5865q054M297J02828K8469
11881e6255N8868j3485m5202L36817L5074j60793N4656R3880p025j18147l47286
11870a68898N9057K24520j93773j70552Q8883M1349l0430p6143K61280P278j02143
11859e9572r5054N1348J76510p0577J12923k12926Q5059M3612q3983j04684o1379
$$ plain form
11934 95248 25621 -53224 -25107 169985 132937 99254 -103866 -115590 130062 222842 321884
11923 321884 298986 272044 67035 54131 203174 167984 -80896 -273256 135624 103976
11913 103976 -37753 169570 -71593 -10584 273091 182101 -92352 -66386 174250 144497
11903 144497 -13691 47620 209891 183715 -53888 43667 73410 -7776 -69117 -66627 -113787
11892 -113787 -126130 -122377 -57331 84630 -233749 -269660 -183795 -191849 -187552 -84724 -56255
11881 -56255 2613 -10872 -56074 280743 315817 155024 209680 303560 296535 178388 -168898
11870 -168898 -109841 114679 -79094 -249646 -160763 -119414 -149844 -225987 35293 42571 -59572
11859 -59572 -154626 -103278 73232 2655 115578 -97348 -12289 31323 -52660 -157344 -218723
11848b18723n3013m6095o1972K86360o6308j59523P5251K7640K60707r416j5336
11837A9572j33896o3881O6486q2417q0822L28449J5706k1208k7659M4358q5638
11826b0950k1226l04421J35181J31458J7541k9674k5788O6184j59442L6345K29929
11815E5137Q2543R4377k0260k27911k77038J81198q6906P9197J73977j32904J73368
11804I4778j72404R839k22315J54553k73034J55275p779n0177J05592J15474K69711
11793A79513j64971j3715o8386k16667P5879K48034M8735k7981k75351J85465
11783b9445j78509m51305L05398Q5440K31479O2675k40158j778j12661j2520J18803
11772b22581R4947j85422K80973o3186k4195Q1437l6971J97588j14936q2139k11145
$$ plain form
11848 -218723 -271736 -317831 -379803 -93443 -159751 -319274 -244023 -216383 44324 34908 19572
11837 19572 -114324 -178205 -111719 -194136 -274958 53491 69197 47989 20330 64688 -20950
11826 -20950 -42176 -346597 -211416 -79958 -62417 -92091 -117879 -51695 -211137 -174792 55137
11815 55137 137680 232057 211797 -16114 -293152 -111954 -198860 -119663 54314 -78590 94778
11804 94778 -77626 -67787 -290102 -135549 -408583 -253308 -261087 -311264 -205672 -90198 179513
11793 179513 14542 827 -67559 -284226 -208347 39687 88422 60441 -214910 -29445
11783 -29445 -207954 -659259 -353861 -268421 -36942 25733 -214425 -216203 -328864 -341384 -222581
11772 -222581 -127634 -313056 -32083 -95269 -119464 -38027 -74998 122590 7654 -74485 -285630
11761b85630r7103K10819j33252N5303K63067J71040P6000j91707j03458m0097
11751g5018k03615J7895J51197J02313j9592j98950J18424J07397m152P7425j25135
11740e1811N4222J97080j34301j84202N7585j8553L1583Q3042k0701k27762Q574
11729b05244p5309j15587K98813J14669p3331k29788q8861J03846j87626J53271
11719c05147P6314j60882J89672n1934Q6385k13275M4554J90941J68840n2691
11709b7223P5100l26929j38410K16289K11426o2022j04618K0541o2465J68206
11699c0105J54028r1578j26864R0399j21659O9191k78382J61778O1033J576k8168
11688a38751M0639K48894l04724l09757J34592K47834N8458n8352J04683J34692
$$ plain form
11761 -285630 -382733 -171914 -305166 -249863 13204 184244 260244 68537 -34921 -75018
11751 -75018 -278633 -260738 -109541 -7228 -26820 -225770 -107346 51 -4101 73324 -51811
11740 -51811 2411 199491 65190 -119012 -61427 -79980 -48397 34645 13944 -213818 -205244
11729 -205244 -280553 -396140 -97327 17342 -55989 -285777 -374638 -270792 -458418 -305147
11719 -305147 -228833 -389715 -200043 -251977 -165592 -378867 -334313 -143372 25468 -27223
11709 -27223 47877 -279052 -417462 -201173 10253 -51769 -156387 -135846 -198311 -30105
11699 -30105 123923 32345 -94519 -4120 -125779 -56588 -334970 -173192 -112159 -110583 -138751
11688 -138751 -98112 150782 -153942 -463699 -329107 -81273 -22815 -81167 23516 158208
11678A58208k62872J32440O9284r1561J24103k70194k13631J38572j68165J21017
11668b62799K94560k30047N8522k7285k06656K5226J64342R2538q1077J92345
11658A9669N6245j35739j62874o1494j21714L91545R7039m8227J28488k94334
11648a31396J66755J1512m5998o2825r2709j55608J62864j32413j56402L36247
11638i9973j2784k3340N8677L00772k13131O1191Q8414k99503q1745J56855q0967
11627a45534k55565N3974K12956K52566L747m1054k17997K7741p099j52456q4626
11616c53347J06519K33388J9086k47067o6129j7143J45645N3995j07661R2549
11606a40165N5382K4689m5776K80254p1935k68789q5294k6341K53428j70140m4213
$$ plain form
11678 158208 -104664 27776 97060 5499 129602 -140592 -354223 -215651 -383816 -262799
11668 -262799 31761 -198286 -139764 -167049 -373705 -348479 -184137 -91599 -172676 19669
11658 19669 75914 -59825 -222699 -284193 -405907 -14362 82677 34450 162938 -131396
11648 -131396 35359 46871 873 -61952 -154661 -310269 -147405 -279818 -436220 -99973
11638 -99973 -112757 -136097 -77420 223352 10221 71412 159826 -139677 -221422 -64567 -145534
11627 -145534 -401099 -347125 -134169 118397 122144 81090 -136907 -109166 -116265 -268721 -353347
11616 -353347 -246828 -13440 5646 -241421 -307550 -324693 -179048 -125053 -232714 -140165
11606 -140165 -84783 -60094 -105870 174384 102449 -166340 -251634 -277975 -24547 -194687 -238900
11595b38900K38188J45015L6754q0460j28340o287N0932J6399J1319j96177m4190
11584a95747l5545j38728K09114K45394R034m1734k3811j17680J18917j18132
11574h8918R0582k0453j50089J84160K214p9819K47087J79461k2525l03550m02348
11563c64198J51810j04880J99077m1833k1305j6736Q2079Q8880j15047M06346
11553B64193K16679J31321l1365K63594o9795k66916J96617M9323j48861m9568
11543E55222M267o6537k08707j27590O6533q5412o7383L016m2872n7890n0923
11532g8276L5148l1663R7156K7846k91325J42298R196K20103J09608r725o8550
11521A61816o7057o4311J27973k77918M4126j22906k25807L31583J84212p9771
$$ plain form
11595 -238900 -712 144303 181057 100597 -27743 -34030 16902 33301 44620 -151557 -195747
11584 -195747 -231292 -370020 -160906 84488 93522 51788 27977 -89703 29214 -88918
11574 -88918 1664 -18789 -168878 15282 17496 -62323 184764 364225 341700 38150 -364198
11563 -364198 -212388 -317268 -118191 -160024 -181329 -198065 -115986 -27106 -142153 264193
11553 264193 480872 612193 580828 844422 774627 507711 704328 753651 604790 555222
11543 555222 559489 492952 284245 156655 223188 137776 70393 73409 30537 -27353 -78276
11532 -78276 -43128 -74791 22365 50211 -241114 -98816 -89620 130483 240091 230366 161816
11521 161816 94759 30448 158421 -119497 -75371 -198277 -424084 -92501 91711 11940
11511A1940k68244O9502j6505J56671L0758n4383J63706l61118J28524k609j18280
11500b60038N8695L0542k9543r1735M29788k55170k42235P4223J85896p2199j2551
11489a84327K19580J2519k28969J06235L7910J07435r7582n2528J12187j11321
11479g8861n64k4022j997O5337J46554q0394k44879K11284l07108L8687J62275
11468a13688j8887j23905J63260K87943k26103j36554J17433j00891K4482k07540
11458c34450J56791j5516Q9107M5369p0774K8244n1559J80912j56817J45251J16926
11447A33484j35826r6090q1017J08985J43082j85931R5067m0595N566R4366j4761
11436B6330j24860N2085o0673j10207j2812R4213j51347J30382j13390n5737j22030
$$ plain form
11511 11940 -256304 -186802 -203307 -46636 -15878 -70261 93445 -267673 -139149 -141758 -260038
11500 -260038 -201343 -170801 -200344 -292079 137709 -117461 -359696 -285473 -99577 -171776 -184327
11489 -184327 35253 47772 -181197 -74962 -37052 70383 -27199 -79727 32460 -78861
11479 -78861 -79425 -103447 -105444 -40107 106447 26053 -218826 -7542 -314650 -275963 -113688
11468 -113688 -132575 -256480 -93220 194723 -31380 -167934 -50501 -151392 -126910 -334450
11458 -334450 -177659 -193175 -104068 -58699 -129473 -101229 -152788 28124 -128693 16558 133484
11447 133484 -2342 -98432 -179449 -70464 72618 -113313 -18246 -58841 -53275 41091 26330
11436 26330 -98530 -46445 -107118 -217325 -230137 -135924 -287271 -156889 -270279 -326016 -448046
11425d48046M02404K6696m6140L05826l05767l71369J41654Q0824j79749J12156
11415b81511K65783Q5551j7249J91373j00620k02825L81285l4034k98771j22002
11405a33020N353l7125J25753o29K4389M5887r3806N6850J57012o5540j53258
11394f8134k75280N4194j20189j21290L83207J49149j6911l7246q2300n8669O1903
11383a31566j05914P4562j8347M88198J14430j01188J9286L8968q5324p5273m1031
11372A76801j4223J74938J48022k47425k07098j01882L0390l8535J33077r8045
11362d3980n7602j4263j07873j07623J71471k7155J9198J45131p3805L3066P5992
11351A2557K2643k9334j04473K8842q5757l5678q9619J23428L4427k43343L39467
$$ plain form
11425 -448046 -45642 -18946 -65086 240740 -65027 -436396 -294742 -213918 -393667 -281511
11415 -281511 -15728 69823 52574 243947 143327 -59498 321787 287753 -11018 -133020
11405 -133020 -127667 -164792 -39039 -39668 -15279 30608 -63198 -6348 150664 85124 -68134
11394 -68134 -343414 -289220 -409409 -530699 -147492 1657 -15254 -52500 -134800 -193469 -131566
11383 -131566 -237480 -162918 -181265 306933 421363 320175 339461 378429 293105 217832 176801
11372 176801 162578 337516 485538 238113 31015 -70867 -40477 -79012 54065 -43980
11362 -43980 -101582 -115845 -223718 -331341 -159870 -187025 -167827 -22696 -96501 -63435 12557
11351 12557 35200 5866 -98607 -69765 -155522 -191200 -280819 -157391 -122964 -366307 -26840
11340b6840J36670j87308O3187L6155p6267q0484J84108R0822r5506L29170k2297
11329C51410k29962m13856J47666O9993J75298r1285Q2003K1467K1345j35419
11319a340q4598j53899q5251J99802R088k1063q7212K37655o2305j24697j43273
11308c17093O1688O029j21873K59254K16258P8012j43729j54668k54442l7425
11298d07989K29235J6255o81J01709K44997l17653q2518J17955J96972L61436
11288D59718r0924l46236j69625J69664k24988j8618K6018j00651N7498J26189
11278a11955J44784j79086r1401N2202j765o0177j11871K26833K84227l10828
11268a59037k7918p1916Q3279j36899K7628K35369N7682M0414j44218m7557J26836
$$ plain form
11340 -26840 109830 -77478 -14291 21864 -54403 -134887 49221 140043 44537 373707 351410
11329 351410 121448 -292408 -144742 -74749 100549 9264 91267 112734 134079 -1340
11319 -1340 -85938 -239837 -325088 -125286 -116198 -137261 -224473 13182 -49123 -173820 -317093
11308 -317093 -255405 -249376 -371249 -111995 104263 182275 38546 -116122 -370564 -407989
11298 -407989 -178754 -162499 -163180 -61471 183526 -134127 -216645 -98690 98282 459718
11288 459718 368794 22558 -147067 22597 -202391 -221009 -194991 -295642 -238144 -111955
11278 -111955 32829 -146257 -237658 -185456 -187221 -247398 -359269 -132436 151791 -159037
11268 -159037 -186955 -258871 -175592 -312491 -284863 -49494 8188 48602 -95616 -143173 -16337
11257a6337r0397j53704j46966M869J6249J52817j30555K95011J1682j76968o011
11246b40310l5876P0972P178Q7237L8740N4576Q6689k27256J49498L30351J87036
11235E08835l51706l52419J75761j7248K2705n2685k4824k95936J46091k8774
11225b70200J4380K37592p1807J3619L5901J68852J06551q4216l04694j15052
11215b69074J35066n5534J07309j48002P6871n9150J38555j16386q5216J58618
11205a16943J71064J14304j48254k68261J02667L72481k1275j75871j6269k23519
11195b09876K77488K33556l0273k62201j44103L1322l8982j58094j18702J39307
11185b80558r9249K05827J22496j07184J39655j48154J04609N2407k6780q081
$$ plain form
11257 -16337 -106734 -260438 -407404 -402535 -386286 -233469 -364024 -69013 -57331 -234299 -240310
11246 -240310 -276186 -205214 -198036 -110799 -72059 -17483 69206 -158050 -8552 321799 508835
11235 508835 157129 -195290 -19529 -36777 -14072 -66757 -91581 -387517 -241426 -270200
11225 -270200 -255820 -18228 -90035 -76416 -40515 128337 234888 150672 -154022 -269074
11215 -269074 -134008 -189542 -82233 -230235 -153364 -212514 -73959 -190345 -275561 -116943
11205 -116943 54121 168425 20171 -248090 -145423 227058 205783 29912 13643 -209876
11195 -209876 67612 301168 270895 8694 -135409 -104087 -143069 -301163 -419865 -280558
11185 -280558 -379807 -173980 -51484 -158668 -19013 -167167 -62558 -10151 -36931 -45012
11175d5012L03l08378K19199N7639k9791L04631O2874K28470j57632j46116j5236
11164A70951q7773k44210j37019J76257R4314P6694K22785m6185o9719o0556M8704
11153A44243k28889J54291n5067p8307K32824q4634o6156o883n7814j6456q3894
11142a46742p3310P2333j85892Q0443J89941J02911j413K32432K2500j76220l1216
11131H5767j15404J58885j77000O3195L2015J49706j90029j27305q9345q651k1643
11120b39809J97308L54881l07237k02363l6163Q3519j93432M7158l1537j39635
11110d67310K47174j4653J75028q6600M7095k3252k22625o369J0004J10536p3532
11099c04504j36559J48400J30487J09964K4860j87547o953P7540j82992J858K95516
$$ plain form
11175 -45012 -44709 -353087 -133888 -76249 -106040 198591 261465 489935 332303 186187 170951
11164 170951 83178 -161032 -298051 -121794 -27480 49214 271999 225814 156095 95539 144243
11153 144243 -84646 69645 14578 -63729 169095 84461 18305 11422 -46392 -62848 -146742
11142 -146742 -220052 -147719 -333611 -253168 -63227 39684 38271 270703 293203 116983 85767
11131 85767 -29637 129248 -47752 15443 47458 197164 7135 -120170 -209515 -218166 -239809
11120 -239809 -42501 312380 5143 -197220 -233383 -149864 -343296 -296138 -327675 -467310
11110 -467310 -220136 -234789 -59761 -146361 -99266 -122518 -345143 -351512 -341508 -230972 -304504
11099 -304504 -441063 -292663 -162176 -52212 -27352 -214899 -221852 -144312 -327304 -325446 -29930
11088b9930N2488k98380J03343K17900o4377J4745k5814J8589n3827r1949K8283
11077a28929L7138J6415k73280o362O2543K34788l668l7678o7574P0499j63863
11066b59971J00954N3571j44799J22089j14365n486J82609O4024r9164j32903
11056b33441p3866K61135j23157P4923o0632j04493o9487K21530k10383J40953
11046a76918K52892j72422k33215J22076O1984L4605l6150o9147J28120j49624
11036b37799q688J95924k78524J25426J54873j76642n91o9283J41553N6676j33396
11025b30471j30709J06585J35612q2197J15935J10431l5197n0419j27835M5329
11015a42936J5740O8379L1246N0600j34669j27355k1268n8769K3785K3113N2574
$$ plain form
11088 -29930 22558 -275822 -172479 45421 -18956 -4211 -30025 -11436 -65263 -157212 -128929
11077 -128929 -91791 -75376 -348656 -355018 -292475 -57687 -61355 -99033 -166607 -96108 -259971
11066 -259971 -159017 -105446 -250245 -128156 -242521 -248007 -65398 -1374 -100538 -233441
11056 -233441 -307307 -46172 -169329 -94406 -155038 -259531 -329018 -107488 -317871 -176918
11046 -176918 75974 -96448 -329663 -207587 -145603 -110998 -147148 -216295 -88175 -237799
11036 -237799 -246487 -50563 -329087 -203661 -48788 -225430 -226021 -295304 -153751 -97075 -230471
11025 -230471 -361180 -254595 -118983 -201180 -85245 25186 -10011 -60430 -188265 -142936
11015 -142936 -127196 -58817 -27571 23029 -111640 -238995 -260263 -319032 -295247 -272134 -219560
11004b19560r5264J34833O9179p5022K61459k37738o4117M8543L9761K3481O7404
10993d7041j2880J6102k4365l2083o7673k57499J62304R0550K2236j44444M2771
10982b52022N5669m4283K01730K42186k40321j1834O664j30757j72759L44745
10972i82L7110j42365J99269k6428M2582K8423J24799l02702l07198P1020l3092
10961c09564L6099M70502M3937j40957l9368j78395r8211L20830q1697L7488N9480
10950A20144r5072q2559r5519j52308j22947K01876k2652k43977o4321M39313
10940a18022R2625L94322j70570j37887N8939j54422o8194q1456N9478K6361j24152
10929b22978l0361j62692j00678M02179N3843k0236J25146p9628j71966J64773
$$ plain form
11004 -219560 -314824 -179991 -110812 -185834 75625 -162113 -226230 -177687 -137926 -114445 -47041
10993 -47041 -59921 -43819 -68184 -100267 -167940 -425439 -263135 -172585 -150349 -294793 -252022
10982 -252022 -196353 -240636 -38906 203280 -37041 -48875 -42211 -172968 -345727 -982
10972 -982 36128 -106237 93032 66604 109186 137609 262408 -40294 -347492 -276472 -309564
10961 -309564 -273465 197037 240974 100017 60649 -117746 -215957 104873 23176 60664 120144
10950 120144 25072 -57487 -153006 -305314 -428261 -226385 -249037 -493014 -557335 -118022
10940 -118022 -25397 368925 198355 60468 119407 -35015 -103209 -184665 -125187 -98826 -222978
10929 -222978 -253339 -416031 -516709 -114530 -60687 -80923 44223 -35405 -207371 -42598
10919d2598j6108K0959j50220k37368J28246J33377j6181K042j3962p5598j41395
10908d08806K40403K1319k40206J83955J9908k08353L8833L05015n1701k8540
10898a28173o0278k6132n3103K4935k6611J6782J52516K5406k7392j40509J67759
10887g4800P899l0535j66155J52426k04592J58819J72201j24879K28097j47974
10877b9493M802J11390j13315j85273N0143K06759j55534j48109J40530K0950
10867i7150L4546k8712J1325J2736J55343Q0396J36661j13695R1346o2250K9938
10856B50484J03632l21850M1679j72852l3950R5442N4646j42251P6202r1694j05017
10845b45529L9822K43326J34541k81003J38573N6903p6678K629N9525o6682o3127
$$ plain form
10919 -42598 -58706 -37747 -187967 -425335 -297089 -163712 -179893 -177851 -191813 -267411 -408806
10908 -408806 -168403 -147084 -387290 -203335 -183427 -391780 -352947 -47932 -99633 -128173
10898 -128173 -188451 -214583 -267686 -242751 -269362 -252580 -100064 -74658 -102050 -242559 -74800
10887 -74800 -66901 -97436 -263591 -111165 -315757 -156938 15263 -109616 118481 -29493
10877 -29493 -24691 86699 -26616 -211889 -161746 45013 -110521 -258630 -118100 -97150
10867 -97150 -62604 -91316 -79991 -67255 88088 168484 305145 191450 282796 220546 250484
10856 250484 354116 32266 73945 -98907 -132857 -37415 17231 -125020 -48818 -140512 -245529
10845 -245529 -205707 37619 172160 -108843 29730 86633 9955 12584 72109 5427 -57700
10834e7700j41682j67580K17016J73380Q14Q6340k41170j9153J99773k24819Q134
10823a66647J70145P1487j64272P064m0605r3878n4161J26111p0470J91879k1511
10812d4858l6114n1244o228m559L31158J28715k36796j55021j84494m8521l8419
10801c46381j38634K82396L7887k63012K49102k5472K61498j71531k19243Q3071
10791b50319J28503J66068L9942j99573q4703R9063K05463L0221r4214k81714
10781b41263n8581k8045M54599J7081k87722k64595J91303M9544M2332K51526
10771A26179L5369k5594l2096q2104p1930j18993j61953q148j99360K09897j14448
10760d43181R9731K77483r5596p8684j3489M4297J25072j3406O7125p7493J03444
$$ plain form
10834 -57700 -199382 -366962 -149946 23434 24248 110588 -130582 -149735 50038 -174781 -166647
10823 -166647 3498 74985 -89287 -82223 -122828 -216706 -270867 -144756 -215226 -23347 -44858
10812 -44858 -80972 -132216 -138444 -143003 188155 316870 80074 -74947 -259441 -307962 -346381
10801 -346381 -485015 -202619 -164732 -427744 -178642 -204114 57384 -114147 -333390 -250319
10791 -250319 -121816 44252 84194 -115379 -200082 -101019 104444 134665 40451 -241263
10781 -241263 -299844 -327889 126710 143791 -143931 -408526 -217223 -167679 -125347 126179
10771 126179 161548 135954 103858 21754 -50176 -169169 -331122 -339270 -538630 -328733 -443181
10760 -443181 -343450 -65967 -161563 -240247 -253736 -209439 -84367 -97773 -30648 -108141 -4697
10749d697K01327j52368k0578J68404j79058j18850J87306n7298J62366P2562
10739B59116p3845k64476K41028r3770j09942j53381K37157J07218r6724q4228
10729c1847K60650q5949O191r3059j65663j63796J3682J75731j09896k827j06078
10718c02861O958K2945L9087m3947J85174r8215j0143J43576L07169j22921p5106
10707E1716k09491J0739q7163P4336J7836k7821J71726J15279o8974j31824O0578
10696b3063l8087O0703j24339j24316K70640j53819p3940q3803j85364K2349J75560
10685b77479J61186n9954k83615j25542J97664J85630J14463k0885j10046Q3539
10675a35039j05260K48118j33885k18562P1505Q0677k934L7227j45352K92832
$$ plain form
10749 -4697 196630 44262 23684 192088 13030 -105820 81486 24188 186554 259116
10739 259116 185271 -79205 161823 68053 -41889 -195270 41887 149105 52381 -31847
10729 -31847 228803 142854 149045 55986 -109677 -273473 -259791 -84060 -193956 -196783 -302861
10718 -302861 -295903 -272958 -233871 -277818 -92644 -190859 -201002 -57426 249743 126822 51716
10707 51716 -157775 -147036 -234199 -159863 -142027 -169848 1878 117157 48183 -83641 -23063
10696 -23063 -61150 -447 -124786 -249102 21538 -132281 -206221 -290024 -475388 -453039 -277479
10685 -277479 -116293 -176247 -459862 -585404 -387740 -202110 -87647 -108532 -218578 -135039
10675 -135039 -240299 7819 -126066 -344628 -273123 -192446 -195380 -158153 -303505 -10673
10665a0673J34490J1212r3567j27176j68346P8672j44018j93514K00138K71713
10655d1069J0105k06832k04427P8288J21265K5519P3480O4510O4794j62925J44565
10644c2727k41078J55069J33773N1394l9138j40037l3822J5160J10365J44197
10634A23156R6281j52467r2911l2178J62952L10769j72568r1945j70373J02066
10624H2782K38798j16699j71590q0788k54950K39867J05610K2507j16743j13835
10614a65041M9538K52230k00057k1559K0522l560j10591j1454K7345o5234Q8023
10603a39838q2436J75223J329q7400J01502M0219o8513R6116j58880J20010R3894
10592I1226j81034l01603Q8625J51545P926j25687k66006J84261J98562j4677
$$ plain form
10665 -10673 123817 135029 41462 -85714 -254060 -175388 -319406 -512920 -312782 -41069
10655 -41069 -30964 -237796 -442223 -363935 -242670 -217151 -143671 -79161 -14367 -177292 -32727
10644 -32727 -273805 -118736 15037 66431 27293 -112744 -146566 -131406 -21041 123156
10634 123156 219437 66970 -25941 -58119 104833 415602 243034 151089 -19284 82782
10624 82782 321580 204881 33291 -47497 -302447 -62580 43030 65537 -51206 -165041
10614 -165041 -115503 136727 -63330 -84889 -64367 -67927 -178518 -189972 -162627 -227861 -139838
10603 -139838 -222274 -47051 -45722 -133122 -31620 8599 -59914 36202 -122678 -2668 91226
10592 91226 -89808 -391411 -302786 -151241 -143315 -269002 -535008 -350747 -152185 -166862
10582a66862N2764p3904k6070p4597M6988J41691O5466j41519j4888J95223j53389
10571a49097R0991q9406j57867l9563j93865J24071L51857j45337j95708r4447
10561d98371M41447M3695j83952J61600j31778j70396N2720J47410L2457P0797
10551c4371J1037J07436N6675j43715J52212j48539j44823J52425j27872m2921
10541a62456N291p9149j38242K91427L1316n5013K6482K08452j98853K51420J29702
10530C10377j07719J4738j347j76160o0090J20317J60578q8319l27245q721J47672
10519a5919j07279P9989J30866m5765m3605k15422J16031j23247J37571o2455
10509a49235P6374O1035q7748K58115j51769j73904M8004n6460J32441j40825
$$ plain form
10582 -166862 -114098 -188002 -214072 -288669 -241681 -99990 -34524 -176043 -190931 4292 -149097
10571 -149097 -58106 -147512 -305379 -344942 -538807 -414736 -62879 -208216 -403924 -498371
10561 -498371 -56924 -13229 -197181 -35581 -167359 -337755 -285035 -137625 -105168 -34371
10551 -34371 -23334 84102 140777 -2938 149274 735 -144088 8337 -119535 -162456
10541 -162456 -157165 -236314 -374556 -83129 -51813 -106826 -80344 128108 -70745 180675 310377
10530 310377 202658 217396 216049 39889 -20201 100116 260694 172375 -154870 -163591 -15919
10519 -15919 -123198 -43209 87657 41892 -1713 -217135 -101104 -224351 -86780 -149235
10509 -149235 -72861 -11826 -99574 158541 6772 -167132 -119128 -175588 -43147 -183972
10499a83972p43J09393L8834m9405J69529j2167j21750r9770Q2762j22174J29460
10488f0003N9397o6943j64396j94488J87174K54083l2617r2028j74391r2675K42703
10477a34184j61249P0406l3223K52686O2457j89726K11904J10686k23426N5985
10467B2316j21301j47374J00826J09696j99987k5875R8289j01570J83644J9674
10457f1662l0152P9303j00519J5832M0233j5095k14093k03K68439j4111p0431
10446a02459K02705J31129n0571J48894k93344m045l2157k33813n0112L9147J09156
10435a35470o2762J86288q3480R2095p12r4465k57952K25153L72726p9492j92481
10424c0552M7059M2509l03319K63009J38535j50274o6985L1792O3831k74239j61196
$$ plain form
10499 -183972 -184715 -75322 -36488 -85893 83636 71469 -50281 -150051 -67289 -189463 -60003
10488 -60003 -606 -67549 -231945 -426433 -239259 14824 -17793 -109821 -284212 -376887 -134184
10477 -134184 -295433 -225027 -258250 -5564 56893 -132833 79071 189757 -33669 22316
10467 22316 -98985 -246359 -145533 -35837 -235824 -261699 -163410 -264980 -81336 -61662
10457 -61662 -91814 -12511 -113030 -97198 -56965 -72060 -286153 -286356 -17917 -32028 -102459
10446 -102459 100246 231375 180804 329698 36354 32309 152 -233661 -283773 -244626 -135470
10435 -135470 -198232 -11944 -95424 -3329 -4041 -98506 -356458 -131305 241421 161929 -30552
10424 -30552 16507 59016 -244303 18706 157241 6967 -60018 -28226 35605 -238634 -399830
10413c99830M43915J9236k76824L33249j20124k01716L7543P8925p5240M4867
10403a15999k8141L1317O243k03838K28724R7314P2690R6485j89342K58624J80387
10392D34464j82180l28670j03818J25272j39538M9300n5858j07945K039L07805
10382H71N5034j62930L1134m1618l3276p5819K8737K31671k647p096K8097j15471
10370f3313j3418j80725r2791L39124j4742J91270J19975l14597j62134J02148
10360h9203K72797k44121K3689J93672m4595J1812l73643O2958O9783m7446r3308
10349b57605k3013O0514K81109j16954k86698n7935J46279k68943K0709J39994
10339c62543j21566J82332J27312j63870N1620m5531M0665J5456J21011L2365
$$ plain form
10413 -399830 44085 63321 -213503 119746 -378 -202094 -164551 -85626 -160866 -115999
10403 -115999 -144140 -112823 -106580 -310418 -81694 15620 88310 184795 -4547 254077 434464
10392 434464 252284 -76386 -180204 -54932 -194470 -145170 -201028 -308973 -306934 871
10382 871 55905 -107025 -75891 -117509 -150785 -226604 -197867 33804 31157 24061 52158 -63313
10370 -63313 -76731 -257456 -350247 -11123 -25865 165405 285380 -29217 -191351 -89203
10360 -89203 183594 -60527 -36838 156834 112239 124051 -249592 -186634 -116851 -164297 -257605
10349 -257605 -280618 -220104 61005 -55949 -342647 -400582 -254303 -523246 -502537 -362543
10339 -362543 -484109 -301777 -174465 -338335 -286715 -332246 -291581 -276125 -155114 -122749
10329a22749j48960R1374K99602r9362k20947R0875K34221R8344j41258P055k36426
10318a48231l0497k66689J1196N6615J07230M0636J58034k30385K986m4972J31611
10307b12466N4460M2280K01680j42834k1110n2731k64442J30033N552o6056J9314
10296c06320J1579J33805q2197j3513K79819J08689o0872r2791l60308K02999
10286a79110K91021K4367j21536j47692P8218P134k014j97494j43019L6966L88571
10275C5412K21414j58271j40345R5566q8497k16884J7579m4594J26738L2856K89316
10264A70290L36224Q8533l00463o245k59507l1970J62913R3707k6507m6673n9671
10253A20631j3597J6896q7788l4919j31471K1734K00742k62468r9898j9551J20915
$$ plain form
10329 -122749 -271709 -180335 119267 19905 -201042 -110167 124054 222398 81140 88195 -148231
10318 -148231 -178728 -445417 -434221 -377606 -270376 -229740 -71706 -302091 -299105 -344077 -212466
10307 -212466 -158006 -115726 85954 -56880 -77990 -130721 -395163 -265130 -259578 -325634 -306320
10296 -306320 -294741 -160936 -243133 -256646 23173 131862 70990 -21801 -382109 -179110
10286 -179110 111911 136278 14742 -132950 -54732 -47598 -49612 -247106 -390125 -353159 35412
10275 35412 256826 98555 -41790 53776 -34721 -251605 -234026 -278620 -151882 -119026 170290
10264 170290 506514 595047 294584 288339 28832 -3138 159775 253482 226975 180302 120631
10253 120631 107034 123930 36142 1223 -130248 -108514 92228 -170240 -270138 -289689 -168774
10242a68774K92549M1914j48471j54325K06132j03867L500r9714K14250K60521
10232C43715J9076j85625j58971P481j09567k5100J09795J49586o164k71128J98945
10221G2043j6866j3757K60655R433P9285J7048p8034j53154q2998J02766L5108
10210B31529p3373J15286r6100k45333O604j32177J8406R5429r4190L4327J78468
10199C8876m7384j48128L09156J01136K1148j77941j99547j5453j07764O3664
10189a62237j03275J62104N9945m3997j58963J47520L2589Q6869N1181k86942
10179b15206k05009J26675J98271J85734K06525j81005k64241J90805l651j39435
10169a00537J72166j0149J53357j57293J07849j81778j24320m0643j09424K66314
$$ plain form
10242 -168774 123775 165689 17218 -137107 69025 -34842 -31342 -131056 83194 343715
10232 343715 362791 177166 18195 25676 -83891 -108991 804 150390 144226 -126902 72043
10221 72043 55177 41420 302075 311508 390793 407841 329807 176653 93655 196421 231529
10210 231529 158156 273442 177342 -67991 -61387 -193564 -175158 -79729 -173919 -139592 38876
10199 38876 -8508 -156636 152520 253656 274804 96863 -102684 -118137 -225901 -162237
10189 -162237 -265512 -103408 -43463 -87460 -246423 -98903 -66314 20555 71736 -215206
10179 -215206 -420215 -293540 -95269 90465 296990 115985 -148256 42549 38898 -100537
10169 -100537 71629 61480 214837 57544 165393 -16385 -140705 -181348 -290772 -24458
10159b4458M0881j70616p5788M3835O1810J22727k9490J15184J28050j61700M5524
10148I5959q9636j65436J21117n186j47172q0787P9982J60850L6029n112k68307
10137b67699J0987J65632K36245q0208j20798J61451j36726j57818n4099q6860
10127c29893K92044L78268k70041k48226L03876L12967j60473j06153O6622M3663
10117B82654J12849l17030k64269r246N4521K37791m5801o4171j4677K5746n1282
10106e2915J75540m7993j3451R9287l50083J03441J50397p9549j8017J02999j77048
10095a07392M6252P1195r9024L7453K30193L2816j04245O0777R3459n5428j46495
10084E9561M968L4493q6398j80789K67260J26019o4369k19766P7155J54591k1251
$$ plain form
10159 -24458 16423 -154193 -229981 -186146 -124336 -1609 -31099 84085 212135 50435 95959
10148 95959 6323 -159113 -37996 -43182 -190354 -271141 -191159 -30309 5720 608 -267699
10137 -267699 -256712 -91080 145165 64957 -55841 105610 -31116 -188934 -243033 -329893
10127 -329893 -37849 340419 70378 -177848 126028 438995 278522 172369 238991 282654
10117 282654 395503 78473 -185796 -195042 -140521 97270 51469 -12702 -27379 -1633 -52915
10106 -52915 122625 74632 61181 160468 -189615 -86174 64223 -15326 -33343 69656 -107392
10095 -107392 -61140 10055 -88969 -51516 178677 211493 107248 168025 261484 206056 59561
10084 59561 64529 99022 12624 -168165 99095 225114 160745 -59021 18134 172725 151474
10073A51474J26136K26981k90085j50527P4637l1187o442q5323J00716n6186n9189
10062A005K3331m3140J5289K2990K797j9207j43579p17J55896j9982k79221J02337
10050a82201L54915q0976j64661J2836m5931K90242j80138k71518J28956R1486
10040d6990J75914L68873J49745j49028j25442J9350M2458K5968o9479r4978p1735
10029B24656j53457K77295k6882j45225q8403r3769j35119L87510J69147l48249
10019F7504J5077k23552l9686J43769L33204j5563j59870j19175k51097J12670
10009a36719j01854O0405K16774M2814L10J34610K51403K78543j7899N3962k82439
9998D99910l72317p6607J41793n5326R5998r4297k954k73142o0206L19000r1066
$$ plain form
10073 151474 277610 504591 214506 63979 138616 107429 100987 15664 116380 60194 1005
10062 1005 24336 -18804 -3515 19475 22272 3065 -140514 -141231 14665 -5317 -284538 -182201
10050 -182201 172714 91738 -72923 -60087 -106018 184224 4086 -267432 -138476 -46990
10040 -46990 128924 497797 647542 498514 373072 392422 434880 460848 391369 296391 224656
10029 224656 71199 348494 321612 176387 87984 -5785 -140904 246606 415753 67504
10019 67504 82581 -140971 -180657 -36888 296316 280753 120883 1708 -249389 -136719
10009 -136719 -238573 -178168 38606 81420 81730 216340 467743 746286 728387 782349 499910
9998 499910 127593 50986 192779 137453 233451 139154 136200 -136942 -197148 121852 30786
9987C0786L73618l37173l5803N0632K9149K47418O0600j05330q9820m3194k26199
9976d5316k685k1960O9656Q7100j77873q670N2977M1812L6331K6486L7467j38876
9964d3551J33709k31729L0622N5061J60396J59753j49396l068j23667j00558j44898
9953b57326K5648K10914l7011j34031J37820P7040q4266K8929k84881q8362L59955
9942d5571J25651m8383o427p7939P272J76954r989k25923j97594K64831J24551
9931H7433N2372j70567q1852j46435J58058P9493k32740j02712J98295L54431
9921A95776l06753l09622J89528J02847J00035l36478j84856K53861P7058j30093
9911c48697m9836J80523J66920r3908j35240O0509K45779p1560K03205o5445j20711
$$ plain form
9987 30786 404404 67231 31428 82060 111209 358627 419227 313897 224077 180883 -45316
9976 -45316 -48001 -69961 -305 86795 -91078 -99748 -46771 -4959 31372 57858 95325 -43551
9964 -43551 90158 -141571 -110949 -55888 104508 264261 114865 111797 -11870 -112428 -257326
9953 -257326 -231678 -20764 -57775 -191806 -53986 23054 -61212 -32283 -317164 -405526 -45571
9942 -45571 80080 31697 25270 -52669 -45397 131557 121568 -104355 -301949 -37118 87433
9931 87433 139805 -30762 -112614 -259049 -100991 -21498 -254238 -356950 -158655 195776
9921 195776 -110977 -420599 -231071 -128224 -28189 -364667 -549523 -295662 -218604 -348697
9911 -348697 -398533 -218010 -51090 -144998 -280238 -219729 26050 -45510 157695 92250 -28461
9900b8461q0594r977l31115L00193J41005o45n7780k8750M8083o0616K07730j28900
9888b9827j77294j85299J57001j45489O068j29352P92L3273K20868J47933J09229
9877G903J42974j65338M7141J9743k34614K1107l2270R722M6338J65567k73410
9866b45137k8397o5961R331K00894K66937k29458J8213K2891j77335N81K62872
9855C5431j05283n463K06205j96113K8614n0916J83693K35422p1735l33398k6060
9844i9603l5347j74107J00790J10942K06759N0441k2089R0977r4003k08040K3552
9833d9728J44846j86962R0039K59728r7651N8552k164q4209l58958k55111J90336
9822b91282K64994R996q1954L6586K4140m751O9973l0190j03256M6490N5666k46621
$$ plain form
9900 -28461 -109055 -119032 -450147 -149954 -8949 -9594 -67374 -96124 -48041 -108657 99073 -29827
9888 -29827 -207121 -392420 -235419 -380908 -374840 -504192 -503400 -470127 -249259 -101326 7903
9877 7903 150877 -14461 32680 52423 -182191 -161084 -193354 -183632 -137294 28273 -245137
9866 -245137 -273534 -339495 -330164 -129270 137667 -91791 -73578 -50687 -228022 -227441 35431
9855 35431 -69852 -75315 130890 -65223 -36609 -87525 96168 331590 259855 -73543 -99603
9844 -99603 -134950 -309057 -208267 -97325 109434 159875 137786 228763 134760 -73280 -49728
9833 -49728 95118 -91844 -1805 257923 160272 218824 216660 132451 -226507 -481618 -291282
9822 -291282 -26288 -16292 -98246 -61660 -37520 -42271 27702 -2488 -105744 -59254 -3588 -250209
9810b50209j12841L89573l3732q6465r2922P0962K4230J20611l06745k91019L71460
9799a97097K69665n6929m1141J54373j71915J15869L01657l40852j20329J20836
9789C4137K26970n0511k09853j32428J83286J43192J306P1524k2504j67645L7210
9778A14684J94269J05559k30457k09206J58081R4783J51271J90002M1287J76402
9768G86675K95046J83819L03289K34951K72963K35340J46751M95149j9568j40936
9758B793479j04642p599P593p6328K19433J43008k35252k68061m6730p7576k99246
9747B048079l76234J66037J11225k35451k66752k6157k9399j92923k54581n8356
9737H85488k85222k13298K0630J25487J55923k08228R7605k11852j10219J53964
$$ plain form
9810 -250209 -363050 26523 -7209 -93674 -186596 -115634 -91404 29207 -277538 -568557 -197097
9799 -197097 72568 15639 -25502 128871 -43044 72825 374482 33630 -86699 34137
9789 34137 261107 210596 743 -131685 51601 194793 196099 267623 245119 77474 114684
9778 114684 308953 414512 184055 -25151 132930 227713 378984 568986 610273 786675
9768 786675 1081721 1265540 1568829 1803780 2076743 2312083 2458834 2953983 2934415 2793479
9758 2793479 2688837 2681238 2688831 2612503 2831936 2974944 2739692 2471631 2424901 2347325 2048079
9747 2048079 1671845 1837882 1949107 1713656 1446904 1420747 1391348 1198425 943844 885488
9737 885488 600266 386968 407598 533085 689008 480780 578385 366533 256314 410278
9727D10278j39644j57454n2709k6774M0363L78611l7309l25812m447J72138j04146
9716A53095J02042p8046j66525K16459J23149j14416P9468j6400j24695L1785
9706B05916j03718r8352J25185j33880J91310J15248j61767k77125k36884l5987
9696d10054K93743J3806K6555K30536j83050m3920M9955J21082K6458M3619J35653
9685C04383j7174L1364j12221j44632K64331K16281k40844k47873K33437p0679
9675B16373j67637J57675j93177j54587J88874j2999L5398K5894m4260j74297
9665a22743P6705M218Q9263n3016k62832J93167j33133K26446L58043m21840o8089
9654a13811J16332P0552j75229J74017K83585M1660R3398j91739m68q0543K03992
$$ plain form
9727 410278 270634 113180 60471 33697 74060 452671 415362 89550 85103 257241 153095
9716 153095 255137 177091 10566 227025 350174 235758 315226 298826 174131 205916
9706 205916 102198 3846 129031 -4849 186461 301709 139942 -137183 -374067 -410054
9696 -410054 -116311 -102505 -75950 154586 -28464 -72384 -22429 98653 125111 168730 304383
9685 304383 287209 318573 206352 61720 326051 542332 301488 53615 287052 216373
9675 216373 48736 206411 13234 -141353 47521 34522 69920 95814 51554 -122743
9665 -122743 -46038 -41820 47443 -5573 -268405 -75238 -208371 18075 376118 -45722 -113811
9654 -113811 2521 73073 -102156 71861 355446 397106 490504 298765 298297 217754 421746
9643D21746j05763j03339n7655q3074K14738j4475j08432N1328K40611k55790
9633A99895J40093J54846q3759J37439j68866j54946M7446R6317J10191q8258
9623C90398r003M7679O1414l7371m6398j16174o4903l2020K80964k8595n1407
9612C94584R9179p5568j2098k54680L3258K50560n5183o3371J24390j28378P2677
9601C85370J71136j18614k25942k42701q849L13290p8663L0268M3113Q6802J04651
9590D59861j83022J85157J66391k24972j14490J22135Q990M4799o0506j72420
9580B31923J3604J42056o114k05344K02181m5895j72697J07475Q6786n3893p1919
9569B28163R6532J31207n3135j19823J1998K47392q7613j62132K85526R3109k04934
$$ plain form
9643 421746 315983 212644 154989 71915 286653 272178 163746 215074 455685 199895
9633 199895 339988 494834 411075 548514 379648 224702 272148 368465 478656 390398
9623 390398 381395 429074 490488 453117 406719 290545 225642 193622 474586 445991 394584
9612 394584 493763 418195 406097 151417 184675 435235 380052 316681 441071 312693 385370
9601 385370 556506 437892 211950 -30751 -39600 273690 195027 225295 268408 355210 459861
9590 459861 276839 461996 628387 403415 288925 411060 420050 464849 404343 231923
9580 231923 245527 387583 381469 176125 378306 332411 159714 267189 353975 300082 228163
9569 228163 324695 455902 402767 282944 294942 542334 454721 292589 578115 671224 466290
9558D66290r3883l7916p184J04379j65332J12024R9408P4492o7686k028K83961
9547G66525k41545j91717j38038q2589J19671P9419J40370j87014Q0164J9454
9537C64700j43410K74102R5633J93616r4394j81839J39645L0193M9932J7258k10280
9526E35156J18550J23799j95503J04632p897k0088l2511j54731J50437j34634
9516D87210n4255M8350J18558k46641J47391J15876o6321j48350n5866J91297
9506E37249j24489j395k5094r2702O6683j60719J87415O9944Q5672r2082K1395
9495D71877Q1360r8444R551M6646N7500j41835K3149K19346J10209l25427j01596
9484C52336q8830j58894Q8572K72482M2192J29738j74759J17751N4745J06413
$$ plain form
9558 466290 372407 334491 327307 431686 266354 378378 477786 552278 484592 482564 766525
9547 766525 524980 333263 195225 112636 232307 311726 452096 265082 345246 364700
9537 364700 221290 495392 591025 784641 690247 508408 648053 678246 728178 745436 535156
9526 535156 653706 777505 582002 686634 678737 658649 626138 471407 621844 487210
9516 487210 432955 481305 599863 353222 500613 616489 550168 401818 345952 537249
9506 537249 412760 411365 386271 293569 360252 199533 386948 456892 542564 450482 471877
9495 471877 553237 454793 464344 510990 568490 426655 449804 669150 779359 453932 352336
9484 352336 263506 104612 193184 465666 507858 637596 462837 580588 635333 741746
9474G41746R9785O0154j58573J82200k94439j14742j74732P4875k2287O8009N5810
9463E17806M868p8416J48148N3798k40971O2929l1679r8946J69195L1058L477
9452E41267M927j07968K38335J40070j90754P7810J01633j54804L3027j7250K5782
9441F92075J7874J12877k37173j64361J98104O4927k00842J7838m8038j57509
9431B95772O0562J97737J90953J5119J22752R105j02650M679j01748L1877q4011
9420F40147K84423k31325q6195R9041K38560j90719R1709O956j16376K83172J81680
9409A201073J80368j59200l8712J27991J14053J85010m0472K47754K27900M09554
9399B455319M36225M91501J08935n85535j87095J03818l22969m0174o0514k45567
$$ plain form
9474 741746 841531 901685 743112 925312 630873 516131 341399 416274 393987 461996 517806
9463 517806 522674 444258 592406 646204 405233 468162 436483 337537 506732 537790 541267
9452 541267 546194 438226 676561 816631 625877 703687 805320 650516 683543 666293 692075
9441 692075 709949 822826 585653 421292 619396 684323 483481 501319 453281 295772
9431 295772 356334 554071 745024 760143 882895 892000 789350 794029 692281 724158 640147
9420 640147 924570 693245 607050 706091 944651 753932 845641 852597 736221 1019393 1201073
9409 1201073 1381441 1222241 1183529 1311520 1425573 1610583 1570111 1817865 2045765 2455319
9399 2455319 2891544 3383045 3491980 2906445 2719350 2823168 2500199 2460025 2399511 2153944
9389B153944j43517J4393m3951j25292j55498j90229j54497O2164Q7857J86443
9379A691817m1326k44492Q3431q843k0822Q4795N9762J10648k94566j35226k6705
9368A258473J21580R7144l840K70777j37203k81366M4493R4753J8317n4111k2407
9357A406610J60017N0154j24962j25676k2138K77142l2370M3082o9663j33873
9347A428323l3817j71908J83162p1270k3135J08788J76573l18311J62401j23237
9337A317569J17953J39985J23326k2478r2127L081N1277k09990K62952J27311
9327A818859j04126L2367J31172j27892p3411K33594J59467L7369j05642k17948
9317A783809l0613J81731j49054k47251k14621M5551K67847p6359m6558j20746
$$ plain form
9389 2153944 2010427 2024820 1980869 1855577 1700079 1509850 1355353 1417517 1505374 1691817
9379 1691817 1650491 1405999 1489430 1480587 1459765 1544560 1604322 1714970 1420404 1285178 1258473
9368 1258473 1380053 1477197 1473357 1744134 1606931 1325565 1370058 1464811 1483128 1429017 1406610
9357 1406610 1566627 1616781 1491819 1366143 1344005 1621147 1588777 1631859 1562196 1428323
9347 1428323 1394506 1222598 1405760 1334490 1311355 1420143 1596716 1278405 1440806 1317569
9337 1317569 1435522 1575507 1698833 1676355 1584228 1587309 1638586 1428596 1691548 1818859
9327 1818859 1714733 1747100 1878272 1750380 1676969 1910563 2070030 2107399 2001757 1783809
9317 1783809 1753196 1934927 1785873 1538622 1324001 1369552 1637399 1561040 1514482 1393736
9307A393736n8781N9940j14875J41557k18532l7035M17778K9908k74539j87748
9297A151409K83758J4843n9471n5808Q5753J12851p4239p2831j26140j9762p5578
9286A164785J66245k19996n4842m6381J88469n1786P6976k14801J73684q0734
9276A101619J77935L38023k29494j08712J17858N1119j85564J26896r3577K6228
9266A322331m889J81495j28003j29045q0682J05771n9476O8985q109J0071j13976
9255A164473R4767j63577j37189P1670J31428M5043j00510L2056P2882J46452
9245A357495M8320n6560O5945R193R4064j49378j51397K20325j97931j8835J17051
9234A338292K12140O4645o0035k60736L01324j98604k01239J0414J07787K27017
$$ plain form
9307 1393736 1334955 1394895 1280020 1421577 1203045 1166010 1583788 1613696 1339157 1151409
9297 1151409 1435167 1450010 1390539 1334731 1420484 1533335 1459096 1386265 1260125 1240363 1164785
9286 1164785 1331030 1111034 1056192 1009811 1198280 1146494 1223470 1008669 1182353 1101619
9276 1101619 1279554 1617577 1388083 1279371 1397229 1448348 1262784 1389680 1296103 1322331
9266 1322331 1317442 1498937 1370934 1241889 1161207 1266978 1207502 1276487 1268378 1278449 1164473
9255 1164473 1259240 1095663 958474 1030144 1161572 1206615 1106105 1138161 1211043 1357495
9245 1357495 1405815 1349255 1415200 1424393 1518457 1369079 1217682 1438007 1240076 1221241 1338292
9234 1338292 1550432 1615077 1555042 1294306 1595630 1397026 1195787 1206201 1313988 1541005
9224A541005Q0811l71138K52391p9890j26800m1715N5369P1653l8941m9071q8123
9213A205551j34687N6826L25128K68322q8079k35005l11331J8002J89206K30555
9203A524488o3644r5291L2253M09985J23859k77810J04301K52526K00111j22663
9193B088115K30239j27311J06614j00552j4449j71936J25497M1800r4492K1138
9183B104663Q7476j61104Q2622j71407l36227j70341L12317J44410k09535K14973
9173A897847J24520j57073j95220o0439K57864M87j30946K10453m324J81563o7146
9162B057586K1739j11554l9052m323m4132K49939o1002k15973r4633K90614o3967
9151A985242k04966J11358J48924k4631N990j7649o4742j27766k36322k01689
$$ plain form
9224 1541005 1621816 1250678 1503069 1423179 1296379 1254664 1310033 1381686 1342745 1293674 1205551
9213 1205551 1070864 1127690 1452818 1721140 1633061 1398056 1086725 1104727 1293933 1524488
9203 1524488 1460844 1365553 1397806 1807791 1931650 1653840 1758141 2010667 2210778 2088115
9193 2088115 2318354 2191043 2297657 2197105 2182656 2010720 2136217 2178017 2083525 2104663
9183 2104663 2192139 2031035 2113657 1942250 1606023 1435682 1747999 1892409 1682874 1897847
9173 1897847 2022367 1865294 1670074 1609635 1867499 1867986 1737040 1947493 1943169 2124732 2057586
9162 2057586 2079325 1967771 1928719 1924396 1880264 2130203 2069201 1853228 1758595 2049209 1985242
9151 1985242 1780276 1891634 2040558 2015927 2021917 2004268 1939526 1811760 1575438 1373749
9141A373749P8867J57018o5397p032O9147J87446K2892J63650k52422j92038P5916
9130A611796q9218J62239J01084N2032l9207J02899O8970j62728R0485k26338
9120A672014j12016l9608k3470n314o7637m6007J25835J14726J33233J33382j01917
9109A783221j52847J93624R7587j77279J76737j22836o4929K30201K42657k50431
9099A955705L9469j25940k6770j95966O0840j27580M2045J21980J97114J67520
9089B108417j03812L6016j2024K64501k27165J59540M285J27029L2356l79222
9079B009921Q6623P9239J76700J23479m5997R6028k98106o4180J06155P886o1821
9068B215927J544l51753N4025K37171J03673j55574j5215J04046r8360R5843J71847
$$ plain form
9141 1373749 1452616 1609634 1544237 1537205 1606352 1793798 1816690 1980340 1727918 1535880 1611796
9130 1611796 1522578 1684817 1785901 1837933 1798726 1901625 1970595 1807867 1898352 1672014
9120 1672014 1559998 1520390 1496920 1491606 1423969 1377962 1503797 1618523 1751756 1885138 1783221
9109 1783221 1630374 1823998 1921585 1744306 1921043 1798207 1733278 1963479 2206136 1955705
9099 1955705 1995174 1869234 1842464 1646498 1707338 1579758 1621803 1743783 1940897 2108417
9089 2108417 2004605 2040621 2028597 2293098 2065933 2225473 2229758 2356787 2389143 2009921
9079 2009921 2096544 2175783 2352483 2475962 2429965 2525993 2227887 2163707 2269862 2277748 2215927
9068 2215927 2217471 1865718 1919743 2156914 2260587 2105013 2089798 2193844 2095484 2191327 2363174
9057B363174J02513N1067k6058k25677J3047L59673p2906q3072L12756P3030M5158
9046B912705n6085j04549o7285L0506P6588K51086r5054j7762l35047j24992K02538
9035B672649m7636J59206M32253k99682j24196J87013l71031J4057J87519q1841
9025B728311k7302j91569J97868K88563q5431p9738J42919m2212L37547j47395
9015C121561J27923J48661r8318o842Q7292j04990n4464K19935P436J73477k26152
9004C395519q4221J13847K96231j08274O37n117J69073m9762j0230j02391Q7644
8993C702956j64319k381J35552K07513J7622K4642q5606P0599l1124M3132K33156
8982D151742k0946K16148K42378K56768J95729l01219K8670K05043J80952K84244
$$ plain form
9057 2363174 2465687 2516754 2490696 2265019 2278066 2637739 2564833 2481761 2794517 2867547 2912705
9046 2912705 2856620 2752071 2684786 2715292 2791880 3042966 2947912 2930150 2595103 2470111 2672649
9035 2672649 2625013 2784219 3216472 2916790 2792594 2979607 2608576 2622633 2810152 2728311
9025 2728311 2701009 2509440 2707308 2995871 2910440 2830702 2973621 2931409 3268956 3121561
9015 3121561 3249484 3398145 3299827 3292985 3380277 3275287 3220823 3440758 3448194 3621671 3395519
9004 3395519 3311298 3425145 3721376 3613102 3613739 3608622 3777695 3727933 3717703 3615312 3702956
8993 3702956 3538637 3536256 3671808 3879321 3896943 3921585 3835979 3906578 3875454 3918586 4151742
8982 4151742 4130796 4346944 4589322 4846090 5041819 4740600 4769270 4974313 5155265 5439509
8972E439509J83883O7436j3163L12618K23790q6958M5286J59397L96652J44019
8962F872469L12870K64487p8350J71469M8715O6441M19899M25339L52126J97241
8952I052706L53424Q84428N79025P78269Q86962J071251J468847J497202J781674
8943A8353788J702724J657945J965930K434116K689968L437553L736117M937990
8935D0916131O003681P591825J0772564J7622176L1823808M7420897N2031836
8928B14182918N6193174O7908979N0798847P305728j8808613j6603075o579084
8921C54398874j1652417k5890600l4315063m0285677m2544382m0650165l3953729
8914A25106841k5805098j8295294j2149781q411978o678129n504855m900275m248503
$$ plain form
8972 5439509 5623392 5690828 5677665 5990283 6214073 6127115 6172401 6331798 6728450 6872469
8962 6872469 7185339 7449826 7371476 7542945 7591660 7658101 8078000 8503339 8855465 9052706
8952 9052706 9406130 10290558 10869583 11647852 12534814 13606065 15074912 16572114 18353788
8943 18353788 20056512 21714457 23680387 26114503 28804471 32242024 35978141 40916131
8935 40916131 46919812 54511637 65284201 82906377 114730185 162151082 214182918
8928 214182918 270376092 338285071 389083918 396389646 377581033 360977958 354398874
8921 354398874 342746457 316855857 282540794 242255117 199710735 159060570 125106841
8914 125106841 99301743 81006449 68856668 60444690 53766561 48261706 43361431 39112928
8906C9112928l554177l663281k773965k398666k351589j957839j624607p47302
8898B0041502r79617n81718p45884p10884m34760m69718o23338o18714o18901
8889A4257968o69269m03085m58756l61588m94245m46233l55960k58307P2222J254
8879A0884001k70325l83562l60648j9788k52496m02743M1588k74961l87880j26549
8869H446637k9468j88736N0818k6318k63256R3379j42684o7987l27044n2081j20928
8858G372332k88657j75140M8378k37774L3682j25387j88147j86905L6346k82166
8848F006562l88341q0590J67030K08666m983l58393k40803J009L37652j52819
8838E494990k36218J32740n9347k43120N6540J60410P6950K6214j48826j18173
$$ plain form
8906 39112928 35558751 31895470 29121505 26722839 24371250 22413411 20788804 20041502
8898 20041502 19061885 18480167 17734283 17023399 16588639 16118921 15495583 14876869 14257968
8889 14257968 13588699 13185614 12726858 12365270 11871025 11424792 11068832 10810525 10882747 10884001
8879 10884001 10613676 10230114 9869466 9849678 9597182 9194439 9236027 8961066 8573186 8446637
8869 8446637 8417169 8228433 8279251 8252933 7989677 8083056 7940372 7872385 7545341 7493260 7372332
8858 7372332 7083675 6908535 6956913 6719139 6752821 6627434 6439287 6252382 6288728 6006562
8848 6006562 5618221 5537631 5704661 5913327 5908344 5549951 5309148 5310157 5647809 5494990
8838 5494990 5258772 5391512 5332165 5089045 5145585 5305995 5382945 5409159 5260333 5142160
8828E142160r1299o7573k1476q895q6333J66053L5350q4903q1080N9587k07689
8817D753902J44056m8746l82629l7415j63808J82754O4180Q5907o2306N5967k18641
8806D373221j00721K37340j98636M6285J74432J55352O5104K9711j37671l5396
8796D609021M712K99505J57486M2542r7700j57563R3027j19873K3718R336j1144
8785D853067k55993j34167l7095M3649r4548l09977l9897j03953K07439j62151
8775C966374q9441k06694k93491n5733j96874K04216p2575k25748j65910O9240
8765B933364L18557j61494p2974J55154j70571j34653J22362J47638K58411k46720
8755C149074j1387J38917p5143k21552k4254m1637K29332l4712k6178r6428l1295
$$ plain form
8828 5142160 5050861 4983288 4961812 4952917 4866584 5032637 5067987 4983084 4902004 4961591 4753902
8817 4753902 4897958 4849212 4466583 4429168 4265360 4448114 4512294 4598201 4535895 4591862 4373221
8806 4373221 4272500 4509840 4311204 4357489 4531921 4687273 4752377 4782088 4644417 4609021
8796 4609021 4613733 4913238 5070724 5113266 5015566 4858003 4951030 4831157 4854875 4864211 4853067
8785 4853067 4597074 4462907 4425812 4469461 4374913 4064936 4025039 3921086 4128525 3966374
8775 3966374 3876933 3670239 3376748 3321015 3124141 3328357 3255782 3030034 2864124 2933364
8765 2933364 3251921 3090427 3017453 3172607 3002036 2867383 2989745 3137383 3395794 3149074
8755 3149074 3137687 3276604 3201461 2979909 2955655 2914018 3143350 3108638 3082460 2986032 2954737
8744B954737j5443j91839k2887P3244J4441p6145N9567o478k23017N5764M8729
8733B670673j64955k0752O7091k2377n1713Q3090O9870j44053k60407n909r2652
8722B127906J84627J61174J14642J1797j18262K10206R1840j61408j87524j09003
8712B325995j78517O6077K44926J9136R6374P9841j48517j65553K47230J32026
8702B719018N6620N6282k3165j32571K63631j99584m0001k02185L95358K03958
8692C097361O643j78614k25050P3856M79441P0356l1183j71889j48782j60761
8682B811378j13507O8965k207K57403J26435J61744j20467m5100k6647N1723l26477
8671B843243l4208N5266J7675q8745R1096N9345J19245j61327j89951j04347j24073
$$ plain form
8744 2954737 2939294 2747455 2724568 2797812 2812253 2736108 2795675 2789197 2566180 2621944 2670673
8733 2670673 2505718 2484966 2552057 2529680 2477967 2561057 2630927 2486874 2226467 2220558 2127906
8722 2127906 2312533 2473707 2588349 2600146 2481884 2692090 2783930 2622522 2434998 2325995
8712 2325995 2147478 2213555 2458481 2477617 2573991 2653832 2505315 2339762 2586992 2719018
8702 2719018 2775638 2831920 2808755 2676184 2939815 2740231 2700230 2498045 2893403 3097361
8692 3097361 3104004 2925390 2700340 2774196 3253637 3323993 3292810 3120921 2972139 2811378
8682 2811378 2697871 2766836 2764629 3022032 3148467 3310211 3189744 3144644 3117997 3169720 2843243
8671 2843243 2809035 2864301 2881976 2793231 2884327 2943672 3062917 2901590 2711639 2607292 2483219
8660B483219J70898L43377j83138L8218k02839o1932k041k0488R6466k0757J2639
8649B653622r5825j0842O8552K10186O3673k11809J10235J99428k36336L1536
8639B782420m0546j10235N2231m7196q5472j01798l6663k6521k45407n5841J4168
8628B099140J09787j52981r2561p4226K5776K10224j97813o9620J9029J52733
8618B029488P7214q5568j15136J24933O6732m6269j65415l7375j57620J44578
8608A835562p6736q4577L64215o1489j79787K1519j4041r4810R5077m3152L9410
8597A801191j18602J4246J53822j59596K9678P0433k2824k24676r3666l02428
8587A147578R4366J54518K40714j11387J41307o0846r7938Q0910j66537m0291
$$ plain form
8660 2483219 2654117 2997494 2814356 2852574 2649735 2587803 2585762 2565274 2661740 2640983 2653622
8649 2653622 2557797 2546955 2615507 2825693 2889366 2677557 2787792 2987220 2750884 2782420
8639 2782420 2741874 2631639 2683870 2636674 2551202 2449404 2412741 2386220 2140813 2084972 2099140
8628 2099140 2208927 2055946 1963385 1889159 1914935 2125159 1927346 1857726 1876755 2029488
8618 2029488 2106702 2021134 1905998 2030931 2097663 2051394 1885979 1848604 1690984 1835562
8608 1835562 1758826 1674249 2038464 1976975 1797188 1818707 1804666 1709856 1804933 1761781 1801191
8597 1801191 1682589 1696835 1850657 1691061 1720739 1791172 1768348 1543672 1450006 1147578
8587 1147578 1241944 1396462 1637176 1525789 1667096 1606250 1508312 1589222 1422685 1382394
8577A382394J56795j52346R1347n9988k76562k61974j06499J33602J66662J22471
8567A195902k79002K68621j34149J8118J92447P2983l43287j55750L5990L42139
8557A214012q4444m0902k43407m7250J56694J84646K7220Q4257j59200j71514
8547I20112J4346J96152o8749l889l8654J57630j06222l3568J78454M5174j97035
8536A063751o5491p2720j2815K25341m5897k60644Q9031j34357M4324J90092j37513
8525H83102O6164K59069M14669l21194k6687q684J63178j35434j28572j83118
8515I82493J18461L48688q4199k08286j36093q418J39309n0431k15630M7121N5848
8504I88863j11910R9341O0620j41816L6570k8614J71616N428k03130l61342P577
$$ plain form
8577 1382394 1539189 1386843 1478190 1418202 1141640 879666 773167 906769 1073431 1195902
8567 1195902 916900 1185521 1051372 1069490 1261937 1334920 991633 835883 871873 1214012
8557 1214012 1129568 1088666 845259 798009 954703 1139349 1166569 1250826 1091626 920112
8547 920112 934458 1130610 1061861 1057972 1019318 1176948 1070726 1037158 1215612 1260786 1063751
8536 1063751 998260 925540 912725 1138066 1092169 831525 920556 786199 830523 1020615 883102
8525 883102 949266 1208335 1623004 1301810 1275123 1266439 1429617 1294183 1165611 982493
8515 982493 1100954 1449642 1365443 1157157 1021064 1012646 1151955 1101524 885894 933015 988863
8504 988863 876953 976294 1036914 895098 931668 903054 1074670 1080098 876968 515626 523203
8493E23203K86998k02265o550M08093k48330l32284k8882L58212L95917m01971
8483G52141l9959N9238k32432j5148l0956K43625J48967j55996O4678q4806k82097
8472D27255J07503L10502j89128p1285Q1453J97539k17719m6548J16594l8132
8462F78034j78220p9857K15555P3305m9533J16862j48802K82030p179J65646N55625
8451A623466L06704L79097K7173N788N4566k3594j26971j03220k43242k25760
8441A674007k12752k95268j28910j43297J2834l3346m9949o3736j43643J9623
8431F35563J62303q8257q3366K7908K31234k52440j07884p143j52141L7290r8548
8420C04519J61300K17130l91558j70813J0495L01949p9387k53632q9939K15571
$$ plain form
8493 523203 810201 607936 601386 1009479 761149 428865 399983 758195 1154112 752141
8483 752141 712182 771420 538988 523840 492884 736509 885476 729480 794158 709352 427255
8472 427255 534758 845260 656132 584847 666300 863839 646120 599572 716166 678034
8462 678034 499814 419957 635512 708817 659284 776146 627344 909374 902195 1067841 1623466
8451 1623466 1930170 2309267 2336440 2342228 2396794 2373200 2246229 2143009 1899767 1674007
8441 1674007 1461255 1165987 1037077 893780 906614 873268 823319 759583 615940 635563
8431 635563 797866 709609 626243 654151 885385 632945 525061 517918 365777 403067 304519
8420 304519 465819 682949 291391 120578 131073 433022 353635 100003 10064 225635
8410B25635j10958l1377J01288k22795P404J07939O4999m8756K79701n483O9015
8399D36612q4745j86006q3889J34137l15602J84343Q5265j26414L42369J91953
8389E78023j54611j88831j34939l4086M0062n3569j4216j02094p8985L69820M052
8378B30626j07742m0812J33583R3837r3868Q894m0494N2019k1936Q678j34150
8367H8635k38530K40378j35243r9745J37562L46585k17328j07008J11660K39459
8357C66425M2145k78426j65744j33847L15411N0324q0348K2650N2004j0277O5752
8346B46069j033j86509k11981P4140J10315k07185k3948K38758L27528o1984r3684
8335B10486J6343m57910o1175L91551L6018q927k70864J2181J83343q8804p4103
$$ plain form
8410 225635 114677 83300 184588 -38207 -30803 77136 142135 93379 373080 367597 436612
8399 436612 351867 165861 81972 216109 -99493 84850 170115 43701 386070 578023
8389 578023 423412 234581 99642 65556 105618 52049 37833 -64261 -143246 226574 230626
8378 230626 122884 82072 215655 309492 215624 224518 184024 236043 214107 222785 88635
8367 88635 -149895 90483 -44760 -144505 -6943 339642 122314 15306 126966 366425
8357 366425 408570 130144 -35600 -169447 145964 196288 115940 138590 190594 180317 246069
8346 246069 245036 58527 -153454 -79314 31001 -176184 -200132 38626 366154 304170 210486
8335 210486 226829 -231081 -292256 99295 135313 126386 -144478 -132297 51046 -37758 -111861
8324a11861M01081O2489j46335k1695m8836j34911q8173j01669o7118L51227J12564
8313B06763l4430k46077j84126J70815K75146l109P3563P0240P7447o1883k40375
8302A03974m5368P6852P5449j14541R8165m120r1327L870O6995j76601J26621
8291A19969K67049k70985M4771J05012J02077j27102l90169o353K9621j86606
8281c12716K11449j03426j1676j12459R8218J79215k20321p9354R0001j092M5283
8270b16878J14830L03418j14005k39335m9764K14438q0641j29073J47713K58511
8260B09214N6682j79897j02700J10795j6168J38039m11400O2755K50269j55542
8250c7953R227m3817j54072k41548N3018m8209L66017J26366n2808q2440L34002
$$ plain form
8324 -111861 289220 351709 205374 183679 134843 -68 -88241 -189910 -257028 94199 206763
8313 206763 172333 -73744 -257870 -87055 188091 184982 258545 328785 406232 344349 103974
8302 103974 58606 135458 210907 96366 194531 190411 99084 102954 169949 -6652 119969
8291 119969 387018 116033 160804 265816 367893 240791 -149378 -155731 -126110 -312716
8281 -312716 -101267 -204693 -216369 -328828 -230610 -51395 -271716 -351070 -261069 -262161 -216878
8270 -216878 -102048 201370 87365 -151970 -201734 12704 -67937 -197010 -49297 209214
8260 209214 265896 85999 -16701 94094 77926 215965 -195435 -132680 117589 -37953
8250 -37953 -28726 -72543 -226615 -468163 -415145 -463354 -97337 29029 -23779 -106219 227783
8239B27783O4078k31715j9818k3461O1432q4601J34316J07266o8280k36299J4619
8228e4680K4764q6989Q0457J35411j75788k95928K35156L6452N2090k1069l47767
8217d17891J73314J16128j25489j51242J07743M20521J6211o5735J14860K7033
8207B15453M3602j48460j70513J59445j20408K2728J79694m3439k14017k75064
8197c50979o3439K33635M0130K6328n08680J607154M84186j068133O0983j9203
8187D41982j20116k49237N2409J25668q6045j80996M34618j73373l70542J63780
8177C8148n5545l4719J27414r2302K30882r407P0652J96715l6037J01070o5256
8166D71615M9406j85894l00655L04773n4194K8632p9845p9025M9832K2824k7605
$$ plain form
8239 227783 291861 60146 40328 16867 78299 -6302 128014 235280 167000 -69299 -54680
8228 -54680 -29916 -116905 -36448 98963 -76825 -372753 -137597 -101145 -49055 -70124 -417891
8217 -417891 -244577 -128449 -253938 -405180 -297437 123084 139295 73560 188420 215453
8207 215453 259055 110595 -59918 99527 -20881 1847 181541 138102 -75915 -350979
8197 -350979 -414418 -180783 -140653 -114325 -623005 984149 1468335 400202 461185 441982
8187 441982 321866 72629 125038 250706 164661 -16335 418283 244910 -125632 38148
8177 38148 -17397 -52116 75298 -17004 213878 204471 275123 471838 435801 536871 471615
8166 471615 521021 335127 34472 339245 285051 313683 233838 154813 204645 227469 199864
8155A99864j36300J45165L6943j39322L3369J77094K1734k65073r0067m1657j58443
8144b16693M7104J40698j39674N8831J90705J24385P3742j81313k51879O9402
8134h4692L77870k71095r3983O4791j81481J59202J641k45925N3623L14014j41760
8123d7795j33392k08330o3751J53441J95117j9579q7174J98769j99963R3942R9496
8112a9219L89413l95778n1390J9803q2009p6274J62373j52001j6705J54962J81647
8101A14822M1094k01393Q1364n6732p6536m3351p3674L17966j06368j84100Q9766
8090i7142j40375J92506k12789j05679M05966k40287l4054L94710j12416O7225
8080A17665n9963j30634K1220J44049K98824j50434k12368n3787k58790K19427
$$ plain form
8155 199864 63564 208729 245672 106350 139719 316813 338547 73474 -16593 -58250 -216693
8144 -216693 -169589 -28891 -168565 -109734 80971 205356 279098 97785 -154094 -84692
8134 -84692 293178 22083 -71900 -7109 -188590 -29388 -27747 -273672 -220049 93965 -47795
8123 -47795 -181187 -389517 -453268 -299827 -104710 -124289 -211463 -12694 -212657 -118715 -19219
8112 -19219 370194 -25584 -76974 -57171 -139180 -215454 -53081 -205082 -221787 -66825 114822
8101 114822 155916 -45477 35887 -20845 -97381 -140732 -214406 103560 -2808 -186908 -97142
8090 -97142 -237517 -45011 -257800 -363479 42487 -197800 -231854 162856 50440 117665
8080 117665 57702 -72932 -51712 92337 391161 240727 28359 -25428 -284218 -64791
8070f4791J50965K13650j27242p640j26368J5313k18972q7028j3628o9211J47515
8059a87437J17261J16485k09128k7410P0977p0096n5157J03938K56308k92422
8049a76681o8407J11409J82261L4630j33144j64725R2924J35136j80784k71647
8039d39028K32383n6959N2490K29757o0773o5965r2424j06815M4164J53425K1638
8028h8107k9100J1643j18071J34826L09430Q6436o9195m25881K3914j10619R1372
8017a83352M1243P6873j52194N1459R8487Q8233L46473k53148m8245J44173J94849
8006D04851k36015M4509n7357R4824n1230j32440j34646M7314R0225r8062N6117
7995B8090J25305j841k31383J30252P8900N7079K67453o0530k10582o0020j5871
$$ plain form
8070 -64791 86174 299824 172582 164942 38574 53887 -165085 -252113 -265741 -334952 -187437
8059 -187437 -70176 46309 -162819 -190229 -119252 -189348 -244505 -140567 115741 -176681
8049 -176681 -245088 -133679 48582 83212 -49932 -214657 -121733 13403 -167381 -439028
8039 -439028 -206645 -263604 -211114 18643 -42130 -108095 -200519 -307334 -263170 -109745 -88107
8028 -88107 -117207 -105564 -223635 -88809 220621 307057 237862 -188019 -164105 -274724 -183352
8017 -183352 -142109 -65236 -217430 -165971 -67484 20749 367222 114074 65829 210002 404851
8006 404851 168836 213345 155988 250812 199582 67142 -67504 -20190 70035 -28027 28090
7995 28090 153395 151554 -79829 50423 129323 186402 453855 393325 182743 122723 106852
7984A06852J26089j18597O3859j25872K84468j05494M0432K10923k5763j62008
7974B94889j49674k3629l4793P7240K11373k2665j59399N0242n9187j20898L33758
7963C97257J30212j14763j98309k84459M18708J12150j49937m1184o4807k89j56960
7952D7619L47161J48304k54537j00607M4507k94247J18201K131K58756j22308
7942A94980j48287n1907J39140k38892q9446J46555Q5349K09351J60740l6357
7932C71226m21535J6412J40094J0342j62082Q9622j20556M8789j11100j48790
7922b87578K28343K23559l3552j9289q8988J42772p7849l987P8942m9738L1031
7911A43666k20431r5242L25591o5065j84902p3239J74885n8450K9851j18074J12749
$$ plain form
7984 106852 232941 114344 178203 52331 336799 231305 271737 482660 456897 294889
7974 294889 145215 121586 86793 164033 375406 352741 193342 243584 184397 63499 397257
7963 397257 527469 412706 214397 -70062 348646 460796 310859 269675 204868 204579 47619
7952 47619 394780 543084 288547 187940 232447 -61800 56401 58532 317288 194980
7942 194980 46693 -5214 133926 -104966 -194412 -47857 37492 246843 407583 371226
7932 371226 -50309 -33897 106197 116539 -45543 44079 -76477 -27688 -138788 -287578
7922 -287578 -59235 164324 130772 111483 22495 165267 87418 83431 162373 112635 143666
7911 143666 -76765 -172007 153584 88519 -96383 -169622 5263 -53187 -23336 -141410 -28661
7900b8661N1388j7913k55q8694l07403o2415K47747K49898j10371O4036j49080
7889a51723K1514L86988j34267k90587R781K63876M7102J54785j24697j83084
7879c12l41599P7471J18830J925m3232l5431M3889M36004o588q9746j04620O5674
7867A22265J20859R5721m2139k12280k4279j51812J04180J04556Q0282m00165
7857b02812o6522K11985L78287P4744n01801j31101J4775J23679j16815j33508
7847c49089J66546N4619j84919P694M51840k04061l57675J91413K23625K970J29840
7836A32803J06530j74403n475K6546k94681l3513K44093L41167j91343k57031
7826a05307k23918K31464K0796J89531J11026k70703J04364O6349m4263k94545
$$ plain form
7900 -28661 22727 4814 4559 -84135 -391538 -453953 -206206 43692 -66679 -2643 -151723
7889 -151723 -130209 256779 122512 -168075 -158294 105582 152684 307469 182772 -312
7879 -312 -341911 -264440 -145610 -143685 -186917 -222348 -178459 257545 250957 161211 56591 122265
7867 122265 243124 338845 296706 84426 60147 -91665 12515 117071 197353 -202812
7857 -202812 -269334 -57349 320938 395682 -106119 -237220 -222445 -98766 -215581 -349089
7847 -349089 -182543 -127924 -312843 -305149 146691 -57370 -415045 -223632 -7 2963 132803
7836 132803 239333 64930 59455 86001 -208680 -242193 1900 343067 151724 -105307
7826 -105307 -329225 -97761 -76965 112566 223592 -47111 57253 123602 79339 -215206
7816b15206j00735J0035R1357L00687L0676k05513J31291m6523j62425Q6148O1632
7805a8576k53387R8341J2048J36514q8310J13629l67081K22387J59136J92046
7795B06747J20042m10289l9142j26898L12811k7273p57p1010L8592P4647j57106
7784g9636K81391l2176m0150j50335j11878J98534p0116K01758j54056m1265J01428
7773A03499k20212q4968L56511O1932j32496J32416J56524O3325m92393j80029
7763b35891K25838K42924J76635j01368o2313j63418j4740l32854J07563J97727
7753D0103j97316J37225J64796o7105j70069J51317R9867o0058J27045m3524J12428
7742B94709M9191j13134k5149j14014J71197l5377j15299k1021J16450m11724
$$ plain form
7816 -215206 -315941 -305906 -214549 86138 116814 -88699 42592 -3931 -166356 -80208 -18576
7805 -18576 -271963 -173622 -161574 -25060 -113370 259 -366822 -144435 14701 206747
7795 206747 326789 -83500 -122642 -249540 63271 35998 35241 -35769 2823 77470 -79636
7784 -79636 201755 169579 129429 -20906 -132784 65750 -4366 197392 43336 2071 103499
7773 103499 -116713 -201681 154830 216762 84266 216682 373206 436531 -55862 -235891
7763 -235891 -10053 232871 409506 308138 245825 82407 67667 -265187 -157624 40103
7753 40103 -157213 -19988 144808 77703 -92366 58951 158818 98760 225805 182281 294709
7742 294709 343900 230766 205617 91603 262800 227423 112124 91103 207553 -204171
7732b04171J15492J81732l0436K29086R1846M2968k02645J85171m4662k11099
7722A53282J95131n2258Q1934o4635N6777L45624L409k2290k52126J02408L3316
7711E80572k68576k297P9941j1768j8284K00523l8359k03971J63612K75738j97232
7700E59899k02695k49205J63018K70652l0990j05170k86930M5791Q6025J85073
7690D35468j51962j04615J43281N3628L160l70611j34603J97791J7968O0220M2396
7679A92121R0192j70547o555L0783L6607M5437j1962M2163o8015q3459O2700K26712
7667C86177j30909p9606j52618J1163J78778j63961J08024O1641P063j64639j9371
7656D1742p5234Q5875j66133M23756J06502m32972j64088j79085K12366P4209
$$ plain form
7732 -204171 -88679 93053 62617 291703 383549 426517 223872 409043 364381 153282
7722 153282 348413 296155 378089 313454 370231 715855 719264 696974 444848 547256 580572
7711 580572 311996 309699 389640 377872 359588 560111 521752 317781 481393 757131 559899
7700 559899 357204 107999 271017 541669 510679 405509 118579 164370 250395 435468
7690 435468 283506 178891 322172 375800 378960 8349 -126254 71537 89505 149725 192121
7679 192121 282313 111766 105211 135994 172601 218038 206076 248239 180224 96765 159465 386177
7667 386177 255268 175662 23044 34207 212985 49024 157048 218689 225752 61113 41742
7656 41742 -33492 52383 -113750 310006 416508 -16464 -180552 -359637 -147271 -73062
7646g3062K37077L61509r7728j92602j02535j24592j90868j1586L16892j11927
7636A0578j55217n7J12713O6942k9485n6706q3209J46911J04186R7075K70553
7625D84284j96745J09405k20663l59573j36373J14099J65619l2071j2890Q2051
7615b857q219l6208J7010k47714J47985j2472J39317J96181n7186q8112N2362
7604A00087L56925k63187j35173J18933r8342j19114J57660o2613p5481L34571
7594C14266O2913j25305m2833J27332j16681k26514Q591j00443r9732J43842P7217
7583B2653L3878J97515o0243n7592r0162j8579L316q9294k3399j6513p0185J25596
7571d3009o4186O2618n7249l348l222k60815R5259J90769Q4737K26909j34732
$$ plain form
7646 -73062 164015 525524 427796 235194 132659 8067 -182801 -194387 122505 10578
7636 10578 -144639 -144696 -31983 34959 5474 -51232 -134441 12470 116656 213731 484284
7625 484284 287539 396944 176281 -183292 -319665 -205566 -39947 -72018 -84908 -2857
7615 -2857 -11076 -47284 -30274 -277988 -130003 -142475 -3158 193023 135837 47725 100087
7604 100087 457012 193825 58652 177585 79243 -39871 117789 55176 -20305 314266
7594 314266 377179 251874 209041 336373 219692 -6822 1769 -98674 -198406 -54564 22653
7583 22653 56531 254046 193803 136211 46049 27470 30786 -58508 -81907 -98420 -168605 -43009
7571 -43009 -107195 -44577 -101826 -105174 -108396 -369211 -273952 -83183 1554 228463 93731
7560I3731k8227R7689l9209k80929p9764O5236L1553O3456n2450Q3850r0144O520
7548a28688p8617Q7950k8453K50294J55497j58720k12524n2968J28769J04388
7538F6928r7201k88244P6136J1175j67330J33954k0642L92157m0678p2636j67592
7527a73973k70158J15133K92624J65241j4866o4447j76603M9504K16776j49585
7517a0354j43498N0455k8980j52645j63364K79130j2056o1076J53059p2995j14537
7506b76861K72520k6694p8643O0867k87912J55227J84076J77059j16785O3440
7496A26294p6121r5501J27105l7668l2502k26990J66644J2790j42208J62607M667
7485a0883k08409j82953N5199K68762n5591r0932j46655j420K18961O9355m8211
$$ plain form
7560 93731 65504 163193 123984 -156945 -236709 -171473 -139920 -76464 -128914 -45064 -135208 -128688
7548 -128688 -207305 -119355 -147808 102486 257983 99263 -113261 -166229 -37460 66928
7538 66928 -30273 -318517 -242381 -231206 -398536 -264582 -285224 106933 66255 -6381 -173973
7527 -173973 -444131 -328998 -36374 128867 114001 49554 -127049 -77545 139231 -10354
7517 -10354 -153852 -103397 -132377 -285022 -448386 -169256 -181312 -242388 -89329 -162324 -276861
7506 -276861 -4341 -31035 -109678 -48811 -336723 -181496 2580 179639 62854 126294
7496 126294 50173 -45328 81777 44109 11607 -215383 -48739 -35949 -178157 -15550 -10883
7485 -10883 -219292 -402245 -347046 -78284 -133875 -224807 -371462 -372882 -153921 -84566 -132777
7474a32777J71736j38429q2302J25705m1346j8115o2050K41927M9967k17550K4227
7463g9007K12019R2970k15883L373p2952J84593r4228n4729m7608k62847l1794
7452c66093k5518L5353j2691N0710N8086N4591J07007J19867k02996K0581K09813
7441D8710K50776k44330j73876J89850k25107j07990O4175J91942n2561k86726
7431c45137K4642R4657r1282J9310J0521n3656J3895J50660n830j57155P1719
7420b67656m2164K75729j50376L8801L77571o5504j26639k71831J30031L52474
7410B50436j33637k47633K1749K0158M2677N0830K03894j48222l13392p8689Q1024
7399b50805J87723k00069M4127K17054j40909o2461m5365j88172L4955J32223
$$ plain form
7474 -132777 38959 -99470 -181772 -56067 -97413 -115528 -177578 64349 114316 -103234 -79007
7463 -79007 133012 225982 10099 13472 -59480 125113 30885 -23844 -71452 -334299 -366093
7452 -366093 -391611 -356258 -368949 -318239 -260153 -205562 -98555 21312 -181684 -161103 48710
7441 48710 299486 55156 -118720 71130 -153977 -261967 -197792 -5850 -58411 -345137
7431 -345137 -320495 -225838 -317120 -297810 -287289 -340945 -327050 -176390 -182220 -339375 -267656
7420 -267656 -309820 -34091 -184467 -145666 231905 166401 39762 -232069 -102038 250436
7410 250436 116799 -130834 -109085 -88927 -46250 4580 208474 60252 -253140 -331829 -250805
7399 -250805 -63082 -263151 -219024 -1970 -142879 -205340 -250705 -438877 -403922 -271699
7389b71699j15126K24343N0196J45364P3437J02303k59255n14029K0210o3096
7379f07352J03050K79624j51731m987k4602l5503K79966m8292l5193n352j27460
7368c77832r490R5389K90496J28373k52238k59687J34819O71k7252j16337J0365
7357c82723J00853j54348Q0415P6647r8577o9523N6364J89053j07639k8203l4376
7346c72057m3374L51605J59122j33112j80674K42791J31277k66281j46733L009
7336b54427M9720l8267j90956q6700K0712N1074K34358J86956k09547j6977Q3821
7325a70233K72720l04896k04432Q578p7562P2334J54306l8302j36188q4714J42767
7314c65622K92124p619k05560J03788j1689R0011k03276J67243M2645o7627P255
$$ plain form
7389 -271699 -386825 -162482 -112286 33078 106515 208818 -50437 -564466 -544256 -607352
7379 -607352 -504302 -224678 -376409 -381396 -405998 -441501 -161535 -209827 -245020 -250372 -377832
7368 -377832 -387322 -291933 -1437 126936 -125302 -384989 -250170 -249499 -276751 -393088 -382723
7357 -382723 -281870 -436218 -355803 -279156 -377733 -447256 -390892 -201839 -309478 -337681 -372057
7346 -372057 -415431 -63826 95296 -37816 -218490 24301 155578 -110703 -257436 -254427
7336 -254427 -204707 -242974 -433930 -520630 -499918 -448844 -214486 -27530 -237077 -254054 -170233
7325 -170233 102487 -202409 -406841 -398263 -475825 -403491 -249185 -287487 -423675 -508389 -365622
7314 -365622 -73498 -81117 -286677 -182889 -194578 -104567 -307843 -140600 -97955 -165582 -158327
7303a58327j24593M2141k5425q5587L18568M0058j77634J8250J61729O579K6379
7292D2138j62522m1909R4487l1397J57818j53691O4433n2896N7167k0348o2319
7281a09039o6370N7920j01779o3249r0560M1702j7794K11281m4593R0236j9635
7270a11880L8608j71749m368j6023k1357K51206m9537N2713j5812l0358j88704
7259b67261j32325Q9769J70246J04633j64613J77705l3842P3246r6731l8009j77124
7248b94306J13570J28451r2011J03197o8786p0357J30401J88089p9639L3095O2543
7237A54247P1950j06044k55177j9471N9238K25601O2269k31606P833n945J51764
7226A14659k289o0582k40965k4289K38521J3216p4414R5352J81660l58887j45980
$$ plain form
7303 -158327 -282920 -240779 -266204 -351791 -33223 6835 -170799 -152549 9180 15759 42138
7292 42138 -120384 -162293 -67806 -99203 58615 -95076 -30643 -83539 -26372 -46720 -109039
7281 -109039 -175409 -117489 -219268 -282517 -373077 -331375 -349169 -137888 -182481 -92245 -111880
7270 -111880 -73272 -245021 -249389 -265412 -286769 -35563 -85100 -32387 -48199 -78557 -267261
7259 -267261 -399586 -309817 -139571 -34938 -199551 -21846 -55688 17558 -79173 -117182 -294306
7248 -294306 -180736 -52285 -144296 -41099 -109885 -180242 -49841 138248 58609 91704 154247
7237 154247 226197 120153 -135024 -154495 -95257 130344 192613 -38993 -31160 -37105 114659
7226 114659 112370 51788 -189177 -213466 25055 38271 -36143 59209 240869 -118018 -263998
7215b63998L39779K55931q7263k39480O6708k23307O6923Q3248K2037J4179J35464
7204A70221q7552o3349J19954K867Q4335J70468k13088k44979J19356p8099m4580
7193f4446J95085M8784r6249J8687j3410k761J88015l85432N3398P4200m6065
7182c0194O8520m5461P6291m0073O2374R7655k32228L0702R7031L0175J648l05577
7170a89137j03061J57200p3880r887O5107P729O6528p7498K67717l0707j3218
7159F6893j4260q7386J77203q5166o7169J39501j6089j0287L49564O6749L19211
7148H38764M89120O3847m2460m13941J35325L7247k46507k1884K0589K9009k51551
7137F37558l30535P3377j45773q1363j61993Q3850o0052k24508j60047J44269
$$ plain form
7215 -263998 75781 331712 244449 4969 71677 -151630 -84707 -1459 20578 34757 170221
7204 170221 82669 19320 139274 142141 226476 396944 183856 -61123 58233 -19866 -64446
7193 -64446 130639 179423 83174 101861 88451 85690 273705 -111727 -58329 15871 -30194
7182 -30194 38326 -7135 69156 29083 91457 189112 -43116 -12414 84617 114792 116440 -189137
7170 -189137 -292198 -134998 -208878 -218765 -153658 -145929 -79401 -156899 110818 80111 66893
7159 66893 52633 -34753 142450 57284 -9885 129616 113527 103240 452804 519553 838764
7148 838764 1327884 1391731 1349271 935330 1070655 1107902 861395 839511 860100 889109 637558
7137 637558 307023 380400 234627 153264 -8729 75121 15069 -209439 -369486 -225217
7127b25217P4748k08335J11857j32306K45382K01375N7188j43388m6683j02303
7117a67682j79194K75431j193o9161Q393J12743j64812K19007K9688l12573m0908
7106b90261K13520J25950J76848j06121l16810L4963P6393K0357J04706k05796
7096a66251j17192K36798p6416O751Q3158J7611k52843p6664M3357k8866J23051
7085b07506J30126P9621j65691j862k43889Q1004K34779k1993O3980j67914k00933
7074d20278K85583J33971j76225j3125l57770O3200K05072K44188m4077m3400
7064a22861k33477l2995J89412J19543j3530L6802J57874j15827r8909r1331J42224
7053f3075R2957k722J58006j05704J21301q0316k18467q0640k03022j37768K77826
$$ plain form
7127 -225217 -150469 -358804 -246947 -379253 -133871 67504 124692 -18696 -65379 -167682
7117 -167682 -346876 -71445 -72638 -141799 -133406 -20663 -185475 33532 63220 -249353 -290261
7106 -290261 -76741 49209 226057 119936 -196874 -161911 -85518 -65161 39545 -166251
7096 -166251 -283443 -46645 -123061 -116310 -33152 -15541 -268384 -345048 -301691 -330557 -207506
7085 -207506 -77380 2241 -163450 -165312 -409201 -328197 -93418 -115411 -51431 -219345 -420278
7074 -420278 -134695 -724 -176949 -190074 -547844 -484644 -279572 -35384 -79461 -122861
7064 -122861 -356338 -389333 -199921 -80378 -93908 -57106 100768 -15059 -113968 -205299 -63075
7053 -63075 29882 27160 185166 79462 200763 120447 -98020 -178660 -381682 -519450 -241624
7042b41624J48125K09926k5105k71610k8643j4786j75708K1190J67228q7606K05104
7031i3509k5514K2124K2405j47749m920j34895K63455J10570J40520o2572J46921
7020B36836K41099l20216n7676o8406J16282J3731j80422j0295l17667K79228
7010f7506L04606l05999j30174j25199q6700j8859L51612J4062k12051P4678q7436
6999b88966L40207L03432l07695q3708n1280l9016K3688L5560j90593q9417J7555
6988c30233j8263J86446J52009J6648k02077J86488R5857k166k60266k4747O8691
6977a31613k90734J20777j7032j97951o7478L16928J51874J11615R5606o4193
6967B7799j39583r6518J09928J8396j18822K51426N78L191J11677j47965j96608
$$ plain form
7042 -241624 -93499 116427 91322 -180288 -208931 -223717 -399425 -378235 -211007 -298613 -93509
7031 -93509 -119023 -96899 -74494 -222243 -227163 -362058 -98603 11967 152487 89915 236836
7020 236836 477935 157719 100043 31637 147919 161650 -18772 -29067 -346734 -67506
7010 -67506 237100 -68899 -199073 -324272 -410972 -429831 -78219 -64157 -276208 -201530 -288966
6999 -288966 51241 354673 46978 -36730 -88010 -127026 -103338 -67778 -258371 -347788 -330233
6988 -330233 -348496 -162050 -10041 6607 -195470 -8982 86875 84709 -175557 -200304 -131613
6977 -131613 -422347 -301570 -318602 -516553 -584031 -267103 -115229 -3614 91992 27799
6967 27799 -111784 -208302 -98374 -79978 -198800 52626 53204 56395 168072 20107 -176501
6956a76501k91607J2610L69063k7136J1391k03817R0911n6271J39670J51021J28037
6945A47371J0128L6235j47999j57715K20266j49044j01924j13821L292n5674k08251
6934e17136n896J19390M2003K6525N00886j65841j5915J23317j51533J55886k62987
6923a51301k40589m337J96143q3821l02827J89594M0868J4478K00859J45985J47706
6912A52758k5778l2572K7892j72595q8805n1988j62401M80131Q5369n6626O5300
6901B20685o5302K18748j42982j03779J47566P7846k04678j96463O1324n3633
6891d0668K48128j78758j14284m9786K1996k22880l89272K44782J43887M4230
6881b92625j01561k916L69966m7035J40153k72638L0018O2700N0944K45378o4780
$$ plain form
6956 -176501 -468108 -455498 -86435 -113571 -102180 -305997 -215086 -271357 -131687 19334 147371
6945 147371 157499 193734 45735 -111980 108286 -40758 -142682 -256503 -253211 -308885 -517136
6934 -517136 -523032 -403642 -361639 -335114 165772 -69 -15984 107333 -44200 111686 -151301
6923 -151301 -391890 -396227 -200084 -283905 -586732 -397138 -356270 -341792 -140933 5052 152758
6912 152758 126980 94408 122300 -50295 -139100 -191088 -353489 126642 212011 155385 220685
6901 220685 155383 374131 231149 127370 274936 352782 148104 -48359 12965 -40668
6891 -40668 207460 28702 -85582 -135368 -113372 -336252 -725524 -480742 -336855 -292625
6881 -292625 -394186 -397102 -27136 -74171 65982 -206656 -176638 -113938 -62994 182384 117604
6870A17604j45227J36939R787k9158k85076L1040k19189M6155L45978J98402K6819
6859B34074J9323k20995r5970m2343q465L4501j01871j64170K14986j24550p1067
6848c26547K22513J35153J75521j30455p0446j28510k07619L7925L73830J33044
6838B14409k08139P847P4223Q8219J15676l94077L98256R7921l4714k61707J21651
6827B19565K9175j38411m6306J03020j67318j6159K62623R6248L2154l8852p4816
6816B60923o4604p0995p1205j6133J42642p3688k33687R9410N6873k14279j46105
6805c30848P5790L49841J07210J02373r3792j07204J95066j8598o5512r3368O0771
6794A81729K86j45017O3774J92486J24577j08627J62216l1104j95364K13909k58258
$$ plain form
6870 117604 -27623 109316 119103 89945 -195131 -164091 -383280 -337125 8853 207255 234074
6859 234074 253397 32402 -63568 -105911 -114376 -79875 -181746 -345916 -130930 -255480 -326547
6848 -326547 -104034 31119 206640 76185 5739 -122771 -330390 -292465 81365 214409
6838 214409 6270 14117 88340 176559 292235 -101842 296414 394335 359621 97914 219565
6827 219565 248740 110329 64023 167043 -275 -16434 246189 342437 374591 335739 260923
6816 260923 196319 125324 54119 37986 180628 106940 -126747 -27337 29536 -184743 -330848
6805 -330848 -255058 94783 201993 304366 210574 103370 298436 279838 214326 120958 181729
6794 181729 182015 36998 100772 293258 417835 309208 471424 440320 244956 458865 200607
6783B00607P7307L43749p502k38522j31340M8932j7087R577K62947j02289p0141
6772C76238n8189j73070J83963j11510K6583m2057Q6914J58831r2359l18841l592
6761C2911J27565r3124J5449L8226l4197Q0825p8462K38431j30159P4063J05122
6750C76650j06702J48391P5569j57356j3646j73134l8938J54056P6161K65815
6740F06866o7949p7170j06001q4581L5351J08498k5882k02200j83885K10638J23164
6729C36849Q8581L4760q3824K38147K3187j43766j21763l12318M1779M01388N33705
6718A036725J27826j46319m4822j71483J99635L07472K34235J52929m5074L76461
6708B027585L96942J44953K08787M33432K94709J92276L8980J23791j57426k387
$$ plain form
6783 200607 277914 621663 614161 375639 244299 293231 276144 285721 548668 446379 376238
6772 376238 318049 144979 328942 217432 244015 201958 288872 447703 355344 36503 32911
6761 32911 160476 67352 82801 121027 86830 167655 89193 327624 197465 271528 376650
6750 376650 269948 418339 493908 336552 322906 149772 110834 264890 341051 606866
6740 606866 538917 461747 355746 271165 306516 415014 389132 186932 3047 213685 336849
6729 336849 425430 460190 376366 614513 637700 493934 372171 59853 101632 503020 1036725
6718 1036725 1164551 1018232 973410 801927 1001562 1309034 1543269 1696198 1651124 2027585
6708 2027585 2424527 2569480 2778267 3211699 3506408 3698684 3737664 3861455 3704029 3701642
6698C701642K57337k23802k14822k02238n3498k11979l78972m722l88321k41111
6688B039514m64190o1327j33924k57317R6320o9070q5365j57767j02285j36179
6678F68410L4464j89911k66310m83J29438r4607p7824j874q7656j7944j6349R8776
6666A78130p6822R4754r6587P8501j05012M9773k00761M29809o3056j27264J79722
6655C41187M7k39974j29845L8494K4426K31707q9951n6118j51206M8871N1942
6644F9580m256q9718K8120N9663K0508J43590j92790l06281J20084k4511K74951
6633I8940K20882j25358P8917j08301j50476j79471j27031R7104j4575K94858
6623H5489K8025k9888J3752J31335o9496k8776k23123K006L81240R1336k5707
$$ plain form
6698 3701642 3958979 3735177 3520355 3318117 3264619 3052640 2673668 2668946 2280625 2039514
6688 2039514 1575324 1513997 1380073 1122756 1219076 1150006 1064641 906874 804589 668410
6678 668410 702874 512963 246653 246170 375608 281001 203177 201303 113647 95703 79354 178130
6666 178130 101308 196062 99475 177976 72964 122737 -78024 351785 288729 161465 341187
6655 341187 341234 101260 -28585 9909 34335 266042 176091 119973 -31233 17638 69580
6644 69580 65324 -24394 3726 63389 83897 227487 34697 -271584 -151500 -176011 98940
6633 98940 319822 194464 273381 165080 14604 -164867 -291898 -194794 -209369 85489
6623 85489 113514 83626 97378 228713 159217 130441 -92682 -90676 290564 381900 356193
6612C56193l5555j31941P2583J14580R8239o4327R4321j13265k41591p776J27047
6601B68508k09952O1206L0434J7840J60495k61697k11207R9872P2356j00876J03810
6590C0789J87600l760l6630J26923J28133J06969n4093l7687K4039m8114J94991
6579F19160j19890L5215j18115J33435Q4136j50706l6113N3930j3792K635j94599
6568B95296J35591N8621J00901q7906k25202k59860k51743L02103j03079j25133
6558a60411L42995J52790k3027k83517j05253J5723p8350L4021K8410J60300l18676
6547b34995K7164M7925j7786K92216M664j40738j27618j13697K13530K09252j20482
6536C9435j29758K9504N48436m02546l60345K53230l0347J97937J80392j23742
$$ plain form
6612 356193 320638 188697 261280 375860 474099 409772 504093 390828 149237 141461 268508
6601 268508 58556 119762 150196 168036 328531 66834 -144373 -44501 27855 -73021 30789
6590 30789 218389 214629 177999 304922 433055 540024 485931 448244 472283 424169 619160
6579 619160 499270 534485 416370 549805 633941 483235 447122 501052 487260 489895 295296
6568 295296 430887 489508 590409 502503 277301 17441 -234302 67801 -35278 -160411
6558 -160411 182584 335374 312347 28830 -76423 -60700 -139050 -105029 -76619 83681 -234995
6547 -234995 -207831 -159906 -177692 114524 119188 -21550 -149168 -262865 -49335 159917 39435
6536 39435 -90323 -60819 487617 85071 -275274 -22044 -52391 145546 325938 202196
6526B02196k42511k3563l6199Q8773O595J82888K08864j0402k94430j51143l05252
6515c74184K50074k24289j04808J60227l977j90777J61547K20983j12512J21611
6505i6105J00520m44123P9149J65782R2465J0901J88211j05584l07294r780M3616
6494b82242J23744m9144N6999K84460n0910k25567l4053K59854m7119j28433k1602
6483a14013M9864j83910P6007J63330O5239l62316j6454J53986o9177O7911N0963
6472a18570O7287l10236P8141j35867M1497K9631m6847J07358k23569q5930J24257
6461d72848J52399K18565j85141l2819Q2867K12921J7864j42083Q6897n3965M6961
6450f8382O1277l57689n1719L52877O485q6228j00622k0977J23958m204k5151
$$ plain form
6526 202196 -40315 -63878 -100077 -11304 -4709 178179 387043 376641 82211 -68932 -374184
6515 -374184 -124110 -348399 -453207 -292980 -296957 -487734 -326187 -105204 -217716 -96105
6505 -96105 4415 -439708 -360559 -194777 -102312 -91411 96800 -8784 -316078 -325858 -282242
6494 -282242 -158498 -207642 -150643 133817 82907 -142660 -176713 83141 36022 -92411 -114013
6483 -114013 -64149 -248059 -172052 -8722 56517 -305799 -322253 -168267 -237444 -169533 -118570
6472 -118570 -51283 -361519 -283378 -419245 -377748 -348117 -394964 -287606 -511175 -597105 -472848
6461 -472848 -320449 -101884 -287025 -319844 -236977 -24056 -6192 -148275 -61378 -115343 -68382
6450 -68382 -7105 -364794 -416513 -63636 -57151 -143379 -244001 -264978 -141020 -145224 -170375
6439a70375J91418o4451m3670j22925j29104n73j28007P7010N6261J50513K10998
6428B7095j98981j98861M3881J90212M33780j56880j17175j76131J92042j09600
6418g0618L4956K100Q9108m5001Q4656K3180J08558k4940M4666l9599Q7084P2924
6406C67074N6751l8733O6477q1032J40013K01119j55451j24936R0289J43622j52492
6395E12701j83378M1514r915j68902J47762o4561J53450j40620p1216J63188J61358
6384E41381j18788n2326K44074R0880l849k73085l9700J28758M3950q6979j70116
6373C04200P9427K15398L1361k43997r5122L1881j81185K74128K8408j80109J6551
6362B80941Q1212J47939k7915r9188r7179J58066j14144R2689j02945K24341J76190
$$ plain form
6439 -170375 21043 -43408 -87078 -210003 -339107 -339680 -467687 -390677 -334416 -183903 27095
6428 27095 -171886 -370747 -326866 -136654 297126 140246 23071 -153060 38982 -70618
6418 -70618 -35662 -33562 55546 10545 95201 118381 226939 201999 246665 207066 294150 367074
6406 367074 423825 385092 451569 370537 510550 711669 556218 431282 521571 665193 512701
6395 512701 329323 370837 360922 192020 339782 275221 428671 288051 216835 380023 541381
6384 541381 422593 370267 614341 705221 701372 428287 388587 517345 561295 474316 304200
6373 304200 383627 599025 630386 386389 291267 323148 141963 416091 444499 264390 280941
6362 280941 362153 510092 482177 382989 285810 443876 329732 422421 319476 543817 720007
6351G20007m2525j46843l4427K12751j99215L73K71515n8507K5795J9246J16220
6340H84390R6857n4237j09481p7829n5583K07288l83697j97656N2114j19781J96074
6329D38459J09553k50260Q4975J28798j6834j44306j5253L43027L3915K37052
6319I49126p6011j37865K12146q7361n6367p4015j75462J13142K42517l6046m2729
6308H31075K34100K10748l14732j29013p9528O2985j23626j47666r4916M06742
6298H56169J82143l8328k36289j16648K97740k5345J80325l04619P497J94469
6288I97114r3159k04908Q4818l24n2128J73085J8820j309n3662j56529R3242N8987
6276H64047Q645j16396j04159k93288L11391K14176p5169k1665N0370K15590j2345
$$ plain form
6351 720007 677482 530639 496212 708963 509748 510121 781636 723129 748924 768170 884390
6340 884390 981247 927010 817529 739700 684117 891405 507708 310052 362166 242385 438459
6329 438459 548012 297752 382727 511525 494691 350385 335132 678159 712074 949126
6319 949126 873115 735250 947396 860035 803668 729653 554191 667333 909850 873804 831075
6308 831075 1065175 1275923 961191 832178 752650 815635 692009 544343 449427 856169
6298 856169 1038312 999984 763695 647047 944787 919442 1099767 795148 802645 997114
6288 997114 903955 699047 783865 783541 731413 904498 923318 922009 868347 711818 805060 864047
6276 864047 872692 756296 652137 358849 670240 884416 809247 787582 837952 1053542 1041197
6265A041197q308j12080j6060J039J12526M3713J72484p2603l9990J8735k32019
6254I08634J13596K67974K33225n9267m59876j38742j08378m1789K97275N5620
6244A068272K5467j56266o3847k2412q3963j88833L7219L97947k5926r5592L27790
6233A219856m0912j08519K45150k17361q0913J55654j51348M0940K91080p5895
6223A277732j65533o3229o898L17821P822m4549j24269j45211O7083j83231k6269
6212I11269j5706J87655J34690j84853K1375j50551M9804J35027k635R9329r7764
6201A087640j77751k63521l349M11580p8194R7317r018p1439k22192m0682K17949
6190I48340j89012k36220J41983J8864j00679R2828j4154J4974J93271m346j43826
$$ plain form
6265 1041197 1032889 920809 904749 905788 1018314 1062027 1234511 1161908 1121918 1140653 908634
6254 908634 1022230 1290204 1523429 1464162 1004286 865544 757166 715377 1012652 1068272
6244 1068272 1093739 937473 873626 851214 767251 578418 615637 1013584 987658 892066 1219856
6233 1219856 1178944 1070425 1315575 1098214 1017301 1172955 1021607 1062547 1353627 1277732
6223 1277732 1112199 1048970 1042072 1359893 1367715 1323166 1198897 1053686 1120769 937538 911269
6212 911269 895563 1083218 1217908 1033055 1054430 903879 953683 1088710 1086075 1185404 1087640
6201 1087640 909889 646368 643019 1054599 976405 1073722 1064704 993265 771073 730391 948340
6190 948340 759328 523108 665091 683955 583276 676104 661950 676924 870195 865849 722023
6179G22023k26376m1104j19865K67758L27014j85166j10115M3198L5270L6848
6169G49485J59610j09016k27894j05361L78042R8482R3319N340J6717k18841j1107
6158H28776K59454J02573k6775K75582j56498J78506j59746o1883N22567j89762
6148A572794K24021n4000J10706L83020J37937N7827m8130j63228k537Q9799J24235
6137B432444o024L15653K52239J98954p8852K82723O229r690K02706K65786J87175
6126D049343k57310k12457L1778j98179n8672L18348J48539R2320r6879j29190
6116C687641j51049n5593l10965J36248J04918k06114k66652L1697j89611K74631
6106C055151o002k24371j5756j57504k16201K5867J7624l140j16940l72685J8461
$$ plain form
6179 722023 495647 454543 334678 602436 929450 744284 634169 677367 712637 749485
6169 749485 909095 800079 572185 466824 844866 943348 1036667 1042007 1058724 839883 828776
6158 828776 1088230 1190803 1164028 1439610 1283112 1461618 1301872 1239989 1762556 1572794
6148 1572794 1796815 1742815 1853521 2236541 2374478 2432305 2384175 2220947 2218410 2308209 2432444
6137 2432444 2426420 2742073 2994312 3193266 3114414 3397137 3403366 3393676 3596382 3862168 4049343
6126 4049343 3792033 3579576 3611354 3413175 3354503 3672851 3821390 3913710 3816831 3687641
6116 3687641 3536592 3480999 3170034 3306282 3411200 3205086 2938434 2970131 2780520 3055151
6106 3055151 3049149 2824778 2809022 2651518 2435317 2461184 2478808 2475668 2358728 1986043 2004504
6095B004504J06475j6298J10367j81665q8115k27593j69909k07530p7087Q469
6085A261618J92371j436k42042j33931Q4849L37826j41787P6845k0135K0205m0568
6074A393815J71891m7706j69608j28557J63826P9374p4761K35910k2760k55381
6064A346043j12821j14443p0769O9386n5269q1974L6533j67256L7462P7435r2660
6053H71667P859J81136j5230O8017n2758n6350J04849J89526j11080N6495j5732
6042A228399j69722K56812K05339k23429r440J45617l91433r0630m9886J70809
6032A072436j6374J82169O42r7304k13102j11665K7539K6192J90210m9979l12192
6021F98572L6203J19300J05258k10186J8630J59818n4357k0768q8856j49804j12597
$$ plain form
6095 2004504 2110979 2094681 2205048 2023383 1935268 1707675 1537766 1330236 1253149 1261618
6085 1261618 1453989 1452553 1210511 1076580 1161429 1499255 1357468 1434313 1414178 1434383 1393815
6074 1393815 1565706 1518000 1348392 1219835 1383661 1463035 1388274 1624184 1601424 1346043
6064 1346043 1233222 1118779 1048010 1117396 1062127 980153 1016686 849430 886892 964327 871667
6053 871667 879526 1060662 1045432 1113449 1060691 1004341 1109190 1298716 1187636 1244131 1228399
6042 1228399 1058677 1315489 1520828 1297399 1287959 1433576 1042143 951513 901627 1072436
6032 1072436 1056062 1238231 1238873 1141569 928467 816802 844341 870533 1060743 1010764 698572
6021 698572 734775 854075 959333 749147 767777 927595 873238 852470 763614 613810 501213
6010E01213J28587J23933J29854n9954J55781K6830k31193P5709K19238K08249
6000A278247j34576j23283J87143j26201J11841J69947k2149L4057o7888N5043
5990A362181K87139m941J29675j79186k47712K31238k9451k27713m9926J40141
5980A411445j29961k96377j49864p8044J91419R2627J81820j45132j96426N3549
5970I35056q113K20754R5573K68123q8628J7200L31739p508n2862j88169K70369
5959A793534J3932Q7424m1489J56208K6857L7453R3293j08101k14573m2476L10766
5948B112828K40840J38611J10174N937Q8936P2618L55788J31008J34635J65253
5938C556628J47335J42259K98737L18804j71026J37801R5496r705j75149j49122
$$ plain form
6010 501213 629800 753733 883587 823633 979414 1006244 775051 850760 1069998 1278247
6000 1278247 1143671 1020388 1207531 1081330 1193171 1363118 1340969 1375026 1307138 1362181
5990 1362181 1649320 1644379 1774054 1594868 1347156 1578394 1548943 1321230 1271304 1411445
5980 1411445 1281484 985107 835243 757199 948618 1041245 1223065 1077933 881507 935056
5970 935056 926943 1147697 1243270 1511393 1422765 1439965 1771704 1764196 1711334 1523165 1793534
5959 1793534 1807466 1894890 1853401 2009609 2036466 2073919 2167212 2059111 1844538 1802062 2112828
5948 2112828 2353668 2492279 2602453 2608390 2697326 2769944 3125732 3256740 3391375 3556628
5938 3556628 3703963 3846222 4144959 4463763 4292737 4430538 4526034 4516329 4341180 4192058
5928D192058R5926j83590k15651k14408j95034L47190N02729J26810J69976K49478
5918D875484J58398L1084j41391Q6599K38702J90317j3139r1401j81127O8359
5908E221885n3362p397J4287K91049K09367J62566J49223l1086J93939J26516
5898F276987J05621L16234M80792N58865K31583O56756R08103R63309J179539
5889A1677789J540034K258840L148082K888265L303857L485010L297997J147258
5881C2747132p78621j084566o06409n77833o96774j199347k045518j315307j141505
5872B3301252p01499K33K93513J60178k4705p02444j045789q63737p59743p01437
5862A8955822j303404j391058j268643j079413j444904r13390o74943o59382n53121
$$ plain form
5928 4192058 4287984 4104394 3888743 3674335 3479301 3826491 4329220 4456030 4626006 4875484
5918 4875484 5033882 5064966 4923575 5010174 5248876 5439193 5426054 5334653 5153526 5221885
5908 5221885 5168523 5161126 5175413 5466462 5675829 5838395 5987618 5956532 6150471 6276987
5898 6276987 6382608 6698842 7179634 7738499 7970082 8626838 9534941 10498250 11677789
5889 11677789 13217823 15476663 18624745 21513010 24816867 28301877 31599874 32747132
5881 32747132 31968511 30883945 30277536 29699703 29002929 27803582 25758064 24442757 23301252
5872 23301252 22599753 22599986 22893499 23053677 23028972 22326528 21280739 20417002 19657259 18955822
5862 18955822 17652418 16261360 14992717 13913304 12468400 11555010 10880067 10220685 9667564
5853I667564k22909j1863o8736j61877k89025j56210l59584m12066j62642l8511
5843G784141j50405j85408k85497k47836L8005N3120m9599K28981K41509M19812
5833G846823K14188M91212L33482L96235l2410L09321j24950l24628k68059K4994
5823H866208j76957j85635l61522l26665l48392l05776n53623k54503k59459n28018
5813E565658j62357J6618J964l6032j32121k54822K22107J367L06322J62632L04895
$$ plain form
5853 9667564 9444655 9432792 9364056 9202179 8913154 8756944 8397360 7985294 7822652 7784141
5843 7784141 7633736 7448328 7162831 6914995 6953000 7006120 6956521 7185502 7427011 7846823
5833 7846823 8061011 8552223 8885705 9281940 9249530 9558851 9433901 9109273 8841214 8866208
5823 8866208 8689251 8503616 8142094 7815429 7467037 7161261 6607638 6353135 6093676 5565658
5813 5565658 5403301 5419919 5421883 5385851 5253730 4998908 5221015 5222382 5528704 5691336 5996231
$$ [...]
##END NTUPLES=NMR SPECTRUM
##END=
