##TITLE=1H_EC-3389(II-1)
 200.13Hz, CDCl3.
 8 sc
 24.8.2026
##JCAMPDX= 6.0         $$ Bruker NMR JCAMP-DX V2.0
##DATA TYPE= NMR SPECTRUM
##DATA CLASS= NTUPLES
##ORIGIN= UXNMR, Bruker Analytische Messtechnik GmbH
##OWNER= pz
$$ XWIN-NMR		Version 3.5
$$ Mon Aug 24 13:34:56 2026 Russian Standard Time (UT+4h)  she@DPX200
##.OBSERVE FREQUENCY= 200.1313
##.OBSERVE NUCLEUS= ^1H
##.ACQUISITION MODE= SIMULTANEOUS
##.ACQUISITION SCHEME= undefined
##.AVERAGES= 8
##.DIGITISER RES= 18
##SPECTROMETER/DATA SYSTEM= spect
##.PULSE SEQUENCE= zg30
##.SOLVENT NAME= CDCl3
##.SHIFT REFERENCE= (INTERNAL, CDCl3, 0, 15.488)
##AUDIT TRAIL= $$ (NUMBER, WHEN, WHO, WHERE, WHAT)
$$ ##TITLE= Audit trail, XWIN-NMR		Version 3.5
$$ ##JCAMPDX= 5.01
$$ ##ORIGIN= Bruker BioSpin GmbH
$$ ##OWNER= she
$$ F:/spectra/data/she/nmr/H-C/1/pdata/1/auditp.txt
$$ ##AUDIT TRAIL=  $$ (NUMBER, WHEN, WHO, WHERE, WHAT)
(   1,<2026-08-24 13:33:37.82 +0400>,<she>,<DPX200>,
      <created by zg, POWCHK disabled, PULCHK disabled
       configuration hash MD5:
       00 E9 B6 7A A2 85 ED C7 34 08 36 98 17 FE 4E 26
       data hash MD5: 16K
       50 F8 D7 A4 EB 36 34 E4 67 26 E3 16 4D 97 62 65>)
(   2,<2026-08-24 13:33:40.29 +0400>,<she>,<DPX200>,
      <Start of raw data processing
       efp BC_mod = 2 LB = 0.25 FT_mod = 6 PKNL = 1 PHC0 = -4585.199 PHC1 = 17.7923 SI = 16K 
       data hash MD5: 16K
       46 63 B6 ED 25 0F 79 25 92 19 81 BE 22 09 6E DA>)
(   3,<2026-08-24 13:34:01.00 +0400>,<she>,<DPX200>,
      <pk PHC0 = 6.273657 PHC1 = -8 
       data hash MD5: 16K
       F0 39 70 E4 1A 1A AE 40 15 F8 7A B0 6D C4 34 4B>)
(   4,<2026-08-24 13:34:09.29 +0400>,<she>,<DPX200>,
      <abs ABSG = 5 
       data hash MD5: 16K
       2E BD 04 09 B8 6D 31 91 4B AC 07 8D 02 E7 DD 24>)
$$ ##END=
$$ 
$$ hash MD5
$$ 36 D6 A0 D0 A0 A6 D4 11 C1 60 17 F1 B0 A6 9B 41
##$RELAX= 
##$RELAX= 
##$RELAX= 
##$RELAX= 
##$RELAX= 
##$RELAX= 
$$ Bruker specific parameters
$$ --------------------------
##$DU= <F:/spectra>
##$EXPNO= 1
##$NAME= <H-C>
##$PROCNO= 1
##$TYPE= <nmr>
##$USER= <she>
##$AMP= (0..31)
100 100 100 100 100 100 100 100 100 100 100 100 100 100 100 100 100 100 
100 100 100 100 100 100 100 100 100 100 100 100 100 100 
##$AQSEQ= 0
##$AQ_mod= 1
##$AUNM= <au_zg>
##$AUTOPOS= <>
##$BF1= 200.13
##$BF2= 200.13
##$BF3= 200.13
##$BF4= 200.13
##$BF5= 200.13
##$BF6= 200.13
##$BF7= 200.13
##$BF8= 200.13
##$BYTORDA= 1
##$CFDGTYP= 0
##$CFRGTYP= 5
##$CHEMSTR= <none>
##$CNST= (0..31)
1 1 145 1 1 1 1 1 1 1 1 1 1 1 1 1 1 1 1 1 1 1 1 1 1 1 1 1 1 1 1 1 
##$CPDPRG= <>
##$CPDPRG1= <>
##$CPDPRG2= <>
##$CPDPRG3= <>
##$CPDPRG4= <mlev>
##$CPDPRG5= <mlev>
##$CPDPRG6= <mlev>
##$CPDPRG7= <mlev>
##$CPDPRG8= <mlev>
##$CPDPRGB= <>
##$CPDPRGT= <>
##$D= (0..31)
0 0.7 0 0 0 0 0 0 0 0 0 0.03 0 0 0 0 0 0 0 0 0 0 0 0 0 0 0 0 0 0 0 0 
##$DATE= 1787564017
##$DBL= (0..7)
120 120 120 120 120 120 120 120 
##$DBP= (0..7)
150 150 150 150 150 150 150 150 
##$DBP07= 0
##$DBPNAM0= <>
##$DBPNAM1= <>
##$DBPNAM2= <>
##$DBPNAM3= <>
##$DBPNAM4= <>
##$DBPNAM5= <>
$$ [...]
##$SUBNAM3= <"">
##$SUBNAM4= <"">
##$SUBNAM5= <"">
##$SUBNAM6= <"">
##$SUBNAM7= <"">
##$SUBNAM8= <"">
##$SUBNAM9= <"">
##$SW= 18.0517328524113
##$SWIBOX= (0..15)
0 0 2 0 0 0 0 0 0 0 0 0 0 0 0 0 
##$SW_h= 3612.71676300578
##$TD= 16384
##$TD0= 1
##$TE= 0
##$TE2= 300
##$TE3= 300
##$TEG= 300
##$TL= (0..7)
0 120 120 120 120 120 120 120 
##$TP= (0..7)
150 150 150 150 150 150 150 150 
##$TP07= 0
##$TPNAME0= <>
##$TPNAME1= <>
##$TPNAME2= <>
##$TPNAME3= <>
##$TPNAME4= <>
##$TPNAME5= <>
##$TPNAME6= <>
##$TPNAME7= <>
##$TPOAL= (0..7)
0.5 0.5 0.5 0.5 0.5 0.5 0.5 0.5 
##$TPOFFS= (0..7)
0 0 0 0 0 0 0 0 
##$TUNHIN= 0
##$TUNHOUT= 0
##$TUNXOUT= 0
##$USERA1= <user>
##$USERA2= <user>
##$USERA3= <user>
##$USERA4= <user>
##$USERA5= <user>
##$V9= 5
##$VALIST= <valist>
##$VCLIST= <CCCCCCCCCCCCCCC>
##$VD= 0
##$VDLIST= <DDDDDDDDDDDDDDD>
##$VPLIST= <PPPPPPPPPPPPPPP>
##$VTLIST= <TTTTTTTTTTTTTTT>
##$WBST= 1024
##$WBSW= 4
##$XGAIN= (0..3)
0 0 0 0 
##$XL= 0
##$YL= 0
##$YMAX_a= 291951
##$YMIN_a= -303998
##$ZGOPTNS= <>
##$ZL1= 120
##$ZL2= 120
##$ZL3= 120
##$ZL4= 120
##$ABSF1= 15.51221
##$ABSF2= -2.539639
##$ABSG= 5
##$ABSL= 3
##$ALPHA= 0
##$AQORDER= 0
##$ASSFAC= 0
##$ASSFACI= 0
##$ASSFACX= 0
##$ASSWID= 0
##$AUNMP= <proc_1d>
##$AZFE= 0.1
##$AZFW= 0.1
##$BCFW= 0
##$BC_mod= 2
##$BYTORDP= 0
##$COROFFS= 0
##$CY= -3
##$DATMOD= 1
##$DC= 0
##$DFILT= <>
##$DTYPP= 0
##$F1P= 0
##$F2P= 0
##$FCOR= 1
##$FTSIZE= 16384
##$FT_mod= 6
##$GAMMA= 0
##$GB= 0
##$INTBC= 1
##$INTSCL= 3.241238e-09
##$ISEN= 128
##$LB= 0.25
##$LEV0= 0
##$LPBIN= 0
##$MAXI= 10000
##$MC2= 0
##$MEAN= 0
##$ME_mod= 0
##$MI= 1.114404
##$NCOEF= 0
##$NC_proc= -7
##$NLEV= 6
##$NOISF1= 3.799351
##$NOISF2= 2.8
##$NSP= 0
##$NTH_PI= 0
##$NZP= 0
##$OFFSET= 15.48797
##$PC= 1
##$PHC0= -4578.926
##$PHC1= 9.792299
##$PH_mod= 1
##$PKNL= yes
##$PPARMOD= 0
##$PSCAL= 0
##$PSIGN= 0
##$REVERSE= no
##$SF= 200.130006751476
##$SI= 16384
##$SIGF1= 3
##$SIGF2= 2
##$SINO= 0.751879
##$SIOLD= 32768
##$SREGLST= <19F.Aceton>
##$SSB= 0
##$STSI= 16384
##$STSR= 0
##$SW_p= 3612.71676300578
##$SYMM= 0
##$S_DEV= 0
##$TDeff= 16384
##$TDoff= 0
##$TI= <>
##$TILT= no
##$TM1= 0
##$TM2= 0
##$TOPLEV= 0
##$USERP1= <user>
##$USERP2= <user>
##$USERP3= <user>
##$USERP4= <user>
##$USERP5= <user>
##$WDW= 1
##$XDIM= 16384
##$YMAX_p= 400198445
##$YMIN_p= -627963
$$ End of Bruker specific parameters
$$ ---------------------------------
##NTUPLES= NMR SPECTRUM
##VAR_NAME=  FREQUENCY,     SPECTRUM/REAL,   SPECTRUM/IMAG
##SYMBOL=    X,             R,               I
##VAR_TYPE=  INDEPENDENT,   DEPENDENT,       DEPENDENT
##VAR_FORM=  AFFN,          ASDF,            ASDF
##VAR_DIM=   16384,         16384,           16384
##UNITS=     HZ,            ARBITRARY UNITS, ARBITRARY UNITS
##FACTOR=    0.220516191357247, 1,           1
##FIRST=     3099.60761114701, 0,            0
##LAST=      -513.109151858767, 0,           0
##MIN=       -513.109151858767, -627963,     0
##MAX=       3099.60761114701, 400198445,    0
$$ Real data points
##PAGE= N=1
##DATA TABLE= (X++(R..R)), XYDATA
$$ [...]
7308a74771P2123L9909J42018k53015J39138j75097O4353M3215O2992J11246k76185
7297b04074J35226J52194k50592k17739m7996J65212o4175j70360K44807J52165
7287a05332j64343K74369J90488N3722k48035j28256O0041K52180k23172j49714
7277a88052O7060M9757J64385j0763R4854J38631j23621j48456j8251O7552j13078
7266a9982k00209R9588M5189L0490J28182k4656j03755n8940K10333N6194j41488
7255B0946j000O9460J85460M819k8517j75546n1450J00877K1655j49333m4740
7244d7369J75850j25570q4367J43047O5618Q2547k13132k28750M85292K12379
7234D65545j79649m1263k83190N9580R602J04453J5244r05k58593n6140n595k7836
$$ y = [-174771, -102648, -62739, 79279, -173736, -34598, -209695, -145342, -102127, -39135, 72111, -204074, -68848, 83346, -167246, -384985, -432981, -267769, -331944, -502304, -257497, -105332, -269675, 4694, 195182, 248904, 869, -127387, -67346, 184834, -38338, -188052, -120992, -71235, 93150, 82387, 177241, 315872, 192251, 43795, 25544, 93096, -19982, -220191, -120603, -75414, -44924, 83258, 58602, -45153, -104093, 106240, 162434, 20946, 19946, 89406, 274866, 279685, 251168, 75622, 24172, 125049, 146704, -2629, -47369, 128481, 2911, -81456, 61591, 127209, 209756, -3376, -232126, 253166, 465545, 285896, 244633, -38557, 21023, 30625, 135078, 150322, 149417, -109176, -165316, -170911, -198747]
7222a98747N1594K82629m1896k49062J4482K04925k94292K46282j48488k03729
7212c36302L21392k05164O7174J12634N5181j51361P1765J5704q3568J91626M924
7201F4005j39540k59492n913K23191n7644J31084j89996o9610J95398l4670k849
7190a46036l4343M5560J79244J99836M8058l29842l2999k156j12829M0882l1264
7179a75889p2585p2866J07677K41478O8069r4230n5244K50346j31185m1872o0531
7168c6832j89789P1305J53773j00684J04797J00199K44974o3733j81667j03896
7158a553k14325K2025r625K21560K45640o1866r3189J8511k13361K15116L05360
7147D34293J83817j07488j453j76826k25780r3166k14082M0283K2583N6880m0296
$$ y = [-198747, -147153, 135476, 93580, -155482, -141000, 63925, -230367, 15915, -132573, -336302, -14910, -220074, -152900, -40266, 14915, -136446, -64681, -48977, -132545, 59081, 64005, -75535, -335027, -340940, -117749, -175393, -44309, -234305, -303915, -108517, -143187, -146036, -180379, -134819, 44425, 244261, 292319, -37523, -70522, -72678, -185507, -144625, -175889, -248474, -321340, -213663, 27815, 95884, 1654, -53590, 196756, 65571, 23699, -36832, -226621, -155316, -1543, -102227, 2570, 102769, 347743, 284010, 102343, -1553, -215878, -193853, -203478, 18082, 263722, 201856, 108667, 127178, -86183, 128933, 434293, 618110, 510622, 509169, 332343, 106563, 13397, -200685, -160402, -137819, -80939, -121235]
7136a21235l89050K86260Q6522l8891K10625j25908p4394p8332j41892l8347K59521
7125a65121J22839M7952m3090j45366J6817K59541k00013J61141Q3354k14299
7115g6245m1495O1808k5636J69002j43333N4082J13593J4297k57488O054J24543
7104h18J49296r665j20284K11447N3647k53350K3069l06857k15281J91436L19093
7093D1733L877j76432J83402J00529k2719j54907J58609n2059J03850j19826k34310
7082a68253J35927l8230L1326J02474P2738o2614k08021J54930m021j68982j19585
7071b72311M86735r2115k08902J42563K9609n9667p1770j98316K1335K21137j32719
7060a34421j95647J67478j68504J26074m6108K17702l299J09099P3992j995k05316
$$ y = [-121235, -510285, -224025, -137503, -176394, 34231, -91677, -166071, -244403, -386295, -424642, -165121, -42282, 5670, -37420, -182786, -165969, 93572, -106441, 54700, 138054, -76245, -117740, -55932, -81568, 87434, -55899, -1817, 111776, 126073, -131415, -125361, -818, 148478, 138813, 18529, 229976, 283623, 30273, 53342, -253515, -468796, -277360, 41733, 45610, -130822, 52580, 153109, 130390, -24517, 134092, 82033, 185883, 66057, -168253, -32326, -70556, -39230, 63244, 135982, 73368, -134653, 20277, 16256, -152726, -272311, 214424, 122309, -86593, 55970, 85579, 25912, -45858, -244174, -222839, -1702, -134421, -330068, -162590, -331094, -205020, -251128, -33426, -36725, 72374, 146366, 144371, -60945]
7049f0945j17779K40008j02142l29j8042j30351R9148M0248n4649m3309Q8586
7038e9556n425K12876k04705j35258P2859O5554j00455O0320J26019l52675J52244
7027a68202n2279K53424K06128M2367j32089j79233j94548J66972K70425K25785
7017D38750j2551j99586L5396J61527K234J63265j74977k972j83159J43212J37720
7006E08859J30768m8385o450m8140l12652n1396J63764P868l14803J23996J29371
6995B82800k40757P87P5786L1080k3240n7810K43018p435n5685m2647Q5529M387
6983B95813l57941j05451K63093p1397J64862r2162j91336J44465J1036q4335
6973b3353P6692J3503j56742J26182k8623K1811k43077L1426Q7206k2695J17049
$$ y = [-60945, -178724, 61284, -40858, -41187, -59229, -189580, -90432, -50184, -104833, -148142, -59556, -64981, 147895, -56810, -192068, -119209, -53655, -154110, -93790, 32229, -320446, -168202, -220481, 32943, 239071, 281438, 149349, -29884, -224432, -57460, 212965, 438750, 426199, 226613, 262009, 423536, 425770, 589035, 414058, 411086, 227927, 371139, 508859, 639627, 591242, 584792, 536652, 224000, 172604, 336368, 344236, 29433, 153429, 282800, 42043, 42830, 118616, 149696, 126456, 68646, 311664, 304229, 248544, 205897, 291426, 295813, -62128, -167579, 95514, 24117, 188979, 96817, -94519, 49946, 60982, -23353, 53339, 66842, -89900, 36282, 7659, 29470, -213607, -182181, -94975, -117670, -621]
6962f21l7415K22673J20011R5801r4507l23255l2373J29661J07245k18247J24854
6951I3827N6993P500o3653j04463J60255J40318j80858r7505L19711j14667m152
6940B13306R3751k3852k9061j55470n7669l0587K6308O0833L9812j2243k62880
6929a37752o80K09132J00110p532K01305j92952j86348P7968O575K3673K2811
6918A16310K2614j20045q3205J65813j21395l3568K18770J39607k17906l3054
6908E3941j9136j51033M482K22785J85402k10816J03803O8588J75477j80363n75479
6897c22349O4273L28286P1172J14716J38458p2922j05031L2788R8730k22149j50825
6886b4853R1178J32391J90860p7011J86799N0272j25227l6069Q0803m6896k72960
$$ y = [-621, -38036, 184637, 304648, 400449, 305942, -17313, -49686, 79975, 187220, -31027, 93827, 150820, 158320, 94667, -9796, 150459, 290777, 109919, 12414, 332125, 217458, 213306, 307057, 283205, 254144, 98674, 41005, 10418, 36726, 97559, 137371, 125128, -137752, -138432, 70700, 170810, 163278, 364583, 171631, -14717, 63251, 69826, 93499, 116310, 138924, 18879, -64326, 101487, -19908, -53476, 165294, 304901, 86995, 53941, 34805, -116228, -111746, 111039, 296441, 85625, 189428, 258016, 433493, 253130, -322349, -258076, 70210, 141382, 256098, 394556, 321634, 216603, 249391, 348121, 125972, -24853, 66325, 198716, 389576, 312565, 499364, 549636, 424409, 388340, 469143, 422247, 149287]
6875A49287k54062R1075K25369l16764M6700L202K50639K7894P7429J50189l41467
6864A09491n8568K026J06647P6668r162J62300O9413k04135j18353N5446j21722
6853G0051k06779J60980J28268j8529M9071l2636R2288Q5651m4823q67R9832j3212
6841C69295K4505J8373q576P9569j87365n5193O3973j76919m5974J14945j46849
6830D9784M5082R8313Q1276M412J36065k594o3243k92489m4085J96607K8653j27604
6818A10177N487J49544J25850j86057o500J1417O2565K16605j69332k24613K68812
6807C63955j48951p7026K47238Q5472j94896j53404J04292o3690R5758r7708J70888
6796C31928j1639K50355N0182j42203J15898q811k18010p9468K24681q9354m04283
$$ y = [149287, -104775, -13700, 211669, -105095, -58395, -55193, 195446, 223340, 300769, 450958, 109491, 50923, 52949, 159596, 236264, 227102, 389402, 458815, 254680, 136327, 191773, 70051, -136728, 24252, 152520, 133991, 183062, 150426, 242714, 328365, 283542, 282675, 382507, 369295, 393800, 412173, 403597, 483166, 295801, 240608, 304581, 127662, 81688, 196633, 49784, 94866, 193179, 274455, 278867, 414932, 412338, 349095, 56606, 12521, 209128, 237781, 110177, 115664, 265208, 391058, 205001, 198501, 209918, 272483, 489088, 319756, 95143, 363955, 215004, 137978, 385216, 470688, 275792, 122388, 226680, 162990, 258748, 161040, 331928, 320289, 570644, 620826, 478623, 594521, 585710, 367700, 288232, 512913, 423559, 19276]
6785A9276L77691J66354O4479n5507K12383K47839l11390j97566P6376J10845
6775G10780K81022k03651l50387O8535r8969J62909K23332J61141j8923J9035
6765I54824K12148q3656R3361J85485J35820M891p8972r5513p9095n9613L90022
6754A579702K76699l42702n16060o70K32007n7875M18306J07614r5974j08083
6744A492964P0308n7209M0596k1900j08229j10301J32788J53208k33681P4945
6734A433489O3210K53339J49197K261J04752j9536l34900k37027P5831J92308
6724A682924P7573J27983J35608o5109J05595m0173P3111J46048O5972r300J74180
6713B474412J92796K65198L90947L59499O32567P08645K80298N40113O71187R99521
$$ y = [19276, 396967, 563321, 627800, 572293, 784676, 1032515, 721125, 523559, 599935, 710780, 991802, 788151, 437764, 506299, 407330, 570239, 793571, 954712, 935789, 954824, 1166972, 1083316, 1176677, 1362162, 1497982, 1502873, 1423901, 1328388, 1249293, 1189680, 1579702, 1856401, 1513699, 997639, 996969, 1228976, 1171101, 1589407, 1697021, 1601047, 1492964, 1563272, 1506063, 1546659, 1524759, 1416530, 1306229, 1439017, 1592225, 1358544, 1433489, 1496699, 1750038, 1899235, 1901496, 2006248, 1986712, 1651812, 1414785, 1490616, 1682924, 1760497, 1888480, 2024088, 1958979, 2064574, 2024401, 2097512, 2243560, 2309532, 2300232, 2474412, 2667208, 2932406, 3323353, 3682852, 4315419, 5024064, 5304362, 5844475, 6515662, 7515183]
6703G515183J156556J095579J572394J436677J362037J535459J317234R52311
6695A7943430M16673j88431K269o18450j002794j124650j234901r35164j478924
6686A1779058j333950j287513p94547r00584j031308q49140n02039l80671n74318
6677D124988m78482l07511j31725l02879m21261N0323p2547j75770j47625l39686
6667A797825K48923r231l89612N4821K1989j78408O2285p5610j62566r7170N1988
6656A325234p1371m9558j37926J68530n8531l7375L65705j70395k10443k9215
6646A094655o4075k28227P8091L3658J53188j59962J48039l5061j20555J3310
6636I13061k04944j48059P7475K45324j36710K39170k9044m2130j47030j53154
$$ y = [7515183, 8671739, 9767318, 11339712, 12776389, 14138426, 15673885, 16991119, 17943430, 18360103, 18171672, 18173941, 17555491, 16552697, 15428047, 14193146, 13257982, 11779058, 10445108, 9157595, 8363048, 7462464, 6431156, 5582016, 5079977, 4699306, 4124988, 3646506, 3338995, 3207270, 2904391, 2483130, 2533453, 2460906, 2285136, 2137511, 1797825, 2046748, 2037517, 1647905, 1702726, 1724715, 1546307, 1608592, 1532982, 1370416, 1273246, 1325234, 1253863, 1204305, 1066379, 1234909, 1176378, 1139003, 1504708, 1334313, 1123870, 1094655, 1030580, 802353, 880444, 914102, 1067290, 907328, 1055367, 1020306, 899751, 913061, 708117, 560058, 637533, 882857, 746147, 985317, 956273, 914143, 767113, 613959]
6626F13959k1386o9296N2085j4057j03929J03519J95166K07256q7685j35313K21796
6615I62115J40612o5027N1481l15112j325J74668L7497j13991J84231m7307k35611
6604G72231m440N14269J3090Q1938Q8426n1556K20946j75308K00677K03835M3347
6593A907455Q7687k1788K14820K10711L07865P6572L11182M49019Q3128N16581
6583D143232K61581K22938K27980K49302J53416K82707J65961j39369m69645k48104
6573D849999k44482l45636K82660m70555n65633k38857l40607l5535j24916N3527
6563B819965K15352l43382j50558l30146m16076J53774P477j18265l09640J05268
6553A633769j1401j91209J5483k60242l10311L41292K4549o915j12329j59928
$$ y = [613959, 592573, 523277, 575362, 561305, 457376, 560895, 756061, 963317, 875632, 740319, 962115, 1102727, 1037700, 1089181, 774069, 772744, 947412, 984909, 870918, 1055149, 1007842, 772231, 767791, 1282060, 1295150, 1377088, 1465514, 1413958, 1634904, 1459596, 1660273, 1864108, 1907455, 1995142, 1973354, 2188174, 2398885, 2706750, 2783322, 3094504, 3543523, 3626651, 4143232, 4404813, 4627751, 4855731, 5105033, 5258449, 5541156, 5707117, 5567748, 5098103, 4849999, 4605517, 4259881, 4542541, 4071986, 3506353, 3267496, 2926889, 2891354, 2766438, 2819965, 3035317, 2691935, 2541377, 2211231, 1795155, 1948929, 1956406, 1838141, 1528501, 1633769, 1622368, 1431159, 1446642, 1186400, 876089, 1217381, 1241930, 1235015, 1122686, 962758]
6543I62758j10687P9189J39174j95659k02186O0782J06011l19454J3276q3656
6533D49548O5378K4516n432J70905j0964o944L4169j50166K8239O8596J14734
6522G82579M1435j52957j27211k48476K24454J4374J51319k260l04688j00896
6512B77673K26496j22256k07898J71485j09310k41662J36038K07796K95115o4583
6502E68894r6689q3665N2461l9308l40592L02J19699K10545j70286L09902r1079
6491D40184k95065M3926j06651K38222K8156m1499P0185J75395l3594J31031k74727
6480C75563m6159J27437Q6247j12855j27803M615q4294J77171J7570p9502J16012
6469D54002Q3228j33330j09860k12770J32342R2544n2725M9968M9941l9734J10427
$$ y = [962758, 852071, 931260, 1070434, 874775, 672589, 733371, 839382, 519928, 533204, 449548, 514926, 539442, 534010, 704915, 693951, 687007, 721176, 571010, 599249, 667845, 782579, 824014, 671057, 543846, 295370, 519824, 534198, 685517, 683257, 378569, 277673, 504169, 381913, 174015, 345500, 236190, -5472, 130566, 338362, 633477, 568894, 472205, 388540, 441001, 401693, 61101, 61403, 181102, 391647, 221361, 531263, 440184, 145119, 189045, 82394, 320616, 348772, 307273, 377458, 552853, 519259, 650290, 375563, 329404, 456841, 543088, 430233, 302430, 307045, 222751, 399922, 417492, 337990, 454002, 537230, 403900, 294040, 81270, 213612, 306156, 253431, 303399, 353340, 313606, 424033]
6458D24033K15198J2322l81016J20090P3313r2511J81879J16500j96747m0030
6448D33031o6125J15941K48525R9391L0853J06663n0878N7965K2815J58684j5516
6437A141349k00790Q1486J18063j09000l2675J94975M7010M3154n7357p5949J26282
6426A276548j0058r0917o641q0629j13195j79339J1728k3327N6986q0995q6432
6415F73729j18851K72170K92749k34125p9764J79913O8172j95545m701j08670
6405G45077k38138j59661J93454L7072l70149K87895p9721j8899L26485K3203
6395G46618j09163k0482R8825K16191R4631O8779O7129n27696R6311L53265K2663
6384A107071j05206K1019j8876K33747Q282J2016J64737k14431O46K67547k70738
$$ y = [424033, 639231, 651553, 270537, 390627, 463940, 371429, 553308, 669808, 473061, 433031, 366906, 482847, 731372, 830763, 861616, 968279, 917401, 975366, 998181, 1156865, 1141349, 940559, 1022045, 1140108, 1031108, 998433, 1193408, 1240418, 1283572, 1226215, 1150266, 1276548, 1266490, 1175573, 1168932, 1088303, 975108, 795769, 807497, 784170, 841156, 760161, 673729, 554878, 827048, 1119797, 885672, 805908, 985821, 1053993, 858448, 853747, 745077, 506939, 347278, 540732, 577804, 207655, 495550, 415829, 396930, 723415, 746618, 637455, 616973, 715798, 931989, 1026620, 1095399, 1162528, 634832, 731143, 1084408, 1107071, 1001865, 1022884, 1004008, 1237755, 1246037, 1258053, 1422790, 1208359, 1209005, 1476552, 1205814]
6373A205814l31001L6942n1997L58698j49923j99210j29363l4149P5847J88183
6363I69841N8687r9416k8945O8898M0327q782j64425k64508K45561O9049j03154
6352G83133R1582j21846L0836J86545J03861L19248j24271J18284j14324r5646
6342A177402M022p9348Q2398J2440J50256j30863k5896P0335r9544j35361j48601
6331H77240P2082J02007j1159Q1851K48138j28217r6242J66896p0386J58926K05966
6320A607102k11739j40937K39639L8475J90293M4950j56671Q2721J43069N5727
6310A892629J85688J64020Q9517k3089j06086K75663j60063o2889N596O4303K72153
6299B597442L30425N92634J8722K81726k994j21007l24351k96008k19321n48233
$$ y = [1205814, 874813, 911755, 859758, 1218456, 1068533, 869323, 739960, 705811, 781658, 969841, 1028528, 929112, 900167, 969065, 1009392, 1000610, 836185, 571677, 817238, 886287, 783133, 874715, 752869, 783705, 970250, 1074111, 1393359, 1269088, 1387372, 1273048, 1177402, 1181424, 1102076, 1184474, 1196914, 1347170, 1216307, 1190411, 1260746, 1161202, 1025841, 877240, 949322, 1051329, 1040170, 1122021, 1370159, 1241942, 1145700, 1312596, 1242210, 1401136, 1607102, 1395363, 1254426, 1494065, 1532540, 1722833, 1767783, 1611112, 1693833, 1836902, 1892629, 2078317, 2242337, 2331854, 2308765, 2202679, 2478342, 2318279, 2255390, 2260986, 2325289, 2597442, 2927867, 3520501, 3539223, 3820949, 3817955, 3696948, 3372597, 3076589, 2857268, 2309035]
6289B309035k38978O0219Q6991K19616j30431O2033N3336l42456K72461j28653
6279B223173j03036N6493L01741K40502J535k7222J44868K60975K67479L97545
6269C764053N74837Q21641P88992J061038R47920J88292q121l72624n24055m54094
6259F787879q54108m82745o41479p80328l05653N666j65894r9679M7521J76505
6249C687685j47533j81839o1836Q2312j81393L2517J43728J32191R7457q177L49007
6238C944119L16118N23209N55134R39254Q88657O76173L42205K2971N1612m63531
6228G795921l88814l52933o99371n93479j30022l70625l44988j18368k81621j04270
6218D411430K1655j32149m24999J15019J27982q3178k10575o970K02371N4414
$$ y = [2309035, 2070057, 2130276, 2217267, 2436883, 2306452, 2368485, 2421821, 2079365, 2351826, 2223173, 2120137, 2176630, 2478371, 2718873, 2720408, 2693186, 2838054, 3099029, 3366508, 3764053, 4338890, 5160531, 5949523, 7010561, 7958481, 8146773, 8138652, 7766028, 7241973, 6787879, 5933771, 5451026, 4809547, 4029219, 3723566, 3729232, 3563338, 3463659, 3511180, 3687685, 3540152, 3358313, 3296477, 3378789, 3197396, 3229913, 3373641, 3505832, 3603289, 3595112, 3944119, 4260237, 4783446, 5338580, 6277834, 7166491, 7842664, 8184869, 8207840, 8259452, 7795921, 7407107, 7054174, 6354803, 5761324, 5631302, 5260677, 4915689, 4797321, 4515700, 4411430, 4433085, 4300936, 3875937, 3990956, 4118938, 4035760, 3825185, 3818215, 4020586, 4075000]
6208D075000j10650J59985N4479K51839L38379P8550J73993K87353L59007j8621
6198E649314P0033P3249P5790J82243J88786l39759J4902J84538j84642J14217
6188F028671J59870J73347k26194o9114j96555J3540J53722j64863p9868j37005
6178E655551j84817p8452R327j53509j4821n6797R3587L42617j00459k49894k0190
6167E242143L2756K74578M12981J82907K61346j06274M19355K80983K35620N63085
6157G799480L80260M77367P38336O46994N81767J14163J03911K84484M7292N7987
6147A1232041J82915J48100L37828N70545M96304P30493O78085P13820P84049
6138A5874180J021702J012857J531544J984814K069598K345703K564388L476471
$$ y = [4075000, 3964350, 4124335, 4178814, 4430653, 4769032, 4847582, 5021575, 5308928, 5667935, 5649314, 5719347, 5792596, 5868386, 6050629, 6239415, 5899656, 5914558, 6099096, 5914454, 6028671, 6188541, 6361888, 6135694, 6066580, 5870025, 5883565, 6037287, 5872424, 5792556, 5655551, 5470734, 5392282, 5401609, 5248100, 5233279, 5176482, 5270069, 5612686, 5512227, 5262333, 5242143, 5274899, 5549477, 5962458, 6145365, 6406711, 6300437, 6719792, 7000775, 7236395, 7799480, 8179740, 8657107, 9395443, 10042437, 10624204, 10738367, 10842278, 11126762, 11174054, 11232041, 11414956, 11563056, 11900884, 12471429, 12967733, 13698226, 14376311, 15090131, 15874180, 16895882, 17908739, 19440283, 21425097, 23494695, 25840398, 28404786, 31881257]
6130C1881257L968752M872206O365783Q053996J0085411J2404742J3346381J2714425
6122A03692953J0608042O970854L686458P68166j228240k400855j327038M05378
6114A21175718K198641L943171M375232K787631M04802l078715o186268q270227
6106A17349985r922497j0349285j0612097j0275282r716035q593525p476336o632475
6098D3772453n055804m281937l355367l120158k675963k107503k069775j440736
6090A9665210j288476j234567j059244q64687q01506r23367q71578o01159k87172
6081A1733454m64584m38454o56215l97114l91945o03607l8404k18957l09381l02404
6071G912389k79773k81425k26706l90446k48515o9598k53365r6865J33300k57269
$$ y = [31881257, 35850009, 40722215, 47087998, 55141994, 65227405, 77632147, 90978528, 103692953, 114300995, 121271849, 124958307, 125726473, 124498233, 122097378, 120770340, 121175718, 123374359, 127317530, 131692762, 134480393, 134885195, 131806480, 125620212, 117349985, 107427488, 97078203, 86466106, 76190824, 66474789, 57881264, 50404928, 43772453, 38716649, 34434712, 31079345, 27959187, 25283224, 23175721, 21105946, 19665210, 18376734, 17142167, 16082923, 15218236, 14416730, 13493363, 12621785, 12020626, 11733454, 11268870, 10830416, 10174201, 9777087, 9385142, 8781535, 8743131, 8524174, 8214793, 7912389, 7632616, 7351191, 7124485, 6734039, 6485524, 6415926, 6162561, 6065696, 6198996, 5941727]
6061E941727l06176j99181o3193P5866n712j57078r5614j31099k67670J25699
6051D917569k06295k82435p9750j10051k77183q472o2018j78474l4217l0111Q2803
6040C731366Q3524k10605k35653O3673j41363l19542k967k09138K02208L17952
6030C279455m7157k60865L6635L9657k42402k36078P9589J77956M4960N887m2797
6019B834840j53545j94736j1134J03455Q9415j72020K19551L1938o3439J8204
6009B702529L8120j31316Q3713Q2278M7196J56012k53889N2956J68637k07234
5999B739002j3912j00376J08125j12574J60225J688M2887l758J6732Q1217J67031
5988C086287N7534q8497Q3437M15387M65427N74472R10902N42517K60874q6616
$$ y = [5941727, 5635551, 5436370, 5373177, 5449043, 5443331, 5286253, 5190639, 5059540, 4791870, 4917569, 4711274, 4428839, 4349089, 4239038, 3961855, 3953383, 3891365, 3712891, 3678674, 3648563, 3731366, 3814890, 3604285, 3368632, 3432305, 3290942, 2971400, 2968433, 2759295, 2961503, 3279455, 3232298, 2971433, 3008068, 3047725, 2805323, 2569245, 2648834, 2826790, 2871750, 2877637, 2834840, 2681295, 2486559, 2475425, 2578880, 2668295, 2496275, 2715826, 2747764, 2684325, 2702529, 2740649, 2609333, 2693046, 2775324, 2822520, 2978532, 2724643, 2777599, 2946236, 2739002, 2725090, 2624714, 2732839, 2620265, 2780490, 2782178, 2825065, 2821307, 2838039, 2919256, 3086287, 3143821, 3055324, 3138761, 3554148, 4019575, 4594047, 5504949, 6047466, 6308340, 6221724]
5978F221724l3036m14004m15884o40437m05337m08337n21318p7929j05528j70225
5968C029689l20170j42875L9413K31503j4014j25161O3200J47004M8144N547k22159
5957B740121L5563J41532L38104j4564l35738R8014k72425N9189K7061K46341
5947C063198K02171Q9017N1008J8796m625M371m4585K66967M9255J8706j0077
5936C704202L9619J66957J05707K17211J32118K90237o8124N81823K37968K65251
5926E672969J63407j82402o0642L03796j22893j92900m6142j06888k35507o6696
5916E126102J94209k4704K19720L03127P94024N39726j13271K2986K75615O1921
5906G399455O9388K74386K55064L82421L76516K25991N90877P94466J098914J851704
$$ y = [6221724, 6188688, 5774684, 5358800, 4718363, 4313026, 3904689, 3383371, 3305442, 3199914, 3029689, 2709519, 2566644, 2606057, 2837560, 2823546, 2698385, 2761585, 2908589, 2956733, 2962280, 2740121, 2775684, 2917216, 3255320, 3240756, 2905018, 3003032, 2730607, 2789796, 2816857, 3063198, 3265369, 3354386, 3405394, 3424190, 3419565, 3423936, 3379351, 3646318, 3695573, 3714279, 3704202, 3743821, 3910778, 4016485, 4233696, 4365814, 4656051, 4587927, 5169750, 5407718, 5672969, 5836376, 5653974, 5593332, 5897128, 5774235, 5581335, 5535193, 5428305, 5192798, 5126102, 5320311, 5295607, 5515327, 5818454, 6612478, 7152204, 7038933, 7061919, 7337534, 7399455, 7468843, 7743229, 7998293, 8380714, 8757230, 8983221, 9574098, 10368564, 11467478, 13319182]
5896A3319182J612333J343257J063755J033585J65116n01772m65964q06862K32332
5887A6994962O52743N38608J256108O77961L95304Q84459P92356K036867L536829
5878B7766197M996087M660215K962303O69185m05935j476876k577279k522538
5870C4071359k016486j452299r93893j54554J679823L928821N601887O799918
5862D7464576O143141L068168J65419j805899l268653m471721m529354m476741
5854C8288936m206034l741762k928617k395465j608319j201093m46017l29341
5846B1432288R6597K92848O28715P61292J024329J323543J142695J457366J518955
5837B9678628K066485K254435K560904K823761L827755M734960N335411P133502
$$ y = [13319182, 14931515, 16274772, 17338527, 18372112, 18537228, 18035456, 17569492, 16762630, 16994962, 17647705, 18186313, 19442421, 20120382, 20515686, 21400145, 22192501, 24229368, 27766197, 32762284, 37422499, 40384802, 41053987, 40648052, 39171176, 36593897, 34071359, 32054873, 30602574, 29608681, 29454127, 31133950, 35062771, 40664658, 47464576, 53607717, 56675885, 56841304, 55035405, 51766752, 47295031, 42765677, 38288936, 34082902, 30341140, 27412523, 25017058, 23408739, 22207646, 21761629, 21432288, 21528885, 21821733, 22450448, 23211740, 24236069, 25559612, 26702307, 28159673, 29678628, 31745113, 33999548, 36560452, 39384213, 43211968, 47946928, 53282339, 60415841]
5829F0415841J0039997J4158088K2326476L6107681N3611226O6323531O5615156
5822C28597996M4520367J4280667o386535j9937654l5720447m1729678m0532875
5815B43091841l8281318l4790844l0767323k7156371k2068475j5632918j0709299
5808F3685293q183639o757077n331657m746348l755847l106418k195435j685315
5800B7923557j379113j183657p40160m84762l80925n4755o737O27237J324215
5791B5644900K496409M270496N012857M765104L012875P23600j275695k175071
5783D2475475l861093m179223l420141l323902l295780k962047k207720j918743
5775A7306826j721083r74307p91952n44259o54578m71182m24591j57173l28278
$$ y = [60415841, 70455838, 84613926, 106940402, 143048083, 196659309, 262982840, 328597996, 373118363, 387399030, 381012495, 361074841, 325354394, 283624716, 243091841, 204810523, 170019679, 139252356, 112095985, 90027510, 74394592, 63685293, 55501654, 48744577, 43412920, 38666572, 34910725, 31804307, 29608872, 27923557, 26544444, 25360787, 24620627, 24135865, 23754940, 23700185, 23693448, 24320685, 25644900, 28141309, 32411805, 37424662, 42189766, 45202641, 45926241, 44650546, 42475475, 38614382, 34435159, 31015018, 27691116, 24395336, 21433289, 19225569, 17306826, 15585743, 14611436, 13819484, 13275225, 12620647, 12149465, 11724874, 11567701, 11239423]
5766A1239423L6934j09560J28914O23926M83989J56914K32077j36583l19417m46551
5756A1890066k95223k80310R2870R0950J15209M50172N77171J055213J512657
5747A5208775K899107M052909N798302O439244O012805L944572J728550p15624
5739D5368640k479535l955730m369995m263901l924294l693323l386601l173936
5731A6121325k365347j895978j218065r67705q08342n37158o16117l29003k13763
5722G169847n40085k97226l28299j96648j64621j62965k97412l15893j36186k35835
5712D494677K10009K10084k95800J28619K87771J82848M29495K17055J77233q5788
5702E956203j28787l81212j69948k23899l50323n21150k51166j54303o3085m52122
$$ y = [11239423, 11276357, 11166797, 11295711, 11919637, 12403626, 12560540, 12792617, 12656034, 12336617, 11890066, 11594843, 11314533, 11407403, 11498353, 11613562, 12063734, 12640905, 13696118, 15208775, 18107882, 22160791, 27959093, 34398337, 40411142, 44355714, 46084264, 45368640, 42889105, 38933375, 34563380, 30299479, 26375185, 22681862, 19295261, 16121325, 13755978, 11860000, 10641935, 9674230, 8865888, 8328730, 7712613, 7383610, 7169847, 6629762, 6332536, 6004237, 5807589, 5642968, 5480003, 5182591, 4866698, 4730512, 4494677, 4704686, 4914770, 4618970, 4747589, 5035360, 5218208, 5647703, 5864758, 6041991, 5956203, 5827416, 5446204, 5276256, 5052357, 4702034, 4180884, 3929718, 3775415, 3712330, 3260208]
5692C260208j34606l50466J96702k0828N047K3765k31392L2921m2752l2457k50597
5681B455545K23774K48752J41447n5805j20454r7046J89849M6915M7985M27639
5671C508601k8884l73376k49061K46270M1478J21500j38601l69091n7910K8263
5661B729189j03506j05461m7061j5505r1496k63895j9676l00124l1851M7436q371
5650A789679k34804K63843k61833j46955K75158j97292q6947N0228K5369J3648
5640A490094p1552j73075j36319J97911L7558M1774K1312o9831j48126J21698
5630A311444r304l41758j36686K15747J94629j8099J41676p2570j84850n0227
5620A050002M411R812J58761K05485o6034L3886r4414o7268m8791n987J94065
$$ y = [3260208, 3125602, 2775136, 2971838, 2951010, 2956057, 2979822, 2748430, 2781351, 2738599, 2706142, 2455545, 2679319, 2928071, 3069518, 3013713, 2893259, 2796213, 2986062, 3032977, 3080962, 3508601, 3479717, 3106341, 2857280, 3103550, 3145028, 3266528, 3127927, 2758836, 2700926, 2729189, 2625683, 2520222, 2473161, 2457656, 2366160, 2102265, 2082589, 1782465, 1750614, 1798050, 1789679, 1554875, 1818718, 1556885, 1409930, 1685088, 1487796, 1400849, 1451077, 1476446, 1490094, 1418542, 1245467, 1109148, 1307059, 1344617, 1386391, 1407703, 1337872, 1189746, 1311444, 1302140, 960382, 823696, 1039443, 1234072, 1215973, 1357649, 1285079, 1100229, 1050002, 1054413, 1064225, 1222986, 1428471, 1362437, 1396323, 1301909, 1234641, 1185850, 1179863, 1373928]
5609A373928j79600q5750J30336L51712K03669q6104k30697l064k61397r0975
5599A122058p5435J55965l5951j8157P1680k70126p1892l09358K96605J90458
5589A055847l0687J30260n2998j20692j79467J34476k59143K6589l9348k99187
5579C65650J14837J8629O5465J63597n6690Q812j37543J83427r7549p8005K36633
5568G87263O6233n2505J72994o2619L0141n8768j61589L4382J16343j92238K41771
5557I21408m4193k5852J35793J75940O9508m2054P7733Q7228K18431P5411J44331
5546A793684k9114k46757j08393o9633j30693M2906K98474J75269j5069J17572
5536A828246J70840K38802K21726M61629R1529M88585L8238Q0396N4398K6021
$$ y = [1373928, 1194328, 1108578, 1238914, 1590626, 1794295, 1708191, 1477494, 1474430, 1213033, 1122058, 1046623, 1202588, 1166637, 1148480, 1220160, 950034, 878142, 568784, 865389, 1055847, 1025160, 1155420, 1102422, 981730, 802263, 936739, 677596, 704185, 664837, 365650, 480487, 499116, 564581, 728178, 671488, 680300, 542757, 726184, 628635, 550630, 787263, 853496, 800991, 973985, 911366, 941507, 882739, 721150, 755532, 871875, 679637, 921408, 877215, 851363, 987156, 1163096, 1232604, 1190550, 1268283, 1355511, 1573942, 1649353, 1793684, 1764570, 1517813, 1409420, 1339787, 1209094, 1252000, 1550474, 1725743, 1710674, 1828246, 1999086, 2237888, 2459614, 2921243, 3012772, 3501357, 3539595, 3619991, 3674389, 3700410]
5526C700410m43856l07636l32787j75511j70956j96065k38360l85830o6683j66320
5516A216406o4510l1347q1637Q7831o3163l6273N6604r5845l5917p7688J45310
5505A019771K19132k65134j0663p2604J14952r6810J79014j1035q0417M0791J25737
5494A162734J9556Q5259P9986M1177M11216J59678K71618L96251K44013j29365
5484B742123J08487k84482j26927P6028j34361r2126K10118N2104k73338j02417
5474B175209j42421j37692o1544K4744J50960k54173m34697k97153l1354J32451
5464A124330J83628N0273l76796n26536J82583L0576J134M9799n8493Q7185p2596
5453F75087J01350k3606m1815J31195k8067k71140m5929l79513O966K83183l0462
$$ y = [3700410, 3256554, 2948918, 2616131, 2440620, 2269664, 2073599, 1835239, 1449409, 1382726, 1216406, 1151896, 1120549, 1038912, 1126743, 1063580, 1027307, 1083911, 988066, 952149, 874461, 1019771, 1238903, 973769, 963106, 890502, 1005454, 908644, 1087658, 1076623, 996206, 1036997, 1162734, 1182290, 1267549, 1347535, 1388712, 1799928, 1959606, 2231224, 2627475, 2871488, 2742123, 2850610, 2566128, 2439201, 2515229, 2380868, 2288742, 2498860, 2550964, 2277626, 2175209, 2032788, 1895096, 1833552, 1858296, 2009256, 1755083, 1320386, 1023233, 991879, 1124330, 1307958, 1358231, 981435, 454899, 637482, 668058, 669192, 718991, 660498, 747683, 675087, 776437, 752831, 711016, 842211, 814144, 543004, 497075, 117562, 124528, 407711, 377249]
5442C77249J87917L7203j54086N2110P9091j92311k48344K46718r5777J0579P2963
5431C73312j41513L5000Q5365K40342L35997k42826l44349J02775J40854l22941
5421B62016j27329L58568j23074p7188j72800K42350L46632J7962m48068J50643
5411D29712R0066j09201J62068K59819l91426j58325J59164o9782O8041j86659
5401B53477N193K80833j68388J79732J49374l86607n2812J88738L0805J61711
5391F42056j4469p1540j31520k69191o0729N18074o6611l61811j09525J37345
5381B12079J0763Q5763m0462q7664Q845K67556M8484m7740L1596J30419o0105
5370E59534j04599k6382j88949O4215O0J37951q1561q3195J89806r450N1374k4338
$$ y = [377249, 565166, 602369, 448283, 500393, 579484, 387173, 138829, 385547, 289770, 300349, 373312, 231799, 266799, 352164, 592506, 928503, 685677, 341328, 444103, 584957, 262016, 134687, 493255, 370181, 292993, 120193, 362543, 709175, 727137, 279069, 429712, 519778, 410577, 572645, 832464, 441038, 282713, 441877, 372095, 440136, 253477, 258670, 539503, 371115, 550847, 700221, 313614, 260802, 449540, 480345, 642056, 627587, 556047, 424527, 155336, 94607, 612681, 546070, 184259, 74734, 212079, 222842, 308605, 268143, 180479, 189324, 456880, 505364, 457624, 489220, 619639, 559534, 454935, 428553, 239604, 303819, 303879, 441830, 360269, 277074, 466880, 457430, 508804, 484466]
5358D84466j27400J96682k00402J58965Q010k81839q6556N250K37283J04259l06346
5347A92372N3203J06554O3443l31602j56426N1093K70346N2251k6240K16601K06896
5336F98491k69404L7492M4259j38583k04781J20355J73319Q4458k88070j99289
5326E8247J72956k17654K97040N2440r8344p458j8776k0529k79483J06501K798
5315D7738N7717P1200N3853M3147O3145K22540m7918k84273j4065j17502L41983
5304D37565R7118k80968j7529k10536K40459J75157l34836j07230L70190N0744
5294D20134j47553J7207J38346K68123J60772k42812j57455P6535p550j89626
5284C36121l6753R1327m5783M6208N8653J49572j50779K29696K5454j03717l7914
$$ y = [484466, 357066, 553748, 353346, 512311, 520321, 238482, 151926, 157176, 394459, 498718, 192372, 245575, 352129, 415572, 83970, -72456, -21363, 248983, 301234, 274994, 491595, 698491, 429087, 466579, 510838, 372255, 167474, 287829, 461148, 545606, 257536, 58247, 231203, 13549, 310589, 363029, 264685, 257227, 238451, 217922, -61561, 44940, 47738, 105455, 176655, 230508, 273655, 336800, 559340, 511422, 227149, 213084, 95582, 437565, 534683, 253715, 236186, 25650, 266109, 441266, 106430, -800, 369390, 420134, 272581, 289788, 428134, 696257, 857029, 614217, 456762, 533297, 525747, 336121, 299368, 390695, 344912, 391120, 449773, 599345, 448566, 678262, 703716, 599999, 562085]
5273E62085N4882l7899k76421k2917J07345J55977N8868P9544r8916j61575n2925
5262C68048n2315J5477J91333j14175J10478M4704j03249J17204M8032m01910
5252B23627J81364J27612p5902o3685k53649l2717j1638J62800M6353j70161n2689
5241H1315m9364M90850P5799O2972l8396k81228O1294L0111N6113J41661q1358
5230E49769J60244J55679j87473k42849j5299J1778q5466O9739l6313l4575P2807
5219D18041O8540p1699N0326l23829J44753J23605j8759O0644p7342J02872K20234
5208F97386j322j25850M7594L6978J91240N8912j31850j90100J14035l3167O1755
5197G25611j1585j7427k52084K5080J79216o044M5760m0559J60875k41037r371
$$ y = [562085, 616967, 579068, 302647, 279730, 387075, 543052, 601920, 681464, 582548, 420973, 368048, 315733, 331210, 522543, 408368, 518846, 563550, 460301, 577505, 625537, 223627, 404991, 532603, 456701, 393016, 139367, 106650, 95012, 257812, 304165, 134004, 81315, 31951, 522801, 598600, 661572, 623176, 341948, 403242, 433353, 489466, 631127, 549769, 710013, 865692, 678219, 435370, 420071, 431849, 346383, 416122, 379809, 345234, 418041, 486581, 414882, 465208, 141379, 286132, 409737, 390978, 451622, 374280, 477152, 697386, 696064, 570214, 617808, 654786, 846026, 904938, 773088, 582988, 697023, 663856, 725611, 714026, 696599, 444515, 469595, 648811, 642767, 688527, 647968, 808843, 567806, 558435]
5186E58435M5478K12350n4643l85918Q012r2850m1013L68015J92999j07207n998
5175F97660K75404q3878l00900k33762O012P4112o9998K03637L34823R2255l53651
5164F41714j3078O5499L9173j77224J27783O4045m6966N0790J4566k62280j0190
5153D93832m8662J46774J63133p3446l16377J75409N2391O4962J41617k68452
5143E31181J86550J8821R4422j88166R7818J46073J77502k75789J39089r52l09503
5132F17046L66034j28878k13629L24119j51477L4805J30080p5219j19868K64556
5122A047569N7316j16472l0200J11394L0551K09564n6377l57295J06715K16024
5112A218789M470l9484L01898K6904j38415l06076J59820j87205R5340M8722k51266
$$ y = [558435, 603913, 816263, 761620, 375702, 383714, 290864, 249851, 617866, 810865, 703658, 697660, 973064, 889186, 588286, 354524, 360536, 434648, 364650, 568287, 903110, 995365, 641714, 628636, 694135, 733308, 556084, 683867, 747912, 700946, 751736, 766302, 504022, 493832, 445170, 591944, 755077, 681631, 365254, 540663, 593054, 658016, 799633, 531181, 717731, 736552, 830974, 642808, 740626, 886699, 1064201, 788412, 927501, 926549, 617046, 983080, 854202, 640573, 964692, 813215, 848020, 978100, 902881, 783013, 1047569, 1104885, 988413, 958213, 1069607, 1100158, 1309722, 1253345, 896050, 1002765, 1218789, 1223259, 1183775, 1485673, 1512577, 1374162, 1068086, 1227906, 1040701, 1136041, 1184763, 933497]
5101I33497L6335l0249O1615K98139m3700N545N2749J72001J01879J17999j41847
5090A563963n0328j25682l5420n806l88335K32690j08740K82291J36472p3676
5080A427429l11726L15825p582p696j11134j36491l9630J78824l5000r488O3759
5069A327090j69258M27428L3340k58048l4264M405m4528J2479J10814J36065J36077
5058A681600M2097k79680j18040j47365j41097K0420L08640J65339j69355k4063
5048A338496J64668n787j7893k82636O2764J16918N0794k1625l10324j1305R6021
5037A180091N94790L13264l22087J7524p041j83550p7905K36205O9021N3387Q0688
5026A954387L9649j48189K0009j17437k03811K32276j33413j16317J47747q5435
$$ y = [933497, 969832, 939583, 1001198, 1299337, 1255637, 1261182, 1313931, 1485932, 1587811, 1705810, 1563963, 1513635, 1387953, 1352533, 1346727, 958392, 1191082, 1082342, 1364633, 1501105, 1427429, 1115703, 1431528, 1423946, 1416250, 1305116, 1168625, 1128995, 1307819, 1272819, 1263331, 1327090, 1157832, 1585260, 1618600, 1360552, 1326288, 1330693, 1286165, 1298644, 1409458, 1545523, 1681600, 1723697, 1444017, 1325977, 1178612, 1037515, 1057935, 1366575, 1531914, 1362559, 1338496, 1503164, 1497377, 1479484, 1196848, 1259612, 1376530, 1427324, 1405699, 1095375, 1084070, 1180091, 1774881, 2088145, 1766058, 1783582, 1776541, 1592991, 1515086, 1751291, 1820312, 1873699, 1954387, 1994036, 1845847, 1865856, 1748419, 1544608, 1776884, 1643471, 1527154, 1674901, 1589466]
5016A589466q5766L41291J03221P080j18629j72277p7780L4916p0542Q2565J68824
5005A802369j55921j8771R1063k37278o1029K21657k4359M732q8202K43747J28314
4994A906322k2618l9744j38536L5895o6690k27360K78857K17046L7539J76393
4984B157104L6204k16975K8509K58460j73611L32325K51448j0770R5487l78523
4974B379658m5348M7837O7416j54676O1242R3176K16248O040n760l9667K5018
4963B651184L7822k38985m696M00273l1050l39125J25790j11836n9803K08288
4953B637862L45250j55678l10557K67472l37825N2287M51183j32916P8199l339
4943B891938J71716K03208j42222j50075J70189J16030j40077n2352J44869J28693
$$ y = [1589466, 1503700, 1844991, 1948212, 1955292, 1836663, 1664386, 1586606, 1621522, 1550980, 1633545, 1802369, 1646448, 1627677, 1718740, 1481462, 1420433, 1642090, 1617731, 1622463, 1534261, 1778008, 1906322, 1883704, 1843960, 1705424, 1741319, 1674629, 1447269, 1726126, 1943172, 1980711, 2157104, 2193308, 1976333, 2004842, 2263302, 2089691, 2422016, 2673464, 2662694, 2758181, 2379658, 2334310, 2382147, 2449563, 2294887, 2356129, 2449305, 2665553, 2671593, 2665833, 2626166, 2651184, 2689006, 2450021, 2445325, 2845598, 2814548, 2475423, 2601213, 2489377, 2429574, 2637862, 2983112, 2827434, 2516877, 2784349, 2446524, 2498811, 2949994, 2817078, 2895277, 2891938, 3063654, 3266862, 3124640, 2974565, 3144754, 3260784, 3120707, 3068355, 3213224, 3341917]
4933C341917j7473J26261j71550k06469J96766Q2175K45987N1925J10008l446
4923C756101J56669J68372K49950k91080p6239K22171N9965k0845K07280R0172
4913D522516N2667J74239j2335N6910M54292n4083j35910J72711K34902K02314
4903E668223M2803J93395J59759M13333q918K37017K35583K87677K45851K02849
4893G677572L3250K10823M51168L68603J19307L00811L03915M34772M75573N17571
4883A0893365P04186L62760M44625K23069M56886O22371N31036O06603J79574
4874A5024475N12313N94364M10885L09778K00916L45177L22569N00069K62671
4865A8483217K81858M92961K92858M85669O23748R42663O86559O45249J036542
$$ y = [3341917, 3324444, 3450705, 3279155, 3072686, 3269452, 3351627, 3597614, 3649539, 3759547, 3756101, 3912770, 4081142, 4331092, 4040012, 3963773, 4185944, 4245909, 4225064, 4432344, 4522516, 4575183, 4749422, 4737087, 4793997, 5248289, 5194206, 5058296, 5231007, 5465909, 5668223, 5711026, 5904421, 6064180, 6477513, 6468595, 6705612, 6941195, 7228872, 7474723, 7677572, 7710822, 7921645, 8372813, 8741416, 8860723, 9161534, 9465449, 9900221, 10375794, 10893365, 11597551, 11960311, 12404936, 12628005, 13084891, 13707262, 14238298, 14844901, 15024475, 15536788, 16131152, 16542037, 16851815, 17052731, 17397908, 17720477, 18220546, 18483217, 18765075, 19258036, 19550894, 20036563, 20660311, 21602974, 22289533, 22934782, 23971324]
4856B3971324J055007J075646R05400R02937R70797J321804J074530J118771J006574
4847C3402790J546733J281151J411888J166003J235790J287797R66679J217124
4839D3515955R54959R45344O58792N23001R16375J001250L03518P85006J179075
4830E0783275R97397M91465R77538J310297J078606J232356J252653J520501J411662
4821F1055750J300424J791108J469577J698329K085186K149756K110097K010823
4813G5671050J916696J759350K250053K342587K071990J814822J276699L84910
4805H9488157J07324l31778p80588j002777q76796o46270n88074o74455p93520
4796H3901223m05589m45366p84719o49894q19353m72747l75887o10049q45992
$$ y = [23971324, 25026331, 26101977, 27007377, 27910314, 28881111, 30202915, 31277445, 32396216, 33402790, 34949523, 36230674, 37642562, 38808565, 40044355, 41332152, 42298831, 43515955, 44470914, 45416258, 46075050, 46598051, 47514426, 48515676, 48819194, 49604200, 50783275, 51780672, 52272137, 53249675, 54559972, 55638578, 56870934, 58123587, 59644088, 61055750, 62356174, 64147282, 65616859, 67315188, 69400374, 71550130, 73660227, 75671050, 77587746, 79347096, 81597149, 83939736, 86011726, 87826548, 89103247, 89488157, 89595481, 89263703, 88483115, 87480338, 86603542, 85957272, 85369198, 84694743, 83901223, 83495634, 83050268, 82265549, 81615655, 80796302, 80323555, 79947668, 79337619, 78491627]
4787G8491627p52526r10831p44738j073568o54299q99878j098248r84800j248331
4778G0124408j269916j706196j870391j709076j497700j678556j550646j555226
4770E7286701j037930j064582j268181j106777r65649j448372r66329r42822j068307
4761D7417752j109858r10618q85626r09373j223591q65864q68132r59310j072732
4752C8612648j041995j130298r13437o65577o11635q93248q49889p50986q21743
4743C0933840l95293q74311l06411q3065n42208l78765k53544l44202k00769L0701
4733B7585973l92294q0487l3292j51349N4896k6148J38139J77168K66555K67052
4723B7806213N29490R70860R06684O84250J014470R41106J293007J602618J762392
$$ y = [78491627, 77739101, 76828270, 76083532, 75009964, 74355665, 73455787, 72357539, 71372739, 70124408, 68854492, 67148296, 65277905, 63568829, 62071129, 60392573, 58841927, 57286701, 56248771, 55184189, 53916008, 52809231, 51843582, 50395210, 49428881, 48486059, 47417752, 46307894, 45397276, 44511650, 43602277, 42378686, 41512822, 40644690, 39685380, 38612648, 37570653, 36440355, 35526918, 34861341, 34249706, 33356458, 32506569, 31755583, 30933840, 30538547, 29664236, 29357825, 29274760, 28732552, 28353787, 28100243, 27756041, 27555272, 27585973, 27193679, 27113192, 27079900, 26928551, 26983447, 26957299, 27095438, 27272606, 27539161, 27806213, 28335703, 29306563, 30213247, 30897497, 31911967, 32853073, 34146080, 35748698, 37511090]
4714C7511090J751030J841359K072922J929515J811250J997886J849806J790634
4706E2555492J578146J502675J333509J462297J847441K069218J712773J634675
4698F5696226K016604J816072K110230J912560J560742J526536J590440J444720
4690G9674130J619999J590981J890183J918358J923546J722302J130509Q38945
4682I2308953K44526k31959p12089j072648j062249j297941j795755j789021j885115
4673H2706702j931538k146984k173281k232946k396567k448124k330765k356840
4665F4689657j995287j643109k012628j915831j466889j515914j315959j104686
4657E1719354q47131j020240j121210j166525j270560j441978j443855j545022
$$ y = [37511090, 39262120, 41103479, 43176401, 45105916, 46917166, 48915052, 50764858, 52555492, 54133638, 55636313, 56969822, 58432119, 60279560, 62348778, 64061551, 65696226, 67712830, 69528902, 71639132, 73551692, 75112434, 76638970, 78229410, 79674130, 81294129, 82885110, 84775293, 86693651, 88617197, 90339499, 91470008, 92308953, 92553479, 92321520, 91609431, 90536783, 89474534, 88176593, 86380838, 84591817, 82706702, 80775164, 78628180, 76454899, 74221953, 71825386, 69377262, 67046497, 64689657, 62694370, 61051261, 59038633, 57122802, 55655913, 54139999, 52824040, 51719354, 50872223, 49851983, 48730773, 47564248, 46293688, 44851710, 43407855, 41862833]
4649D1862833j508391j903159j933493j863753j988041j677717j762139j814803
4641B7411337j419482j237371j483112j268945j199077j038624q01013r15504
4633A8048209j068661o56483m30418o47096n45789m18961l35215n73696o20423
4624A2751467j80753L2087j90707l23826n50377j85089P9405k57181j95547M225
4614A0983704l21647j35880m16597n51933K43414j92931k75266K02094k04760
4605I330198j93975j59254k17252j08624j04820j38426k99009K46284p4292l7774
4595H243056j87882j19467J83469N9842o6664R0197j99736k15396j48019k4861
4585G614539j57627J19787J49013J07022L4669o7162o4L726j1389l97234j05019
$$ y = [41862833, 40354442, 38451283, 36517790, 34654037, 32665996, 30988279, 29226140, 27411337, 25991855, 24754484, 23271372, 22002427, 20803350, 19764726, 18963713, 18048209, 16979548, 16323065, 15892647, 15245551, 14699762, 14280801, 13945586, 13371890, 12751467, 12570714, 12602801, 12412094, 12088268, 11537891, 11352802, 11432207, 11175026, 10979479, 10983704, 10662057, 10526177, 10109580, 9557647, 9801061, 9608130, 9332864, 9534958, 9330198, 9136223, 8976969, 8759717, 8651093, 8546273, 8407847, 8108838, 8355122, 8280830, 8243056, 8055174, 7935707, 8119176, 8179018, 8112354, 8202551, 8002815, 7787419, 7639400, 7614539, 7456912, 7576699, 7725712, 7832734, 7867403, 7800241, 7800177, 7803903, 7792514, 7395280, 7290261]
4574G290261L39744K24883j40852l84514J73627J50755j12086J22043J7009k9280
4564G651590j97460j80689j33858K77133k16003j66676k75038P2557L14469Q2563
4554G228588R8808r9863j11103j77382J54318k05577L9295K32228n17131N3720
4544F695901K33483J0924J87800j71255j68075K10171L19476O6677J47299K58799
4534G791200o9171o969P2682P9014J62787J25906L653K61555O1924q6547M6761
4523H442795K73063j02925k9096M03355J86124j00460J60234K49288L9697L83474
4513I905549M31666K54908k3987J4057J43790M29382O6895J84763Q0383M17302
4503A1904708M83637j6835Q0999j2552K19440K14575J81596N0904L92625M67467
$$ y = [7290261, 7630005, 7854888, 7714036, 7329522, 7503149, 7653904, 7541818, 7663861, 7680870, 7651590, 7454130, 7273441, 7139583, 7416716, 7200713, 7034037, 6758999, 6831556, 7146025, 7228588, 7327396, 7227533, 7116430, 6939048, 7093366, 6887789, 6927084, 7159312, 6642181, 6695901, 6929384, 6940308, 7128108, 6956853, 6788778, 6998949, 7318425, 7385102, 7532401, 7791200, 7722029, 7715060, 7787742, 7866756, 8029543, 8155449, 8159102, 8420657, 8482581, 8396034, 8442795, 8715858, 8612933, 8583837, 8987192, 9173316, 9072856, 9233090, 9482378, 9522075, 9905549, 10337215, 10592123, 10568136, 10582193, 10725983, 11155365, 11222260, 11407023, 11487406, 11904708, 12388345, 12371510, 12452509, 12439957, 12659397, 12873972, 13055568, 13106472, 13499097, 13966564]
4493A3966564L38527L24930K99820L15189L53134N47624L53802O19217Q28394
4484A7947201R26130R19143J361161J869527K723654L454612M024618M567852
4476C7793898M337067L254936K262063J513280J321143Q83298J963495L338118
4468E6667298N046210P059117Q113543O495281K840540L86753j352097k941465
4460H2315180m378676l775589k983808k086177j309100r13121r32303r83555j389585
4451F3563266j558917k074006k380596k022580k248913k155439j704767j238368
4443D8179680q87517k75550j5384P24555J271232J394255J744512K003355K506372
4434E6645510L063086L500305L721875M650221N542454O690725P933983R456458
$$ y = [13966564, 14305091, 14630021, 14929841, 15245030, 15598164, 16145788, 16499590, 17118807, 17947201, 18873331, 19792474, 21153635, 23023162, 25746816, 29201428, 33226046, 37793898, 42130965, 45385901, 47647964, 49161244, 50482387, 51365685, 53329180, 56667298, 61713508, 68772625, 76886168, 83381449, 86221989, 86608742, 85256645, 82315180, 77936504, 74160915, 71177107, 69090930, 67781830, 66868709, 65936406, 64952851, 63563266, 62004349, 59930343, 57549747, 55527167, 53278254, 51122815, 49418048, 48179680, 47292163, 47016613, 47001229, 47725784, 48997016, 50391271, 52135783, 54139138, 56645510, 59708596, 63208901, 66930776, 71580997, 77123451, 83814176, 91748159, 101204617]
4426A01204617J1331800J3220062J5666160J8192989K0625438K2322055K3270196
4419B25833317K3857355K2717248K1097136J8444259J5438182J2345934R491262
4412C49224693O861969N455393M470703M237535M709189N202038N641893N960507
4404C91763920N469169K965356j46780m317166r431035j4165809j8528159k2406782
4396C31202714k5068435k5897844k6125208k5401406k3851668k1960880j9765056
4389A63132217j7683560j5068173j2953914j1105684q818595p515167o604893
4382H3382231n900319n211961m940766m568781l765367l369043l180074k688848
4374D9757072k776882k737572j894959j924247j698741j511457j015095j106473
$$ y = [101204617, 112536417, 125756479, 141422639, 159615628, 180241066, 202563121, 225833317, 249690672, 272407920, 293505056, 311949315, 327387497, 339733431, 349224693, 356086662, 361542055, 366012758, 370250293, 374959482, 380161520, 385803413, 391763920, 397233089, 400198445, 400051665, 395734499, 386303464, 372137655, 353609496, 331202714, 306134279, 280236435, 254111227, 228709821, 204858153, 182897273, 163132217, 145448657, 130380484, 117426570, 106320886, 97502291, 89987124, 83382231, 77481912, 72269951, 67329185, 62760404, 58995037, 55625994, 52445920, 49757072, 46980190, 44242618, 42347659, 40423412, 38724671, 37213214, 36198119, 35091646]
4366C5091646r89225j232813o97945n33388q23278p35097p25578p54525n46364
4357B8053433q15669o08814m16510k68120m26666m14163l55813o4070k66634n47425
4347B3869549m68552j88765m67968k58600R267m31762j52610m8121k47059l03465
4337B1311914K6883J45087k68959k99146j24199J13463K35702n08L07453L70039
4327B1817729L8072K28343M82710M72264L67975O45476Q75951Q22260P62876N93048
4317B7106704J248464J105976J397859J591454J297547J629615J854519K296696
4309C9528834K383249K256433K472153K546517K634468K542786K802927K523487
4301E9690854K862718L021916L126428L066348K819933L044052L469538L453813
$$ y = [35091646, 34102421, 32869608, 32171663, 31638275, 30814997, 30079900, 29354322, 28599797, 28053433, 27237764, 26628950, 26212440, 25944320, 25517654, 25103491, 24747678, 24683608, 24416974, 23869549, 23400997, 23212232, 22744264, 22485664, 22494931, 22063169, 21910559, 21862438, 21615379, 21311914, 21338797, 21483884, 21214925, 20915779, 20791580, 20905043, 21140745, 21140237, 21447690, 21817729, 21855801, 22084144, 22566854, 23039118, 23407093, 24052569, 24928520, 25750780, 26513656, 27106704, 28355168, 29461144, 30859003, 32450457, 33748004, 35377619, 37232138, 39528834, 41912083, 44168516, 46640669, 49187186, 51821654, 54364440, 57167367, 59690854, 62553572, 65575488, 68701916, 71768264, 74588197, 77632249, 81101787, 84555600]
4293H4555600L617271L594851L473375L437804L349016L103048K981847L108291
4285A11221103K677611K429011K493318K263576K071470K085280K049907J783319
4277A29074595J653771J570281Q91349O26685L50893q5711p95078p12488p63786
4268A31810511j396136j647807j812001j833368k198087j967444k227435k473896
4260A16254337k776039k684955k816521l054952l467142l553742l503540l526595
4252I0870851l472339l174607l205310l150898l214675l093370k804626k851640
4244F5903386k646408k927481k629055k549977k397910k601808k168006k032768
4236D5949973j860641j894267j688818j736045j760195j047042j015538j067008
$$ y = [84555600, 88172871, 91767722, 95241097, 98678901, 102027917, 105130965, 108112812, 111221103, 113898714, 116327725, 118821043, 121084619, 123156089, 125241369, 127291276, 129074595, 130728366, 132298647, 133189996, 133816681, 134167574, 134081863, 133286785, 132574297, 131810511, 130414375, 128766568, 126954567, 125121199, 122923112, 120955668, 118728233, 116254337, 113478298, 110793343, 107976822, 104921870, 101454728, 97900986, 94397446, 90870851, 87398512, 84223905, 81018595, 77867697, 74653022, 71559652, 68755026, 65903386, 63256978, 60329497, 57700442, 55150465, 52752555, 50150747, 47982741, 45949973, 44089332, 42195065, 40506247, 38770202, 37010007, 35962965, 34947427, 33880419]
4228C3880419r66454j164133j027746j191417q59500p64189o50584p20100p92957
4219B5743339n25699o49053r04282p20000j76742n54357n97250l06340m03622
4210B0905994n82640n00074n12241m63066k12447n06817m30420m75256k40293
4201A6982740p05450m54465k78705j01226k65152o51053l34713l08388k05201
4192A3678387j73704J31737j78254l43671j27866k37840j29683L6906J19470K28637
4182A3004119l612O9624L0247K45585M80980O28226P54163P02086P41362J391421
4172A8044201J767460J954213K034552K475801K440144K473633K392939K135475
4164C5718418J328624R03651O01667J24975j62707m55251o09180m70522p00081
$$ y = [33880419, 32913965, 31749832, 30722086, 29530669, 28671169, 27906980, 27256396, 26536296, 25743339, 25217640, 24568587, 23664305, 22944305, 22767563, 22213206, 21615956, 21309616, 20905994, 20323354, 19823280, 19311039, 18847973, 18635526, 18128709, 17698289, 17223033, 16982740, 16277290, 15822825, 15544120, 15442894, 15177742, 14526689, 14191976, 13883588, 13678387, 13504683, 13636420, 13458166, 13114495, 12986629, 12748789, 12619106, 12656012, 12775482, 13004119, 13000507, 13070131, 13100378, 13345963, 13826943, 14455169, 15209332, 15911418, 16652780, 18044201, 19811661, 21765874, 23800426, 26276227, 28716371, 31190004, 33582943, 35718418, 37047042, 37950693, 38552360, 38677335, 38514628, 38059377, 37450197, 36979675, 36279594]
4155C6279594p13647o13162o03266m45072n21597q70464j127103j240410j384036
4146B8760837j630989k074369j594164j549686j764245j743573r75331j126279
4138A6302201j409927p60065p90732n53888n53666k89113l86627l69382k02000
4129A0986801k7956p5664q1428K22091p5649J71676J6132J08203K82682J65918
4119A1692806k54159l65089r6464K39821j421r6835j34500J4566l9283j06945
4109A0852497j54562j2380o657l06101j07980r375j89617k82329l01799m05173
4099I076524J11907r0214k24153l43684j38070l1765j38250q1323k96248j62255
4089G682469J40424K6473J55785k08691N5672K0363k87052p8530L43199m4338
$$ y = [36279594, 35565947, 34952785, 34349519, 33904447, 33382850, 32512386, 31385283, 30144873, 28760837, 27129848, 25055479, 23461315, 21911629, 20147384, 18403811, 17428480, 16302201, 14892274, 14132209, 13341477, 12787589, 12233923, 11944810, 11558183, 11188801, 10986801, 10958845, 10883181, 10801753, 11023844, 10948195, 11119871, 11136003, 11244206, 11526888, 11692806, 11438647, 11073558, 10977094, 11216915, 11215494, 11118659, 10984159, 10998725, 10959442, 10852497, 10697935, 10685555, 10678898, 10372797, 10264817, 10255442, 10065825, 9783496, 9481697, 9076524, 9188431, 9098217, 8874064, 8530380, 8392310, 8360545, 8222295, 8140972, 7844724, 7682469, 7822893, 7849366, 8005151, 7796460, 7852132, 7872495, 7585443, 7506913, 7850112, 7805774]
4079G805774k6336K59555o9073J19488k0153n8255J76103J98481q6806K51570
4069H550348K08314k27136J05592J04021J90483K81744M6232k27535k1296n0839
4059H959928M29208L38093L8486J94505k17943p2330K24328L07082j11737K61791
4049A0351411J88093J98013n8745K49057K64614j4131l2790M38416N15207J34809
4039A2233954j23396K13700J64795L16739N7951J30042K15643K13374K63102L84717
4029A4070621M99898M39968K69377J67674K8533N4827L57180L58815M33214K49257
4019A6929364M83571M02018M67252J69663J25317K72857M73485R37271P28969
4010B0989767P99279P06313O57856O07856J137869J031705R00934J122060J396033
$$ y = [7805774, 7779438, 8038993, 7969920, 8089408, 8069255, 8011000, 8187103, 8385584, 8298778, 8550348, 8758662, 8531526, 8637118, 8741139, 8931622, 9213366, 9259598, 9032063, 9010767, 8959928, 9389136, 9727229, 9765715, 9960220, 9742277, 9669947, 9894275, 10201357, 10089620, 10351411, 10539504, 10737517, 10678772, 10927829, 11192443, 11178312, 11145522, 11583938, 12099145, 12233954, 12110558, 12324258, 12489053, 12805792, 12863743, 12993785, 13209428, 13422802, 13685904, 14070621, 14570519, 15010487, 15279864, 15447538, 15476071, 15530898, 15888078, 16246893, 16680107, 16929364, 17412935, 17814953, 18282205, 18451868, 18577185, 18850042, 19323527, 20260798, 20989767, 21789046, 22495359, 23153215, 23761071, 24898940, 25930645, 26831579, 27953639, 29349672]
4001B9349672J568186J473818J531841J413544J402386J603390J972882J970003
3993D2285722J558216J588353J780295J421451J889594J723509J950571K100795
3985E6298506K290877K482408K644259K910121L033942K500667K700272K201067
3977G7062119K573339K651778K401394K872960K696208L023162K816392L382453
3969I9479805L260608L341137L964215L734089L958793L817227L928301L946144
3961A29430319M198227L979495M074245L808521L467760L081925K710298J945565
3953A56696355J436982J267039R21892J049723J411917J799932K584225L264821
3945A70432886L943201L902224L522747L028082J844022J520304J376119R19818
$$ y = [29349672, 30917858, 32391676, 33923517, 35337061, 36739447, 38342837, 40315719, 42285722, 43843938, 45432291, 47212586, 48634037, 50523631, 52247140, 54197711, 56298506, 58589383, 61071791, 63716050, 66626171, 69660113, 72160780, 74861052, 77062119, 79635458, 82287236, 84688630, 87561590, 90257798, 93280960, 96097352, 99479805, 102740413, 106081550, 110045765, 113779854, 117738647, 121555874, 125484175, 129430319, 133628546, 137608041, 141682286, 145490807, 148958567, 152040492, 154750790, 156696355, 158133337, 159400376, 160322268, 161371991, 162783908, 164583840, 167168065, 170432886, 174376087, 178278311, 181801058, 184829140, 186673162, 188193466, 189569585, 190489403]
3937A90489403J586880J983355K684614M405394N540458O591418P511586P587720
3929B28380828O856665N744263L983969K844632J184344K63938l70961l92961
3921B48494717n63843j66961L48148R68023J790217K335796K360852J752735P91317
3912B58111001M44208J5468q67399r15624j239507j367818j513208j557712j781344
3903B49328065j969278k374500k687692l361455m203797m815170n652340o281434
3895B17982399o597629o425121o594731o452918o186067n959283n923809n526926
3887A68315915m984656m346824l613051l493116k845950j987996j516100p74718
3879A44753504J75597N09684J407803K182557K504330K963521L369943L474809
$$ y = [190489403, 192076283, 194059638, 196744252, 201149646, 206690104, 213281522, 220793108, 228380828, 235237493, 240981756, 244965725, 247810357, 248994701, 249258639, 248887678, 248494717, 247930874, 247763913, 248112061, 249080084, 250870301, 253206097, 255566949, 257319684, 258111001, 258555209, 258570677, 257703278, 256787654, 255548147, 254180329, 252667121, 251109409, 249328065, 247358787, 244984287, 242296595, 238935140, 234731343, 229916173, 224263833, 217982399, 211384770, 204959649, 198364918, 191912000, 185725933, 179766650, 173842841, 168315915, 163331259, 158984435, 155371384, 151878268, 149032318, 147044322, 145528222, 144753504, 144929101, 145438785, 146846588, 149029145, 151533475, 154496996, 157866939, 161341748]
3871A61341748L629622L846818L649005L691186L267394L927389L721752L200997
3863A90275911L173570K819905K635834K338088J561669J499957J397351R34238
3855B06636523R37795J395432K579692L540210M272845M243381K945667O74264
3847B27225809k463721n716959q863469j1109221j2720482j3371939j3410688
3840A59569330j3057413j2487742j1372463j0396613r243866p941533o975106
3833H8094594n920891n284299m482069l709683l126031k553279k080196j807968
3825E9130178j525462r72745n84111m20787k10328k40984L61284K19897L49919
3816E6106861M48223J89016L87743L25954K53414M94867P33655M28807M42936
$$ y = [161341748, 164971370, 168818188, 172467193, 176158379, 179425773, 183353162, 187074914, 190275911, 193449481, 196269386, 198905220, 201243308, 202804977, 204304934, 205702285, 206636523, 207574318, 208969750, 211549442, 215089652, 219362497, 223605878, 226551545, 227225809, 224762088, 219045129, 210181660, 199072439, 186351957, 172980018, 159569330, 146511917, 134024175, 122651712, 112255099, 103011233, 95069700, 88094594, 82173703, 76889404, 72407335, 68697652, 65571621, 63018342, 60938146, 59130178, 57604716, 56631971, 56047860, 55627073, 55416745, 55175761, 55537045, 55756942, 56106861, 56555084, 56744100, 57131843, 57457797, 57711211, 58206078, 58939733, 59368540, 59811476]
3807E9811476L41231o2301M6957k44811k99689p39562q56502j166976j182575
3798E5647248r32356j368074j482706j300313j574366j383549j643422j661801
3790D4300661j244734j934870j835051j680705j977483j737763j722405j501328
3782C0666322j626294j584415j326291j331108j354049j225272j056465o36724
3774B0525704j024118p17489q22117q14610l27690o24062n66086m65589l84211
3765A4779732n43439n11521k99192J5678l77562l21775k49848l63506k75077p5914
3755A1777576q7553k94760l40766k30643q938j62140j47386j6198j78720k43881
3745A0066591o6379q0537o8238l99839J25478J49300j43581k48557k74216l45797
$$ y = [59811476, 60152707, 60090406, 60137363, 59892552, 59592863, 58853301, 57996799, 56829823, 55647248, 54714892, 53346818, 51864112, 50563799, 48989433, 47605884, 45962462, 44300661, 43055927, 41121057, 39286006, 37605301, 35627818, 33890055, 32167650, 30666322, 29040028, 27455613, 26129322, 24798214, 23444165, 22218893, 21162428, 20525704, 19501586, 18784097, 17961980, 17147370, 16819680, 16195618, 15629532, 15163943, 14779732, 14236293, 13724772, 13425580, 13441258, 13063696, 12741921, 12492073, 12128567, 11853490, 11777576, 11690023, 11395263, 11054497, 10823854, 10814916, 10652776, 10505390, 10489192, 10310472, 10066591, 10000212, 9919675, 9851437, 9451598, 9577076, 9726376, 9582795, 9334238, 9060022, 8714225]
3735H714225k40258J05474l49171J22352M1286j87001L55680N9107m47056j18803
3725H055835L38J05136j97388k28304J12003k1724N1782l01718R5773j08673M0660
3714G603720J34769k20515k00791j21072J24697m10109J65015k84804K24453K44014
3704G259377K5629l7502J1073k4610q4700k66604m2566j06694K98101K24898k91055
3693F965347P0428j8531j22383J81216J40078j81151k15303O7275O9659k6391
3683F930244J67793j43320j24078J78446l5553K5099n6619k57379K49975Q3892
3673G018500J89418J44506p7550k26882r8179N0752K30021j63583M2683K32837
3663G342523K475K41054j19982j55390J57536p4628j93061K20193Q0788j60428
$$ y = [8714225, 8473967, 8579441, 8230270, 8352622, 8393908, 8206907, 8562587, 8621694, 8174638, 8055835, 8056173, 8161309, 7963921, 7735617, 7847620, 7825896, 7877678, 7575960, 7671733, 7563060, 7603720, 7738489, 7517974, 7317183, 7196111, 7320808, 6910699, 7075714, 6790910, 7015363, 7259377, 7285006, 7247504, 7258577, 7233967, 7149267, 6882663, 6840097, 6733403, 7031504, 7256402, 6965347, 7035775, 7017244, 6894861, 7076077, 7216155, 7035004, 6819701, 6886976, 6956635, 6930244, 7098037, 6954717, 6830639, 7009085, 6973532, 6998631, 6942012, 6684633, 6934608, 7018500, 7207918, 7352424, 7274874, 7047992, 6949813, 7000565, 7230586, 7067003, 7109686, 7342523, 7344998, 7586052, 7466070, 7310680, 7468216, 7393588, 7200527, 7420720, 7501508, 7341080]
3653G341080k3350o419m663l1031K08640N205O3393L3112j28284J21706Q8085
3642G667474j87616L75443R9135N7759P361J24224o1450J82014K25284j57574
3632H332054L81358J40039K50099K225k76657J42785O2231k0965K45670j51466
3622I107373K0363K03973J28467K39713Q6745K9848J03478K27415j83738k78693
3612I684944r2182l5175P9554k6649M2834J92594j00480Q8858M80148J00852K25709
3601A0641007K73415J78658K15284K06845M03939M68601M48879R96736P62094
3592A4595458J009297R08564K99544M42974K46783l41648m88112m00518o02888
3583A5669454n22091p49607m76168q10359j87605j18953k22823j53257j87657
$$ y = [7341080, 7317730, 7311311, 7306648, 7275617, 7484257, 7489462, 7552855, 7585967, 7457683, 7579389, 7667474, 7479858, 7855301, 7954436, 8012195, 8019556, 8143780, 8082330, 8264344, 8489628, 8332054, 8713412, 8853451, 9103550, 9105775, 8829118, 8971903, 9034134, 9013169, 9258839, 9107373, 9127736, 9331709, 9460176, 9699889, 9786634, 9816482, 9919960, 10147375, 9963637, 9684944, 9592762, 9557587, 9637141, 9610492, 9653326, 9845920, 9745440, 9834298, 10314446, 10415298, 10641007, 10914422, 11093080, 11308364, 11515209, 11919148, 12387749, 12836628, 13833364, 14595458, 15604755, 16513319, 16812863, 17255837, 17502620, 17160972, 16672860, 16272342, 15669454, 15147363, 14397756, 13921588, 13111229, 12923624, 12804671, 12581848, 12428591, 12240934]
3574A2240934K41788N67424K47690p4644K75458L43827J11373m6193N56225M67928
3564A4931810Q26063J307879J515088J918460K512977J875825R39963K11989r8858
3555B5941196o04559j156477j192900j151497j124099j095108o90135q31394q19599
3546A7275428k90694j66910k56812J86279K88652L31724k19303K35824L1997J97548
3536A7613733J16408q4989L32838K05559N04659P81030Q89689J369048J664647
3527B3392622J204178P98789N31726N15506j06616l53679j85687l78216m85121
3518B4933502J27118k85815k22719m45214k37P8337M86807R2207j54866J42064
3508B4751184L55735N70137L95293N40058L42998O34170P94630P46786O83273
$$ y = [12240934, 12482722, 13050146, 13297836, 13223192, 13498650, 13842477, 13953850, 13907657, 14463882, 14931810, 15757873, 17065752, 18580840, 20499300, 23012277, 24888102, 25828065, 26040054, 25941196, 25336637, 24180160, 22987260, 21835763, 20711664, 19616556, 18926421, 18095027, 17275428, 16984734, 16817824, 16561012, 16747291, 17035943, 17367667, 17148364, 17384188, 17416185, 17613733, 17730141, 17645152, 17977990, 18183549, 18688208, 19469238, 20358927, 21727975, 23392622, 24596800, 25395589, 25927315, 26442821, 26336205, 25982526, 25796839, 25418623, 24933502, 25060620, 24774805, 24552086, 24106872, 24106635, 24184972, 24671779, 24763986, 24609120, 24751184, 25106919, 25677056, 26072349, 26612407, 26955405, 27589575, 28384205, 29130991, 29814264]
3499B9814264P30650Q01888R13256J157837J305694N92763J189225R07267Q97076
3490C8309920J004505R71356J206846J662737J944974K009675K694475K677953
3482E2482441L166758L246091L415279L370959L593193L271648K619607K919324
3474G8085300K619656K243538J855976J980756K052945J540611J778586P45274
3466I2902642J14465n80214j963455k637044l999392m306585m609797m723206
3458G0197414m584440m420678m044022l883107l293178k840786k694227k454134
3450D1982842k213724k104046j753294j325312j577174j499205r32412q85161
3442B9692514p81735q57996o60762p63023p43000l62905q56383m23124k21840
$$ y = [29814264, 30544914, 31346802, 32260058, 33417895, 34723589, 35316352, 36505577, 37412844, 38309920, 39314425, 40285781, 41492627, 43155364, 45100338, 47110013, 49804488, 52482441, 55649199, 58895290, 62310569, 65681528, 69274721, 72546369, 75165976, 78085300, 80704956, 82948494, 84804470, 86785226, 88838171, 90378782, 92157368, 92902642, 93017107, 92436893, 90473438, 87836394, 83837002, 79530417, 74920620, 70197414, 65612974, 61192296, 57148274, 53265167, 49971989, 47131203, 44436976, 41982842, 39769118, 37665072, 35911778, 34586466, 33009292, 31510087, 30577675, 29692514, 28910779, 28052783, 27392021, 26628998, 25885998, 25523093, 24666710, 24243586, 24021746]
3433B4021746n77254m41631m23261m27492o24407m23671m83238n11196l79752
3424A9729844o41385m29041l85823k59395m28328l37860m10022l44829k63325
3415A6229836l31682j02320J1215m17201n28185p5519k55019m15584j86628k70706
3405A3658207J322j38084k8987Q669n25886m36907L1771L7405M5852r2859m92447
3394A2068056k66446j12294Q2164p2248l41617k2961j02466k92221p6652O8724
3384A0932039J9577k18474j87231j88067r7398r3392l546q0826j43232J05395
3374A0044845Q4483j13767J04075j71596k03150j37025Q4437j28834l24659k60470
3364H978339q0357J59632n7116M5828p4020k40595l07583L9584Q6539j75659J69770
$$ y = [24021746, 23444492, 23002861, 22579600, 22152108, 21527701, 21104030, 20620792, 20109596, 19729844, 19088459, 18659418, 18273595, 18014200, 17585872, 17248012, 16837990, 16493161, 16229836, 15898154, 15795834, 15807049, 15389848, 14861663, 14786144, 14531125, 14115541, 13928913, 13658207, 13659529, 13521445, 13492458, 13501127, 12975241, 12538334, 12570105, 12607510, 12653362, 12560503, 12068056, 11801610, 11689316, 11771480, 11699232, 11357615, 11334654, 11232188, 10939967, 10863315, 10932039, 10951616, 10733142, 10545911, 10357844, 10260446, 10167054, 10163508, 10082682, 9939450, 10044845, 10129328, 10015561, 10119636, 9948040, 9744890, 9607865, 9692302, 9563468, 9238809, 8978339, 8897982, 9057614, 9000498, 9046326, 8972306, 8731711, 8424128, 8463712, 8550251, 8374592, 8544362]
3353H544362k52612j64827J68041j4398p4549j58238j85026M7167J28546r3465
3343G945001k84455J51886J93985k84456J01683K3603j62018j89386j02418M0011
3333G433436l28916j135K43062k55211k41552K29816J56300l22694J96409K16571
3323G326086l86374k52054J74592J18906M7988j31136n8341P917K3809k0838Q149
3312F858704J4878o9717J31818k31492J9187r4935o1239m6004o8564j4988k76626
3301F161022J62008J31434P8869j37577q5881Q1917o9556l8709p7676L17368o094
3290F517125k11618K04099O6624r2741l1391k3829j77913j68651l9481J63394
3280F205618P196o4463k28262R251p4701L9449K17345k988j74846L6441J78266
$$ y = [8544362, 8291750, 8126923, 8294964, 8280566, 8206017, 8047779, 7862753, 7909920, 8038466, 7945001, 7660546, 7812432, 8006417, 7721961, 7823644, 7847247, 7685229, 7495843, 7393425, 7433436, 7104520, 7103385, 7346447, 7091236, 6849684, 7079500, 7235800, 6913106, 7109515, 7326086, 6939712, 6687658, 6862250, 6981156, 7029144, 6898008, 6839667, 6847584, 6871393, 6850555, 6858704, 6873582, 6803865, 6935683, 6704191, 6723378, 6628443, 6567204, 6521200, 6452636, 6437648, 6161022, 6323030, 6454464, 6533333, 6395756, 6309875, 6391792, 6322236, 6283527, 6205851, 6523219, 6517125, 6305507, 6509606, 6576230, 6483489, 6452098, 6428269, 6250356, 6081705, 6042224, 6205618, 6212814, 6148351, 5920089, 5929340, 5854639, 5894088, 6111433, 6108445, 5933599, 5970040, 6148306]
3269F148306j0936k10571M3392j1178K4215M4028j78781P861j25454N0009N7232
3258E838123N9428L9126m4722O5308R8193J1316J26896j0895O2470J78530j022
3247F422751j088l7570K1659K82329J24679r2318Q3128K53143o9041L33602R0500
3236G411774J24989J78753L50789N12559K82915J58139N29201M52575N50302N28996
3226A1080992L51133L92093J88565K16371K28989Q6521r3888j66226O7141j64868
3216A2186823l93148N3745r9336k30265N0545q2519k37832j2663j8647J66204
3206A1382907j85541l4132J42862J90445L51632M77393N76984N75429L15009O28268
3196A4421256M34111Q88806N36864Q45052R48773P41128J128758R87964Q69533
$$ y = [6148306, 6137370, 5926799, 5970191, 5959013, 5983228, 6027256, 5848475, 5856336, 5730882, 5780891, 5838123, 5897551, 5936677, 5891955, 5957263, 6055456, 6066772, 6193668, 6182773, 6245243, 6423773, 6422751, 6421663, 6384093, 6405752, 6688081, 6812760, 6720442, 6803570, 7056713, 6987672, 7321274, 7411774, 7536763, 7715516, 8066305, 8578864, 8861779, 9019918, 9549119, 10001694, 10551996, 11080992, 11432125, 11824218, 12012783, 12229154, 12458143, 12544664, 12450776, 12284550, 12351691, 12186823, 11793675, 11847420, 11748084, 11517819, 11568364, 11485845, 11248013, 11235350, 11216703, 11382907, 11197366, 11163234, 11306096, 11496541, 11848173, 12325566, 12902550, 13477979, 13792988, 14421256, 14855367, 15744173, 16281037, 17126089, 18074862, 18815990, 19944748, 20932712, 21802245]
3187B1802245L50408N8153j44616k09431q0369l22582K1031o06475m42942o20622
3177A9804800n13909j84907p45023l44376m01128j37175j39665L18674J06570
3168A7763861L35915O44860P67175M31594R84212J123702P88551J239818J445958
3159B5525646J456577J175839J420681J319694J038099Q47655O35921M73841K86674
3150C4180627n8863k62617j45292k38016k91797k5834m75301k99032j35651k0645
3140C2227579k1782J14271K46025K00110O97471Q82823J517325K258942L304663
3131D1427427L790821L899639L155274K068414O84117o43439j677584k308510
3123E0396159k488524k598175k969231k805345k522872k265945j257839j037389
$$ y = [21802245, 22152653, 22210806, 22066190, 21856759, 21776390, 21453808, 21474839, 20868364, 20425422, 19804800, 19290891, 19105984, 18360961, 18016585, 17615457, 17478282, 17338617, 17657291, 17763861, 18099776, 18744636, 19511811, 19943405, 20927617, 22051319, 22839870, 24079688, 25525646, 26982223, 28158062, 29578743, 30898437, 31936536, 32784191, 33420112, 33893953, 34180627, 34121764, 33859147, 33713855, 33475839, 33184042, 33158208, 32682907, 32383875, 32248224, 32227579, 32205797, 32320068, 32566093, 32766203, 33463674, 34346497, 35863822, 38122764, 41427427, 45218248, 49117887, 52273161, 54341575, 55025692, 54382253, 52704669, 50396159, 47907635, 45309460, 42340229, 39534884, 37012012, 34746067, 33488228, 32450839]
3115C2450839j142178o26115m25530j49870M1749K78692n9824L13831P64008L64315
3105C1809917O91219R19075Q49133J102862O92175Q88511J002815J50704l73320
3096C7733091k96624p90337j449266j527594j654939j615333j454498j407252
3088B7537248j512384j136445j134113q17954o46936m73703m25722l29184j91507
3079B0869300j54800m93652o9657n39011n04649l16404o69230K1004m17302o37952
3069A7087647o73882n70569n10861n54537o53492m41500o50496o89235m49968
3060A1893107l58283l10204n16230k99000j93879o1856j71752l17603l10035l01047
3050I053218o0994l9204j34696j04004m17495m08866K8121j89945R986m5866m17751
$$ y = [32450839, 31308661, 30682546, 30257016, 30107146, 30148895, 30427587, 30367763, 30681594, 31445602, 31809917, 32501136, 33420211, 34269344, 35372206, 36064381, 36952892, 37955707, 38106411, 37733091, 37436467, 36646130, 35196864, 33669270, 32014331, 30398998, 28944500, 27537248, 26024864, 24888419, 23754306, 22936352, 22289416, 21815713, 21389991, 21060807, 20869300, 20714500, 20220848, 20151191, 19612180, 19107531, 18791127, 18121897, 18142901, 17725599, 17087647, 16413765, 15843196, 15332335, 14777798, 14124306, 13682806, 13032310, 12343075, 11893107, 11534824, 11224620, 10708390, 10409390, 10215511, 10153655, 9981903, 9664300, 9354265, 9053218, 8992224, 8953020, 8818324, 8714320, 8296825, 7887959, 7916080, 7726135, 7736121, 7690255, 7272504]
3039G272504j63477k11389j62011j33423O2144k42518j319N944M2833l34973l78563
3028E755752K51232l7196m72554j78843j23063O7747M1455m07685j12898J25809
3018D909756o0063Q6429j33911l03216m4416j13445N3304j88817j97883n3244
3008C954494P8265L349l00569k4854m7967P0552j61962P2450o2792m341K7412
2997C604037j97028m2468l48672O1612m2199K2611k42400J89914j27657l53413
2987B524337J97536j03289J6867k0789q692j07300j12005K83238P862k85665L7488
2976B429588Q5183k76026J19562R9035j22901l15060l59271L85601R2357q5635
2966B052433k5356k01438J18687n8728k34389j86954m0268J66354J01842n4638
$$ y = [7272504, 7109027, 6897638, 6735627, 6602204, 6664348, 6421830, 6420511, 6426455, 6469288, 6134315, 5755752, 6006984, 5969788, 5497234, 5318391, 5195328, 5263075, 5304530, 4896845, 4783947, 4909756, 4849693, 4936122, 4802211, 4498995, 4454579, 4341134, 4394438, 4205621, 4007738, 3954494, 4032759, 4036108, 3735539, 3710685, 3662718, 3733270, 3571308, 3643758, 3580966, 3576625, 3604037, 3407009, 3364541, 3015869, 3077481, 3035282, 3057893, 2815493, 3005407, 2877750, 2524337, 2721873, 2618584, 2635451, 2614662, 2605970, 2498670, 2386665, 2669903, 2677765, 2392100, 2429588, 2514771, 2238745, 2358307, 2457342, 2334441, 2019381, 1660110, 2045711, 2138068, 2052433, 2027077, 1825639, 1944326, 1885598, 1651209, 1464255, 1423987, 1590341, 1692183, 1637545]
2956A637545O3496J23490l34434l67401Q0155N7935k00281J12460N2151j36835
2946A088281R8873J19314K6559P7431L68207q4965j16539j84532J17525j40299
2936A369855j01245j28463J2725l3209P478j0216j57628J28550J39214J7463k83321
2925I61203n2463J4560r313K6527O4483N9285j16810n5257P7596J29056J72134
2914A271001r9683k30062o5124J717k84440R0295K56941P6386j21087O2247k389
2903I55802p1779J7560K55699k4689k01907O8030K26678k55923J10974O8472O589
2892A155506j68420q9659J03818J27888l9675J00236J49862N8583j53119O9518
2882A314538L09566j69683M9647j10799M6958P6608J36229K12997j09483j10321
$$ y = [1637545, 1701041, 1824531, 1490097, 1122696, 1202851, 1260786, 1060505, 1172965, 1225116, 1088281, 1187154, 1306468, 1333027, 1410458, 1778665, 1693700, 1577161, 1392629, 1510154, 1369855, 1268610, 1140147, 1152872, 1119663, 1127141, 1116925, 959297, 1087847, 1227061, 1244524, 961203, 908740, 923300, 913987, 940514, 1004997, 1064282, 947472, 892215, 969811, 1098867, 1271001, 1171318, 941256, 876132, 877849, 593409, 683704, 940645, 1017031, 895944, 958191, 955802, 884023, 901583, 1157282, 1132593, 930686, 998716, 1225394, 969471, 1080445, 1148917, 1155506, 987086, 897427, 1001245, 1129133, 1089458, 1189694, 1339556, 1398139, 1245020, 1314538, 1624104, 1454421, 1504068, 1393269, 1440227, 1516835, 1653064, 1866061, 1756578, 1646257]
2872A646257J80462K7760l7370K19518K79188k2582J94841k4744N1348k02643
2862B312035k17415J20911J52865J62513j05801J08090q9208j98392P7046J99389
2852B522033K44822m8525K18837J04001L39161L73689k72596j26496M06171R6010
2842C857107j02785M3220K05224K9493j18501O6549J04034K7680K7125K3236o0449
2831D101933L7131J45642k3296k61323Q0801J1577k43684o3943l1510K74862j15117
2820C913073l19710K77639k3776n720K93699M34565J57352K09821J96328J13047
2810E246318K71428K59707m0331k72381O2918J24433l07495k20919J12483r3801
2800E142360j27425l75460l73369p5586k69729L1469M4049M1614j57034o5124
$$ y = [1646257, 1826719, 1854479, 1817109, 2036627, 2315815, 2293233, 2488074, 2463330, 2514678, 2312035, 2094620, 2215531, 2368396, 2530909, 2425108, 2533198, 2443990, 2245598, 2322644, 2522033, 2766855, 2718330, 2937167, 3041168, 3380329, 3754018, 3481422, 3354926, 3761097, 3857107, 3754322, 3797542, 4002766, 4032259, 3913758, 3980307, 4084341, 4112021, 4139146, 4162382, 4101933, 4139064, 4284706, 4261410, 4000087, 4080888, 4092465, 3848781, 3784838, 3753328, 4028190, 3913073, 3593363, 3871002, 3847226, 3841506, 4135205, 4569770, 4727122, 4936943, 5133271, 5246318, 5517746, 5777453, 5737122, 5464741, 5527659, 5652092, 5344597, 5123678, 5236161, 5142360, 5014935, 4639475, 4266106, 4190520, 3920791, 3952260, 3996309, 4037923, 3880889, 3815765]
2790C815765J97145N8208j42919n4311l9341j35862k02668K375o5p66j503P2699
2778C568757K20204K12041J62946J27861K31725P6142k23992j62028l19795k56805
2768C637056r4247k13061k43891j76800k33559j73366l1899k80101p289R8146
2758B280989j59890p1724j14419J13170j67260q8509O1225j86152p3413j93598
2748A400419O3960Q1571J81302k49500l13911K18221N939J52956P9521l3566k34265
2737A352647R4346K90074l13724k09312j90350P2519j44974K72772k53871k65715
2727G04412l04828J47707M2212j76314n044J23910j09554k89904Q2028m856J13302
2716C23071K7743Q2443r9289m0236m4762p7482o3235j1782R067l5246J40852L7822
$$ y = [3815765, 4012910, 4071118, 3928199, 3873888, 3834547, 3698685, 3496017, 3498392, 3498327, 3497561, 3496058, 3568757, 3788961, 4001002, 4163948, 4291809, 4523534, 4599676, 4375684, 4213656, 3893861, 3637056, 3542809, 3329748, 3085857, 2909057, 2675498, 2502132, 2470233, 2190132, 2182843, 2280989, 2121099, 2049375, 1934956, 2048126, 1880866, 1792357, 1853582, 1667430, 1594017, 1400419, 1464379, 1545950, 1727252, 1477752, 1163841, 1382062, 1388001, 1540957, 1620478, 1586912, 1352647, 1446993, 1737067, 1423343, 1214031, 1023681, 1096200, 951226, 1223998, 970127, 704412, 399584, 547291, 589503, 413189, 408145, 532055, 422501, 132597, 214625, 209769, 323071, 350814, 433257, 333968, 293732, 248970, 171488, 108253, 96471, 105538, 70292, 211144, 248966]
2704B48966j7272j49437J40716P6457N8380Q41j77636k23289K83774P995j40958
2693A08537k1403J30710n2123j93966J65063q3529r6958q303K8398o9317k3405
2682a16296P5408J55166k18275J55908K37932J19518j51084K03881j88134j55512
2672A18512N5689k28974O8146K48668k9735j66660j25756k7248j52831N0118K29106
2661C9035o0799J01781K58331j04165k07459r9664j47363p2052O1910J04774K89880
2650A64209M2254l3619q2167R0271J32360l1237l26512l5146J41027J05541k41911
2639g4930K08086r8376j46231K8651m0426n23j20198J36684k7285O7589M74651
2628D07692k86903k37730K15437n017j79737p8397j04202m4562N8703k5860P0298
$$ y = [248966, 231694, 82257, 222973, 299430, 357810, 358651, 181015, -42274, 241500, 249495, 108537, 87134, 217844, 165721, -28245, 136818, 53289, -43669, -51972, -23574, -92891, -116296, -40888, 114278, -103997, 51911, 289843, 409361, 258277, 462158, 274024, 118512, 174201, -54773, 13373, 262041, 232306, 65646, -60110, -87358, -240189, -190071, 39035, -21764, 80017, 338348, 234183, 26724, -72940, -220303, -292355, -230445, -125671, 164209, 206463, 172844, 90677, 180948, 313308, 282071, -44441, -79587, 61440, 166981, -74930, 133156, 34780, -111451, -82800, -123226, -123749, -243947, -107263, -134548, -66959, 407692, 120789, -116941, 98496, 93479, -86258, -164655, -268857, -313419, -254716, -280576, -210278]
2617b10278P5208k46180R7895L7948J25594M33513l4796j38312j8364j47325r8125
2606a23222M29977j33810J30744q2765j07606j9528J33888J27231O4726O5351
2596D84986R1423k45621L96301q6286n7016l3042j72540K22858J00547j88074
2586E13536P1994j6926k98609j22938j60922o3919M8726K69471j82857j60530
2576a02974M5961O577P4145q677O1634O5951k85816j33277K76250j59850P06J12148
2564d7222L0854k63856j90033K07311K56748N5254J37315m578k15490k1542j1443
2553f6682K6700K23809K1964n8637k04571J69531l77492N2865J75576o6152K02917
2542I9828n3414j4289q4764K09381O7117j13770k12440R5031o8385l5137R5299
$$ y = [-210278, -135070, -381250, -283355, -245407, -119813, 313700, 278904, 140592, 122228, -25097, -123222, 306755, 172945, 303689, 220924, 113318, 93790, 227678, 354909, 419635, 484986, 576409, 330788, 727089, 640803, 583787, 550745, 378205, 601063, 701610, 513536, 585530, 568604, 269995, 147057, -13865, -77784, -29058, 240413, 57556, -102974, -57013, -50436, 23709, 15032, 76666, 142617, -143199, -276476, -226, -160076, -159370, -47222, -16368, -280224, -470257, -262946, -6198, 49056, 186371, 181793, -33697, -55239, -66682, -39982, 183827, 205791, 147154, -57417, 112114, -265378, -212513, -36937, -103089, 99828, 46414, 32125, -52639, 156742, 223859, 110089, -102351, -7320, -75705, -110842, -15543]
2531a5543l2024m9395K15090l652J69J4958j67686J49311L5167j64084L44627
2520C26938j61282j60567L18816r3923J6691j13529j16269L7914J94117m9601
2510A99305l5797q3389j93708J99537k763m6720N3148J71952l07105J05457J31567
2499A91484k2464j91274l2409J12041K67254Q0295j0803o0092l07304j12033J33695
2488D8390o5086J68414J20031j53282r4832K35006j4841l4489N9860N7535j09151
2477B17555k49053K7727J37282n3484m5460N416M5064J30999J81051j09326q5575
2466B02196k19396q7601J87529J98346l6804j6312K98198n50k39696j43390n9108
2455H3412O5653O8208r4296O9283n2692J52001P4754k2446p4753J05764M5363
$$ y = [-15543, -47567, -96962, 118128, 114476, 114645, 129603, -38083, 111228, 146395, -17689, 326938, 165656, 5089, 323905, 229982, 246673, 133144, 16875, 54789, 248906, 199305, 163508, 80119, -113589, 85948, 83185, 36465, 89613, 261565, -45540, 59917, 191484, 169020, -22254, -54663, 57378, 324632, 404927, 394124, 334032, 26728, -85305, 48390, -16696, 151718, 271749, 118467, 23635, 258641, 243800, 209311, 269171, 326706, 217555, -31498, -3771, 133511, 80027, 34567, 39983, 85047, 216046, 397097, 287771, 202196, -17200, -104801, 82728, 281074, 244270, 227958, 526156, 525606, 285910, 142520, 83412, 149065, 217273, 122977, 192260, 139568, 291569, 366323, 343877, 269124, 374888, 420251]
2444D20251J19338j94923m9037j1462j29513J56657K51517k31729j87658J47341
2434B90782L8836j41691J41555P1087k3030J27941k5023N9430J00973M1598j92564
2423D89894j09877k6390q391m5043o5520M33480R6249k57751K07925j02927J80168
2412G91817r4307J52352J44096o1580k9092R9861j746k93578j03007o1420L72665
2401I16061n040N0570k0248j57377J26017L34701J01125Q1262k33974L18133j76243
2390A334987J57669o8237j04427J82025N4792j13498l5834J98301p2641J0218
2380A543355j07981J09788R1838J6000M1739K0863K29396L30920j0416l32061
2370A933441J31776K62966L00077r4884j53577j4084M30705J38285j84630K20901
$$ y = [420251, 539589, 344666, 295629, 284167, 154654, 311311, 562828, 331099, 143441, 290782, 329618, 187927, 329482, 400569, 377539, 505480, 480457, 539887, 640860, 682458, 489894, 380017, 353627, 345236, 300193, 234673, 668153, 764402, 506651, 714576, 611649, 791817, 697510, 849862, 993958, 932378, 903286, 1003147, 1001401, 707823, 604816, 543396, 916061, 911021, 961591, 941343, 783966, 909983, 1244684, 1345809, 1427071, 1193097, 1511230, 1334987, 1492656, 1424419, 1319992, 1502017, 1556809, 1443311, 1407477, 1605778, 1533137, 1543355, 1435374, 1545162, 1637000, 1653000, 1694739, 1715602, 1944998, 2275918, 2265502, 1933441, 2065217, 2328183, 2628260, 2533376, 2379799, 2365715, 2796420, 2934705, 2750075, 2970976]
2360B970976K23492l7162q0195J81461o261J04374M95420K44424L28568K14651
2350D639748K38239N83908N53682P76892N44799J204738J179222J061628R54014
2341A1736870R66897O79262R89678P40022J525582K165414K773403M057238O542011
2332C2176377J1585443J9632177K7097024K9756911K1112779O466221k829356
2325A44997576o534077j4070575j7555770j5845398j5256338j3549230j1794368
2318E0391820j0649997r101096n529926l143856j898554j825178j685393j741146
2310A4816674j445578j572370j005307q52872o77178q89895q89708r23534l18712
2301F241520l1488m12057K6622m16551l95629j98473k51876l75976j37947J44429
$$ y = [2970976, 3194468, 3157306, 3077111, 3258572, 3252311, 3356685, 3852105, 4096529, 4425097, 4639748, 4877987, 5461895, 6015577, 6792469, 7337268, 8542006, 9721228, 10782856, 11736870, 12703767, 13383029, 14372707, 15112729, 16638311, 18803725, 21577128, 25634366, 32176377, 43761820, 63393997, 90491021, 120247932, 141360711, 147826932, 144997576, 138463499, 124392924, 106837154, 90991756, 75735418, 62186188, 50391820, 39741823, 30640727, 25110801, 21966945, 20068391, 18243213, 16557820, 14816674, 13371096, 11798726, 10793419, 9940547, 9263369, 8373474, 7483766, 6560232, 6241520, 6210032, 5797975, 5824597, 5408046, 5012417, 4813944, 4562068, 4186092, 4048145, 4192574]
2291D192574k16743j57572k54342O1783l57280r8096m0664k60704J47132k1267
2281B994821j27161r6023k02360k09398N3110l3060j25183l4890p8092J49935
2271B291699k33320j98461n468j08571R0295P18N6508j21561m1463K2017n6484
2260A695909k67916p7583K7370M9754k90120l7580p54R2510J28347l4721j32471
2249A152745l84236R0547K76347n5407j92394J77265N9450l74742m8018L14043
2239A015600o2103j12922j49267L5304l520L4531K54944l97392l9854J01677K61495
2228I38493j30536j00495k6136J18338k08617l53987J68405J59265L03561l50366
2218E17925q9422O9185O5832k55754L57198R0579k30166J16456j14730p2735N8023
$$ y = [4192574, 3975831, 3818259, 3563917, 3625700, 3268420, 3170324, 3129660, 2868956, 3016088, 2994821, 2867660, 2771637, 2569277, 2359879, 2412989, 2379929, 2254746, 2219856, 2141764, 2291699, 2058379, 1859918, 1854450, 1745879, 1836174, 1836892, 1893400, 1771839, 1730376, 1752393, 1695909, 1427993, 1350410, 1377780, 1427534, 1137414, 1099834, 1099080, 1191590, 1319937, 1285216, 1152745, 768509, 859056, 1135403, 1079996, 887602, 1064867, 1124317, 749575, 701557, 1015600, 953497, 840575, 691308, 726612, 723092, 757623, 1012567, 615175, 575321, 676998, 938493, 807957, 707462, 681326, 799664, 591047, 237060, 405465, 564730, 868291, 517925, 428503, 497688, 563520, 307766, 664964, 755543, 525377, 641833, 527103, 454368, 512391]
2207E12391j87567j27228j17886K96866j58696k03568K73312J05357l6584j36018
2197B20379K99322j21874j39408j67130P6740P1355j2187m5451k00558k8401o9261
2186a16474J31108L9116J16329J58731J26107J339k08294k04520k69382L22799
2176I6859J57999j76863M8628j03074L2635K98597l64314k34816K33582L19651
2166C08884M067l01667o8968J4839M3538L86250k67122j63221k5892j40453J40075
2155f9670J48835r5040k9239K18825J2684j15892j025m3941k99038o7624L79303
2144C8178P858j55302J62057O5624n9829j36425J15376j98734N138J56490M1540
2133D1971j96269J35012j01274j1417N1550M986p4147j85181j21458J71278J11169
$$ y = [512391, 324824, 197596, 79710, 376576, 217880, 14312, 287624, 392981, 356397, 220379, 519701, 397827, 258419, 91289, 168029, 239384, 227197, 181746, -18812, -47213, -116474, 14634, 53750, 170079, 328810, 454917, 456256, 247962, 43442, -225940, 96859, 254858, 77995, 126623, 23549, 56184, 354781, -9533, -244349, -10767, 308884, 312951, 11284, -57684, -42845, 693, 386943, 119821, -43400, -69292, -209745, -69670, 79165, -15875, -45114, 173711, 186395, 70503, 69478, 25537, -273501, -341125, 38178, 46036, -109266, 52791, 118415, 58586, -77839, 37537, -161197, -156059, 431, 41971, -154298, -19286, -120560, -131977, -80427, -75441, -149588, -334769, -456227, -284949, -173780]
2122a73780O789R3603Q7677J44144j4351l4978K1591n8488j31291J7477n2207
2111i3814O1713R7782q9879n5750R1729K35862j27707k26415J36920J66830j65168
2100C2103k01505M3913m569n2742J73632j38607n721K2062q1014J82492J31531
2089A01575k44777k18166L05775m0149j00199M7967Q2828K05023L9214k46133
2079f7042P5985r374k3579K4295p3723P88m6568o1382K51702q784k25973j4047
2067a77702Q6349n84r423J5026M25658J3431j53660J16632R6795J46829r4709
2056D64642M7487J72184q9751O4722m08962O7786K98291k57533m8734k64470j35244
2045h9582L36555R7209m13010j99276R25K75687J36856j83459J12167n1280M4379
$$ y = [-173780, -166991, -73388, 14289, 158433, 144082, 109104, 130695, 72207, -59084, -41607, -93814, -32101, 65681, -24198, -79948, 11781, 247643, 119936, -106479, 30441, 197271, 32103, -169402, -125489, -130058, -182800, -9168, -147775, -153496, -131434, -212448, -29956, 101575, -143202, -361368, -55593, -95742, -195941, -147974, -65146, 139877, 179091, -67042, 8943, -431, -24010, 285, -73438, -72650, -119218, -180600, 71102, 62318, -163655, -177702, -91353, -91937, -101360, -86334, 339324, 352755, 199095, 315727, 412522, 559351, 464642, 512129, 684313, 594562, 659284, 250322, 318108, 616399, 358866, 310132, 45662, -89582, 246973, 344182, -68828, -268104, -267179, 8508, 145364, -38095, 74072, 22792, 67171]
2034F7171o8909r8424r4140K2998O2288K55876k25442R389M5314j216J92584j79634
2022a2145k0368j8251O1556M4776k2735n1475j10203Q4140J00605l32175M07991
2011A31716j22324j13225L695n538N2656J08537k28884J01349j38237l0651L01854
2000F0948j8817j52203K0310J77466j85354k9133J34073o941q0465K21611M1967
1989A83462j36368m6601J2617q7241N9915j09299Q1048K70042k77019q8638n3775
1978a91857J08960J03280q0272J62535N6891l4152l60795n4555j77195K57478
1968b09682J25325l8596N2200o2311K42713k44037J11439j53650j96355j22220
1958d95174j3215K87906Q2683j43479R6680L37633j87345k36550J75531K28686
$$ y = [67171, -1738, -100162, -194302, -171304, -109016, 146860, -78582, -69193, -23879, -25095, 167489, -12145, -32513, -50764, 10792, 55568, 32833, -18642, -128845, -44705, 55900, -276275, 131716, 9392, -103833, -100138, -105676, -53020, 55517, -173367, -72018, -210255, -240906, 60948, 42131, -110072, -89762, 87704, -97650, -126783, 7290, 349, -80116, 141495, 183462, 47094, 493, 13110, -74131, -14216, -123515, -42467, 227575, -49444, -138082, -191857, -82897, 20383, -59889, 102646, 159537, 125385, -235410, -289965, -467160, -209682, -84357, -122953, -70753, -133064, 109649, -134388, -22949, -176599, -372954, -495174, -508389, -220483, -137800, -281279, -184599, 153034, -34311, -270861, -95330, 133356]
1948A33356l6649k16531l0524O3118k9370K94163o901j40165j19029p0050K13697
1937E5115m7627k37080J88362J54701l3274O8364j84184j27593J35038j44467
1927a72645J25532O0288j69810j74841K43061K7909n4793j94286P6381L20632
1917H7428l52750K43612P177m3692J69361o4079j19401r0856K88567j73380j81655
1906b29668L4526O0537j18551J8261L08715l3064M9980j96264R6889M6440j10068
1895g2267j29438M5095J13263n7141J45249M4961K00369K33300j27805l71645
1885B3941r5338L69970j50020j11503q5488j5057k27653j33918L42041o360q6272
1874a75657J79257l5948o7078J10646n9989l23190J94692K81435p1034J71978
$$ y = [133356, 96707, -119824, -150348, -87230, -116600, 177563, 170662, 30497, -88532, -158582, 55115, 7488, -229592, -41230, 113471, 80197, 148561, -35623, -163216, -28178, -172645, -47113, 13175, -156635, -331476, -88415, -60506, -115299, -309585, -233204, 87428, -265322, -21710, -14533, -58225, 111136, 47057, -72344, -163200, 125367, -48013, -229668, -195142, -134605, -253156, -234895, 73820, 40756, 90736, -105528, -8639, 37801, -72267, -201705, -156610, -43347, -100488, 44761, 89722, 290091, 523391, 395586, 23941, -71397, 298573, 148553, 37050, -48438, -63495, -291148, -425066, -83025, -89385, -175657, 3600, -32348, -99426, 11220, -48769, -371959, -177267, 104168, 33134, 205112]
1864B05112Q1429j16193k33341K9739k5115J56926j19360j21239k22000n3135
1854d17177K77135M8194J15967p0501j27605j89112Q8510p1635R4264j945R9057
1843a54848K1571N1956L11892j74832k44064k16763J07918J65385J02301n2155
1833h1639q1496N7306K9588K16475j38058j41052M9738j9884Q9090j55130J71456
1822c606j16615o414P2564m948p9853k6580K06219p1765k20194J94214O2429k39585
1810b34134J38819J26538J27799J86601q3899j33556J60297M3669q5066P3703
1800C20771k62924k03896J52281J07118P302P5304j7459k38283l06375K28233
1790a37928J15726J06590J03936j2496j56042P7198k59675j71270K23008j9363
$$ y = [205112, 286541, 170348, -62993, -33254, -58369, 98557, -20803, -142042, -364042, -417177, -140042, -91848, 24119, -46382, -173987, -363099, -274589, -346224, -251960, -253905, -154848, -133277, -81321, 230571, 55739, -188325, -405088, -297170, -131785, -29484, -81639, -163135, -105829, -76241, 140234, 2176, -138876, -89138, -109022, -19932, -175062, -3606, -120221, -126635, -54071, -59019, -138872, -165452, 40767, -30998, -251192, -56978, 5451, -234134, -95315, 31223, 159022, 345623, 261724, 128168, 288465, 332134, 247068, 320771, 57847, -146049, 6232, 113350, 120652, 195956, 178497, -59786, -366161, -137928, -22202, 84388, 188324, 175828, 19786, 96984, -162691, -333961, -110953, -130316]
1780a30316J37258K09572k19039k80874L56568k63319j65172L79797J13807j05408
1770C2874K77039O0544j21073j11019J3479O5244j44157j25020O812j37738K01227
1759A8212r1036j25942j0302O8585J50395n9475L3982J9607k29104j37306K26647
1748a35737J76939n6562j04590K55100q542q87J22410R6001k64339o5908k35023
1737b21138j24322Q3793J12069Q5908j36801R8540j09095K47688J49333k74165
1727h8190j74387R7524J66195K42106P9742j16769j9114l35301j41415Q3904K38929
1716C3224J03874O0144Q9380l59131j8664m4828J31056j43766K09332k13411j62238
1705c15028p615r897K49036k09258L8958m0229o2210K05487N0960j47623J72166
$$ y = [-130316, 6942, 216514, -2525, -283399, 73169, -190150, -355322, 24475, 138282, 32874, 309913, 370457, 249384, 138365, 151844, 217088, 72931, -52089, -45277, -183015, 18212, -72824, -198766, -209068, -140483, 9912, -49563, -15581, 4026, -225078, -362384, -135737, 41202, -15360, -119950, 135150, 126608, 125721, 248131, 344132, 79793, 13885, -221138, -345460, -261667, -149598, -63690, -200491, -101951, -211046, 36642, 185975, -88190, -262577, -165053, 1142, 243248, 322990, 206221, 187107, -148194, -289609, -205705, 33224, 137098, 197242, 286622, -72509, -91173, -136001, -4945, -148711, 60621, -152790, -315028, -322643, -332540, -83504, -292762, -253804, -294033, -356243, -150756, -99796, -247419, -75253]
1694g5253N0776j28301j72824j10099L98715k9603j32020K28919J284Q6311J10390
1683B28295J23663k04320j41178k28768k6j65970j47209K46959K63377j5073m23447
1672d63697J62875P0481j28135K8591J51007n7998r5186K83402M6054j85956j08439
1661b97001J74276m4471O8690J85364p6250k4273K04865o6024j76222j99150r7727
1650c47923J75062K9588j21453K42186j18950k21986K67473j0694j21147J49328
1640g8516Q1318j48656j3210r9404J20866r1804K62912J60115j10641l7930j1960
1629C3090j56208q5579j31159K50181m3826j2398J19292k23829M9466R325Q8773
1618a02872l8700J43990n6968N6873k5109N9934J00550j17205J5050K27405k11034
$$ y = [-75253, -24477, -152778, -325602, -435701, -36986, -66589, -198609, 30310, 31594, 117905, 228295, 351958, 147638, 6460, -222308, -222334, -388304, -535513, -288554, -25177, -40250, -463697, -300822, -230341, -358476, -329885, -178878, -236876, -332062, -48660, -2606, -188562, -297001, -122725, -167196, -98506, 86858, 10608, -13665, 191200, 125176, -51046, -250196, -347923, -172861, -143273, -264726, -22540, -141490, -363476, -96003, -106697, -227844, -78516, 2802, -145854, -159064, -258468, -137602, -229406, 33506, 193621, 82980, 45050, 33090, -123118, -208697, -339856, -89675, -133501, -145899, -26607, -250436, -200970, -191645, -102872, -141572, 2418, -54550, 2323, -22786, 37148, 137698, 20493, 35543, 262948, 51914]
1607E1914J53035j45000r2336p062j1848J50509k508J59348k4435j60338N3766
1596A25045Q0633j14605l2468l795J3825r4546J38449M9440j60769r518K09603
1585B01294j80404j86333J51244o7747j13869K4805P2043j8025p0485o0672N0830
1574a97319p3052M5988J50245J06868j87798K0388K49119k28557j72180r3702
1564c80000K31639r946J63005J85078j77185K9969J96941J09235l86016j8100
1554e5380O7599P9475K823l7510j96756m9472P2086j06980j13953J83776K04635
1543E0343q692N1952j02450l2983n3295j09996r9747j8822K49844J69784m11677
1532c15739n1903L26610k89296J69112K34846j16298o2145m8983M0628R5773L63445
$$ y = [51914, 204949, 59949, -32387, -39449, -51297, 99212, 96704, 256052, 231617, 71279, 125045, 205678, 91073, 58605, 54810, 68635, -25911, 112538, 161978, 1209, -8309, 201294, 20890, -165443, -14199, -81946, -195815, -171010, -98967, -116992, -187477, -248149, -197319, -270371, -224383, -74138, 32730, -155068, -134680, 114439, -114118, -286298, -380000, -148361, -158307, 4698, 189776, 12591, 42560, 239501, 348736, -37280, -55380, 12219, 91694, 94517, 57007, -139749, -189221, -117135, -224115, -338068, -154292, 50343, 41651, 93603, -8847, -41830, -95125, -205121, -304868, -323690, -73846, 95938, -315739, -367642, -41032, -330328, -161216, 73630, -42668, -104813, -153796, -113168, -17395, 346050]
$$ [...]
##END NTUPLES=NMR SPECTRUM
##END=
