##TITLE=1H_EC-3389(1)
 200.13Hz, CDCl3.
 8 sc
 19.8.2026
##JCAMPDX= 6.0         $$ Bruker NMR JCAMP-DX V2.0
##DATA TYPE= NMR SPECTRUM
##DATA CLASS= NTUPLES
##ORIGIN= UXNMR, Bruker Analytische Messtechnik GmbH
##OWNER= pz
$$ XWIN-NMR		Version 3.5
$$ Wed Aug 19 12:16:21 2026 Russian Standard Time (UT+4h)  she@DPX200
##.OBSERVE FREQUENCY= 200.1313
##.OBSERVE NUCLEUS= ^1H
##.ACQUISITION MODE= SIMULTANEOUS
##.ACQUISITION SCHEME= undefined
##.AVERAGES= 8
##.DIGITISER RES= 18
##SPECTROMETER/DATA SYSTEM= spect
##.PULSE SEQUENCE= zg30
##.SOLVENT NAME= CDCl3
##.SHIFT REFERENCE= (INTERNAL, CDCl3, 0, 15.4902)
##AUDIT TRAIL= $$ (NUMBER, WHEN, WHO, WHERE, WHAT)
$$ ##TITLE= Audit trail, XWIN-NMR		Version 3.5
$$ ##JCAMPDX= 5.01
$$ ##ORIGIN= Bruker BioSpin GmbH
$$ ##OWNER= she
$$ F:/spectra/data/she/nmr/H-C/1/pdata/1/auditp.txt
$$ ##AUDIT TRAIL=  $$ (NUMBER, WHEN, WHO, WHERE, WHAT)
(   1,<2026-08-19 12:14:55.95 +0400>,<she>,<DPX200>,
      <created by zg, POWCHK disabled, PULCHK disabled
       configuration hash MD5:
       00 E9 B6 7A A2 85 ED C7 34 08 36 98 17 FE 4E 26
       data hash MD5: 16K
       C4 27 97 45 BB 97 38 4D BD 4A 24 8B DD A2 14 AB>)
(   2,<2026-08-19 12:14:58.37 +0400>,<she>,<DPX200>,
      <Start of raw data processing
       efp BC_mod = 2 LB = 0.25 FT_mod = 6 PKNL = 1 PHC0 = -4580.373 PHC1 = 14.5923 SI = 16K 
       data hash MD5: 16K
       24 F1 1B D5 7F 03 50 FC A4 62 03 7D 0A 2D 64 96>)
(   3,<2026-08-19 12:15:21.39 +0400>,<she>,<DPX200>,
      <pk PHC0 = 2.520904 PHC1 = -7.000002 
       data hash MD5: 16K
       40 0E F7 8D 1C 2B FF 6E 69 35 74 7A 65 5B 64 6E>)
(   4,<2026-08-19 12:15:25.26 +0400>,<she>,<DPX200>,
      <abs ABSG = 5 
       data hash MD5: 16K
       36 A9 BA 27 97 2B 86 8F 14 74 82 A2 75 9A 03 E0>)
$$ ##END=
$$ 
$$ hash MD5
$$ A1 97 C7 8D 97 52 20 7B 31 20 FD 3C FD 0F 06 FA
##$RELAX= 
##$RELAX= 
##$RELAX= 
##$RELAX= 
##$RELAX= 
##$RELAX= 
$$ Bruker specific parameters
$$ --------------------------
##$DU= <F:/spectra>
##$EXPNO= 1
##$NAME= <H-C>
##$PROCNO= 1
##$TYPE= <nmr>
##$USER= <she>
##$AMP= (0..31)
100 100 100 100 100 100 100 100 100 100 100 100 100 100 100 100 100 100 
100 100 100 100 100 100 100 100 100 100 100 100 100 100 
##$AQSEQ= 0
##$AQ_mod= 1
##$AUNM= <au_zg>
##$AUTOPOS= <>
##$BF1= 200.13
##$BF2= 200.13
##$BF3= 200.13
##$BF4= 200.13
##$BF5= 200.13
##$BF6= 200.13
##$BF7= 200.13
##$BF8= 200.13
##$BYTORDA= 1
##$CFDGTYP= 0
##$CFRGTYP= 5
##$CHEMSTR= <none>
##$CNST= (0..31)
1 1 145 1 1 1 1 1 1 1 1 1 1 1 1 1 1 1 1 1 1 1 1 1 1 1 1 1 1 1 1 1 
##$CPDPRG= <>
##$CPDPRG1= <>
##$CPDPRG2= <>
##$CPDPRG3= <>
##$CPDPRG4= <mlev>
##$CPDPRG5= <mlev>
##$CPDPRG6= <mlev>
##$CPDPRG7= <mlev>
##$CPDPRG8= <mlev>
##$CPDPRGB= <>
##$CPDPRGT= <>
##$D= (0..31)
0 0.7 0 0 0 0 0 0 0 0 0 0.03 0 0 0 0 0 0 0 0 0 0 0 0 0 0 0 0 0 0 0 0 
##$DATE= 1787127295
##$DBL= (0..7)
120 120 120 120 120 120 120 120 
##$DBP= (0..7)
150 150 150 150 150 150 150 150 
##$DBP07= 0
##$DBPNAM0= <>
##$DBPNAM1= <>
##$DBPNAM2= <>
##$DBPNAM3= <>
##$DBPNAM4= <>
$$ [...]
##$SUBNAM3= <"">
##$SUBNAM4= <"">
##$SUBNAM5= <"">
##$SUBNAM6= <"">
##$SUBNAM7= <"">
##$SUBNAM8= <"">
##$SUBNAM9= <"">
##$SW= 18.0517328524113
##$SWIBOX= (0..15)
0 0 2 0 0 0 0 0 0 0 0 0 0 0 0 0 
##$SW_h= 3612.71676300578
##$TD= 16384
##$TD0= 1
##$TE= 0
##$TE2= 300
##$TE3= 300
##$TEG= 300
##$TL= (0..7)
0 120 120 120 120 120 120 120 
##$TP= (0..7)
150 150 150 150 150 150 150 150 
##$TP07= 0
##$TPNAME0= <>
##$TPNAME1= <>
##$TPNAME2= <>
##$TPNAME3= <>
##$TPNAME4= <>
##$TPNAME5= <>
##$TPNAME6= <>
##$TPNAME7= <>
##$TPOAL= (0..7)
0.5 0.5 0.5 0.5 0.5 0.5 0.5 0.5 
##$TPOFFS= (0..7)
0 0 0 0 0 0 0 0 
##$TUNHIN= 0
##$TUNHOUT= 0
##$TUNXOUT= 0
##$USERA1= <user>
##$USERA2= <user>
##$USERA3= <user>
##$USERA4= <user>
##$USERA5= <user>
##$V9= 5
##$VALIST= <valist>
##$VCLIST= <CCCCCCCCCCCCCCC>
##$VD= 0
##$VDLIST= <DDDDDDDDDDDDDDD>
##$VPLIST= <PPPPPPPPPPPPPPP>
##$VTLIST= <TTTTTTTTTTTTTTT>
##$WBST= 1024
##$WBSW= 4
##$XGAIN= (0..3)
0 0 0 0 
##$XL= 0
##$YL= 0
##$YMAX_a= 319877
##$YMIN_a= -326758
##$ZGOPTNS= <>
##$ZL1= 120
##$ZL2= 120
##$ZL3= 120
##$ZL4= 120
##$ABSF1= 24.49361
##$ABSF2= 6.441599
##$ABSG= 5
##$ABSL= 3
##$ALPHA= 0
##$AQORDER= 0
##$ASSFAC= 0
##$ASSFACI= 0
##$ASSFACX= 0
##$ASSWID= 0
##$AUNMP= <proc_1d>
##$AZFE= 0.1
##$AZFW= 0.1
##$BCFW= 0
##$BC_mod= 2
##$BYTORDP= 0
##$COROFFS= 0
##$CY= -3
##$DATMOD= 1
##$DC= 0
##$DFILT= <>
##$DTYPP= 0
##$F1P= 0
##$F2P= 0
##$FCOR= 1
##$FTSIZE= 16384
##$FT_mod= 6
##$GAMMA= 0
##$GB= 0
##$INTBC= 1
##$INTSCL= 3.241238e-09
##$ISEN= 128
##$LB= 0.25
##$LEV0= 0
##$LPBIN= 0
##$MAXI= 10000
##$MC2= 0
##$MEAN= 0
##$ME_mod= 0
##$MI= 1.114404
##$NCOEF= 0
##$NC_proc= -7
##$NLEV= 6
##$NOISF1= 3.799351
##$NOISF2= 2.8
##$NSP= 0
##$NTH_PI= 0
##$NZP= 0
##$OFFSET= 15.49017
##$PC= 1
##$PHC0= -4577.852
##$PHC1= 7.592299
##$PH_mod= 1
##$PKNL= yes
##$PPARMOD= 0
##$PSCAL= 0
##$PSIGN= 0
##$REVERSE= no
##$SF= 200.130006309631
##$SI= 16384
##$SIGF1= 3
##$SIGF2= 2
##$SINO= 0.751879
##$SIOLD= 32768
##$SREGLST= <19F.Aceton>
##$SSB= 0
##$STSI= 16384
##$STSR= 0
##$SW_p= 3612.71676300578
##$SYMM= 0
##$S_DEV= 0
##$TDeff= 16384
##$TDoff= 0
##$TI= <>
##$TILT= no
##$TM1= 0
##$TM2= 0
##$TOPLEV= 0
##$USERP1= <user>
##$USERP2= <user>
##$USERP3= <user>
##$USERP4= <user>
##$USERP5= <user>
##$WDW= 1
##$XDIM= 16384
##$YMAX_p= 523853180
##$YMIN_p= -1091620
$$ End of Bruker specific parameters
$$ ---------------------------------
##NTUPLES= NMR SPECTRUM
##VAR_NAME=  FREQUENCY,     SPECTRUM/REAL,   SPECTRUM/IMAG
##SYMBOL=    X,             R,               I
##VAR_TYPE=  INDEPENDENT,   DEPENDENT,       DEPENDENT
##VAR_FORM=  AFFN,          ASDF,            ASDF
##VAR_DIM=   16384,         16384,           16384
##UNITS=     HZ,            ARBITRARY UNITS, ARBITRARY UNITS
##FACTOR=    0.220516191357247, 1,           1
##FIRST=     3100.04772480482, 0,            0
##LAST=      -512.669038200961, 0,           0
##MIN=       -512.669038200961, -1091620,    0
##MAX=       3100.04772480482, 523853180,    0
$$ Real data points
##PAGE= N=1
##DATA TABLE= (X++(R..R)), XYDATA
$$ [...]
11243 198638 237180 20593 -205536 -343024 -203799 -118544 -111173 -213023 -344965 16399
11233 16399 51955 39249 -131684 -55081 -181489 -87399 63058 -112719 -36879 -15988 -108010
11222 -108010 -339545 -20350 34092 181639 -35108 -5924 20693 -92518 -152114 -44403
11212 -44403 -21768 -94849 -13339 -156154 -370969 -238271 -63355 -80948 -89170 6691 109675
11201 109675 -32120 -193510 -177055 -52901 111338 16942 -58440 -333279 -269821 -298838
11191 -298838 -285242 -19067 42916 38732 185755 246366 145092 -77024 -105713 -150381 -177951
11180 -177951 -115096 -113136 -354788 -488211 -251562 -211084 -210860 -187488 -561644 -258166 -148785
11169 -148785 -219987 -17599 -121537 -170835 -216636 -179984 -114683 -92233 -74445 257262 341883
11158 341883 111222 53112 -172668 -403367 -293506 -244601 -198586 -134187 43067 -17233
11148 -17233 -116863 -45505 -75278 -153827 -240442 -68512 -142514 -201838 -38307 -96068 -43537
11137 -43537 -153074 -94515 -254221 -148885 -52634 -315235 -414797 -36085 -39988 -197986 -86322
11126 -86322 -31673 -16384 18707 -23088 -168396 -238783 -224148 -233293 -180002 -192286 -40332
11115 -40332 137256 119367 -88802 -236723 -132678 -183961 23303 265696 69810 -46824
11105 -46824 -184117 -57647 -69157 -20417 49744 -30320 -257515 -324211 -189043 51407 -107124
11094 -107124 -100751 38136 -231769 -311357 -226088 -228401 -197291 -160421 -97917 100389 312424
11083 312424 224068 355275 348108 -67489 4535 -17935 -124543 -21687 66688 -35444 -109720
11072 -109720 -129609 -5260 -14267 -251762 -155103 250377 202150 23157 -33051 -253800 -283790
11061 -283790 -185710 -175923 -103141 -349041 -521365 -390785 -324196 -418155 -374218 46601 226358
11050 226358 38891 -101022 -18132 -25047 -123449 -106042 109827 179148 36593 74667 34068
11039 34068 170289 113378 18339 -340204 -130468 -352710 -716352 -539128 -396865 -234352
11029 -234352 -155898 -118971 -20049 -55606 -30365 -117803 -281458 -113728 -239134 -393215 -349901
11018 -349901 -479579 -545134 -338473 -276445 -1459 85961 -75822 -138185 53017 -120979
11008 -120979 -200002 -162209 -96236 -90206 -177853 -194203 53102 -19007 -215047 -147700 -11142
10997 -11142 37572 -61354 -189981 -87956 147450 -48791 -277898 -169695 -40734 1825
10987 1825 -41996 -83543 -122750 108067 -36316 -71351 -82854 -211372 79333 -147541 -27960
10976 -27960 -44401 -47543 -22511 59 -96524 -58582 -328149 -195177 -51033 127210 327746
10965 327746 251165 146843 -144569 -483968 -348977 -252216 -328603 -447083 -424320 -307867
10955 -307867 -156571 -22677 -46839 -172254 -242233 -25502 -114994 -180668 -405183 -362668
10945 -362668 -274230 -106364 84244 131786 233455 -71101 -66214 -154973 -270838 46975
10935 46975 -18166 102778 -17516 120481 273214 -110466 -193377 -238398 -203748 -90899
10925 -90899 206347 197050 -85782 107077 158543 12138 -39428 -40260 175112 72791 197226
10914 197226 254354 62482 271592 125101 -37282 44421 76730 122549 -72830 -374755
10904 -374755 -448317 -230335 -150183 -32059 169171 65081 -170470 -408389 -398702 -193372
10894 -193372 -203968 -101453 -23602 -198100 -174616 -46549 -155785 -491345 -300726 -125576
10884 -125576 61744 -19519 -131316 -144305 12235 -60999 -282781 -396337 -400444 -194107
10874 -194107 -72882 -27700 54458 88998 -107107 -37320 154176 -94828 109645 88730
10864 88730 -111115 -289066 -250995 -318795 -415436 -335263 -205996 -148196 -324673 -311168 -188873
10853 -188873 -273459 -222773 -210217 -40042 142767 219481 -21739 -62524 -100187 -72864 -74813
10842 -74813 -208052 -246666 -289374 -265163 -179210 -130540 -29314 -171945 -244196 -104149 27582
10831 27582 189786 128510 108604 -63258 -68145 166082 72496 -156335 -147857 -104376 24102
10820 24102 -196835 4214 -502 -35059 -248936 -111735 -202119 -228590 -210197 -134302 -92305
10809 -92305 -207266 -157594 -328444 -341107 -187403 -159846 -74317 -206603 -231787 -116448 -213379
10798 -213379 -131541 152557 243889 -89159 -125413 -173057 -401650 -310369 -156029 -13591
10788 -13591 -119796 -124108 -176988 -77822 -146867 -168702 -11861 76553 -8096 -91665 -363369
10777 -363369 -533551 -484748 -444693 -263836 -106770 -12539 -96791 -270522 -285809 -198114 -189371
10766 -189371 -117073 -183074 -130004 143041 -98101 -231831 -31841 91966 95538 -108762
10756 -108762 -109119 -263843 -196175 -95579 -53771 -71162 -459675 -358878 -181092 98359 68030
10745 68030 -124317 -181723 19893 -85192 -196530 -229390 -515374 -145383 86238 77602
10735 77602 158338 123817 -55485 -108034 -368249 -284414 -192557 -230327 -271869 -174191 130946
10724 130946 142228 61606 5714 -25074 153298 9041 -10713 115963 -105067 -8807 -156622
10713 -156622 -337350 -138831 -254671 -177825 -88077 -99963 -84364 -96268 -6928 165563 176288
10702 176288 95629 -9335 -7199 38350 -137954 -71550 226849 -134347 -112557 7518 99705
10691 99705 -10366 -148325 -130655 -184050 -282029 -275826 -12622 -63020 -182257 -139963 -5062
10680 -5062 -181444 -220575 -116063 -119910 -146156 -236501 -128721 -39136 199683 440783 296403
10669 296403 -107668 15507 9067 -190067 -102720 -61120 -74448 -84794 -260766 -58505 -59011
10658 -59011 -309067 -186688 -110948 -88102 -12492 216715 155204 -150854 -297599 -47828
10648 -47828 163808 304445 195720 -67431 -192614 -38069 150765 -94530 -219281 -213173
10638 -213173 -286164 -232844 -257885 -197909 -296628 -294951 53703 166656 85398 20351 37116
10627 37116 -57162 -150732 -381154 -401017 -158320 -200519 -182105 -179042 -166043 -444023 -301581
10616 -301581 -49826 -45364 -240826 -135865 -195256 -252012 -252655 -180319 -59713 57532 92093
10605 92093 -177272 -119012 -4402 -23828 158077 1478 -61132 50655 -32704 -166063
10595 -166063 -321304 -370610 -152092 34498 -234507 -201511 -380577 -332276 -142319 -188170
10585 -188170 -34455 -37265 135362 165734 -68854 -21491 -50382 202183 98237 -120646
10575 -120646 -394928 -318345 -138959 -57916 180693 -6846 -219892 -66118 -50531 -151717
10565 -151717 -27469 -7987 -128122 -163216 -7095 78275 267014 191991 181698 77339
10555 77339 -101877 -27545 -234193 -266196 -196504 -251000 -340542 -365317 -379062 -257249 -218889
10544 -218889 53019 125234 12975 181125 -58174 -95734 -212528 -228559 -337165 -378111
10534 -378111 -191255 -58580 5840 147530 65350 -88498 -215115 -320459 -327745 -228482
10524 -228482 14666 -234763 -220732 23169 105080 -12745 -258616 -167753 95439 -229212
10514 -229212 -337223 -132085 -232779 -273627 -685652 -428809 5676 45729 53818 250817
10504 250817 -13054 -60046 127578 52447 21666 -64138 -120110 -19770 -96403 -180426 -300889
10493 -300889 -261268 -238273 -241228 -101813 -83174 78753 -15930 -9878 -61703 53444 58959
10482 58959 85690 -32696 4476 -29995 -202192 -134269 -415576 -448743 54739 59776 249982
10471 249982 -6090 -29375 -78190 -167998 -282786 -314278 -222668 -295790 -78372 -120557 -103257
10460 -103257 -130176 -99721 -162620 -161691 -96832 -96005 -2976 -46932 -179467 -78367 -104453 -144409
10448 -144409 -103847 -41312 -187504 -163340 -79674 42652 -94581 -173754 -62875 -54690 -89036
10437 -89036 -157648 -21678 -5945 -114634 -420090 -533002 -398370 132300 -74285 -194331
10427 -194331 -42357 -101339 -245701 -446304 -158041 -106672 -273987 -104682 -18177 -173547
10417 -173547 -138984 -159355 -380083 -253856 -94067 -57978 -114666 -457436 -292356 -17669
10407 -17669 -177354 -43107 -66002 -152746 4209 -256418 -445976 -156661 -156129 -284907 -260401
10396 -260401 -200028 -99926 -240606 -228442 -177528 -160909 -85680 46213 -321924 -13933
10386 -13933 31454 -380597 -73352 -11002 -195878 -336301 -389950 -514713 -376538 -127611
10376 -127611 -8744 -223433 -268002 -47030 -210475 -311184 -130156 15476 97000 292153
10366 292153 -156832 -145223 -227262 -273491 -279826 -178202 138823 104762 20523 29466 180528
10355 180528 282281 95553 -156710 -176308 -246960 -47624 180907 -39931 -286915 -373861
10345 -373861 -267147 -128567 9054 -104525 -163703 -121979 -133109 -153645 -305226 -165244
10335 -165244 8946 65956 237555 -102553 -261300 -13684 -218871 -31551 4685 -164737
10325 -164737 -132302 -138903 -181246 14954 -79968 -37961 -112428 -88989 -92568 -349722 -283928
10314 -283928 -96059 29080 -139287 -198747 -29979 -130756 -125461 -221348 -148348 -447971
10304 -447971 -408427 -26227 122728 183126 -69952 -330834 -39919 -220868 -241826 206199
10294 206199 141595 -166088 -232913 -136498 -171728 -36432 170228 85019 8813 136624 -21715
10283 -21715 -100619 -379405 -407586 -218302 -179864 -99500 -335944 -378908 55605 340204 116320
10272 116320 -44168 -154457 -63224 -123710 -453221 -236369 -29505 93086 296351 196370
10262 196370 -150787 -134218 -219234 -212119 -175636 -86809 -142222 54171 132761 29672 -85939
10251 -85939 -135814 -152339 -129096 -111925 -20710 -237994 -204586 -363629 -348046 -135400 -75555
10240 -75555 -252992 -90262 17108 -165854 -174134 -147895 -57068 -292888 -357422 -455985 -323273
10229 -323273 -205243 -301077 -315241 -144550 4944 -4471 -218295 -253814 -361937 -176557
10219 -176557 -133863 76567 171133 -14414 -214956 -170342 17616 -45187 -90253 -215798
10209 -215798 -292560 -216879 -216311 38124 155345 -4229 -228747 -425292 -427017 -565826 -131412
10198 -131412 -46319 -250308 -139744 -199200 -325445 -399503 -304449 -228151 89893 165897 -48266
10187 -48266 -190353 -169548 16825 -117046 2290 -540 -93053 -69627 548 -10056 -288119
10176 -288119 -113210 -118616 -239934 -141369 -156013 -34220 39004 304111 214708 -183172 28965
10165 28965 -152880 -306634 -357071 -330607 -481333 -419519 -217159 -108292 -117965 -120977 87918
10154 87918 19918 60768 317275 99412 -160708 -27684 -149726 -115563 18949 88962
10144 88962 -4577 -32416 38162 72777 -174993 -218296 -206553 68644 -74126 -75186 -140102
10133 -140102 -346565 -190491 -161356 -17623 191365 112865 -84672 161865 110505 -37365
10123 -37365 -43210 -207192 -240117 -315188 36432 -89243 -27990 -8752 34716 -106644 -286008
10112 -286008 -10392 37563 128838 -141717 90285 80643 10051 -87971 -211817 -381042 -177270
10101 -177270 -149801 -56347 -137103 -207564 -330512 -233244 -311021 -48497 -138778 -102853 288003
10090 288003 192144 6000 -268952 -208588 -87202 -157035 -88336 63861 -13560 -226912
10080 -226912 -48955 -121309 -107116 174358 -102864 -14125 193762 273155 212548 127014 133831
10069 133831 161290 -62255 -252387 -209480 -189485 -196406 -353394 -312687 -179628 -269154 -386705
10058 -386705 -154614 81873 -51660 -203247 -256787 -247926 -287196 94750 -166404 -353210
10048 -353210 -205803 -90953 -30128 2133 -386161 -577788 -329386 142724 177575 5034
10038 5034 -128739 -51023 108200 72316 -153709 64576 131869 13698 46546 -55542 130785
10027 130785 -30151 -133951 -62716 17616 185371 36315 75019 35920 -136976 -448
10017 -448 182386 59536 -221605 -177991 -63848 -18310 -279866 -455558 -278853 -132334
10007 -132334 -30941 -81355 -56685 90735 -87883 -144056 -100664 -107237 -197498 -142546 -146106
9996 -146106 -418487 -249471 -210901 -125576 64531 -296035 -204256 -140246 -355849 -6761
9986 -6761 -25136 -177203 36489 -81423 -13896 96060 -50819 -91903 -293170 -180265 56037
9975 56037 -33260 -92438 -46043 54950 26521 72080 280808 171826 59517 -41217 43963
9964 43963 -78772 -86047 -88410 50460 158536 -3882 -144951 -275919 -229632 -98738 64490
9953 64490 -106952 -121290 -147386 -197069 -176147 -353131 -269133 -10470 -43845 -63876 -168382
9942 -168382 -248445 -193565 -96675 -53667 116615 -89178 -208998 -31764 85693 11000 69400
9931 69400 -220796 -48685 23390 -141205 -127135 25928 -54827 -231477 -236340 -348478 -276326
9920 -276326 -430323 -353704 -310085 -66629 123458 -19891 -209187 -146107 -228918 -300244 -280110
9909 -280110 -228053 -78791 -133849 32393 2417 -52220 -128615 -139801 -210797 -120694 -164350
9898 -164350 -181432 -174678 246875 228637 -57363 118237 305780 135229 42492 34618 -187995
9887 -187995 -258897 -211946 -289645 -145082 -129117 -252014 -175637 122871 -90313 -202798 80406
9876 80406 -37463 -193008 -132661 -232919 -380140 -198482 -66197 -125007 3030 -63797
9866 -63797 50453 22292 -226811 -72600 -3905 84093 -105914 -42884 -65983 147662 168920
9855 168920 -32487 78734 -37270 108434 393595 214333 171159 188373 -101868 -225847
9845 -225847 139512 229878 267793 30593 59265 -108363 -272739 -342673 -244625 -158602 6411
9834 6411 -15682 -73077 144878 52893 265 331184 345496 308095 258048 311685 130574
9823 130574 173063 139989 131530 377 244092 200682 135529 223499 301710 404343 553108
9812 553108 560100 560050 723506 935484 1156451 1246078 1282326 1055282 1083771 1213748 1145219
9801 1145219 909511 787263 616607 739459 495369 419710 405472 368554 153325 65592
9791 65592 2174 131406 271490 313981 88582 -42792 220522 337754 433606 539074
9781 539074 450738 277994 457244 731253 894184 875602 1053042 1238811 1149964 1166799
9771 1166799 1307876 1448875 1520653 1414800 1222976 1363903 1299927 1212089 1186068 1253008
9761 1253008 1323148 1410625 1197093 1084203 1185367 1141454 1084412 883364 1026040 788647
9751 788647 593392 509730 551783 366880 61977 84348 284362 432120 237007 183054
9741 183054 57178 53674 187007 308285 117574 54397 188211 67132 -151766 -161360 -225498
9730 -225498 -70491 -163173 -68463 65134 -9602 -57305 217993 245576 113281 158488 -142678
9719 -142678 -126377 -58129 -106235 -86376 -321118 -27648 233089 244020 191720 234950 186975
9708 186975 20416 -72383 46722 -82216 -34542 -61709 -128747 62734 -137135 -155994 19893
9697 19893 -67551 -273244 -302295 -323199 -221500 -73334 30679 -42148 -214771 -373351 -433965
9686 -433965 -383281 -205290 -7227 -233483 -382675 -275404 -40332 235091 79011 -186153
9676 -186153 -422166 -102418 22120 61540 -41398 -5456 29462 -89375 -65697 -203855
9666 -203855 -235711 -36356 -262265 -51056 176987 122529 51455 -20391 125208 262636
9656 262636 343790 129123 114526 -129132 -108650 -93164 -288415 -224266 -120064 -138038 -137522
9645 -137522 80461 295196 55702 -192966 -226084 -79365 -212575 -166490 -361385 -238393
9635 -238393 -49010 -103789 2356 -94015 -108490 -33783 163998 33516 88780 -45379 -293176
9624 -293176 -338107 -277328 -75574 -184843 -392882 -216405 45888 346803 408729 342432
9614 342432 148815 149079 191857 131373 44083 65604 -26553 15021 -123480 -285989 -136472
9603 -136472 -150996 -155321 -206267 -295682 -138439 -154693 832 -203469 -126241 -249232 -264656
9592 -264656 -131356 80653 -21732 18374 223327 187976 27021 -135244 -134460 -181136 -97129
9581 -97129 -56558 -132673 -96683 94951 -58281 140089 194679 290696 161320 76186 77883
9570 77883 -4132 2739 -110290 -166778 -136186 -41814 321694 89232 -223603 -171103 -220471
9559 -220471 -355283 -210054 -71709 36019 29277 4962 36805 -199817 -215451 -185112 -170563
9548 -170563 220426 325769 152678 -122396 -122792 32074 74817 61962 15173 162590 21953
9537 21953 -170542 -312580 -285750 -253141 -170293 -75397 -5334 70564 -23284 -141123 263021
9526 263021 558020 303561 257707 -65683 -196266 -106750 248968 270315 -33795 8218
9516 8218 166621 275779 203837 27784 146403 -18236 -153609 -116412 47684 504939
9506 504939 257728 65455 130051 218485 387020 286086 222843 322768 46359 169000
9496 169000 111980 89641 -144968 -231294 -288164 -157666 113776 -55200 -293308 -365063 82866
9485 82866 261520 135401 -44928 172612 204446 -24157 -62191 7817 -114889 -93415 -3139
9474 -3139 169963 199243 154197 16654 -40906 60071 -134165 206955 282680 -17311 148597
9463 148597 -17876 -108210 -367096 -196025 -345282 -399058 -80215 55231 222396 -21626
9453 -21626 71690 70607 -21225 222271 -38343 74683 71113 -454 -186535 -65802 -114371
9442 -114371 -124736 -125711 24771 304120 204199 171794 250406 175385 143072 175927 227313 293676
9430 293676 -33837 -163420 -164691 -225542 -321932 122634 374434 496339 282380 177246
9420 177246 190229 72312 -20140 2504 194286 61651 33100 125249 61660 116894 266710
9409 266710 260102 -53701 -119344 188193 170276 183133 301480 392317 790115 1204033 1525168
9398 1525168 1607913 1900518 2112874 1936744 1887433 1619511 1349402 1064143 942415 978800
9388 978800 635517 512889 378106 346779 394063 195748 -42195 147155 60995 152969
9378 152969 63159 306462 424834 322974 92254 103641 9113 30029 262944 220898 80369
9367 80369 -68458 -28620 -6420 142945 453221 604346 110985 -4563 386692 418720
9357 418720 506100 325428 212125 380312 382654 283546 209039 185091 186810 208962 74959
9346 74959 110476 303289 362628 401981 294310 295256 244843 323400 144977 144219 280573 436182
9334 436182 -13198 61554 143663 219316 363937 432447 498834 264597 271666 184438 227845
9323 227845 287269 548037 467005 690928 567990 689448 955844 744084 745166 933623
9313 933623 1114318 1380894 1295933 1377124 1139500 961288 833623 821607 923580 746101
9303 746101 640086 529168 563641 647341 660056 468862 472978 640718 557471 592121 501597
9292 501597 613824 718013 543544 519103 526283 537363 518447 650634 1156888 1161282 1148705
9281 1148705 1244009 1333389 1158617 1210487 1353183 1401276 1399941 1468786 1250308 1138077 1169422
9270 1169422 1229778 988311 637987 463004 470315 540908 315519 481148 679950 241351
9260 241351 190195 328096 535291 511235 373156 290351 272769 52678 173470 375948
9250 375948 388766 300469 315945 183332 67112 83298 179400 183529 97054 202546 294675
9239 294675 318978 240599 110467 36914 281528 119494 66663 202330 323251 163318
9229 163318 291560 339970 320918 205798 -24111 -109573 -197588 -45180 -119756 114474 326211
9218 326211 133692 230695 219788 -116632 128551 329889 345160 593135 631468 414946
9208 414946 122493 221317 247875 356253 344985 380730 441861 430754 8336 150850 113659
9197 113659 3372 127699 23425 -102563 -167383 -168571 -20315 133889 209765 74638
9187 74638 122133 297353 173008 392659 411986 264019 588072 478339 484777 522463 435568
9176 435568 408818 391436 394081 311282 50880 157716 288725 387811 308778 256940 234477
9165 234477 395888 616063 400096 243778 552685 447566 432095 210711 255252 334404
9155 334404 396708 371712 272941 417010 554984 449877 303316 493469 430794 352440 293944
9144 293944 351537 594662 611483 497954 675703 859453 819010 645522 652726 633847 411259
9133 411259 413801 527526 628489 558834 406119 364878 328646 325933 378816 364073 323016
9122 323016 546586 576367 957407 743468 696577 545447 622359 644853 681643 487877 440671
9111 440671 431388 174287 271675 464014 561842 504545 668917 572699 601787 713620 626770
9100 626770 631309 671475 646457 606491 707113 969946 731004 819228 1123232 780759 847224
9089 847224 703678 753781 708337 864634 788218 888195 811514 608996 615692 700744 927274
9078 927274 664920 670900 914991 1040865 1031508 1094558 1158974 1097301 1070800 1261260 987716
9067 987716 944567 1088270 951920 1103243 1126188 1196576 1170030 1093348 1166066 1009194 1044555
9056 1044555 1283260 1413764 1289486 1611599 1584390 1628135 1557245 1923312 2098186 2165155
9046 2165155 2151958 1851872 1842656 1663326 1631154 1474878 1414756 1551823 1705373 1527913
9036 1527913 1729884 1636428 1591953 1826161 1897544 1830616 2005738 1813951 1959291 2090820
9026 2090820 1914102 1979951 1956034 2128100 2129750 2444444 2607975 2777195 2925148 2792339
9016 2792339 2873215 3026685 2865854 3001807 3176804 3177842 3326693 3309093 3160333 3043727
9006 3043727 3123832 2884863 2925638 2734337 2898379 3023525 2944473 2797315 2943585 3202129
8996 3202129 3119630 3268763 3256562 3186387 3155335 3210569 3189617 3187365 3337665 3292804 3458767
8985 3458767 3888872 4065980 3973700 4143517 4464273 4677238 4550122 4573115 4713713 4577581
8975 4577581 4410292 4113699 4149170 4341982 4598258 4700178 4936597 5127908 5410070 5558048
8965 5558048 5715469 6013600 6371189 6561689 6691677 6867696 7334188 7666281 8059035 8560061
8955 8560061 8725029 8936553 9363616 9669347 10055446 10378726 10931801 11889926 12416249 12939644
8945 12939644 14019950 14966577 16062360 17469453 19092803 21068128 23299217 25886621
8937 25886621 28722589 31966907 35190856 39179982 44606152 51893291 62153142 80360840
8929 80360840 115641531 175385536 244174731 300947641 338879971 348154796 334599777
8922 334599777 307432295 271026854 231856555 194540396 160530388 131792478 107328282
8915 107328282 85552920 66395966 51974995 42594422 36013824 31227745 27303709 24440014
8907 24440014 22448093 20714631 19144703 18073998 17058205 15963405 15215589 14535661
8899 14535661 13764986 13362537 12950171 12371874 11860429 11494397 11164665 10784617 10262567
8890 10262567 10167701 9907146 9565172 9391544 9242028 8617263 8151156 8275808 8210169 7588141
8880 7588141 7427367 7209085 6984516 6948116 6881626 6592012 6368242 6027153 5884606 6033153
8870 6033153 5719001 5346913 5131892 4947240 4594669 4465502 4688085 4527552 4441050 4233638
8860 4233638 4001318 4149158 3959789 3782693 3799606 3539738 3754761 3606464 3499216 3455949
8850 3455949 3319034 2896770 2768987 2743008 2672460 2626647 2646411 2799205 3166365 2773751
8840 2773751 2605852 2487368 2742994 2552743 2133192 1975480 1862131 1740996 1950400 1969293
8830 1969293 2170809 2182003 1963969 1961755 1793947 1422903 1383062 1833045 1918990 1883123 1771130
8819 1771130 1787392 1895033 1919348 1515983 1676636 1844655 1786030 1522224 1607346 1549436
8809 1549436 1499572 1686160 1803429 1443855 1327061 1605884 1590549 1685196 1664372 1370130
8799 1370130 1439779 1442021 1573175 1414543 1277186 1447161 1509281 1532593 1529999 1820419 1680382
8788 1680382 1373851 1513161 1511928 1605909 1731008 1899871 1675350 1624167 1777963 1601484
8778 1601484 1521381 1684299 1590942 1747186 1810448 1506082 1104565 1209631 1142679 1228843
8768 1228843 1143645 1202183 1209191 1102211 872590 720395 690584 625795 690975 680113 790246
8757 790246 774156 568894 521281 599405 727780 958952 718045 429985 369808 605286
8747 605286 511115 481300 576128 492618 593782 734139 738979 842990 641622 767104 638235
8736 638235 431011 586237 514506 573512 708261 596928 695449 822387 761411 585735
8726 585735 686085 859742 668203 680556 506406 550178 395762 383266 213653 49939
8716 49939 55264 75762 56006 149094 365354 329792 266686 355663 434240 70987 191436
8705 191436 360831 124335 360499 229090 4211 -130163 -20786 155967 254410 292605
8695 292605 313033 193840 70259 255690 172688 58231 127812 147117 238756 227604 104095
8684 104095 96814 123490 212031 392500 331012 331893 388736 467027 547235 243534 259502 445207
8672 445207 193573 119619 136497 130940 228779 228600 215548 70462 132108 245359 167491 62894
8660 62894 126570 185008 522286 124169 309412 74223 -3329 -32054 -144924 29375 159168
8649 159168 -29889 -195861 -78304 123177 299942 339058 461798 279009 135080 152066
8639 152066 175842 446196 639655 600846 429477 330442 466110 367859 95284 100780 216507
8628 216507 167503 82381 184800 110664 76153 156427 241070 271971 263222 316470 274760 252398
8616 252398 441916 214013 367421 610374 439287 242359 427523 636695 218852 223979
8606 223979 140935 44895 -19730 92415 65800 -57295 271250 432987 359000 38343 161645
8595 161645 271610 401771 693639 492926 389302 84981 74420 272453 132743 -13457
8585 -13457 122106 111380 122422 20126 -7025 18400 50237 101567 37615 54839 218879
8574 218879 71789 5852 -30777 60655 -113908 -24643 196741 -71254 74540 208093
8564 208093 -201789 33959 -20641 -93765 -28067 -96489 86039 131409 103907 77953 -49793
8553 -49793 -3668 -52240 70607 178130 215621 507367 442519 378702 168632 -162510 -128008
8542 -128008 152531 36297 -49580 54999 83238 341000 206044 -127499 -232343 -37193
8532 -37193 182944 224877 44859 350538 183096 72201 -226974 -241240 290275 231739
8522 231739 -108022 -179796 -78188 -115187 156917 -116849 -244063 -204876 -201822 49122 214648
8511 214648 154783 41679 95251 46583 115189 -21793 -28717 207548 48357 219888 351390
8500 351390 211706 109290 93414 -10190 171123 75126 69587 194278 76562 -430529
8490 -430529 -552535 -233799 -32437 108884 248766 -54391 -208941 -252104 -248289 22828
8480 22828 95399 -93843 -153861 -275591 -172187 -267249 -85280 -95505 100750 240741 228712
8469 228712 -122764 -81797 330067 384385 303727 303403 322956 237547 238449 344256 512192 484940
8457 484940 483069 356493 365977 384926 523365 545442 865681 1315679 1644146 1908800 1865680
8446 1865680 1879504 1561840 1430909 1617699 1186219 917904 619661 511885 675568 726933
8436 726933 326472 272798 373255 284955 66704 189849 212769 231294 64437 19509 -203258
8425 -203258 -343464 35595 122107 -83433 -168984 -27289 -35930 -220328 -245569 -109080 -128972
8414 -128972 -162079 -71717 -247053 -219550 -67511 -114829 -110160 24391 178806 36606 -25489
8403 -25489 -13841 169413 358221 229069 175937 220322 215241 67054 -165856 -161382 -140341
8392 -140341 -86382 -137108 19077 210420 48458 -256316 -378267 -20570 114425 -171738
8382 -171738 -111786 146945 -184792 -307261 -124268 -59928 49111 207000 33799 -320499
8372 -320499 -25317 111992 162375 251270 313297 448466 213990 124407 256839 253827 163413
8361 163413 278722 314086 234250 200809 107728 240012 116894 -109030 108268 35734 270888
8350 270888 287245 67873 41056 52060 -60096 -77861 197857 -23435 -441299 -397234 -169916
8339 -169916 -498356 -264120 -65023 56470 172169 152036 230438 34044 184263 93336
8329 93336 -85010 -123817 8381 60124 -11100 -150046 -425558 -73633 -130869 -282419 -228222
8318 -228222 -280060 -103487 -151392 -406438 -79348 -10278 -147105 -212656 -177623 -232093 -44174
8307 -44174 84425 5958 68974 254446 92346 -132970 -260198 -263523 -15557 199312 409787
8296 409787 238083 238157 284759 118888 121583 52152 19235 82924 -103556 -157022 24055 64690
8284 64690 -25014 -93371 -205290 -128107 -133784 -37170 104208 -217614 -1349 -115960 -279851
8273 -279851 -125811 -356196 -245290 -231540 -87970 132420 346492 314452 142414 -63481
8263 -63481 -132296 -287492 -179151 49197 -84081 -114623 -232698 -213082 -127718 -117439 115895
8252 115895 -203698 -557650 -236749 -38162 101253 130596 210782 111089 69605 368066
8242 368066 409866 131703 -163871 -64084 79563 -157793 -327160 -209274 116720 26363
8232 26363 193924 225078 125594 269130 156026 232204 32339 150479 164031 -196557 -258890
8221 -258890 34750 -176835 -108803 34388 -274718 -541286 -308616 -174993 129340 336411
8211 336411 76802 -6226 280326 214329 34165 -5783 185476 146894 -96913 -201515
8201 -201515 -25110 -54848 -121005 104135 287062 140904 237117 358881 993763 646444
8191 646444 -642970 -241556 -460657 -370058 -386023 -287463 -308801 -329929 -185780 -96012 -276334
8180 -276334 -358104 -338556 -245712 54805 17063 -10703 168231 128391 107110 55010 7885
8169 7885 3823 -94401 -27797 51233 213622 225961 212910 194462 210767 119685 83723 51450
8157 51450 -50030 -109008 -37581 -120967 -289281 -307031 57489 67134 -111098 -21654 -36384
8146 -36384 -104763 39173 -124138 -109719 -83314 -74240 -59616 123376 89530 -143019 -284782
8135 -284782 -321050 -209667 -173101 -86206 -190152 180235 336481 254316 -90289 -175200 -187307
8124 -187307 -146110 22569 -138316 -124059 -205774 53907 340686 -2560 -253310 -274294
8114 -274294 -253834 -309087 -262360 -119451 -144490 -232680 -198448 -11136 -58922 -251846 -182034
8103 -182034 -100453 -88760 11013 146449 -60493 -48694 -171782 -218831 -155842 -45618 -252263
8092 -252263 -161870 -52399 -15052 -58960 -13404 96714 -99009 28901 19865 36592 -152483
8081 -152483 -214559 -46394 -192807 -96620 -134266 -179594 -145514 -19362 182326 -102960 -80831
8070 -80831 -209360 -298396 -226978 -140144 -233461 -110944 18161 -222568 -233845 -202928 -150288
8059 -150288 -442417 -607387 -593831 -320309 -198863 -88875 -149507 -112723 -21504 -26062 -3213
8048 -3213 28276 -182900 -301209 -193915 -530179 -549746 -399546 -262769 -315601 -15099 91327
8037 91327 -16387 -161834 -264310 -293301 -2346 67200 -136526 -126201 -162694 76501 -51168
8026 -51168 2463 -113437 -285341 -315616 -456184 -373418 -133547 -26648 -185445 -26263
8016 -26263 -210845 -252430 -129950 -82944 103474 193815 272649 150411 41340 -119242 -400476
8005 -400476 -91141 -106312 38163 143193 82456 -237048 -234710 -290907 -89939 -158096 -204183
7994 -204183 -46834 -171800 -165061 -213444 -56324 255594 348062 409835 340374 183408 102290
7983 102290 -98814 140912 -161550 -261992 -120441 -291529 -97346 18566 -126775 -132956
7973 -132956 119465 26832 38785 -108948 -85171 -49301 70593 -99735 -106107 52995 299104
7962 299104 41078 -110541 7642 -135068 -96624 8818 120211 -210798 -175375 78414
7952 78414 182582 22965 -156992 -96151 227354 -72661 -145340 -163941 -385062 -288075 207901
7941 207901 -33609 -120190 -38968 48031 -65419 29221 28812 65916 143703 -23041 209342
7930 209342 191265 102070 183318 -10500 -223731 -342264 -164860 -589138 -530051 -307419
7920 -307419 -93676 22337 105408 -46647 -136708 -55421 -243989 -99523 -215935 -397087
7910 -397087 -304223 -302018 -191152 -124865 -83133 -22399 -45704 -128673 131456 200908 169780
7899 169780 259598 -111854 -125706 -122685 26565 -6531 -18581 71994 -96307 -72421 28523
7888 28523 -258709 -333167 -158496 -54573 -136214 107142 295175 -200794 -267914 -297809 -150876
7877 -150876 47604 143081 -36725 -294488 -95355 94677 -142419 -164270 -195712 -366350
7867 -366350 -62441 211115 264144 -12531 -244648 -94945 78882 -147896 -231077 -530486
7857 -530486 -361443 -118856 -216336 -90376 63529 -10544 -117422 -60306 164388 7724
7847 7724 -8351 -107246 37141 -78765 -57204 110249 145274 232528 258277 -30447 -96116
7836 -96116 142814 194179 173226 58496 220218 66579 -91750 -59631 -166577 -320316
7826 -320316 -288677 -183084 -220704 -46308 -230307 -425640 -508236 -357801 -307956 -428882
7816 -428882 -447291 -345406 -580872 -610339 -463658 -552433 -347982 -262834 -99372 -127725 -168548
7805 -168548 -148636 -356938 -216958 12911 88072 266513 72343 -175497 -297375 -451517
7795 -451517 -281821 -207022 -301632 -41076 -85263 -147661 -224138 -103528 -106083 -100187 -216644
7784 -216644 -634153 -599437 -114663 125080 157396 179275 6211 -121139 -450834 -216951
7774 -216951 -132426 -272281 -116989 -237103 -170045 -4195 -49674 -304529 30899 -72313
7764 -72313 -207476 11172 73847 -144145 -389233 -453738 -426405 -184768 -120850 -243393 -41780
7753 -41780 169530 44459 -166594 -162598 -120422 -158286 -122500 13679 46481 -71039 33842
7742 33842 -204482 -334158 -261114 -247554 -253810 -206820 -400115 -427544 -454332 -441886 -272335
7731 -272335 -276026 -157932 -117743 -261814 -40759 181131 14003 -48286 48157 21660 -84324
7720 -84324 -194916 -126214 62175 -144977 -62842 -13045 -3356 -207891 -92789 -130937 43459
7709 43459 211059 101558 44152 -202031 -39475 -32432 48580 232291 349601 483360 346000
7698 346000 314371 204927 79147 114547 -37871 20654 -13389 -8008 85331 47566 57065
7687 57065 170016 275101 184945 4937 -64140 40466 34465 -115682 -48191 -45898 184322
7676 184322 -32527 -340335 -303599 14045 16134 -98591 -229451 -244809 -126596 -108979 27185
7665 27185 -164502 76918 25534 20418 171903 -54323 -368503 -362296 -234297 -115723 -225531
7654 -225531 -260792 -144515 -108809 -174868 -192782 16784 58109 -100485 -309879 -113338 -166561
7643 -166561 -88882 -136946 -387304 -102563 -182823 -75984 44538 -190342 -216572 -125022 -10213
7632 -10213 334308 416804 74298 -33021 7124 -80559 -161550 -288262 -179691 140160 179134
7621 179134 206384 353267 363790 238187 38869 -78474 -236502 -452794 -432113 -448360
7611 -448360 -256551 -52504 -97276 -145835 -219073 -349355 -222246 14620 145783 -213951
7601 -213951 -413367 -444644 -386498 -173267 41311 179275 58945 -66981 -287 -128189
7591 -128189 -211503 -39110 -231862 -228425 -233840 -294534 -276163 -118360 -115306 -173151 -280288
7580 -280288 -174518 99604 101040 13897 -239559 -90956 -39137 -157786 -51897 -115772 -115076
7569 -115076 110466 189952 101099 -238328 -417990 -384640 -279948 -230100 -190370 -317256 -151310
7558 -151310 -41101 -161230 -83500 6561 179625 -123631 -65985 184149 221732 104813
7548 104813 -1039 -92666 -398441 -276293 -149707 -132807 -18248 -111215 -85849 -36397 -110803
7537 -110803 -76383 -1874 -29634 -154284 -239129 -363488 -298245 -171776 -107854 -405190 -377572
7526 -377572 -162036 -219926 -414844 -380601 -294107 45500 103922 -248313 -287184 -188567 -164150
7515 -164150 -148852 -129495 -442372 -656773 -410018 -127777 -39051 -190714 -163748 -99699 -383662
7504 -383662 -322866 -277207 -194892 -39693 -18865 -203614 -189503 -342389 -429835 -406223 -228179
7493 -228179 -279043 -152352 -305119 -220736 36121 -35431 67951 72286 -112887 -114520 -18231
7482 -18231 -48800 74696 173532 8161 -174931 93231 288120 170020 -91776 -381403
7472 -381403 -279904 -229840 -236747 17262 -97215 -99481 -84145 -39930 15969 2178 -275038
7461 -275038 -435852 -605820 -309929 -192710 -187255 93686 119180 111699 -68907 -62565 -234423
7450 -234423 -323410 -228262 -203540 -346394 -290750 -235790 -288908 -348832 -344420 -184157 -100311
7439 -100311 -283080 -41032 -57346 -247756 -82074 17958 -124242 25781 -18966 -17953
7429 -17953 -53329 -54032 -112357 -245356 -211886 -296569 -295039 -288938 -227279 -158498 108759 -76199
7417 -76199 -154476 -29381 -87517 -163462 -166788 -127464 -326683 -383829 -142220 -476233 -392879
7406 -392879 -26196 4824 214371 109767 -260104 -113108 25656 20120 -4285 43945 20144
7395 20144 -45256 -103669 24727 -21308 -110852 -330078 -285773 -350427 -265065 -353606 -398214
7384 -398214 -178408 -210500 16623 -32491 -58906 10204 -215093 -99610 43532 -42332 -8772
7373 -8772 -96435 113449 184365 -56272 -101615 -200665 -223083 -139382 -272919 -262261 -105404
7362 -105404 -253013 -524983 -390062 -290505 -183785 -268130 -147955 -89626 -62144 -169338
7352 -169338 -17005 94127 -113380 -145492 -122760 -128361 -202124 84725 20380 -206536 -219549
7341 -219549 28839 -7650 -245351 -304852 -300827 -183587 -197957 -98012 -23680 40 -121068
7330 -121068 -328667 -69912 -107070 -505457 -540820 -232321 -287299 -397348 -220475 -29055
7320 -29055 87166 28025 24693 153298 -106940 -129756 -154689 -142461 -136631 -355704 -73160
7309 -73160 -134833 -456749 -129783 41604 -151988 93987 93873 -3114 -172192 685 98096
7298 98096 -199806 52749 190762 -101562 -151917 -262569 -46701 -200668 -225271 -235066 -330604
7287 -330604 -431774 -250343 -93073 -180580 -196404 -286128 -260938 -258269 -95624 -332109 -291931
7276 -291931 -59950 -106234 -220645 -225563 -134697 81770 -15478 -269327 -270732 -284713 -264697
7265 -264697 -363892 -77338 -15197 -252804 -164877 -161496 -111915 -262137 -156348 -1662 -224835
7254 -224835 62546 -50632 -328214 -97363 11502 33345 -191855 -231863 96251 246905
7244 246905 429724 492092 32877 -112155 -163656 -156990 1859 -50740 -108994 -255716 -179108
7233 -179108 4063 68973 103696 82070 38621 -23324 182595 18648 -154495 -39423 17940
7222 17940 6125 141518 -108370 -300207 -185210 -69953 -18837 -34009 -122034 19029 49138
7211 49138 133870 -52080 -277309 148742 388962 233171 17515 -87655 -148863 -264978
7201 -264978 -476998 -271528 -108220 11247 72714 101929 35358 21308 -211612 -195527 -57535
7190 -57535 -116009 10040 -15712 -260395 -190452 -81052 -158780 -208902 -100472 82291 56411
7179 56411 160555 11964 -173337 -83399 105739 -87852 -57536 -19099 -92575 18457 -97096
7168 -97096 -178666 7374 112787 43686 -327463 -181220 -8992 292808 336925 137369
7158 137369 196224 130205 124988 -23834 -2017 -54088 -172981 -145117 -76095 -159506 -302514
7147 -302514 -171006 -89331 -179334 -113856 -235706 48092 154865 394912 397648 259055 246674
7136 246674 206991 356691 388601 428432 163789 132946 528646 563245 160373 -116230 -40642
7125 -40642 -78911 -134021 -24919 -17109 -148058 -267009 -235954 -60712 -371265 -308300 -109815
7114 -109815 18374 229442 50433 -44118 -23620 -62957 -207720 -303461 -135004 -46947 -180602
7103 -180602 -93331 -11203 87040 -124343 -145056 96527 -168738 -135800 -176218 -217941 -149720
7092 -149720 -65356 43920 -96071 -180439 -139900 -295311 -301790 38453 144082 -437387 -331837
7081 -331837 -102125 -278836 -11167 261013 59367 -120888 -40798 -224 -55560 -145242
7071 -145242 -356964 -193691 -148808 -75221 17483 -310392 -367609 -184406 40525 -50678 -66888
7060 -66888 96956 124922 116840 16915 37799 -11056 -976 -8311 77863 162981 -180069 113206
7048 113206 -88261 -1357 156602 73064 -163720 69353 41585 4709 -5435 -99080 -179397
7037 -179397 -285559 -159695 13251 -7275 -32373 69902 152016 87884 -56927 -111765 83569
7026 83569 12118 57645 -51906 -228775 -27545 -6898 -214516 -295973 -12211 109487 172071
7015 172071 91127 223523 29521 -204456 80081 -66786 10909 120674 55146 305612
7005 305612 104253 -198540 -226191 -199334 157795 8261 -45721 194556 108996 -49013
6995 -49013 -78570 79574 20848 -74292 -153240 -137771 58550 71665 15398 -41132 16305
6984 16305 104227 97943 52130 68849 211281 159000 11581 37466 86312 -132023 -88916
6973 -88916 -74652 -17499 153914 205173 29476 240237 239388 211203 -34883 -311537 -202014
6962 -202014 -311 -76556 -73272 23035 -116090 -86394 -148880 -84413 -18403 -110294 -38444
6951 -38444 53110 134697 216827 212368 148758 254228 118420 198356 292873 361543 112521
6940 112521 303691 53205 -131090 -148109 -190141 95984 406604 205448 87516 -24296
6930 -24296 67804 -8461 -123720 -64158 -168622 -114131 60790 188241 -11887 -40180 -26393
6919 -26393 23367 144563 163304 -19267 -89148 -33909 -27499 72968 131130 132508 126374 186734
6907 186734 369612 252170 250013 189491 188518 159826 344156 488743 399297 314979 263661
6896 263661 161743 180453 52507 -19957 62827 -65054 188031 321486 168480 351979
6886 351979 314227 315710 233308 124092 138261 114037 203523 332120 368658 348278 337303
6875 337303 488191 128900 67343 336069 435701 209771 201519 134158 74753 161008 318404
6864 318404 444000 263748 56639 4585 93475 73620 -66436 -162286 -138701 107299 153280
6853 153280 19699 -55469 257481 -156613 -96721 382722 254191 164139 42881 -148894
6843 -148894 -170514 -278959 36373 138108 318021 224213 307177 204893 21885 -69553
6833 -69553 -173415 -240790 -197381 -250517 -251822 49214 80021 167170 186801 386283 236620
6822 236620 35611 -58088 -158360 -243779 -200891 -33823 46365 -9551 -19323 -124873 112715
6811 112715 28389 55970 -42728 -82436 259622 168134 155105 56760 -216243 -35140 -183482
6800 -183482 -16245 -76171 94447 97528 -9296 25598 -208771 -330564 -243056 -83424 -4019
6789 -4019 -61840 -6258 -84743 118660 260990 255658 50787 -33896 62328 50749 -28297 281537
6777 281537 338764 99399 143186 93490 147179 -2761 -249659 30891 144049 279966
6767 279966 382417 173562 20283 -41132 27659 -49270 -48914 44199 69393 142159 153458
6756 153458 185892 208360 130461 -25392 -59806 93923 188579 248724 108746 -157567 -195073
6745 -195073 -153975 -235585 -106883 -10538 -116499 99603 114077 19785 21878 -339905 -181607
6734 -181607 -228899 -17002 -104856 101855 247867 -96926 -12278 10041 -102766 -169995 -13121
6723 -13121 62297 155576 286719 190180 -295903 -91732 -166302 -65232 -83803 -243392 -128990
6712 -128990 72050 422636 462882 284081 328717 633833 780318 672433 603796 635041
6702 635041 520083 677478 794002 988861 1068180 1058299 1136074 1492493 1700717 1780552 1753918
6691 1753918 1369501 1259662 1189488 858555 644786 770118 923489 825574 773081 823500
6681 823500 701400 464937 355391 202410 303589 567735 407458 339987 310050 347785
6671 347785 210924 -28515 7512 45165 105927 -110557 -14591 -183831 -111188 -32397 -94593
6660 -94593 -168317 -56854 125470 -19874 -82658 176677 -57436 -7508 90393 108768 126925
6649 126925 -213482 -226974 33432 -96367 -67186 -158934 151924 87631 -86242 -61902 158742
6638 158742 128271 40188 94594 144481 274089 289790 330771 -147159 -250936 15044 -13410
6627 -13410 67698 36557 185644 464158 351686 548429 491630 80950 -429239 -190256
6617 -190256 33248 196108 -102897 -143068 -41715 -33893 -259380 -118500 95319 157204
6607 157204 177851 162165 283370 450385 511638 290208 266587 325678 383140 503527 519147
6596 519147 553518 435497 326446 445235 734495 875932 841873 771032 468637 461803 661656
6585 661656 539951 685755 669408 938159 1007274 854802 745127 630597 565892 407849
6575 407849 478853 388186 153891 106854 144603 495960 471421 343710 448288 371166 504179
6564 504179 490851 288197 313563 323063 272049 194658 226488 236933 21509 -34793 -84637
6553 -84637 222375 218803 57587 231192 140765 77297 38860 273019 434897 328118 219676
6542 219676 108204 235130 160464 144366 87212 67777 -102527 -57247 94703 63928 -28635
6531 -28635 79005 279970 153085 -141197 38954 123846 59404 74308 135375 120983 -116265
6520 -116265 278214 284710 307551 137108 -112984 -131296 -162349 -5045 32680 327256 -126713
6509 -126713 -266530 -280444 -323302 -148180 -31145 -47612 5983 147375 136217 221548 277330
6498 277330 94701 155756 197651 109752 144187 101033 25286 50057 295702 327441 350511
6487 350511 195823 5714 137323 431500 350250 157008 136760 120928 150701 180123 397289
6476 397289 559672 156265 -58449 36659 109292 -10406 106086 438181 454071 362173
6466 362173 274549 277049 42687 -103742 148848 277652 219787 354327 437678 123477 91660
6455 91660 91549 97237 224669 134778 166410 44898 241780 406914 303446 357858 477425
6444 477425 411698 468538 765465 735525 559020 830955 965073 781262 798692 1061935
6434 1061935 984399 828706 795695 779435 1029018 1237862 1161495 873274 831814 849110 1021870
6423 1021870 752925 923915 874315 736420 702658 511301 556254 646242 697071 787922 765246
6412 765246 742736 789627 918331 682771 763667 653619 347810 315015 228335 250364 234229
6401 234229 447958 450624 408585 349454 368253 305694 347623 326691 267647 293447 285409 174576
6389 174576 318117 616281 735200 567846 530803 460797 405412 406377 501890 286188 199563
6378 199563 477620 626759 599543 407290 296826 413905 404523 665349 601728 484064
6368 484064 554556 734994 585649 601811 886073 742022 649033 719474 570436 624505 730581
6357 730581 693523 757839 872652 1195226 1151551 1125276 1562057 1764912 1697884 1658150 1775089
6346 1775089 1773139 1560698 1717974 1629811 1534183 1632267 1390967 1401607 995120 1094771 1109708
6335 1109708 1195729 1110390 1038857 1061369 1033884 1257245 1058327 1029438 1123034 1372517 1242966
6324 1242966 1329762 1594634 1947112 1993436 2637602 3164845 3552571 4058930 4328919 4281246
6314 4281246 4370759 4258258 4063044 3614105 3338038 3200625 3090637 2776899 2486456 2517073
6304 2517073 2579146 2428637 2510695 2464847 2442538 2723316 3220026 3534858 3611410 3484169
6294 3484169 3590780 3453068 3536886 3662966 3707461 3871511 3948378 4459372 4861753 5007919
6284 5007919 5399055 5624732 4994953 4858537 4662389 4255909 3850878 3806132 3897368 3698747
6274 3698747 3330346 3319256 3517571 3490090 3574960 3660260 4039126 4928345 5711818 6195350
6264 6195350 7090417 7668365 7522201 7386476 7123255 6950413 6388480 5715602 5484370 5065120
6254 5065120 5094413 4961748 4678321 4331086 4167091 4360746 4166658 3754690 3551900 3393797
6244 3393797 3331977 3435624 3475977 3324374 3354645 3773356 4084058 4312041 4533805 5039898
6234 5039898 5714095 6570063 7403365 8015930 8411486 8307761 7754108 7523631 6855234 6284379
6224 6284379 5577592 5540228 5160013 5013599 4809005 4652608 4749105 4692932 4674528 5004978
6214 5004978 4902133 4752796 4898205 4896222 4543773 4509847 4602828 4724812 4636828 4542350 4789874
6203 4789874 5003617 5063407 5310758 5770554 6216404 6593567 6817284 6888340 6872912 7064528
6193 7064528 7227669 7496932 7251322 7590530 7552614 7495075 7499223 7462175 7278671 7615345
6183 7615345 8000071 7978960 7972683 8054190 8129579 7894522 7945155 8029456 7869965 7471387 7430790
6172 7430790 7359501 7197043 7112750 7186657 7220532 7071120 7096905 7249130 7409580 7525983
6162 7525983 7919829 8328189 8381764 8566489 9090455 9274921 9677102 10300363 11059922 11646975
6152 11646975 12842269 13561258 14084986 14358283 14518774 15220963 15811791 16137987 16484435
6143 16484435 17088704 17760700 18823302 19782085 20855370 22217875 23658255 25023432 26969854
6134 26969854 29352065 31815873 34878856 37985819 41784225 46478366 51762495 58395172
6126 58395172 66753252 77594169 91272154 107462390 125024376 141600157 155336100
6119 155336100 164328866 168819236 169012857 166941937 163993664 161710997 162467400 166086091
6111 166086091 171146370 176288980 179410430 179144488 174804863 166571400 155290742 141972935
6103 141972935 127701496 113793511 100484749 88170605 76755502 66777515 58477696
6096 58477696 51082131 45030267 40087787 36152094 32888231 30053237 27647011 25638250
6088 25638250 23841141 22455946 21004231 19568911 18560796 17278990 16470728 15927635
6080 15927635 15106787 14402372 13806065 13589751 12729720 12411505 11931167 11444581 11192866
6071 11192866 10904283 10490351 10278884 9692258 9413104 9054655 8896874 8894890 8750322 8443895
6061 8443895 7991421 8115187 8091432 7645046 7401857 6950397 6614957 6675916 6785394 6117979
6051 6117979 6035478 6002672 5860257 5703135 5427920 5184516 5253401 5509661 5051985 4962861
6041 4962861 4969400 4914951 4699960 4556541 4448316 4320498 4189530 4413846 4282616 4105234
6031 4105234 4044016 4142433 4018955 3893597 3790017 3563792 3553434 3796060 3923956 3930041
6021 3930041 3794194 3517359 3504362 3400802 3478836 3568682 3339365 3273480 3365138 3370913 3486688
6010 3486688 3465048 3282758 3028411 3245408 3516662 3250201 3674354 3740880 3851672 3761277
6000 3761277 3622015 3683216 3569142 3564479 3725544 3679635 3882172 3871624 3764116 3851144 3917176
5989 3917176 4077716 4277574 4490532 4667369 5276443 5802119 6634508 7591805 9082953
5980 9082953 10534047 11641303 12251971 12522342 12022927 11066671 10339547 9495646 8673030
5971 8673030 8010315 7184140 6453934 5902079 5695247 5408281 5389054 5187137 4913117 4889709
5961 4889709 4965430 5072987 5084810 5130823 4982290 5182167 5068572 5034558 4937480 5228467
5951 5228467 5312838 4912271 4970760 5547969 5397307 5365160 5441225 5581281 5669867 5658736 5609285
5940 5609285 5811703 5510599 5325427 5385099 5378523 5692214 5998757 6079319 6306598 6616846
5930 6616846 6511945 6834023 7269868 7388343 7672061 7979675 8327573 8615251 8871570 9336161
5920 9336161 9488604 9490652 9731013 9722565 9728140 10217017 10841899 11368042 11772530 12045019 12414347
5909 12414347 12875090 13568926 14078304 14718217 15837406 17041139 18255813 19156629 19855111
5900 19855111 20684614 21880804 23279079 25291415 27399255 29876158 32454271 35007354
5892 35007354 37691833 40918849 45240910 51692712 61331351 79319057 108801973 143279104
5884 143279104 173137578 193977943 201865243 197887511 187157153 172936943 158543714
5877 158543714 147332512 137539716 128471490 119444384 109440844 99511729 89823147 81369142
5869 81369142 73770717 66413719 59466101 53493071 48362403 43738421 39784447 37346353
5861 37346353 35608560 34004110 32345581 30915056 29965760 28630793 27687064 26997663 26451575
5852 26451575 26025326 25506592 25264180 25272396 25394441 25577876 26189342 26848289 27276085 28188621
5842 28188621 29307263 30691571 32339330 34252863 36358680 38726736 41503840 44978733
5834 44978733 49175465 53855058 59309164 65123258 71727284 80162750 90195592 103977079
5826 103977079 124162002 156041094 210439097 290927253 381036781 457499823 508149906
5819 508149906 523853180 508239192 471892019 422364764 367847672 314517307 265103144
5812 265103144 221495681 183638697 149937227 120799658 97787637 81060304 69145828
5805 69145828 59999591 52932768 47323258 42963167 39279091 36478770 34024571 31895407
5797 31895407 30366185 28740347 27378414 26312875 25028869 24019679 22829047 22079567
5789 22079567 21560148 20948025 20928617 21360928 21740844 21439769 20986962 20300493 19394761 18665708
5779 18665708 17820447 16742496 15793147 15021396 14521826 14227076 13658997 12801500 12156506
5770 12156506 11725706 11334732 11025059 10728356 10455951 10232096 9880095 9664717 9362631
5761 9362631 8993107 8635980 8211952 8025003 8368037 8084777 7688046 7498546 7338767 7322995
5751 7322995 6946391 6463202 6198997 6188625 6401927 6381462 6430313 6590259 7220130 7757753
5741 7757753 8087166 8253273 8089165 7791581 7606180 7197721 6551354 6320115 6071089 5766507
5731 5766507 5139487 4806813 4505979 4444580 4499868 4371649 4244499 4270841 4084424 3820878
5721 3820878 4004358 4131247 4113951 4236487 4625487 4670628 5204696 5206207 5155864 4855237
5711 4855237 4324649 4013166 3863199 3690384 3408394 3222484 3316918 3112791 2902159 2905496
5701 2905496 2806977 2891029 2717422 2466457 2433397 2701212 2503805 2353886 2316376 2295679
5691 2295679 2249883 2366643 2170763 1994361 1858914 1878432 2057872 2027143 2019967 2167797
5681 2167797 2294989 2269613 2153654 1898985 1850019 1986268 2106644 2049894 1961352 1662336
5671 1662336 1947492 2037979 2022921 2179372 2008363 1821092 1888329 2014062 2198026 1940696
5661 1940696 1754238 2091571 2024275 1978758 1749427 1670112 1843425 1435008 1509572 1472143
5651 1472143 1275297 1263742 1124621 1183966 1073652 1007158 1056098 1106292 1229792 1204928 1154026
5640 1154026 970425 1004211 914426 754352 915066 946720 999535 775590 815427 882660 896797
5629 896797 830323 783090 838097 1000742 870034 739310 819364 1086064 951115 915663 869961
5618 869961 1011336 1170432 1050582 857696 733862 919454 925417 1030992 1106570 1112369 940441
5607 940441 813938 926119 792717 826375 1122416 1129019 896182 810362 443219 739128
5597 739128 696302 641561 998465 1133526 1039321 980972 861985 747623 750627 492132 404362
5586 404362 729493 673894 446402 475117 465167 720192 630863 745081 425380 657382 740170
5575 740170 588149 733424 919465 890449 768650 683599 634126 630369 547008 511789 748416
5564 748416 681003 633553 692064 660256 786625 783323 594701 623960 716174 621630 724218
5553 724218 590100 746495 805407 925529 1300496 1501319 1592447 1695775 1613077 1889423
5543 1889423 1817415 1499733 1463110 1565410 1387257 1188431 865868 864328 906844 765790
5533 765790 493820 466492 430315 422403 379386 378143 619925 671815 571753 378522 463966
5522 463966 414547 300224 357934 449966 245639 564256 649534 495553 543633 710908 732020
5511 732020 542443 483205 496662 583350 411589 372889 642100 619993 533801 436264 576977
5500 576977 738683 725870 630592 610143 495754 671566 611962 638081 821250 868133 950865
5489 950865 1378998 1602001 2033537 2570699 2895894 2970792 3169008 3142535 2672931 2249841
5479 2249841 2202242 2288198 2001650 1598482 1212481 1252406 1237278 813282 577109 576998 614478
5468 614478 738326 636488 437558 357903 389304 454322 464108 306007 271869 646737 386009
5457 386009 363913 347280 435737 425113 254032 290018 410461 395825 223465 174626 214885
5446 214885 331635 180755 128833 -33698 -74950 636 134992 23070 162809 450756
5436 450756 345674 236204 415545 239393 -36675 247820 544139 317686 416324 413060
5426 413060 521118 371898 271793 42456 44204 -108289 -25358 -134830 -8089 81365
5416 81365 221457 296546 139736 178099 291594 371294 290962 206741 289951 55306 -36974
5405 -36974 394464 365114 286938 420862 489219 389503 292853 395517 192832 119824 278009
5394 278009 126627 91696 111336 110725 131638 146451 136941 220546 266272 364955 256062 214070
5382 214070 246628 282698 282217 226191 269243 254204 -108158 136372 432587 343865 86241
5371 86241 144839 174571 297647 478620 530753 268474 335739 244966 197158 169617 258945
5360 258945 154435 -33139 213513 -194756 -309941 278132 411283 273376 244152 352136
5350 352136 177308 25273 358542 247307 450343 517146 228423 261860 171524 264144
5340 264144 286933 378032 478286 317047 172424 203885 379315 217442 301360 330603 139726
5329 139726 -9855 25998 386026 468757 198621 126676 96812 239730 214583 361131 306798
5318 306798 348524 416285 243963 131942 190516 151399 92701 175828 96555 115191 179411
5307 179411 261064 -34769 41498 16800 201997 101338 -100993 -34177 221694 498041
5297 498041 356901 130689 177882 290963 354269 450990 563837 576627 485958 517736 205083
5286 205083 94928 120731 134248 310993 107290 -52145 53411 353288 471567 311542
5276 311542 461538 267871 294107 451376 487412 441410 339714 185839 291032 322673
5266 322673 305785 408330 329874 228534 130215 177236 445062 333439 175296 285265
5256 285265 83797 166614 445951 426753 288529 296039 386632 608071 523570 170528 134783
5245 134783 143861 187189 252468 80538 226047 372474 267612 44026 -129466 150770
5235 150770 173369 -102006 -52565 -9505 -24543 197061 321818 327539 115021 -7559 59872
5224 59872 244879 212048 187016 323646 137585 156795 274918 123222 235649 348185
5214 348185 264944 255241 431197 476708 396198 394126 178827 214958 137931 179051 165558 422699
5202 422699 335963 286521 382079 579867 497220 412216 677277 486412 379636 313566 157552
5191 157552 272712 498917 365025 419202 697067 433485 310843 250061 250682 313821 247433
5180 247433 210663 279507 447700 242418 320370 268050 376731 684007 521788 238762
5170 238762 305989 433899 566297 493868 595915 848133 632795 366205 503178 725566
5160 725566 697134 854719 786323 621469 636192 602556 723247 773130 672205 479314 577474
5149 577474 608492 728347 739244 725674 873350 684967 728743 860139 875290 797789 715629
5138 715629 854497 827637 823685 839764 742298 459654 716515 968298 916063 735333 607155
5127 607155 532863 906456 953183 672288 910922 1062489 529323 702383 757867 683550
5117 683550 635227 507744 503926 663215 635416 857033 1169103 1289936 1323332 1128571 1201744
5106 1201744 1220759 1123564 940123 1069383 1119935 1103262 862715 1020538 1204991 1427594
5096 1427594 1368369 1144128 1038268 1227356 1251021 1319438 982922 937825 994770 1109430
5086 1109430 1020233 1002342 1144315 1247281 1172853 1057223 1371799 1248441 1054336 1059905
5076 1059905 974684 742221 793911 987587 1004109 1187517 1137995 1242366 1096728 973779
5066 973779 962862 991909 1047540 1119843 1206454 1048074 1039391 1303188 1338934 1192559 1570251
5055 1570251 1331241 1224142 1176624 1204385 1249124 975960 958647 951711 1158510 1453025 1561873
5044 1561873 1608948 1491382 1467673 1711552 1659205 1468336 1664102 1515650 1515071 1470529 1203092
5033 1203092 1537426 1809127 1769693 1899874 2046379 1863861 1759565 1614919 1405160 1445023
5023 1445023 1355631 1275372 1352588 1300661 1657388 1539616 1779815 1896956 1617516 1590311
5013 1590311 1639041 1879156 1756803 1655145 1545992 1459866 1440989 1389753 1673591 1690368
5003 1690368 1706441 1432087 1499209 1762508 1686165 1607581 1911226 1901280 1743423 1646329 1763288
4992 1763288 1996674 1802274 1894217 1835502 1938181 1916246 1734079 1793575 1944264 2013416
4982 2013416 2143473 2269367 2566401 2359427 2139290 2161167 2398604 2348532 2339808 2340613 2367993
4971 2367993 2648543 2754563 2544587 2503922 2351179 2569137 2494002 2499302 2550326 2584689 2679219
4960 2679219 2898045 2850353 2595951 2432272 2687442 2898026 2730710 2790230 3262367 3328064
4950 3328064 3120888 3125683 3159753 3073572 2925389 2793737 2876948 3294376 3340681 3422386 3493452
4939 3493452 3656008 3648812 3431105 3450836 3420632 3248951 3503943 3662045 3586686 3786751
4929 3786751 3883961 3863966 3927604 4030587 4207076 4361099 4367885 4329257 4544470 4546082 4290912
4918 4290912 4300431 4508221 4654971 4870660 5206435 5185212 5399972 5474881 5698704 5922468
4908 5922468 5922397 6211592 6304767 6546032 6302047 6430504 6735869 6916075 6998813 7307424 7781134
4897 7781134 8065660 8249574 8598113 8827255 9193060 9569048 10303206 10770326 11130354 11423708
4887 11423708 11784722 11942502 12548449 13135955 14034131 14904221 15848184 16799660 17840841
4878 17840841 19168292 20133902 21463071 22702993 23918524 24977735 25940966 26651839 27507738
4869 27507738 28582063 29696479 30547550 31668140 32674516 33565114 34428357 34912357 35584686
4860 35584686 36129778 36926908 38000884 38934629 40417180 41812516 43747108 45737338 47890262
4851 47890262 50257667 52611011 54988464 57320579 59589843 61898350 64673982 67652433
4843 67652433 70632360 73532575 76232926 78616258 80668060 82022423 83082382 84136736
4835 84136736 85402595 86356934 87017614 87442505 87069473 86812721 87102692 87479619 87891425
4826 87891425 88492484 89744729 90942865 91979831 93296739 94857192 96147893 97436555
4818 97436555 99103206 100898190 102525366 104175736 106314898 108458758 110120235 111622170
4810 111622170 113112795 114677259 116424307 118075220 119849357 121170506 121909502 121820104
4802 121820104 120836860 119399143 117862363 115957713 114012904 112405668 110878966 109758232
4794 109758232 108781160 107610499 106425767 105633140 104856939 103785269 102710618 102050012 101637989
4785 101637989 101026657 100492705 99596517 98518042 97309972 96051588 95071295 93860016 92531648
4776 92531648 90865694 89169506 87409660 85437437 83431147 81326205 79919362 78354616
4768 78354616 77125044 76309821 75448131 75108882 74851893 74105941 73633008 73265007 72964861
4759 72964861 72808830 72507243 72429747 72049822 71292026 70511183 69564604 68147591 66559251
4750 66559251 65295872 63820237 62494890 60800193 59063677 57311929 55629488 53938715
4742 53938715 52368077 50783795 49154053 47967719 46924819 45982431 45424695 44911299 44746078
4733 44746078 44516676 44288907 44086210 43740559 43607327 43466609 43340063 43103302 43053698 42954348
4723 42954348 42838599 42638538 42713542 42666815 42952774 43152556 43561268 44005262 44485150 45700339
4713 45700339 47039135 48544920 50326809 52525693 54802157 56816870 58855531 60726138
4705 60726138 62748530 64244106 65797294 67348848 69080052 70982638 72948338 74636301
4697 74636301 76128155 78167850 80286068 82387272 84731643 86667474 88719406 90553412
4689 90553412 92237278 93742409 95282311 97244597 99214900 101424052 103500458 105467078
4681 105467078 106760301 107447295 107103298 106336465 105321919 103524105 101805349 99800898
4673 99800898 97360687 94924871 92153535 89247157 86755529 83962624 80690361 77518955
4665 77518955 74937229 71893769 69131527 66755680 64598402 62747426 61123754 59445396
4657 59445396 57871504 56586681 55350718 54425461 53067031 51757290 50375579 49223704
4649 49223704 47857790 46028197 43888287 42002050 40120035 38019359 35846105 33702730
4641 33702730 31533138 29384886 27457627 25470793 23812571 22486904 21215668 19934868
4633 19934868 19043401 18126843 17154316 16357603 15433752 14902073 14342980 13747175 13270617
4624 13270617 12807703 12379839 12127974 11750426 11609005 11276926 11016517 10639305 10285727
4615 10285727 10062171 9826923 9749219 9466450 9204685 8875265 8495195 8505211 8462870 8560000
4605 8560000 8393196 8147630 8002680 7969140 7818781 7729467 7617542 7307221 7519115 7521214
4595 7521214 7361289 7490932 7389298 7335359 7514906 7418740 7182393 7345351 7431992 7468726
4585 7468726 7402385 7279193 7221183 7190053 7400308 7348551 7341140 7588765 7838146 7739063 7537434
4574 7537434 7608318 7636349 7543360 7812842 7466346 7409167 7331130 7336867 7662089 7874381 7780472
4563 7780472 7818959 7799906 7696009 7573295 7583932 7638188 7694965 7408582 7051858 7240693
4553 7240693 7495778 7308062 7145556 7270558 7447171 7266509 7460490 7497854 7650943 7773985
4543 7773985 7885426 8007561 7787555 7905069 7932596 8169451 7993575 8005109 8201440 8504359
4533 8504359 8525298 8493240 8892713 9015904 9001014 9048560 9200175 9545366 9708265 9839723
4523 9839723 10013134 10234619 10213468 10404672 10521033 10752032 10937861 11198385 11455449 11567678
4513 11567678 12027841 12573410 12924099 12909521 12947500 13258860 13526818 13763898 13908762 14145195
4503 14145195 14120494 14388076 14798938 15031649 15277138 15757804 16154917 16424198 16695798 16791264
4493 16791264 17218115 17532948 17706754 18193690 18856449 19536877 20095790 21045154 22224991
4484 22224991 23484981 24702108 26344620 28612340 31510710 35191877 39877787 45500440
4476 45500440 51372807 56818258 61108529 63975878 65538995 66686463 67952040 70304249
4468 70304249 75027791 83031246 93245498 103095792 110596538 114191867 113643652 110597754
4460 110597754 105630334 100100379 95247756 91569931 89025498 87615969 86655434 85118289
4452 85118289 83316267 81161977 78615773 75790557 72578564 69295754 66385228 63900272
4444 63900272 61665257 60011702 58932528 58690971 58839832 59516995 60715283 62335742 64333708
4435 64333708 66894836 69488812 72671763 76127810 80298664 85299985 90822210 97583080
4427 97583080 105586556 115072225 126164213 139919201 156494809 176052698 198827204
4420 198827204 224433641 252515906 281906557 311329122 339527981 365284735 387909039
4413 387909039 406101584 420163385 430552891 438144698 443936801 448759070 453641899 459247049
4405 459247049 465979693 473573315 481391235 488027795 491609702 490372363 483861703 471489722
4397 471489722 452669058 428123977 399030488 367485086 334530228 301689566 269826049
4390 269826049 239915921 212959970 188546726 166793308 148444084 132590741 118880723
4383 118880723 107313844 97841290 89693765 82730711 76628614 71500059 67155372 62812728
4375 62812728 59086769 55733980 52667355 50157660 48041640 45758427 43993317 42529739
4367 42529739 41137842 39966737 38691471 37405500 36303918 35235744 34540309 33849198
4359 33849198 33167031 32405253 31407485 31100412 30514214 29589525 29151077 28702214 28199979
4350 28199979 27625977 27023882 26404792 25928956 25584642 25209409 24579841 24387115 24139617
4341 24139617 23746526 23448716 23217265 22975940 22687749 22529011 22356271 22176052 22152239 22210550
4331 22210550 22437136 22536628 22765926 23043470 23174117 23723430 24233489 24758782 24993513 25669654
4321 25669654 26426093 27372382 28627230 29457451 30720816 31795560 33206529 34748819 36140397
4312 36140397 38024019 39728157 41687875 43921462 46226944 48771578 51455427 54305122
4304 54305122 57173510 60429547 63917415 67199390 70650227 74062532 77520058 81170765
4296 81170765 85255190 89008004 93128211 97483573 101598121 105990678 110455704 114764310
4288 114764310 119183090 123144909 127069569 130869386 134602770 137909661 140867496 143721113
4280 143721113 146216964 148772435 151292551 153684826 155599320 157414439 159140440 160147817
4272 160147817 160674216 160765391 160175862 159342224 158198982 156910549 155300768 153219050 150995427
4263 150995427 148612054 146147577 143322577 140228070 136881124 133645376 129948060 125691686
4255 125691686 121626647 117384131 112954531 108784940 104204480 99639264 95259962 90951789
4247 90951789 86972028 82983868 79071509 75049970 71619804 67751684 64311888 61013379
4239 61013379 57585833 54534322 51579560 48262637 45474556 42853186 40523458 38378633
4231 38378633 36327643 34506521 32840703 30959063 29147888 27837391 26646900 25338109
4223 25338109 24260312 23143766 21901032 20659467 20087611 19681898 18960562 18261389 17908694
4214 17908694 17047645 16292532 15969058 15318059 14935444 14739763 14740308 14178807 13661948 13521796
4204 13521796 13436042 13245795 13107676 12764149 12204971 11971555 12075937 11736834 11466363 11080458
4194 11080458 10904596 10868757 10929067 10675291 10296335 10147145 10219048 10173312 9963332 9863185
4184 9863185 10189100 10109911 10150968 9801872 9568096 9599831 9660653 9306665 9168725 9279955
4174 9279955 9375862 9221056 9473969 9865627 9723625 10081275 10410146 10863535 11097219 11401963
4164 11401963 11440930 11329296 11392320 11562774 11351926 11251365 11092458 11232097 11166031 11013794
4154 11013794 10976459 10713805 10543628 10538670 10456388 10409355 10500341 10153310 9665256 9369423
4144 9369423 9071221 9130292 8821761 8408001 8357946 8188006 8247386 8207963 8095846 8058685
4134 8058685 7972022 7793736 7900619 7828790 7865194 7940485 8048746 8366624 8531794 8819498
4124 8819498 8848602 9126492 9434809 9754505 9900633 10160232 10278090 10220048 10074479 10100362
4114 10100362 10283350 10113334 9978208 10258334 10177752 9818838 10023903 10059049 10078406 10180516
4104 10180516 9961480 9817905 9686226 9803195 9733085 9545805 9410511 9256386 8991665 8833057
4094 8833057 8446293 8279512 8330640 8278634 8153073 8118232 8206748 8334088 8350867 8228149
4084 8228149 8286312 8329660 8396636 8468255 8417271 8255870 8629928 8534427 8481317 8572042 8865922
4073 8865922 9140497 9588332 9521696 9130078 9316913 9641839 9620080 9822014 9793642 9753688
4063 9753688 9821291 10032707 10014940 10159350 10482523 10402717 10583025 10677437 10639899 10764949
4053 10764949 10917299 11347578 11639087 11822823 11906361 11912637 12369851 12812889 12962621 12899571
4043 12899571 12982661 13526044 13774705 14291580 14480628 14805358 15223295 15661169 16030963 16624918
4033 16624918 17092246 17275302 17783601 18423586 18968095 19260526 19542078 20186897 20552443
4024 20552443 20656550 21571336 21968834 22421517 22905037 23604446 23905656 24443921 24622529
4015 24622529 25208624 25773908 26178793 26601841 27371971 28243214 29147768 30115536 31181820
4006 31181820 32249244 33829115 35457063 37321965 39006482 40905601 42956690 45121184
3998 45121184 47649446 50421077 53600259 56940017 60250968 63219808 66250085 69184208
3990 69184208 71997876 74580672 77114270 79601268 82263424 84600816 87415633 90335760
3982 90335760 94194632 98877235 103857801 109724213 116166655 121991444 127330687 131595755
3974 131595755 135145889 138118507 141152257 144443002 148112300 152614367 157840561 163713314
3966 163713314 169827301 176458635 183440252 190247827 196574545 202408090 207851749 212690193
3958 212690193 216811188 220319381 222802226 224574601 225862637 226682121 227338791 228273672
3950 228273672 229598740 230797346 231796141 232664138 233354996 234534193 236198049 238735204
3942 238735204 241331811 243762488 245674984 246510448 246663094 246003163 245220092 244844334 245264658
3933 245264658 247526614 251359804 256640491 263588589 271596189 279710912 287561997 293838591
3925 293838591 298388493 300920253 301027322 300029617 297992037 295570424 293168492 291477829
3917 291477829 290768762 291245105 293286620 296172411 299201968 302054280 304388885 305443486
3909 305443486 305701290 305434667 304880061 303942960 302397513 300807715 298991564 297336842 295027252
3900 295027252 292732318 289680060 285696582 280801172 275137958 268365256 260553073 252699853
3892 252699853 244302837 236093370 228229418 220442397 213025920 206098811 199400224 193623161
3884 193623161 188205394 183417031 179580205 176394026 173867119 172202204 171291804 171274438
3876 171274438 171816333 173190820 175354556 177686526 180152145 182838105 186051007 188952029
3868 188952029 192134361 195673501 199216276 202569504 206087513 209708163 212666731 215304187
3860 215304187 217682931 219260925 220007275 220440273 220389641 219653188 218961005 218654251 218641250
3851 218641250 218618367 218576444 218301946 216649673 213193229 207917785 200917568 191982105 181924840
3842 181924840 171055510 159511055 147786200 136409127 125615757 115304295 106370803
3835 106370803 98372970 90915051 84156448 78614603 74256408 70293347 66759786 63953211
3827 63953211 61642089 60151884 58725332 58084346 57883053 57680182 57662225 58019219 58606533
3818 58606533 58841745 59446618 60218386 60715322 61288133 61781879 62117088 63029018 63532140
3809 63532140 63983584 64756097 65372737 66189180 66416444 66415972 66234926 65766362 65056808 63973197
3799 63973197 62626815 60949279 59255347 57438364 55622934 53551401 51853178 50041223
3791 50041223 48214676 46618169 44748533 42748625 40485560 38308790 36167856 34297940
3783 34297940 32256173 30163037 28438469 26514468 25012334 23537421 21968683 20420007
3775 20420007 19166410 18431341 17907479 16954025 16256433 15711316 15090325 14299589 13735480
3766 13735480 13427223 13246631 12691715 12195181 12083281 11687455 11475332 11408175 11016483 10839255
3756 10839255 10629500 10253370 9801610 9658111 9278949 8960153 9108159 9145274 9104362 8785171
3746 8785171 8438350 8274309 8292544 8098704 7852795 7791074 7672501 7632394 7465508 7494837
3736 7494837 7550386 7387028 7084391 6925840 7019885 7129244 6945879 6666204 6430248 5908838
3726 5908838 5727521 6042631 6227839 6160712 6024069 5861541 5938427 5912872 5813755 5684366
3716 5684366 5566424 5589733 5557250 5352472 5408148 5067407 5259713 5132187 5137482 5334158
3706 5334158 5378272 5277873 5145105 4980699 5090836 5126594 5064195 4824404 4811595 5038222
3696 5038222 5047622 4904774 4555304 4546544 4578183 4825183 4728772 4528280 4809090 4914352 4908168
3685 4908168 5063177 4780286 4801033 4934922 4727894 4824235 4922044 4779894 4834750 5204377
3675 5204377 5102778 4959563 4809841 4761072 4756250 4467461 4654428 4760550 4677056 5073932
3665 5073932 4967782 4706477 4811373 4860016 4815646 4753256 4917006 5062781 5027447 5078915
3655 5078915 4961682 4848540 4798714 4978444 4989258 4973605 5094211 5048358 5169296 4989648
3645 4989648 5165160 5516618 5576244 5673582 5895232 6336083 6735314 6887687 7411320 7874042
3635 7874042 8287403 8290079 8173713 7996389 7935332 7901821 7681905 7368757 6876994 6690375
3625 6690375 6526771 6480047 6373084 6215619 5993752 6112020 6168128 6187693 6515324 6500426
3615 6500426 6594176 6416885 6687350 6777272 6757485 6733614 7131374 7326146 7768355 9197119
3605 9197119 10515661 11402520 12070390 12586935 12670456 12400735 12101561 11845873 11480919 11408504
3595 11408504 10912891 10490531 10712516 11283249 11508282 11885990 12103649 12131529 11880497 11277083
3585 11277083 10755687 10051177 9443894 9246283 9050897 8637220 8105440 8079894 8122605 8146853
3575 8146853 8455059 8742885 9222613 9568476 9884844 10016696 10482855 10549220 10112960 10260463
3565 10260463 10259533 10284480 10525220 11101264 12052960 13520965 15426112 17037279 17994777 17896803
3555 17896803 17536436 16575866 15459443 14293050 13081785 11955945 11158849 10202186 9189823
3546 9189823 8651300 7975911 7589908 7432793 7312061 7487406 7809681 7894381 7666959 7643352
3536 7643352 8090029 8178108 8045962 7842698 7799012 8176127 8415887 8795971 9705087 10721651
3526 10721651 11503260 12100731 12254979 12134258 12239546 11771615 10947731 10532158 10210511
3517 10210511 9397405 8936773 8744632 8563851 8177557 7820524 7773150 7698923 7960459 7987414
3507 7987414 7702645 7663180 7860492 7795447 7894949 8180580 8116461 8004146 8564415 8961895
3497 8961895 9303487 9643832 10011838 10484356 10536941 10715146 10581639 10685883 10696878 11071525
3487 11071525 11251991 11148791 11210624 11304622 11545481 11716457 11958497 12641308 13152602 13484780
3477 13484780 14018996 14512089 15191022 16021800 17009769 17870309 18852420 19996547 21587729
3468 21587729 23042156 24336853 25503223 26078125 26549619 26521730 26118019 25596002 24542914
3459 24542914 23156768 21794865 20449332 19268393 17941232 16831495 15973518 14725998
3451 14725998 13465424 12843014 12147435 11483134 10998350 10364304 10017867 9948204 9757892
3442 9757892 9363625 9122839 8930937 8666085 8193440 8004442 7953428 7821829 7745573 7606869
3432 7606869 7576943 7421921 7204084 7326745 7139238 7161289 7206014 6906105 6829299 6927303
3422 6927303 6546408 6273916 6320649 6003647 5862132 5816453 5651450 5634205 5477670 5215948
3412 5215948 5151563 5060544 5134257 5147536 5001945 4813410 4980273 5143040 4992755 4716741
3402 4716741 4922175 5039724 5037105 4648177 4366915 4430618 4713349 4878898 4538586 4388528
3392 4388528 4129059 4040690 3885740 3924495 4148115 3924154 3670295 3858575 3954207 4115028
3382 4115028 4131396 3840409 3688179 3878526 3904994 3975699 4050181 3961464 3588688 3413185
3372 3413185 3445536 3735724 3540821 3438359 3306877 3343495 3426300 3496205 3674278 3825275
3362 3825275 3607181 3378473 3418527 3233631 3173803 3288412 3097021 3130681 3263236 3311843
3352 3311843 3116969 2799504 2663942 2761691 2997930 3136166 3019979 2962113 3025531 2888576
3342 2888576 3004891 2957958 3152913 3084418 3043309 2921354 2931483 3082232 3085968 2825565 3022928
3331 3022928 2970875 2866692 2378769 2464639 2750999 2634903 2593962 2463266 2523135 2588389
3321 2588389 2568278 2458040 2564353 2553838 2451283 2646119 2824464 2837221 2626404 2645330
3311 2645330 2658547 2483418 2544332 2609519 2455017 2437855 2428925 2320886 2423595 2310606 2222665
3300 2222665 2263266 2496113 2804540 2517270 2543491 2342829 2246692 2221164 2199024 2189802 2212374
3289 2212374 2305497 2251218 2276275 2342564 2370938 2287603 2427337 2534946 2651711 2393364 2364028
3278 2364028 2290381 2134499 2317448 2539733 2317150 2243589 2258552 2336035 2238336 2533181
3268 2533181 2573892 2454426 2577379 2406712 2313208 2355603 2381218 2281660 2240577 2379383 2461985
3257 2461985 2393160 2259362 2175224 2151983 2245072 2468967 2570072 2539368 2526895 2554275 2480530
3246 2480530 2526481 2654535 2672094 2457889 2428662 2899155 2883264 2750713 2892515 2948973
3236 2948973 2782688 2928529 3188585 3413460 3562481 3361829 3162728 3503556 3746001 4167550
3226 4167550 4172384 4213696 4710625 4623747 4715772 4847641 5129694 5100863 4982658 4961082 4832090
3215 4832090 4711158 4852872 4555631 4334915 4383337 4475335 4387301 4503476 4254543 4001187
3205 4001187 4105015 4202162 4332858 4416159 4747693 4796549 4888707 5154055 5450027 5667604
3195 5667604 5767412 5972975 6297363 6704499 6931858 7236709 7772745 7803188 7965875 8244103
3185 8244103 8344881 8261856 8415446 8245846 7925258 7954772 7628172 7561986 7607228 7288666
3175 7288666 6929215 6817071 6682986 6323242 6051778 5700346 5906932 5812331 5953485 6128664
3165 6128664 6095721 5992823 6149267 6151543 6471417 6741918 6294110 6609428 7027523 7634813
3155 7634813 7941792 8565481 8783116 8954873 9126974 8681055 8734924 8951065 9027201 8940083
3145 8940083 8764295 8838998 8365580 7983603 7943493 7974817 8167365 8096349 8266860 8041690
3135 8041690 7844554 8263449 8504014 8622291 8879588 9283932 9761553 10195638 10459487 10895610
3125 10895610 11058982 11026051 10878250 10714406 10344364 10123721 9873655 9891872 9539398 9152837
3115 9152837 8952483 8754213 8689703 8537883 8555014 8402472 8381493 8711504 8982090 8896531
3105 8896531 8914890 9009012 9091952 9547237 9792309 10084926 10305007 10427524 10547423 10690602
3095 10690602 10722006 10381071 9952160 9795781 9392925 9126690 8725042 8374595 8246501 7804372
3085 7804372 7803102 7660596 7328930 7233032 7319772 7161060 6890425 6949897 6909844 6737644 6911584
3074 6911584 6626795 6469407 6389428 6378725 6245989 6195344 6049868 5919901 5691709 5194837
3064 5194837 4776374 4829291 4883396 4778050 4518445 4384012 4007763 4087769 4121004 3826649
3054 3826649 3671864 3694735 3501490 3478667 3555935 3549790 3487762 3390301 3305998 3218506 3195870
3043 3195870 3079078 2756279 2790021 2882644 2934495 2981120 2804509 2381504 2354422 2428592 2255380
3032 2255380 2265900 2164371 2078997 2084076 2311203 2275760 2060162 1987868 1941625 1826635 1861137
3021 1861137 1723544 1818038 2012034 1949734 1952705 2003539 1981483 1989230 2222171 2104619 1664034
3010 1664034 1616079 1421719 1457963 1378504 1427598 1831081 2061628 1846466 1737104 1475397
3000 1475397 1340227 1289546 1264699 1342650 1349292 1313892 1298098 1287381 1503207 1341540 1225180
2989 1225180 1179588 1274715 1152178 1108542 1025428 1086626 1044025 1111896 1236153 703875 625269
2978 625269 646912 800055 938110 946623 1032753 766531 889868 856622 880218 1018135 793081
2967 793081 503482 547503 597761 656625 611186 611098 535990 335511 597619 626077 563172 466838
2955 466838 748644 548455 442733 557540 877612 609531 557197 600218 375583 407406
2945 407406 398868 650746 694357 648803 569386 352209 198886 184791 256591 655829 538025
2934 538025 421325 457459 303059 272347 334366 589045 536631 597334 371716 174719 404077
2923 404077 292020 473509 382760 484143 339562 166803 341802 367505 306592 126476
2913 126476 358172 370691 246273 182426 532701 588229 832651 494026 420269 357584 232193
2902 232193 385609 281643 210500 385929 389890 275136 517911 288661 261013 472559
2892 472559 584392 436743 274212 402658 214339 437612 413111 247722 -43589 49124
2882 49124 331823 389240 565479 405699 213965 362726 729352 631062 795244 882357
2872 882357 819785 912216 948889 865502 922166 944027 1061757 743116 689363 817520 894464
2861 894464 745085 760298 1047371 1018602 965219 1203428 1191755 1104777 980686 663824 748638
2850 748638 736417 535782 528106 793017 1388294 1386928 1387188 1037004 915811 1136919 1228918
2839 1228918 1311792 1393525 1647536 1612558 1327176 1279378 1598727 1668693 1597689 1616103 1775543
2828 1775543 1851310 1930673 1647307 1442629 1510671 1654147 1406875 1361564 1593597 1758580
2818 1758580 1664084 1455182 1429062 1336769 1511606 1829780 1922657 1923817 2117761 2150888 1883558
2807 1883558 2092362 2172456 2025975 1999730 2048144 2009260 1956588 1873112 1688675 1912823 1790439
2796 1790439 1600229 1599503 1478614 1712820 1787330 1623592 1391773 1465179 1509558 1651061 1793735
2785 1793735 1725375 1553455 1210724 1208074 1408640 1532321 1581430 1436029 1254188 1419746
2775 1419746 1633563 1564170 1540122 1250198 1284444 1567000 1698252 1494316 1272810 1343628
2765 1343628 1132695 895507 1043492 891836 680727 810220 542764 505983 447035 618402
2755 618402 774881 819520 1051965 870919 675665 620134 632051 629208 463678 333974 466795
2744 466795 640971 310675 357665 478957 366584 713862 739451 644145 319431 244072
2734 244072 159866 225626 206870 168163 464802 211658 174270 243428 370062 145031 112677
2723 112677 148747 159328 11095 15520 154076 249900 283986 91507 -163922 24085 295431
2712 295431 161656 93869 133183 251324 304391 389135 106934 -66182 -160096 -284603 -248331
2701 -248331 -143362 10982 -123346 -105473 91042 182971 30121 104181 219909 -136904
2691 -136904 -189958 37976 68313 67315 -23444 -36207 -134570 -239095 -308276 -178609 -268992
2680 -268992 -309963 -239975 -40699 -60841 -90930 -223058 -247306 -198726 -281400 -385971 -341425
2669 -341425 174945 9683 -221761 -300282 -286686 -79959 -158777 73922 -40513 -301295
2659 -301295 -252226 -95445 -85033 -254893 -280286 -201239 -41900 -141430 -147171 -55227 -155728
2648 -155728 -244436 -338074 -442985 -484505 -185689 -193113 -499655 -288604 -41028 47363 -138247
2637 -138247 -271911 -507105 -503992 -408953 -216062 -438137 -409327 -434822 -301921 -466646 -348139
2626 -348139 -273003 -254437 -148733 -248416 -238782 -97800 46441 244304 -35082 -459504 -430826
2615 -430826 -190780 50365 23565 -122404 -75522 90779 106554 39699 12868 -55213 -195284
2604 -195284 -106395 -81428 -221452 -341298 -308188 -141839 34043 261239 428796 418618
2594 418618 521997 661074 672627 577292 693003 876054 639395 272389 385023 312573
2584 312573 58499 64149 317348 350144 166013 232020 125690 -74685 -45391 -105598 22861
2573 22861 -225747 -102961 -193855 -233914 -172393 -372312 146006 217339 9473 55071 -31100
2562 -31100 267877 258552 354149 105749 41134 111447 132812 82456 -272113 -247088 -150830
2551 -150830 -63672 164405 47089 -53949 15956 -149615 104666 197204 111594 194203 215383
2540 215383 162171 -16200 -201033 -154511 -150100 -48294 -187893 -205019 -130575 -75813 -213974
2529 -213974 -233566 -80339 -111214 -79886 -187700 -210339 -309732 -117472 -6549 -246530 -298975
2518 -298975 -338890 -188408 -80771 132518 -116634 67047 -53445 -75994 -176303 -116135
2508 -116135 6619 -217689 -46512 -285959 -366186 -386945 -133234 224426 -3911 -268461
2498 -268461 -157043 -238751 -143976 -119233 1064 70845 100467 100652 146619 25801 83228
2487 83228 209421 196310 -43214 205129 148831 101327 263713 353716 105957 144792 508413
2476 508413 315310 312319 364267 175649 306590 545082 393624 57688 200668 152274
2466 152274 269631 270105 288114 79792 -159545 258991 118275 70224 101117 224548 4402
2455 4402 -48858 174709 146254 54478 -73838 83150 410213 436556 641442 466333 391822
2444 391822 501627 574652 396106 391017 387026 316431 152709 496982 740924 560016 360700
2433 360700 310661 654208 839917 842518 686546 815885 724779 592962 488087 373602
2423 373602 309872 381985 344413 397734 321357 499141 896067 727808 728347 930187 960453
2412 960453 810716 836569 1044763 834085 811890 1000521 934729 1076391 989808 927706 1021097
2401 1021097 917251 841527 921802 1174697 1202292 1197929 1557285 1480146 1382630 1403595 1593163
2390 1593163 1536446 1487255 1505494 1599434 1666398 1630660 1547979 1735040 1800976 1553480 1446366
2379 1446366 1727845 1808904 1912659 1976559 1886271 1777521 1805878 1897938 1969476 2123953 2169457
2368 2169457 2285872 2437782 2470814 2426111 2478078 3135598 3232266 3276101 3427318 3427620 3510394
2357 3510394 3533752 3944036 4261627 4317077 4601439 4944811 5075228 5465018 5683777 6299427
2347 6299427 6861500 7480876 8393203 9489681 10892752 12379678 13711736 14619188 15778040
2338 15778040 16772579 17916133 19435784 20881499 23118476 26489051 31291137 39052730
2330 39052730 53570142 78796561 109810052 135714472 153547377 159267559 154082500
2323 154082500 142484270 126641559 108733909 91573492 76215129 62779397 51442894
2316 51442894 41265015 32663198 26188990 22185495 20091764 17934713 16101506 14464576
2308 14464576 13253599 12180568 10880923 9965139 9096563 8414304 7750909 6968176 6269268
2299 6269268 5868256 5692863 5257627 4870429 4564039 4408290 4271226 3960250 3908673 4068524
2289 4068524 3783912 3482767 3398854 3175372 3184589 2958486 2880368 3290657 3239510 2655935
2279 2655935 2504256 2547593 2471359 2597162 2584052 2265471 2352468 2061379 2018700 1836138
2269 1836138 1613593 1695762 1942871 1721121 1684997 1820429 1591290 1553271 1477960 1306626
2259 1306626 1248755 1446473 1469473 1373096 1394230 1123918 1141878 970088 991857 1019804 968866
2248 968866 864917 966834 914190 675954 895693 972193 858570 543585 663181 543204
2238 543204 585284 746415 605273 623937 524758 630679 769165 685169 595256 514943 544588
2227 544588 428787 170874 248494 339009 353279 497409 653481 358808 172629 450676
2217 450676 279415 47296 503411 513037 254891 440395 711144 562614 551586 558438 479181
2206 479181 195920 69055 405508 326524 100901 -181655 6161 13483 25350 -3448 104273
2195 104273 133368 238538 433956 450152 420382 340729 451256 573643 323705 105230
2185 105230 162406 41293 33334 -33055 -99554 113643 267549 124951 253819 221815 173033
2174 173033 422933 372702 224385 61489 -123537 2165 -7624 181383 115129 71831 -50415
2163 -50415 -122928 -192957 -172124 -304162 -446083 -279356 -170865 -291411 -470095 -180168
2153 -180168 38255 169495 240610 307685 152948 216217 78842 210391 296993 116097
2143 116097 -8276 -156344 -149326 -201174 -223304 28229 74370 -211058 -220020 -129258 -167264
2132 -167264 -179132 -65115 232050 97319 170410 80423 198713 126670 146519 406479 296759
2121 296759 372389 259156 20432 -111983 -108804 113670 57888 -83064 11248 -188059 -265969
2110 -265969 -255026 -483729 -308587 -52493 -298058 -263707 -262147 -207125 -332411 -313547 -35580
2099 -35580 91114 -110955 -367285 -68225 75220 -275258 -327128 -581424 -474039 -248117
2089 -248117 84798 295297 101218 -290527 -517039 -466426 -215000 -114144 -338674 -235511
2079 -235511 -410757 -369315 -372168 -192963 -334288 -301801 -143655 -107176 -159 -27825 -160014
2068 -160014 -13200 56212 -104888 -6530 83502 -79826 -175134 83977 81211 274739 382930
2057 382930 502935 793235 738884 692637 870848 656420 477050 397401 436890 276047
2047 276047 36034 -2857 -38864 -202266 -274431 -54721 -264821 -340983 -259744 -342231 -286946
2036 -286946 -153561 -76742 173358 159541 -16557 -201264 -310626 -228457 -195237 -369018
2026 -369018 -205865 -236605 -161138 -5527 -11871 303354 191039 -91211 -130938 102901 -59151
2015 -59151 -189591 -178352 214181 183330 -205677 -70860 -308895 -104931 29575 -124409
2005 -124409 -216320 -318765 -431284 -160785 -77224 -199128 -7460 -55887 87987 242308
1995 242308 74515 -216278 -319240 -325344 -185758 -21061 9650 9192 -212384 -323175 -43890
1984 -43890 130646 843 -295981 -255947 -21607 137074 -152168 -129452 -93901 -104636 -62008
1973 -62008 25841 -163071 -549024 -177695 -220486 -81079 -114724 -225059 -146927 -379894 -125207
1962 -125207 -91519 -25575 -229463 -173522 -166907 -86391 128642 206587 81872 59208 -48758
1951 -48758 -327022 -267027 -375625 -469560 -422057 -53729 -201409 -145960 -140378 -151271 -276596
1940 -276596 -158537 277091 322869 223297 -194599 -101051 36523 -195400 -198271 -207848 -172535
1929 -172535 -101579 -55344 18268 130374 154185 151988 36693 -81659 72312 86946 -75520
1918 -75520 9151 -257619 -392268 -326899 -153853 -172542 -220216 -181198 -50123 -43074 -100346
1907 -100346 -107541 -252014 -214042 -445425 -84866 79935 -225466 -175893 -125373 17034 6031
1896 6031 -57722 -14033 -46077 41711 48047 6967 -113984 -53346 -130770 -89267 -227903 -375856
1884 -375856 -90519 -250454 -302351 -240564 107942 -77091 -252758 -179829 -204616 -455592
1874 -455592 -552539 -263395 -104719 -143388 -241420 -100723 -174950 -105891 -183876 -102185 -149814
1863 -149814 -326565 -493616 -235201 -192063 -252180 -20705 170121 277976 183 -407506
1853 -407506 -385278 -571460 -157619 136799 258817 -25578 -87149 254618 100653 -101082
1843 -101082 -162414 -63856 -184690 -256537 -176645 240770 157372 38997 -173921 -308533 -318647
1832 -318647 -276660 -335562 -205912 -86675 56368 -79930 -288048 -289428 -349893 -214122 -34690
1821 -34690 130327 198977 -49918 -110881 108003 -149599 -212680 -404761 -445888 -168684 -130662
1810 -130662 -50840 -114737 -302937 -159422 -67598 152526 -9458 91560 146299 -128998
1800 -128998 -174581 -287342 -256519 -148170 -30359 -399332 -218167 -296006 -166690 -98051
1790 -98051 145706 -105345 -235452 -149703 -163128 -423344 -253187 -35462 -5330 161655
1780 161655 326198 168630 143666 269677 -92832 141535 150518 -20982 -233624 -255305
1770 -255305 -167996 -324708 -413421 -393201 -520646 -288299 -142892 -198794 -83896 -156810 -143933
1759 -143933 54083 213775 -114003 -154931 19783 -105589 -138288 -239766 -535885 -652384
1749 -652384 -226707 -29837 -174293 -61451 73355 -6060 -70011 -280038 -209918 115962
1739 115962 -27810 -170750 -243944 -532730 -425917 -523175 -478627 -29469 -159550 -231455
1729 -231455 33098 -111739 13269 57424 -13500 -177683 -35813 -234531 -249306 -216666
1719 -216666 -63223 -319510 -317654 -197768 -453609 -554183 -513044 -342035 -410374 -441330 -292312
1708 -292312 -31101 -135465 -60871 -18102 -143071 -142770 -25835 23207 40415 -165400 -107449
1697 -107449 189423 -124877 -184271 -42800 254440 -95135 -203389 -300969 -344332 -385161
1687 -385161 -68544 -44962 -52510 -53794 -87046 -35689 -370852 -261638 -93142 86614 212028
1676 212028 252867 54417 -16177 -86261 132120 113500 147558 -175841 -138562 -108227 38434
1665 38434 83188 82655 -244522 -390333 -232620 -70473 -8600 13663 -114049 -273069 -140982
1654 -140982 55841 -6513 -74304 -103937 -218616 -237469 -230808 4463 -133980 28333 44537
1643 44537 -143063 -192666 -178630 -73227 -119195 -81026 85448 -81160 -230714 -200086 -188958
1632 -188958 -95102 -205533 43498 -94427 -237767 -51805 -57240 -136479 -198908 -81938 -154521
1621 -154521 -85309 56157 112150 253148 41645 -181870 -183033 -236932 -155970 -182306 -90278
1610 -90278 -28012 -111624 -23468 -45862 -187459 -104928 -272095 -244397 163885 -29624 -149786
1599 -149786 -148465 43530 70865 109489 350153 26651 -180040 101328 -107702 176093
1589 176093 187009 -56555 -39634 -331267 -243555 -478431 -387777 90877 211173 22362
1579 22362 95926 189470 234825 130270 50078 54791 -278781 -349078 -140314 -30401 22508
1568 22508 112162 -231158 -123892 -14342 -121101 -177184 -214593 -173481 -166904 -86310 103444
1557 103444 -6217 -19639 120910 244374 302455 276342 33115 -13972 251871 141086
1547 141086 -23685 43210 112551 144084 119007 153425 303750 189877 211934 345744 471495
1536 471495 218165 50234 -201716 213172 296354 279424 -66573 -444935 -494900 -342230
1526 -342230 -68875 -187718 -192556 -408501 -286376 -63296 -331122 -191968 -103729 -333984
1516 -333984 -381523 -185717 332 -89673 54853 53745 -104891 -173712 -228215 -163346 -319081
1505 -319081 -218737 -123153 -295451 -348668 -326409 -284685 -89677 -251616 -281527 -279799 -185076
1494 -185076 -60921 -304331 19801 -33982 -66060 -212933 -390010 -200806 -97777 -126896
1484 -126896 -158920 -70115 -46770 -180927 -189638 687 193353 146967 39431 -224858 -266212
1473 -266212 26716 -80722 -38182 -10084 74284 -39539 83472 56033 -368069 -454558 -233224
1462 -233224 -378941 -336659 -396442 -441228 -87403 87969 91772 -21937 -647 -206454 -152022
1451 -152022 -199729 -347494 -218147 -203607 -180817 -38245 -24178 -83134 -273364 -7874 206288
1440 206288 27649 -14951 -113971 -134847 107630 -267318 -356855 -131366 -72083 -17917 -61403
1429 -61403 -243117 -198709 -135325 -214251 -215681 -273000 -365409 -289752 -139970 -428225 -326747
1418 -326747 -128349 -37291 173458 -52141 -148365 143212 216889 -10620 -142846 -93011
1408 -93011 133061 227327 161543 82436 -193175 -93218 24897 -93335 -180587 -161362 -164212
1397 -164212 -102086 45150 41068 -58160 11531 -127921 -208516 -86787 118809 305281 256637
1386 256637 121683 -85166 -78426 -204608 -254581 -198006 -69713 -73861 -65426 -101491 183127
1375 183127 144810 -81272 -127855 -209623 -234537 -355086 -270797 -84235 -191235 -47465 -168421
1364 -168421 -5352 -160943 -439560 -252968 -4016 79803 -21309 29257 73675 115269
1354 115269 -81002 -632 198647 147749 -224046 -213069 79915 -27130 -17077 76946 9639
1343 9639 -52172 11888 107700 -129654 -65262 -267115 -50244 4540 -205305 -92112 -253690
1332 -253690 -246211 -160775 -223179 -39491 -123587 -32169 252252 262684 276144 247073 -15851
1321 -15851 -259967 -320476 -398428 -336874 -188752 -262112 -203879 -243187 -132460 -229740 -399608
1310 -399608 -259799 -205965 -133766 61082 -33836 2267 -64521 52413 66672 -82395 -24989
1299 -24989 282960 391531 166835 -59453 -163689 68830 16293 -37395 -195919 -151458
1289 -151458 -196290 -51696 -136093 -192836 -266736 -254872 -153438 19034 128167 93404 -91642
1278 -91642 -228687 -170809 -151619 -59185 -7034 53856 137566 -119824 -24614 -126806 -94778
1267 -94778 -1700 83358 189837 210241 112090 243324 175921 6870 -33895 -110928 -208303
1256 -208303 -265596 -177532 -17386 87609 -169567 -216772 -223453 -59222 -61224 -143991 -295685
1245 -295685 -101276 -140626 95801 75737 -22030 -75442 -204397 -176832 -134017 42515 -116608
1234 -116608 -398387 -151160 29536 -344351 -702363 -332275 -258417 -319667 -2725 190094
1224 190094 151961 15534 65440 82736 -106655 -158043 -57523 119669 23038 -90009 26774
1213 26774 111905 -98758 -58843 13504 74186 4165 -281370 -122618 -76091 -70971 -15534
1202 -15534 -169365 -194765 -113418 -150585 -156747 76541 285705 190425 260070 314845 336572
1191 336572 217431 104158 -100530 -128326 -103594 -440443 -473225 -503 114548 -86095
1181 -86095 111746 75728 -13203 -238250 -187212 24452 -123904 -186321 -55797 -206077 -213333
1170 -213333 -58007 -122659 -147046 -112798 -311207 -384612 -227103 -88138 4887 -70106 -39171
1159 -39171 -112027 -18694 30401 -34123 90725 -30667 -6494 -32719 -350196 -422742 -354695
1148 -354695 -198218 -282519 -134891 140526 275284 190516 72089 -327406 -45517 -79766
1138 -79766 -54152 -239664 -199955 -178535 -335829 -108682 -257951 -355780 -171923 -163746 39181
1127 39181 190570 133115 78227 127633 85428 -148133 -104383 -59486 30289 269677 178971
1116 178971 216994 209696 156348 342915 122221 -95885 -117160 -81719 171096 64609 -25445
1105 -25445 73524 85733 -12026 -91923 81541 242337 176908 -70683 -61215 -252345 -446208
1094 -446208 -223959 -73661 -45022 -19127 4461 -63555 -55210 -8181 57285 140152 125815
1083 125815 29202 94137 173407 210898 374791 357191 -236362 -215626 63722 -149015 -89923
1072 -89923 -213074 -119535 -130140 -108470 -29786 145865 299415 357397 122206 -51084 -86521
1061 -86521 90337 133722 79884 -2158 179312 60344 -168323 -302190 -167470 -274362
1051 -274362 -248966 -70834 -125155 -124747 -131686 -67182 78199 91437 79324 -45227 42183 102828
1039 102828 307644 373439 110461 274940 549735 220291 162292 48282 176855 262497
1029 262497 256032 106544 58533 71470 -247641 -200980 56197 219601 115904 -75928 -151876
1018 -151876 -264946 -440395 -306567 -108391 -102863 49613 218293 108016 310618 343349
1008 343349 231852 167095 247456 377713 -6100 200234 548461 357199 271949 187073
998 187073 323929 8391 -46767 8497 52661 105346 60161 159355 322735 212900 61376
987 61376 39245 -82509 152702 256100 44916 27697 -464016 -108199 1877 -195571
977 -195571 -59148 307505 381835 215659 8733 -96486 -188069 -476012 -185679 11586
967 11586 60907 122208 282835 -70529 -320427 -175581 125646 58713 111290 -35610 -5673
956 -5673 57438 180620 519002 300007 444474 146767 36052 -46847 91750 55960 65175
945 65175 -95356 -28512 -70706 -207177 -302593 -239403 -223335 -285086 107103 63630 60111 632
933 632 85645 306335 125387 -16257 85939 -172073 -101707 -50802 -121506 -179703 -122438
922 -122438 -130328 -91018 -219480 -225620 -77819 -27411 222874 8918 -27643 172154 -149297
911 -149297 -115621 -58437 -227112 -186040 -299434 -22737 15383 -21685 139633 67301 -77696
900 -77696 74793 120663 102263 -60407 -106166 -219469 -142649 84702 -86294 -281335 -193476
889 -193476 -49023 -48540 -63181 93852 281996 137970 -234197 -125991 -16184 -87752 -197474
878 -197474 -93409 48100 68492 -33229 20500 137413 195334 177423 180484 356391 539018
867 539018 166770 -236700 16028 -47884 27240 -170392 -199792 -16386 12290 349 -77323
856 -77323 -153604 98082 50590 121543 244950 294560 193786 22447 73372 291232 425820
845 425820 494902 340052 173985 130195 93281 180150 322203 16587 17333 -4359 -80538
834 -80538 34006 -28071 -58511 39803 -66043 -26402 104730 -14535 66010 165691 176549
823 176549 104250 -48636 -407 -202030 -146912 -164731 -3425 100717 190540 176466 166669
812 166669 -23768 57513 -15439 -198169 -126856 170135 12231 -105205 53736 189230
802 189230 297787 71810 269532 149948 81703 -141343 -80856 217273 426572 165286
792 165286 -18673 -88150 -127483 -133471 -13201 -51539 128130 229881 258314 162532 216726
781 216726 40986 -66745 21937 110472 56569 -180893 -18329 -151083 -164520 -118744 -126360
770 -126360 69468 -32510 -197365 -51737 306536 352535 482188 292710 9259 194869
760 194869 447592 172667 -98257 70071 117633 131762 148039 314793 97266 103564 62171
749 62171 201940 120581 94544 50449 -66394 132342 52839 246703 323717 222134 221652
738 221652 20596 -123265 32625 -22270 152759 -188091 -150143 -22308 -233460 -102550
728 -102550 -147899 149992 255490 61475 -3221 -36320 -83008 -3878 21471 39983 -252003
717 -252003 -289369 42437 -87613 183269 206059 294049 336971 439880 403593 54477 70024
706 70024 118946 91855 37827 49076 143157 171118 380696 181714 332531 230918 170522
695 170522 92510 20055 21869 24584 -48261 30278 153894 122910 -8891 -89004 104218 173515
683 173515 161228 -71262 -134304 -47012 102481 42392 -146845 -130908 257163 170603 -168969
672 -168969 -17003 133364 -111829 122955 141795 23621 49603 119004 -162486 -2424
662 -2424 100575 -136831 -97413 -18998 166229 275373 97974 -123546 -97638 -44931 -8673
651 -8673 -36970 138081 224324 16587 120603 143688 252013 19740 8222 32670 35433
640 35433 148590 79577 313769 340263 264017 361073 293153 43466 -137698 31220 178127
629 178127 230909 119509 28069 39631 288624 182167 142325 -100568 -38404 231846 185525
$$ [...]
##END NTUPLES=NMR SPECTRUM
##END=
