##TITLE=1H_EC-3389(1)-x
 200.13Hz, DMSO+CDCl3.
 8 sc
 24.8.2026
##JCAMPDX= 6.0         $$ Bruker NMR JCAMP-DX V2.0
##DATA TYPE= NMR SPECTRUM
##DATA CLASS= NTUPLES
##ORIGIN= UXNMR, Bruker Analytische Messtechnik GmbH
##OWNER= pz
$$ XWIN-NMR		Version 3.5
$$ Mon Aug 24 13:56:30 2026 Russian Standard Time (UT+4h)  she@DPX200
##.OBSERVE FREQUENCY= 200.1313
##.OBSERVE NUCLEUS= ^1H
##.ACQUISITION MODE= SIMULTANEOUS
##.ACQUISITION SCHEME= undefined
##.AVERAGES= 8
##.DIGITISER RES= 18
##SPECTROMETER/DATA SYSTEM= spect
##.PULSE SEQUENCE= zg30
##.SOLVENT NAME= CDCl3
##.SHIFT REFERENCE= (INTERNAL, CDCl3, 0, 16.138)
##AUDIT TRAIL= $$ (NUMBER, WHEN, WHO, WHERE, WHAT)
$$ ##TITLE= Audit trail, XWIN-NMR		Version 3.5
$$ ##JCAMPDX= 5.01
$$ ##ORIGIN= Bruker BioSpin GmbH
$$ ##OWNER= she
$$ F:/spectra/data/she/nmr/H-C/1/pdata/1/auditp.txt
$$ ##AUDIT TRAIL=  $$ (NUMBER, WHEN, WHO, WHERE, WHAT)
(   1,<2026-08-24 13:55:04.68 +0400>,<she>,<DPX200>,
      <created by zg, POWCHK disabled, PULCHK disabled
       configuration hash MD5:
       00 E9 B6 7A A2 85 ED C7 34 08 36 98 17 FE 4E 26
       data hash MD5: 16K
       42 35 FC EE 31 29 44 78 98 6B C0 4C EC FC 86 0C>)
(   2,<2026-08-24 13:55:07.21 +0400>,<she>,<DPX200>,
      <Start of raw data processing
       efp BC_mod = 2 LB = 0.25 FT_mod = 6 PKNL = 1 PHC0 = -4577.769 PHC1 = 7.992299 SI = 16K 
       data hash MD5: 16K
       02 7A EF 86 49 74 CD D9 E8 6C 73 D4 38 C4 97 B5>)
(   3,<2026-08-24 13:55:24.40 +0400>,<she>,<DPX200>,
      <pk PHC0 = -0.9701578 PHC1 = -1.6 
       data hash MD5: 16K
       A4 9D E1 96 58 A7 90 BE 69 AA 58 50 0E CE 66 62>)
(   4,<2026-08-24 13:55:38.56 +0400>,<she>,<DPX200>,
      <abs ABSG = 5 
       data hash MD5: 16K
       04 C0 2A C3 31 5D 11 63 2E E1 D2 D1 9F 19 1E D8>)
$$ ##END=
$$ 
$$ hash MD5
$$ F7 69 DF 51 C6 19 05 F2 AC 41 DD C9 A2 49 73 FA
##$RELAX= 
##$RELAX= 
##$RELAX= 
##$RELAX= 
##$RELAX= 
##$RELAX= 
$$ Bruker specific parameters
$$ --------------------------
##$DU= <F:/spectra>
##$EXPNO= 1
##$NAME= <H-C>
##$PROCNO= 1
##$TYPE= <nmr>
##$USER= <she>
##$AMP= (0..31)
100 100 100 100 100 100 100 100 100 100 100 100 100 100 100 100 100 100 
100 100 100 100 100 100 100 100 100 100 100 100 100 100 
##$AQSEQ= 0
##$AQ_mod= 1
##$AUNM= <au_zg>
##$AUTOPOS= <>
##$BF1= 200.13
##$BF2= 200.13
##$BF3= 200.13
##$BF4= 200.13
##$BF5= 200.13
##$BF6= 200.13
##$BF7= 200.13
##$BF8= 200.13
##$BYTORDA= 1
##$CFDGTYP= 0
##$CFRGTYP= 5
##$CHEMSTR= <none>
##$CNST= (0..31)
1 1 145 1 1 1 1 1 1 1 1 1 1 1 1 1 1 1 1 1 1 1 1 1 1 1 1 1 1 1 1 1 
##$CPDPRG= <>
##$CPDPRG1= <>
##$CPDPRG2= <>
##$CPDPRG3= <>
##$CPDPRG4= <mlev>
##$CPDPRG5= <mlev>
##$CPDPRG6= <mlev>
##$CPDPRG7= <mlev>
##$CPDPRG8= <mlev>
##$CPDPRGB= <>
##$CPDPRGT= <>
##$D= (0..31)
0 0.7 0 0 0 0 0 0 0 0 0 0.03 0 0 0 0 0 0 0 0 0 0 0 0 0 0 0 0 0 0 0 0 
##$DATE= 1787565304
##$DBL= (0..7)
120 120 120 120 120 120 120 120 
##$DBP= (0..7)
150 150 150 150 150 150 150 150 
##$DBP07= 0
##$DBPNAM0= <>
##$DBPNAM1= <>
##$DBPNAM2= <>
##$DBPNAM3= <>
##$DBPNAM4= <>
$$ [...]
##$SUBNAM3= <"">
##$SUBNAM4= <"">
##$SUBNAM5= <"">
##$SUBNAM6= <"">
##$SUBNAM7= <"">
##$SUBNAM8= <"">
##$SUBNAM9= <"">
##$SW= 18.0517328524113
##$SWIBOX= (0..15)
0 0 2 0 0 0 0 0 0 0 0 0 0 0 0 0 
##$SW_h= 3612.71676300578
##$TD= 16384
##$TD0= 1
##$TE= 0
##$TE2= 300
##$TE3= 300
##$TEG= 300
##$TL= (0..7)
0 120 120 120 120 120 120 120 
##$TP= (0..7)
150 150 150 150 150 150 150 150 
##$TP07= 0
##$TPNAME0= <>
##$TPNAME1= <>
##$TPNAME2= <>
##$TPNAME3= <>
##$TPNAME4= <>
##$TPNAME5= <>
##$TPNAME6= <>
##$TPNAME7= <>
##$TPOAL= (0..7)
0.5 0.5 0.5 0.5 0.5 0.5 0.5 0.5 
##$TPOFFS= (0..7)
0 0 0 0 0 0 0 0 
##$TUNHIN= 0
##$TUNHOUT= 0
##$TUNXOUT= 0
##$USERA1= <user>
##$USERA2= <user>
##$USERA3= <user>
##$USERA4= <user>
##$USERA5= <user>
##$V9= 5
##$VALIST= <valist>
##$VCLIST= <CCCCCCCCCCCCCCC>
##$VD= 0
##$VDLIST= <DDDDDDDDDDDDDDD>
##$VPLIST= <PPPPPPPPPPPPPPP>
##$VTLIST= <TTTTTTTTTTTTTTT>
##$WBST= 1024
##$WBSW= 4
##$XGAIN= (0..3)
0 0 0 0 
##$XL= 0
##$YL= 0
##$YMAX_a= 116052
##$YMIN_a= -112846
##$ZGOPTNS= <>
##$ZL1= 120
##$ZL2= 120
##$ZL3= 120
##$ZL4= 120
##$ABSF1= 15.49017
##$ABSF2= -2.56168
##$ABSG= 5
##$ABSL= 3
##$ALPHA= 0
##$AQORDER= 0
##$ASSFAC= 0
##$ASSFACI= 0
##$ASSFACX= 0
##$ASSWID= 0
##$AUNMP= <proc_1d>
##$AZFE= 0.1
##$AZFW= 0.1
##$BCFW= 0
##$BC_mod= 2
##$BYTORDP= 0
##$COROFFS= 0
##$CY= -3
##$DATMOD= 1
##$DC= 0
##$DFILT= <>
##$DTYPP= 0
##$F1P= 0
##$F2P= 0
##$FCOR= 1
##$FTSIZE= 16384
##$FT_mod= 6
##$GAMMA= 0
##$GB= 0
##$INTBC= 1
##$INTSCL= 3.241238e-09
##$ISEN= 128
##$LB= 0.25
##$LEV0= 0
##$LPBIN= 0
##$MAXI= 10000
##$MC2= 0
##$MEAN= 0
##$ME_mod= 0
##$MI= 1.114404
##$NCOEF= 0
##$NC_proc= -8
##$NLEV= 6
##$NOISF1= 3.799351
##$NOISF2= 2.8
##$NSP= 0
##$NTH_PI= 0
##$NZP= 0
##$OFFSET= 16.13804
##$PC= 1
##$PHC0= -4578.739
##$PHC1= 6.392299
##$PH_mod= 1
##$PKNL= yes
##$PPARMOD= 0
##$PSCAL= 0
##$PSIGN= 0
##$REVERSE= no
##$SF= 200.129876654811
##$SI= 16384
##$SIGF1= 3
##$SIGF2= 2
##$SINO= 0.751879
##$SIOLD= 32768
##$SREGLST= <19F.Aceton>
##$SSB= 0
##$STSI= 16384
##$STSR= 0
##$SW_p= 3612.71676300578
##$SYMM= 0
##$S_DEV= 0
##$TDeff= 16384
##$TDoff= 0
##$TI= <>
##$TILT= no
##$TM1= 0
##$TM2= 0
##$TOPLEV= 0
##$USERP1= <user>
##$USERP2= <user>
##$USERP3= <user>
##$USERP4= <user>
##$USERP5= <user>
##$WDW= 1
##$XDIM= 16384
##$YMAX_p= 459823935
##$YMIN_p= -2131554
$$ End of Bruker specific parameters
$$ ---------------------------------
##NTUPLES= NMR SPECTRUM
##VAR_NAME=  FREQUENCY,     SPECTRUM/REAL,   SPECTRUM/IMAG
##SYMBOL=    X,             R,               I
##VAR_TYPE=  INDEPENDENT,   DEPENDENT,       DEPENDENT
##VAR_FORM=  AFFN,          ASDF,            ASDF
##VAR_DIM=   16384,         16384,           16384
##UNITS=     HZ,            ARBITRARY UNITS, ARBITRARY UNITS
##FACTOR=    0.220516191357247, 1,           1
##FIRST=     3229.70406324139, 0,            0
##LAST=      -383.012699764395, 0,           0
##MIN=       -383.012699764395, -2131554,    0
##MAX=       3229.70406324139, 459823935,    0
$$ Real data points
##PAGE= N=1
##DATA TABLE= (X++(R..R)), XYDATA
$$ [...]
7828h6370L45973N70l80743p3291J30481J09257j66456J35446l15942K28687q9904
7817a62292L38603J27087l45942m01460N6722J17203K80715M02963m81719K2256
7807d5864L70693J04939J0316j64738L77661k60965q0920j0112m02797k029767
7797b131554J107480J191305j95443M39171K1045k27758M238k31491j6714j46574
7787a86295L28132P7542J58772m9227o7517j5233k74230O19700k87726m53125
7777a49207j28638J88112N9157k08659O8983J44159L40503P2483o94505q7498
7767c95110K44482M6691l4739K2220j47597r4391M34132n4621j40968r8264J05212
7756a12953j07420J25599n01088L48170N53020M47891k14638k28747M26443m87028
$$ plain form
7828 -86370 259603 260173 -120570 -193861 -63380 45877 -120579 14867 -301075 -72388 -162292
7817 -162292 176311 303398 -42544 -444004 -387282 -270079 10636 413599 -68120 -45864
7807 -45864 324829 429768 440084 275346 653007 392042 311122 301010 -101787 -2131554
7797 -2131554 -1024074 167231 -28212 410959 432004 204246 208484 -23007 -39721 -186295
7787 -186295 141837 219379 378151 328924 261407 246174 -28056 591644 303918 -149207
7777 -149207 -277845 -89733 -30576 -239235 -170252 -26093 314410 386893 -307612 -395110
7767 -395110 -150628 -103937 -138676 -116456 -264053 -358444 75688 21067 -119901 -218165 -112953
7756 -112953 -220373 -94774 -595862 -247692 305328 753219 538581 309834 736277 249249
7746B49249l42346j19583K70652k87495j90838O01665J88425q7306j20605J95869
7736C57687j11087k76579k48458K28122K50165n14013J42425j38608k2646J83171
7726a49821K54372j26794k85383L74726N61596M0970o09040m39686Q10542p9981
7716C51501K79816o1276J1989k55081R7478m35144j24305j77229J77983O2100
7706g2168J23246k94721l8430J26401Q7993n09708P02256m37048l67381K13097
7696d66463n7365J27983R873N32096k15141O4337J64884K11120J78766n89702
7686c9612k44797N09542J93650K46199p1185m66951K20850j59524m59627K35502
7676c5953K54956l1132l15884j83174K49867O21498j1080l65085l99913J94684
$$ plain form
7746 249249 -93097 -212680 57972 -229523 -420361 181304 369729 282423 161818 357687
7736 357687 246600 -29979 -278437 -50315 199850 -314163 -171738 -310346 -332992 -149821
7726 -149821 104551 -22243 -307626 67100 628696 669666 60626 -379060 431482 351501
7716 351501 631317 570041 582030 326949 424427 -10717 -135022 -312251 -134268 -72168
7706 -72168 51078 -243643 -282073 -155672 -67679 -577387 124869 -312179 -679560 -466463
7696 -466463 -523828 -395845 -385972 146124 -69017 -4680 160204 371324 550090 -39612
7686 -39612 -284409 225133 418783 664982 593797 126846 347696 188172 -271455 -35953
7676 -35953 219003 187871 -128013 -311187 -61320 560178 549098 184013 -215900 -21216
7666b1216m39459J30581j14535K59175k6480M62158O3186L67190n45671k46277
7656a11348K13443L68614j89039l33602j91918k39934L5262J72962M7962K86240
7646E8642l79254p5415L66168Q1451J61610l2927j12751m27488K12546L7519k38776
7635c48675L1511L12510K24783n74927l46418M05459K31340M79905k58839l58037
7625b01388J88015n0244m61181M8427O2898R237J46454q857l96460N77475j29571
7614b15195L38544K31560l38786l13390j29540K85797P225o2118L20070J52683
7604B76850r7517k598P537k16679j49422J7370M66654j72617l11065O4610l3000
7593a49877l68377j48526m00749K72337L92193L84950K20396k57858N15938k39064
$$ plain form
7666 -21216 -460675 -330094 -444629 -185454 -211934 250224 313410 680600 134929 -111348
7656 -111348 102095 470709 281670 -51932 -243850 -483784 -448522 -275560 -227598 58642
7646 58642 -320612 -396027 -29859 51592 213202 180275 67524 -359964 -147418 -109899 -348675
7635 -348675 -317164 -4654 220129 -354798 -701216 -295757 -64417 415488 156649 -201388
7625 -201388 -13373 -63617 -524798 -476371 -413473 -404236 -257782 -266639 -663099 -85624 -215195
7614 -215195 123349 354909 16123 -297267 -426807 -141010 -133785 -195903 124167 276850
7604 276850 179333 176735 184272 -32407 -181829 -164459 302195 129578 -181487 -116877 -149877
7593 -149877 -518254 -666780 -1067529 -795192 -402999 -18049 202347 -55511 460427 221363
7583B21363m92901K0359L02367K49799l62484Q1328M92309m08019k13929L14510
7573B04702j86426r4804o6902J79396R8844Q9840j48714j94322L81181l28030
7563f5235n70026O3597O67794j2149L80522l05359k30953k02743j05161j33592
7553e13305L6341j63523K61228L19042K03836m3477j99699m12468N86895k16875
7543a42005L68165J49168j14849L51029n97068k68896n06530j47937O85000k8655
7533b52578M7722r4792r183K0643K85301L60732l834J75507K6079k56798k40952
7522E7847J14340N84256k81284l80642j54203L39456N00426m43322k59997K65947
7512C42824l9289K56361r3889l35387m71455k06956K75287m19456M18703k86365
$$ plain form
7583 221363 -271538 -251179 51188 300987 -61497 19831 512140 104121 -109808 204702
7573 204702 18276 -76528 -143430 35966 134810 224650 75936 -118386 262795 -65235
7563 -65235 -635261 -571664 96130 83981 464503 159144 -71809 -274552 -379713 -513305
7553 -513305 -476964 -640487 -379259 -60217 143619 100142 -99557 -512025 74870 -142005
7543 -142005 226160 375328 260479 611508 14440 -254456 -760986 -908923 -223923 -252578
7533 -252578 -204856 -299648 -308831 -288188 -2887 357845 354011 529518 555597 298799 57847
7522 57847 172187 756443 475159 94517 -59686 279770 780196 336874 76877 342824
7512 342824 303535 559896 466007 130620 -340835 -547791 -272504 -691960 -273257 -559622
7502e59622N36823J67065m85125M56853M17619j16625L30891k14994l83401n10580
7492c61096J62533L03057j03634m60346M8191J3940J20580l14687P31591m72123
7482c31994m54608J48569j07839P66708n09846N8471L89300O597o8390K9983Q6881
7471A3832n85764Q97286L26362o81667j89424j25159N79215J56376m87263k06946
7461c03152J2311R5120n1644K15115L27945j32570n24619O266K82340K70262J09153
7450C06527n02896l845O0667J08821K89676m07270J69202l71371L29076J46553
7440A25140j78388N20735K43745k79419p26685K5974O53731k41733m06772J66603
7430i7069J09350J46762K6842M5951j58093q593k3259L57221J99742m98146l98535
$$ plain form
7502 -559622 -22799 144266 -340859 115994 533613 416988 747879 532885 149484 -361096
7492 -361096 -198563 104494 860 -459486 -411295 -397355 -276775 -591462 140129 -331994
7482 -331994 -786602 -638033 -745872 20836 -489010 -430539 -41239 -34642 -103032 -73049 13832
7471 13832 -571932 325354 651716 -29951 -219375 -344534 234681 391057 -96206 -303152
7461 -303152 -290841 -195721 -247365 -32250 295695 163125 -361494 -355228 -72888 197374 306527
7450 306527 -196369 -200214 -139547 -30726 258950 -148320 20882 -350489 -21413 125140
7440 125140 -53248 467487 711232 431813 -294872 -268898 384833 143100 -263672 -97069
7430 -97069 12281 159043 185885 231836 73743 65150 41891 399112 598854 100708 -297827
7419b97827P0360L51840K46478j32756m64702O74447J33980q30720Q1468m92075
7409f59507M15266L59618k41817k47243k57935P07043P4121l46960J16958m8731
7399a29187l96601r9118J03730j71632Q94615j51543l10830k76770K99925j09773
7389c47184L47558j83006j36970K70024K39052Q6958k38394J49690m54841j44265
7379d11378L60957k03063j8192K82166l83968J49932J5580J19173J23866n18007
7369d82934M13982J23288M7383J53399k63698k20769J5258L39422j82051m80215
7359e36935K33210m9170N552L07276K14661j27584k67925P7922O5972J57415k49846
7348a69452J27607N9412n1201L37272n1934l77042m93448K99867M77431k0196
$$ plain form
7419 -297827 -227467 124373 370851 238095 -226607 447840 581820 -248900 -167432 -659507
7409 -659507 -244241 115377 -126440 -373683 -631618 75425 149546 -197414 -80456 -129187
7399 -129187 -525788 -624906 -521176 -692808 201807 50264 -260566 -537336 -237411 -347184
7389 -347184 374 -182632 -319602 -49578 189474 276432 38038 187728 -267113 -411378
7379 -411378 -50421 -253484 -271676 10490 -373478 -223546 -207966 -88793 35073 -482934
7369 -482934 -68952 54336 101719 255118 -8580 -229349 -214091 125331 -56720 -536935
7359 -536935 -303725 -352895 -347343 -40067 174594 47010 -220915 -142993 -77021 80394 -169452
7348 -169452 -41845 17567 -33634 303638 251704 -125338 -618786 -318919 158512 138316
7338A38316k19878O7159k83992j78442q5262j23866J79763j09568N35494P8672
7328a604m80239q1622j07208R71289p0170l84167l00694J2202N05982n84882Q4987
7317d36126J83949j638l61482P9904K8259N22414O563j85689k5946K08025n3543
7306c5310k97928Q8579J48122J99703R6787L81256j49299l0603m46457r9389L01000
7295A56461l85311J95837j65872p27746n37330O40903J41460J51201l80274p3076
7285i83747N86797N7217j21572P6042k86100L02435j75479L68298N20398o7386
7275B76903k29890j14514k9150N85451n568l06747n24666P33N03099m71125n7552
7264c73026P3419M70973j68503j3737K48900K33301m57805l0850L4540L61005
$$ plain form
7338 138316 -81562 -14403 -298395 -476837 -562099 -685965 -506202 -615770 -80276 -1604
7328 -1604 -481843 -563465 -670673 300616 230446 -153721 -454415 -442213 63769 -521113 -436126
7317 -436126 -252177 -253815 -615297 -535393 -507134 15280 21843 -163846 -189792 18233 -35310
7306 -35310 -333238 -244659 -96537 103166 199953 581209 431910 401307 -45150 -144539 156461
7295 156461 -228850 -33013 -198885 -926631 -1463961 -823058 -681598 -530397 -910671 -983747
7285 -983747 -396950 -339733 -461305 -385263 -671363 -368928 -544407 -176109 344289 276903
7275 276903 47013 -67501 -96651 488800 483232 176485 -348181 -347448 155651 -315474 -373026
7264 -373026 -299607 171366 2863 -10874 238026 471327 13522 -17328 17212 378217
7254C78217m29051k02835k01483J98294L01844k73778k35954j88597K88213r3178
7244d58308K19591K59957o5081N4839p6898K2123j94014M24495n15989K12130
7234a17155j83450J5806J77712l85913L98804R3686J03582j84930R8659m08970
7224c92169m9107J32509m5737j35547M15396K26079j74929j77629J83403p580
7214b5311J75039j81937j44322N8168J81034q539J90425L2016Q3761p7378m96996
7203b14040l93479k1678k571P4562N08014o0274l42221j85765K06689M9259M01634
7192B0130J28997n1410k95971k72234j32815M7876j61947L12482L65521J37893
7182I8522o2620m6113J57329k05821l5864L9716k19478J84250K67306l53477m97286
$$ plain form
7254 378217 -50834 -253669 -455152 -256858 44986 -228792 -464746 -653343 -365130 -458308
7244 -458308 -238717 21240 -43841 10998 -65900 -43777 -237791 186704 -329285 -117155
7234 -117155 -300605 -284799 -107087 -493000 -94196 -510 103072 -81858 16801 -392169
7224 -392169 -441276 -308767 -354504 -490051 -74655 151424 -23505 -201134 -17731 -25311
7214 -25311 149728 -32209 -176531 -118363 62671 54132 244557 276573 360334 282956 -214040
7203 -214040 -607519 -629197 -631768 -557206 -49192 -109466 -451687 -637452 -430763 -381504 20130
7192 20130 149127 97717 -198254 -470488 -603303 -555427 -717374 -404892 -39371 98522
7182 98522 35902 -10211 147118 -58703 -94567 -54851 -274329 -90079 177227 -176250 -673536
7171f73536j24951n5249K70752N37000R0663K28039J18471l74787K40139J78988
7161D35529p43179J77315O8724p4865k92684J27807N72243k44656j10925l66390
7151d51081K17063K05696j55628K04658K17031l56391K58458J83628p65382m1549
7141d83497J26434J7474M9439J48118r1511L47896K98830o25434k34667r3455
7131e40373J15774j59337J57983P6690L46607J96313l194k68773Q298J36630n85147
7120e18529J64443k68286k10957L75596L06026k47675K02245J50369m04894M86912
7110C5250L82628q2365j9287l93961k37655K15756M21776l43666m1334L55352
7100B92494M2941o4541j32796k44571k35922M0437L14570J01969K3607k86478
$$ plain form
7171 -673536 -798487 -853736 -582984 -45984 44679 272718 391189 16402 256541 435529
7161 435529 -307650 -130335 -61611 -136476 -429160 -301353 270890 26234 -84691 -451081
7151 -451081 -234018 -28322 -183950 20708 237739 -118652 139806 323434 -441948 -483497
7141 -483497 -357063 -339589 -290150 -142032 -233543 114353 413183 -212251 -446918 -540373
7131 -540373 -424599 -583936 -425953 -349263 -2656 193657 190463 -78310 -70012 66618 -518529
7120 -518529 -354086 -622372 -833329 -457733 -151707 -399382 -197137 -46768 -451662 35250
7110 35250 417878 335513 316226 -77735 -315390 -99634 322142 -21524 -62858 292494
7100 292494 335435 270894 138098 -106473 -342395 -301958 12612 114581 138188 -148290
7090a48290r1785k87921R5575N15975J43886P7876p8933k4362l2126l61318J84860
7079f563J1438J01118j7920k37244j92205N4467J01519j28396M16182l1424j53108
7068h2136k05302m2801L70433K47554J26356k2092n67995p5804Q6351K28406j67096
7057a04126k42803k71613M33295n36695k5357O93641M15400l09887k39971L78577
7047A90461L96306o40176k35656N3799K11426l74664J66395p3036k14619j33912
7037f53676m1224L74674L20771P4603p4250R2744k01790m939P8370k15710l99396
7026f49823N78234J77935k71116l04479N72250m17563J33543j15151L83370J85940
7016B73140n32900m17857N53969J70662L59854K81252k85487J5337j12607m64917
$$ plain form
7090 -148290 -240075 -527996 -432421 83554 227440 305316 226383 202021 169895 -191423 -6563
7079 -6563 4875 105993 88073 -149171 -341376 -286909 -185390 -313786 102396 70972 -82136
7068 -82136 -287438 -330239 40194 287748 414104 392012 -175983 -251787 -165436 62970 -104126
7057 -104126 -346929 -618542 -185247 -721942 -747299 -53658 361742 51855 -188116 190461
7047 190461 586767 -53409 -289065 -235266 -23840 -398504 -232109 -305145 -519764 -653676
7037 -653676 -694900 -320226 545 75148 898 93642 -108148 -113087 -34717 -250427 -649823
7026 -649823 -71589 106346 -164770 -469249 103001 -314562 -181019 -296170 87200 273140
7016 273140 -259760 -677617 -123648 47014 406868 688120 402633 417970 305363 -159554
7006a59554M12173M5451J36699k81174j08822l03731J47807n507j60069R7831
6996a78896M64887L20715q13003p8071J27954l00591J89517K38632j12064K15881
6986G4961J21018J50683m93411l48056M3849J39379M2752m98837J44653J049205
6976D26196n5204P9932k31996M64680p00488j54152Q44361k90674l26448p9323
6966b3116j94291O748M78702J20683Q8311p87415m61465K79990M21082J09409
6956C8638j18174J01387m34500J42709J79327R9814N0005l77166J41378J24353
6946e2229n7703j08636K26720K03562j43648k81029O9218o5485k69963M42810
6936c6383K2970o7019K64946j74655O271J03059Q5269K82246l01203n34262j24261
$$ plain form
7006 -159554 252619 298070 434769 153595 44773 -258958 -111151 -116658 -276727 -178896
6996 -178896 285991 606706 -206297 -284368 -156414 -457005 -267488 -28856 -140920 74961
6986 74961 195979 346662 -146749 -494805 -450956 -311577 -268825 -767662 -623009 426196
6976 426196 370992 450924 218928 683608 -16880 -171032 673329 382655 56207 -23116
6966 -23116 -217407 -210659 268043 388726 477037 -310378 -771843 -491853 -70771 38638
6956 38638 -79536 21851 -412649 -269940 -90613 9201 59206 -317960 -176582 -52229
6946 -52229 -109932 -218568 8152 211714 68066 -212963 -143745 -209230 -479193 -36383
6936 -36383 -13413 -80432 184514 9859 16130 119189 204458 486704 185501 -348761 -473022
6925d73022L47901k240O5799k4553k56203j89717N06649L1561m03470j29413O39966
6914A13258J93847l59205j00132k38334L82937K86632k13406L26794j05061l34823
6904d7493L97828p8727j9679J82863r4665m97184R2441L27457k88827K90794k80427
6893a5619J18548q9627k31367O5328j08462L81986N6208P8939j76194J05925k43712
6882e8047l68865L43577l31897m3171K89514N18086Q5790o77973l67711K27371
6872c83326K44108J15757R5128m97j82133m88187l25850R3265J47170P02662M7856
6861F5953m23210J03871n91944j69724L44066L65918P7379M76822J14589K28396
6851E92116m56969K82521q9797m55198K37300l37235P9789k87649j1330M31392
$$ plain form
6925 -473022 -125121 -127361 -61562 -86115 -342318 -532035 -25386 6175 -397295 -526708 113258
6914 113258 307105 -52100 -152232 -390566 -7629 279003 65597 392391 287330 -47493
6904 -47493 350335 271608 251929 434792 340127 -157057 -64616 262841 -25986 264808 -15619
6893 -15619 102929 13302 -218065 -152737 -261199 120787 176995 255934 79740 185665 -58047
6882 -58047 -426912 -83335 -415232 -458403 -168889 349197 434987 -242986 -610697 -383326
6872 -383326 -139218 -23461 71667 71170 -110963 -599150 -925000 -831735 -684565 18097 65953
6861 65953 -357257 -253386 -845330 -1015054 -670988 -305070 -227691 249131 363720 592116
6851 592116 135147 417668 327871 -127327 109973 -227262 -147473 -435122 -446452 -15060
6841a5060K46210K2278L7594l2962N6211j00509k32052l9137J95998j87105j97490
6830b46024j59610n7969k85111K25931j29763J09040O67713j37745j01150j88553
6820c03241K07272k56860M63104k58151O5434l77589j29533N34089L2921j54429
6810a76983j85158R7288R4394k362L67693N2405n20685J26169K84072L48743l97843
6799H7733L79531O0357p18564j92791Q16411m97966j29421L96773j41435N3533
6789A14161R9004L05513M9068m18213k70330l8267n96059M28775K57931p7231
6779a45648M39581N27154J20462m46138k47961J41667n6904l32312K28543K22591
6769D51035j87186J4770p08101Q5470j5399L85403N3773j58545L40635L70782
$$ plain form
6841 -15060 231150 253428 291022 258060 314271 213762 -18290 -57427 138571 -48534 -246024
6830 -246024 -405634 -463603 -748714 -522783 -652546 -543506 124207 -13538 -114688 -303241
6820 -303241 -95969 -352829 110275 -147876 -82442 -460031 -589564 -55475 -22554 -176983
6810 -176983 -362141 -264853 -170459 -172821 194872 247277 -273408 -147239 136833 485576 87733
6799 87733 467264 527621 -190943 -383734 432677 -65289 -194710 202063 60628 114161
6789 114161 213165 518678 567746 149533 -120797 -159064 -755123 -326348 -68417 -145648
6779 -145648 293933 821087 941549 495411 247450 389117 332213 -99 228444 451035
6769 451035 263849 278619 -429482 -344012 -359411 25992 79765 -78780 261855 632637
6759F32637l18316j70517K53506j40218l99159n6038O04167q18581j70112J55044
6749d27587k81573M34160J91680N5368M5361l32269N39153K3670o1651l9647m24627
6738b77962m84260K10485Q74627m61337k16855L11656k69330N27412q255k52782
6728d6601k64445n0422K72420N06906K82301k52674L08364k68818J71620P90131
6718A448782J22433K14144M40728m78416n45459m72336M80542L51654m02747n64680
6708E94645m23831J20448J12443o33209l2090K3892K03783M37428o6881M5834
6698C82462n66003n59878L27005O2506J30873q1235q9258L48500l52566R99880
6688F02286k80576k25825j29036J12250L62825l58788m81315j86295j17825P13346
$$ plain form
6759 632637 314321 143804 397310 257092 -142067 -198105 406062 -412519 -582631 -427587
6749 -427587 -709160 -275000 -83320 -27952 17409 -314860 224293 247963 186312 146665 -277962
6738 -277962 -762222 -551737 322890 -138447 -355302 -43646 -312976 214436 206181 -46601
6728 -46601 -311046 -361468 -89048 417858 700159 447485 755849 487031 658651 1448782
6718 1448782 1571215 1785359 2226087 1747671 1202212 729876 1210418 1562072 1159325 594645
6708 594645 170814 291262 403705 -229504 -261594 -237702 -33919 403509 336628 382462
6698 382462 -183541 -743419 -416414 -353908 -223035 -304270 -393528 -45028 -397594 602286
6688 602286 321710 95885 -33151 79099 441924 83136 -398179 -584474 -702299 11047
6678A1047l9022J15369P9598l56699K31931J86982J59186r3017o09566J21882
6668a92309L67920j58453N2612j64461K05983M2020J24124q1466j21304O8579
6658A43245n4014n36570L30596K7576L81734j5810J63973m38096o61840K48797
6648d10409P45794J01177K23807r7164o92943O6842o0271J64888J98992J23644
6638C64357o00829J62465J24462j06741J68364K14296j49116j29120J42284J63169
6628C53591k15386K03821m41455k83081K88660l2544j32259M83298J98869p07659
6618b84145n196J49192J30250K35790K37340P0483m1860m27440l76612k74922
6608e87120K83319K26741K8509k75517j4102j8264M81424l80120L71380M35474
$$ plain form
6678 11047 -27975 87394 166992 -189707 42224 229206 388392 295375 -314191 -192309
6668 -192309 175611 17158 69770 -94691 111292 153312 277436 195970 74666 143245
6658 143245 89231 -447339 -116743 -89167 292567 276757 440730 2634 -659206 -410409
6648 -410409 335385 436562 660369 563205 -129738 -62896 -123167 41721 240713 364357
6638 364357 -236472 -74007 50455 -56286 112078 326374 177258 48138 190422 353591
6628 353591 138205 342026 -99429 -382510 -93850 -126394 -258653 224645 423514 -284145
6618 -284145 -289341 -140149 -9899 225891 463231 533714 491854 64414 -312198 -587120
6608 -587120 -303801 -77060 -48551 -324068 -338170 -356434 124990 -255130 116250 551724
6598E51724q15851j01643J81670O56312k50827M6616K11477J42660J55157n79899
6588A97396j11128M73586k71219J54391n54524m09025K72889K53936N45673K12309
6578G64284l25489l44597K9033k54991N07755O5065p87700L05345P40651k35481
6568D63875m55479R1841k36874J6467k73133l71049R6565K11918J89908k53684
6558e19645M1304L5323O49273n82403O6384O7818M47033j44417m97396O6138L2635
6547c37953m2431p5405O00387o4354L89491j89097J2603j87188J21564k85742
6537e8125n32333J17072K48022k07087k95628J95078Q0043L87562n46085K66003
6527c45478j81653p6400N5323K46767J35888M671L16872j17469O9998q3809p4289
$$ plain form
6598 551724 -264127 -365770 -184100 472212 221385 268001 479478 622138 777295 197396
6588 197396 86268 559854 288635 443026 -111498 -520523 -247634 6302 551975 764284
6578 764284 438795 94198 123231 -131760 375995 441060 -346640 -41295 699356 463875
6568 463875 8396 100237 -136637 -120170 -393303 -764352 -667787 -455869 -265961 -519645
6558 -519645 -478341 -443018 206255 -376148 -309764 -241946 205087 60670 -436726 -370588 -337953
6547 -337953 -380384 -455789 144598 80244 469735 280638 293241 106053 227617 -58125
6537 -58125 -590458 -473386 -225364 -432451 -728079 -533001 -452958 -65396 -611481 -345478
6527 -345478 -527131 -603531 -548208 -301441 -165553 -160882 155990 38521 108519 24710 -49579
6516d9579l03001J76178J53584L49092k86318J68044j51521K36959k36200r6722
6506c9484L50329l86836N88711l95150j24275o5363j48826L23265L04823M2062
6496D49256k04882j3412M90226l34p49433o16279R4572J04858L43672L17033o76591
6485d61314J93579M17126J68264q6300K82446j31277m39345n86622Q26203K66455
6475D49215k81204K22780K6154Q7318k33876k3249m82765J17880M2221k03831
6465b79357P5469l3237j1491K87925K59702J16131j6106K24867l82202n63733
6455c22032J52102M12363O9873M8400j46556k54648l49140J42312K21830K35058
6445B09562l51604k90980N85191J07119K04701j55030k61171J27556m78126q95485
$$ plain form
6516 -49579 -352580 -176402 -22818 326274 39956 208000 56479 293438 57238 -39484
6506 -39484 310845 -75991 512720 117570 -6705 -72068 -220894 102371 407194 449256
6496 449256 244374 230962 721188 720854 -28579 -644858 -550286 -445428 -101756 215277 -461314
6485 -461314 -267735 149391 317655 231355 513801 382524 -56821 -643443 182760 449215
6475 449215 168011 390791 416945 504263 270387 247138 -235627 -117747 -75526 -279357
6465 -279357 -203888 -237125 -248616 39309 299011 415142 399036 623903 241701 -322032
6455 -322032 -169930 242433 312306 360706 214150 -40498 -389638 -247326 -25496 209562
6445 209562 -142042 -433022 152169 259288 463989 308959 47788 175344 -302782 -1198267
6435a198267L60708Q15380K10262J49263L73114j01706k10904p2987k92149O5250
6425I7964J98906L6090j15170k01187J35086n69830p2247K03929L56351j06413
6415c6521K55084J16059N9500Q3433m21383j91378K3079n679J05586j19621j04280
6404b36121j51641L39901m02758k38623J26612M20382L06601J43342k27999o7976
6394A1720L36193k95133l50091L25401M40733p29480k89815K30986Q8497J10941
6384a20048j41191l2678r0637l5791p8490j79290L82288N10942J34215p49455
6374d00135J69612k46599P06613o6671j89196q0456M81116j2991m49278k65824
6364c53809m03783K33900M41973l01169Q3753J18556J60006M43571J68447j6713
$$ plain form
6435 -1198267 -837559 -22179 188083 337346 710460 608754 397850 324863 32714 97964
6425 97964 296870 332960 217790 16603 151689 -418141 -490388 -286459 69892 -36521
6415 -36521 218563 334622 394122 477555 56172 -135206 -112127 -117806 -12220 -131841 -236121
6404 -236121 -387762 -47861 -450619 -689242 -562630 -142248 164353 307695 79696 11720
6394 11720 347913 52780 -297311 28090 468823 -260657 -550472 -319486 -230989 -120048
6384 -120048 -261239 -293917 -384554 -420345 -498835 -678125 -295837 215105 349320 -400135
6374 -400135 -230523 -477122 229491 162820 -26376 -106832 374284 361293 -87985 -353809
6364 -353809 -757592 -523692 -81719 -382888 -299135 -180579 -20573 422998 591445 574732
6354E74732m8592l08021K93233r8792m12812K0038J07499J02620l35698N889L22159
6343B22255L48541J11528k83770J34055J52495p7541r0979M2811j48645q2295
6333C28455j00399Q186j81660j18871M55601K97395j74632m24344J6144j68374
6323f2499r8022k2679K30936J88003L14092l11529J0609k74804R4398N701l86768
6312c12562k2547L26595M96053q2217j92040o0918j11263k65749p7075K70510
6302c1213k5961L34372l63088M7917k6744m13801l0917M77895l3115l35414m96559
6291h96628N11598L28136L21515K5505j94309l98930j96104L25476M032N71688
6281D01979l67118j3225L90321n00331n09531j45473M86011J28086k9420j69263
$$ plain form
6354 574732 526140 218119 511352 412560 -252 19786 127285 229905 -105793 -99904 222255
6343 222255 570796 682324 398554 532609 685104 607563 516584 559395 410750 328455
6333 328455 228056 236242 54582 -64289 391312 688707 514075 89731 105875 -62499
6323 -62499 -160521 -183200 47736 235739 549831 238302 248911 -25893 68505 74206 -312562
6312 -312562 -335109 -8514 487539 405322 213282 152364 41101 -224648 -301723 -31213
6302 -31213 -57174 277198 -85890 -37973 -64717 -478518 -509435 -31540 -64655 -400069 -896628
6291 -896628 -385030 -56894 264621 290126 95817 -303113 -499217 -173741 -169709 401979
6281 401979 34861 21636 411957 -88374 -597905 -743378 -257367 -129281 -158701 -327964
6271c27964j8732O59566q9668N88230p0229l63241j25420K36922j20511K5870
6261C94823p14269j19076N22535K45335l59392k1435l221k9399k64491r6608N93843
6250A48645K10255p3507J91265L16249m151j78854k00233j80209j55693K6295
6240A00062J73173k83489j67334R1928L45586K24960J4955k54124k46228L22071
6230C21560r0431n99554l10092J052087n1423R3543l00694k63636m47023M6194
6220e49469K01530N18334l61976L90843j02432j82975L46412P9372k80596r6347
6210c7304J34040J12888K16691j50156P69595J9219o33463J08731L57405o01355
6200B96291m13034k22881O2610j29473K53200K37829K99965o33394K19114L61071
$$ plain form
6271 -327964 -346696 312870 223202 811432 741203 377962 252542 489464 368953 394823
6261 394823 -319446 -438522 84013 329348 -30044 -51479 -54700 -84099 -348590 -445198 148645
6250 148645 358900 285393 476658 792907 788756 609902 409669 229460 73767 100062
6240 100062 273235 -10254 -177588 -85660 259926 484886 499841 245717 -511 321560
6230 321560 231129 -368425 -678517 373570 322147 415690 114996 -148640 -595663 -549469
6220 -549469 -347939 170395 -191581 199262 96830 -86145 260267 339639 59043 -37304
6210 -37304 96736 209624 426315 276159 1045754 1064973 431510 540241 897646 296291
6200 296291 -116743 -339624 -277014 -406487 -153287 84542 384507 -248887 -29773 331298
6190C31298l16878m24217o0398k37333M44403J40301j32142l2176J51757J73554
6180C8169k62539K39512m37631k40661M63333j65093j86550K55028j36385j12604
6170e45421n8844J10463M75220M45902P8227m23943q1842J98620j10270k4420
6160F3692p5428N62690j57144l46492r2785J94660K53595l3621j09998j95872
6150F3297K46027Q9689k09215j66334J02972J31132R6757j0923n87320J87152
6140e6766l30405N2820J05333J76098O39966l1817j74383m54074P8801M6646j25612
6129g3393m8309K46117N60480J1775l80149j05636p86891J22997L91460L17490
6119B55941r3920m09093N18928k04325M09605J22027j67543k98517J16509P9555
$$ plain form
6190 331298 14420 -409797 -470195 -707528 -263125 -122824 -254966 -287142 -135385 38169
6180 38169 -224370 15142 -422489 -663150 -199817 -364910 -551460 -296432 -432817 -545421
6170 -545421 -604265 -493802 -18582 427320 505547 81604 -238 198382 88112 63692
6160 63692 -11736 550954 393810 47318 -45467 149193 402788 369167 259169 63297
6150 63297 309324 399013 189798 23464 126436 257568 354325 343402 -243918 -56766
6140 -56766 -387171 -334351 -229018 -52920 587046 555229 380846 -73228 5573 52219 -73393
6129 -73393 -121702 124415 684895 696670 316521 210885 -576006 -453009 -61549 255941
6119 255941 162021 -247072 271856 67531 477136 599163 431620 133103 249612 329167
6109C29167k4949k78650j26936L64376n0841K19853M26906n15005j00943l84469
6099a41491L784K4973m306K59589N74948K11881m31800O185n19249J01750q2974
6088C290p4879l79896M14152N3411r4366J52831N10970o26292M75745o9590o7439
6077B97937j02218k9090R3187K06364J65903n07848N8337j74895L8513M36720
6067D82910K835r3849K51969m42513l2355r5778m23524J76573L91052k28136j28338
6056a39154m4191n1665O59823q7224R4480m83446J0042O05197J6345k30294k39492
6045A10421K28066m12307k89726J1093J64430j50724K03638J49068k21405L71779
6035A64333R14617M9581k71932l45124J65680n19703k2208J13103O23701l1201
$$ plain form
6109 329167 304218 25568 -101368 263008 212167 432020 858926 343921 242978 -141491
6099 -141491 -137707 -112734 -117040 142549 717497 929378 497578 503763 -15486 86264 3290
6088 3290 -71589 -451485 -37333 16078 -78288 74543 585513 -40779 434966 365376 297937
6077 297937 195719 166629 259816 466180 632083 124235 182572 7677 46190 482910
6067 482910 485745 391896 643865 201352 168997 73219 -350305 -173732 217320 -10816 -139154
6056 -139154 -183345 -235010 424813 337589 432069 -51377 -41335 563862 580207 349913 110421
6045 110421 338487 -73820 -363546 -352453 -188023 -338747 -135109 13959 -207446 164333
6035 164333 1078950 1128531 856599 511475 677155 157452 135244 248347 872048 840847
6025H40847p38069q5246j68165M2233j71409M15824J82956m22628K61633K97711
6015D55687l44719n2617j66290L56734K96707m09710j11260l44524L71749Q12964
6005H64721l09262o33537R8121N83070J35415j042J00346l81275J53757r6548
5995E13766m91620l30823M27861L18834n4352k95715j2384M70134k79013J96051
5985D62739N245l26479K17174j92855J43503j8778J44109o5905N1580J56309L28787
5974I05429n08597n39811J27760m34460N56680M66933J87884k05555l75303l73194
5964a92234K28952L11591q2131K1092N28655l5229j87559l09412k19976l02477
5954b38728R8404R57760l72638R8436l92792m42042M28659k71440L00936P61795
$$ plain form
6025 840847 102778 17532 -150633 -108400 -279809 136015 318971 -103657 157976 455687
6015 455687 110968 58351 -107939 248795 545502 135792 24532 -319992 51757 864721
6005 864721 555459 -78078 20043 603113 738528 737486 837832 456557 610314 513766
5995 513766 22146 -308677 119184 438018 383666 87951 75567 545701 266688 462739
5985 462739 467984 141505 358679 165824 309327 290549 434658 368753 420333 576642 905429
5974 905429 396832 -142979 -15219 -449679 107001 573934 761818 556263 180960 -192234
5964 -192234 36718 348309 266178 287270 815925 780696 593137 283725 63749 -238728
5954 -238728 -140324 817436 444798 543234 150442 -291600 137059 -134381 166555 928350
5944I28350j13546j4446l95894j57679r5680m25277o123O54263J80288l7223J40036
5933F57069j99216n66876J19626O9817J50045L00153k69158j05636m60201K02420
5923a01957N82299p614n85520k77190N47827J19590l79347K57826N2934J30588
5913C39436q7251j0729j33884j2349q337M66287o15885K16386N61949n60319l27932
5902a72628j32252l11058O91568M83548m9154M4569k66153j13050l65542L33232
5892A43080K81785m93837K47580L61633j9858k33784J2712M6394L37485O7351
5882G50541l24274l05303j45285K86354K6437l47638j748L60548k28984o65671
5872e95023N97286K51603Q4738K99819K53934k17191o82162p1779k4767J86966
$$ plain form
5944 928350 814804 800358 404464 246785 151105 -274172 -280295 373968 554256 517033 657069
5933 657069 457853 -109023 10603 80420 230465 530618 261460 155824 -304377 -101957
5923 -101957 480342 472728 -112792 -389982 157845 277435 -101912 155914 208848 339436
5913 339436 252185 241456 107572 95223 86886 553173 -62712 153674 715623 155304 -172628
5902 -172628 -304880 -615938 75630 559178 510024 554593 288440 175390 -190152 143080
5892 143080 424865 -68972 178608 540241 520383 286599 299311 345705 683190 750541
5882 750541 426267 120964 -24321 262033 288470 -59168 -60916 299632 70648 -595023
5872 -595023 2263 253866 338604 638423 892357 675166 -6996 -78775 -103542 83424
5862H3424n7017J20061J74604N22539Q7835k24171o63575k82570L90918M13864
5852E65912k57998O454L79843Q414l60208J1955j62409J96962j0318j83485J60528
5841C55650L45573o5894p41665K89023P74251l59163L42382l35380j05694K22428
5831G21511m31908N15720M09866n2456m64733l06693L45281r2731j26447k56843
5821B60567k21094L13714L48522M12345k00007j82940j31561K17986J12712j15510
5811H14734j61167J14608m12692l07523O44760j50835l16887M8621P70612o7499
5801I76732m13437j42122k56453L31431o4541K33292J05162r0338K1721l01769
5791C99678M09306N58148q67412p09339K63788J56705J37937J97850l61055P65346
$$ plain form
5862 83424 26407 146468 321072 843611 931446 707275 43700 -238870 152048 565912
5852 565912 307914 314368 694211 702625 342417 354372 191963 388925 378607 195122 355650
5841 355650 701223 635329 -106336 182687 956938 597775 940157 604777 499083 721511
5831 721511 289603 805323 1215189 1162733 698000 391307 736588 643857 517410 260567
5821 260567 39473 353187 701709 1114054 914047 731107 599546 817532 930244 814734
5811 814734 653567 768175 355483 47960 692720 541885 224998 273619 1044231 976732
5801 976732 563295 421173 164720 496151 431610 664902 770064 679726 701447 399678
5791 399678 808984 1367132 499720 -209619 54169 210874 348811 546661 185606 950952
5781I50952M93909J56767p46788l12129J06563j0879P8947n5664k09970k02227
5771B49481J33054J10842N0635j81307L25164k60372R2595L5499j03778N3846
5761E05659K43061L15l52714O1867k05273j03143K12713K91792k45929m3549r0033
5750B74766j15317N8789J92570o0343M90496j33992K17484K32335q80525k3123
5740B53140J08598K81741q8225J30036K53019j59067l52942K78480j26081K88817
5730H67516M86468L53422J1904l95036m74610K86812M63092K98238l47547k18563
5720A331696l35605L57556l1601n16045k28847L80701P8510k06624j70556p25303
5710f6118q3984J126721N66638o93862Q0333M45864J03757K76806k14370j64179
$$ plain form
5781 950952 1444861 1601628 854840 542711 649274 638395 717342 661678 451708 249481
5771 249481 382535 493377 544012 362705 687869 427497 520092 555591 451813 505659
5761 505659 748720 749035 396321 458188 252915 149772 362485 654277 408348 364799 274766
5750 274766 159449 218238 410808 350465 840961 706969 924453 1156788 276263 253140
5740 253140 361738 643479 555254 685290 938309 779242 426300 704780 578699 867516
5730 867516 1353984 1707406 1719310 1324274 849664 1136476 1599568 1897806 1550259 1331696
5720 1331696 996091 1353647 1322046 806001 577154 957855 1036365 829741 659185 -66118
5710 -66118 -150102 976619 1543257 849395 929728 1375592 1479349 1756155 1541785 1377606
5700A377606j78467J24329K24165L80841Q10901K30701L01719M535j22734l71121
5690B782475L47512k50465l65204n90756n20727j19622J09417o9523R1400K75195
5680A689702Q9806j49443j4653j88574k09679M09539l09542j52568N95114J0343
5670A770045j5848L02683M0380k39981j54365P82196O12624O08153P1666p213
5660C770340j33870q04420j40384R1759o11154n03314m38724M03045O7013o2161
5650A638130m78546r5891k57655L58741P82250q81723R9935j93867j52361K95070
5640A114083M68296m12227n6928J79167N92873o48237L26291N03380n10518j26838
5630A429342M22574l223j10006j36081Q2138n14619j32697j55813J84995K89075
$$ plain form
5700 1377606 1199139 1323468 1547633 1928474 2739375 2970076 3271795 3276330 3153596 2782475
5690 2782475 3129987 2879522 2514318 1923562 1402835 1283213 1392630 1323107 1414507 1689702
5680 1689702 1779508 1630065 1615412 1426838 1217159 1626698 1317156 1164588 1759702 1770045
5670 1770045 1754197 2056880 2097260 1857279 1702914 2485110 3097734 3705887 3777553 3770340
5660 3770340 3636470 2832050 2691666 2783425 2172271 1668957 1230233 1633278 1700291 1638130
5650 1638130 1159584 1063693 806038 1164779 1947029 1065306 1165241 971374 819013 1114083
5640 1114083 1582379 1170152 1113224 1292391 1885264 1237027 1563318 2066698 1556180 1429342
5630 1429342 1851916 1848693 1738687 1602606 1684744 1170125 1037428 881615 1066610 1355685
5620A355685J09135k38477k65427m60319N9071J92644O15055j57872k04330P30723
5610A735888K85066q1678r92242r9765M86445L64611k71287M63716r1306l57494
5600A441954N827n0577R96754j32602J15615M15817R7107J61258k99922L46363
5590C097594j79567K60136m78199k2945k04426l21701m78952K51912o750l09413
5580A607689j89331J2545M30L16978o10058J52598M51890l04507j45611o16588
5570F76035K13426N74851J40018k84278J71572K96471p09836Q9642J95704M99612
5560A863217J16030l77176O6770l2356l89448R6686M47154J87209l67914P0241
5550A680413J77683k21384J44517j09974l80045P87234K62927L60585j02715o09287
$$ plain form
5620 1355685 1464820 1226343 960916 500597 559668 752312 1367367 1209495 1005165 1735888
5610 1735888 2020954 1939276 947034 847269 1333714 1698325 1427038 1890754 1799448 1441954
5600 1441954 1447781 1397204 2393958 2261356 2376971 2792788 2889895 3051153 2751231 3097594
5590 3097594 2918027 3178163 2699964 2677019 2472593 2150892 1671940 1923852 1917102 1607689
5580 1607689 1418358 1430903 1431333 1748311 1138253 1290851 1742741 1438234 1292623 676035
5570 676035 889461 1464312 1604330 1320052 1491624 1788095 1078259 1167901 1363605 1863217
5560 1863217 1979247 1602071 1668841 1636485 1247037 1343723 1790877 1978086 1610172 1680413
5550 1680413 1858096 1636712 1781229 1671255 1291210 2078444 2341371 2701956 2599241 1989954
5540A989954K37153k9326M70250L45865M38978k9591k58172K44922L96292J1693
5530C818018j09468M08825k1702n1436P1964k29526j51329p4587j11147m28572
5520C121040l40740K12720o3709m096M5020l11140P5632k69537j00992m00938
5510A963260L94818m03725q03099J32003M90720l77p827J03983k6599J81718l63764
5499A661111L3739K19636M15804M62730l19188p46759l38993K11349m8339J82597
5489A733687k59036M7598K62080l3104P68031q4974l12259k5441l40741P6132
5479A831973l59130q1338J30709J61923J63570r4127j38993N45255Q1041J01965
5469B342848J80074j57451p25384K99367P79356o24295l76036P3691J2648L51825
$$ plain form
5540 1989954 2227107 2197781 2668031 3013896 3452874 3423283 3165111 3410033 3806325 3818018
5530 3818018 3708550 4117375 4095673 4044237 4116201 3886675 3735346 3660759 3549612 3121040
5520 3121040 2780300 2993020 2929311 2925215 2970235 2659095 2734727 2465190 2364198 1963260
5510 1963260 2358078 1954353 1151254 1283257 1773977 1773600 1765773 1869756 1843157 2024875 1661111
5499 1661111 1694850 1914486 2330290 2793020 2473832 1727073 1388080 1599429 1551090 1733687
5489 1733687 1474651 1522249 1784329 1751225 2519256 2434282 2122023 2096582 1755841 1831973
5479 1831973 1472843 1391505 1522214 1684137 1847707 1753580 1614587 2159842 2240883 2342848
5469 2342848 2522922 2365471 1640087 1939454 2718810 2094515 1718479 1792170 1804818 2156643
5459B156643l45635j68620l084K59387j32471N56973N73802m15665k62286M27936
5449B646980Q5352k74822j65586j89108N7215j32116Q84178m64246k3668k90029
5439B134150k74281J25502M30788n511k84411N1953m84522o3454M24776k23210
5429A831780Q1941O35225m6649m1450j61306k76422j02129K43641L84102K28864
5419B777597l67325q5579M3325J87147p6759L67155p2388k03478K71466m26767
5409B414394r0419L60420O5488l22894L11961K16211k62442l29240l16808J15717
5399B162388J19637k87521L92577K77432J52435K27945r776K3053J57980J7140
5389C233290K34849Q1756l18912j03166j21799K44059M22846j4699l10620q9090
$$ plain form
5459 2156643 1811008 1642388 1639304 1898691 1766220 2323193 2896995 2481330 2219044 2646980
5449 2646980 2732332 2457510 2291924 2102816 2160031 2027915 2912093 2447847 2424179 2134150
5439 2134150 1859869 1985371 2416159 2410648 2126237 2178190 1693668 1630214 2054990 1831780
5429 1831780 1913721 2548946 2502297 2460847 2299541 2023119 1920990 2164631 2548733 2777597
5419 2777597 2410272 2324693 2368018 2555165 2478406 2845561 2773173 2569695 2841161 2414394
5409 2414394 2323975 2684395 2749883 2426989 2738950 2955161 2692719 2363479 2046671 2162388
5399 2162388 2282025 1994504 2387081 2664513 2816948 3044893 3035117 3058170 3216150 3233290
5389 3233290 3468139 3549895 3230983 3127817 3006018 3250077 3672923 3658224 3347604 3258514
5379C258514P32386l77062l53817k404J72906J38572o7148l41204K94063J99560
5369C654366q95477J59795P13610K62312J15936M22940J1786N07251k54769m01833
5359D295917l86738O4515K82551M34103k21800K94111J86273j52722O0269K01224
5349E057703N52723l49813L15377l9399J82786M51480k21791l12795N9301o0844
5339E634728M0483L62221N7384l48823l99593Q8712K38068K40137N24392l80105
5329F057604j4761L67102p7552j43937N8651J52049L23730J60202q4705j30688
5319F667695m1313J15605J39090M77762j1398L9666L93773R3625J37324K41555
5309H253384R7239j70227M75834M70072j39024N63519K58606M52694J78153M48777
$$ plain form
5379 3258514 3990900 3613838 3260021 3257617 3430523 3569095 3501947 3160743 3454806 3654366
5369 3654366 2758889 2918684 3632294 3894606 4010542 4433482 4445268 4952519 4697750 4295917
5359 4295917 3909179 3973694 4256245 4690348 4468548 4762659 4948932 4796210 4856479 5057703
5349 5057703 5610426 5260613 5575990 5536591 5719377 6170857 5949066 5636271 5695572 5634728
5339 5634728 5675211 6037432 6094816 5745993 5346400 5435112 5673180 5913317 6437709 6057604
5329 6057604 6042843 6409945 6332393 6188456 6247107 6399156 6722886 6883088 6798383 6667695
5319 6667695 6626382 6741987 6881077 7358839 7347441 7387107 7780880 7874505 8011829 8253384
5309 8253384 8350623 8180396 8656230 9126302 8987278 9550797 9809403 10262097 10440250 10889027
5299A0889027M50026K35253N05250N02027M94725Q0194L20403P22105O47004k4119
5289A4821895j90545P99509J068518N36169J229750J048257J248194J004005P97663
5280B2363415Q66118J843400J996608K315642K492995L791666M219414L906414
5272D3795672M952782N673576O642114P667726R675056J3212869K0430463L0593949
5264A42644207M2947509N3067842N5521261M5526145K3489467K802140j0663843
5257C55334728k0103528l1710747m0947549m2044291l8230676l4192677k8701241
5250A19404019k1612377j6154681j2995505r757973p272734n559632m600504l561018
5242C7889595k761693k625456j392658j307795j456351j530565j009037p68589
$$ plain form
5299 10889027 11339053 11574306 12079556 12581583 13076308 13156502 13476905 14199010 14846014 14821895
5289 14821895 14631350 15430859 16499377 17035546 18265296 19313553 20561747 21565752 22363415
5280 22363415 23229533 25072933 27069541 29385183 31878178 35669844 39889258 43795672
5272 43795672 48748454 54422030 61064144 68731870 78406926 91619795 112050258 142644207
5264 142644207 185591716 238659558 294180819 339706964 363196431 365998571 355334728
5257 355334728 335231200 303520453 262572904 220528613 182297937 148105260 119404019
5250 119404019 97791642 81636961 68641456 58883483 51610749 46051117 41450613 37889595
5242 37889595 35127902 32502446 31109788 29801993 28345642 26815077 25806040 25037451
5234B5037451j096291p30149j73440o0395K27131k59166K66430R11771R95011
5225B5118353K98183L70394j167351m85661j238438j313681r87601j455238j269471
5216A7869489o35206o94323o65221p14780J37585j04507j59712k1624J91687n4011
5206A5149377M1225N05161P01253n4392l00384l73631m95324j59053n61595j86305
5196A4266332j60503n08660m47959m76648k21280k3767J98717K90875p85410j1972
5186A2119725k0871k23534J66718k8998k49658N1320J07098M30440O8095K82864
5176A2703199k02935k98786k14218m7285o9667k42818L89202N33317l24905N7816
5166A2282920K37210N7871j38604L06150L5670m45470l7831J17325m5352J56361
$$ plain form
5234 25037451 23941160 23211011 23037571 22977176 23204307 22945141 23211571 24123342 25118353
5225 25118353 25416536 25786930 24619579 24133918 22895480 21581799 20594198 19138960 17869489
5216 17869489 17234283 16539960 15874739 15159959 15297544 15193037 15033325 15011701 15203388 15149377
5206 15149377 15190602 15695763 16397016 16342624 16042240 15668609 15173285 15014232 14452637 14266332
5196 14266332 14105829 13597169 13149210 12672562 12451282 12427515 12626232 12917107 12131697 12119725
5186 12119725 12098854 11875320 12042038 12013040 11763382 11814702 11921800 12352240 12420335 12703199
5176 12703199 12500264 12201478 11987260 11939975 11870308 11627490 12016692 12550009 12225104 12282920
5166 12282920 12520130 12578001 12439397 12745547 12781217 12335747 12297916 12415241 12369889 12526250
5156A2526250J64215J685m99897K21457M3347q90728k18167J6627P049M56149
5146A1827987l66648n71698k30753O56458q4831k81607L04271J66804m78869K56383
5136A1197497M1219k10677m0016J51958k0983j26110J74245J55090o170k51110
5126A1064943M9834R4317l89767k57489L74719l61300L96513L39625J38580K36580
5116A1686555J57300j01638M02078J07760o22903L2215J6752L03042M7269L84935
5106A2413365L30104K5455j26940J35754Q6327J08688J67718o19879Q6462N4778
5096A2661832M1950l14881N40105L77241K14614R0521O24225j42678m49508L89609
5086A4033030M31114j07669j73194K99206K25183j05643L25514K65375m0217L89850
$$ plain form
5156 12526250 12690465 12692150 12192253 12413710 12457057 11566329 11348162 11364789 11371838 11827987
5146 11827987 11461339 10889641 10658888 11315346 11230515 10948908 11253179 11419983 10941114 11197497
5136 11197497 11238716 11028039 10988023 11139981 11118998 10992888 11167133 11322223 11316053 11064943
5126 11064943 11114777 11209094 10819327 10561838 10936557 10575257 10971770 11311395 11449975 11686555
5116 11686555 11843855 11742217 12144295 12252055 11629152 11661367 11678119 11981161 12028430 12413365
5106 12413365 12743469 12768924 12641984 12777738 12864065 12972753 13140471 12520592 12607054 12661832
5096 12661832 12703782 12388901 12929006 13306247 13520861 13611382 14235607 14092929 13643421 14033030
5086 14033030 14464144 14356475 14183281 14482487 14707670 14602027 14927541 15192916 15152699 15542549
5076A5542549L72236k53838n28444L55621N24477q2816M66144L41233j14424J54399
5066A6777137L02363K80520N0525L27446Q9584O2599K54782P8241K92685k80148
5056A8235734r2461O76389M63929K36850J8607k24248k95919L56069Q59694O20563
5046B0855207J02305N01675N75811m55447K88713K91507K06273Q8157K3848P04837
5036B3182886j05903N3061P36829N13888k46487P91220M42152N52080L62287N01843
5026B6783856K16052M07779O5512l3082Q36759M66528J47691J40872N61075L52911
5016B9945953M42994J80282Q31945k8085Q15311J048975L79751J30349L46856
5007C4094331K7529K64600L94886N08866O91579N38668M37883M80424R89940M94513
$$ plain form
5076 15542549 15914785 15660947 15132503 15488124 16012601 15929785 16395929 16737162 16622738 16777137
5066 16777137 17079500 17360020 17410545 17737991 17827575 17890174 18144956 18223197 18515882 18235734
5056 18235734 18143273 18819662 19283591 19520441 19539048 19314800 19018881 19374950 20234644 20855207
5046 20855207 20957512 21459187 22034998 21579551 21868264 22159771 22366044 22454201 22478049 23182886
5036 23182886 23076983 23130044 23866873 24380761 24134274 24925494 25367646 25919726 26282013 26783856
5026 26783856 26999908 27407687 27473199 27440117 28276876 28743404 28891095 29031967 29593042 29945953
5016 29945953 30388947 30569229 31401174 31373089 32188400 33237375 33617126 33747475 34094331
5007 34094331 34121860 34386460 34781346 35290212 35981791 36520459 36958342 37438766 38428706 38923219
4997C8923219R38004M39452M69076P47275Q37323J61760P76724Q77841M11042
4988D4581716P11923J090515O17335Q13860P62114M53713Q12452R84990L12419
4979E1141037P09933J454588J248104Q80647P20728J128336P64000J101655J055522
4970F0204550J364250J393816J225265R44562J132115J195080J595484J337924
4962G0393046J152941J662439J499632J198259J394510K007071J723351J996436
4954H3027685J649510J737148K009803J585751J683747K601478K147674K184828
4946I8627624K119582K015546K761169K932648K065107K085231K687077K622717
4938A17916701L004095L552115L686926L110116L209467L694127L300045L391386
$$ plain form
4997 38923219 39861223 40300675 40769751 41517026 42354349 42516109 43292833 44170674 44581716
4988 44581716 45293639 46384154 47001489 47815349 48577463 49031176 49843628 50828618 51141037
4979 51141037 51850970 53305558 54553662 55434309 56155037 57283373 58047373 59149028 60204550
4970 60204550 61568800 62962616 64187881 65132443 66264558 67459638 69055122 70393046
4962 70393046 71545987 73208426 74708058 75906317 77300827 79307898 81031249 83027685
4954 83027685 84677195 86414343 88424146 90009897 91693644 94295122 96442796 98627624
4946 98627624 100747206 102762752 105523921 108456569 110521676 112606907 115293984 117916701
4938 117916701 120920796 124472911 128159837 131269953 134479420 138173547 141473592 144864978
4930A44864978M256544M162026M612797M210211M953578M350403M739488N611815
4922A81761840N072033N316597N296648M790736N973644O137354N956320N890384
4914B26195556O420289P091829P034235P182615P554494P476696P427726Q194068
4906B84577508Q174152Q681357Q519186Q276359Q340811Q983964Q927496Q846965
4898C53327798Q883164R005778R024012Q198538Q801105P787440P103365P606314
4890D19737514P346738O026894N486876N001290M445210M129330L057289K297723
4882D57528864J646646O48425p46820r24924k043685j804373l426467m547144
4874D46330522m881583n290735o135499o306814o955680p110203p796092q070719
$$ plain form
4930 144864978 149121522 153283548 157896345 162106556 167060134 171410537 176150025 181761840
4922 181761840 186833873 192150470 197447118 202237854 208211498 214348852 220305172 226195556
4914 226195556 232615845 239707674 246741909 253924524 261479018 268955714 276383440 284577508
4906 284577508 292751660 301433017 309952203 318228562 326569373 335553337 344480833 353327798
4898 353327798 362210962 371216740 380240752 388439290 397240395 405027835 412131200 419737514
4890 419737514 427084252 433111146 438598022 443599312 448044522 452173852 455231141 457528864
4882 457528864 459175510 459823935 459077115 458152191 456108506 454304133 450877666 446330522
4874 446330522 441448939 436158204 430022705 423715891 416760211 409650008 401853916 393783197
4866C93783197q689923r000917q244177q791571q341522q528344q328377q206084
4858C25652282q736642q518841p868825q020152p606026p449086p549307p417172
4850B62486231p164038p026473p114814o985799o429996o391957o199869n310277
4842B09863008n704450n364399n294304m948414n020588m953424m754159m787171
4834A69036099m156541m187627m233707l774911l562382l481235l303596l563085
4826A38773015l620273k795878l233388l363425k651458k764243k384501l388584
4818A14571265k791241k431036k425850k399875k163814k046601j637560k648082
4810I6027206j923642j652698k022498j704477j953728k238566j345145j831669
$$ plain form
4866 393783197 385093274 376092357 367848180 359056609 350715087 342186743 333858366 325652282
4858 325652282 316915640 308396799 300527974 292507822 284901796 277452710 269903403 262486231
4850 262486231 255322193 248295720 241180906 234195107 227765111 221373154 215173285 209863008
4842 209863008 204158558 198794159 193499855 188551441 183530853 178577429 173823270 169036099
4834 169036099 164879558 160691931 156458224 152683313 149120931 145639696 142336100 138773015
4826 138773015 135152742 132356864 129123476 125760051 123108593 120344350 117959849 114571265
4818 114571265 111780024 109348988 106923138 104523263 102359449 100312848 98675288 96027206
4810 96027206 94103564 92450866 90428368 88723891 86770163 84531597 83186452 81354783
4802H1354783j980728j641932k000842j349491j123402j366528j274161j326747
4794F9290952j690472j176176r63418j422358j189097q36298q07096j092393j342946
4785E8770698j046921j141943r51571p86432r55201j546802j375987p15601q27659
4776D9422581o63446l64468r03593p07617n78650m96283m06873n75265j571524
4767D3154862j191858o1033n67586q43751p42757j107737l72645n65456o02029
4758C7100010q23203o32115k24272n60056p58994j91901k63568n80381l95200
4749C2670320m74483p18295m05893l05530p00604p27669q9750j88787r0606p06087
4739B8262616o80678k69505m20405n36819m00034P2789j95411l59361j20487j86613
$$ plain form
4802 81354783 79374055 77732123 75731281 74381790 73258388 71891860 70617699 69290952
4794 69290952 67600480 66424304 65460886 64038528 62849431 62013133 61206037 60113644 58770698
4785 58770698 57723777 56581834 55630263 54843831 53888630 52341828 50965841 50250240 49422581
4776 49422581 48759135 48394667 47491074 46783457 46204807 45708524 45301651 44726386 43154862
4767 43154862 41963004 41901971 41334385 40490634 39747877 38640140 38267495 37702039 37100010
4758 37100010 36276807 35644692 35420420 34860364 34101370 33909469 33645901 33065520 32670320
4749 32670320 32195837 31477542 31071649 30766119 30065515 29337846 29248096 29059309 28968703 28262616
4739 28262616 27581938 27312433 26892028 26355209 25955175 26027964 25832553 25473192 25352705 25166092
4729B5166092l78562p62786K14887k89158l33182j22589n43908l71782k24804
4720B2354208K09936j54666o44795m08314k96508m39813L70833n60221p86376
4711A9644284m43633k37996o46842j8576j53309j54893N2928k12822m54240q248
4701A7366653k44802k59841k06918j91073l40611o58782k57773P59877j08127
4692A5858603o48629l45216L33957m30201l0951L19898j45245n89129r07500r4780
4682A3320807K12753l0777k91933m72136K81700P2088N3229K41514p84451p2104
4672A2530690K15993k15974n03282K42671r4104l3663k64973n45414J91275Q1994
4662A1605213j83756R4928L5697K38868p32317L9420k63717j67651j25982n43120
$$ plain form
4729 25166092 24787530 24024744 24239631 23950473 23617291 23494702 22950794 22579012 22354208
4720 22354208 22564144 22409478 21764683 21356369 21059861 20620048 20990881 20430660 19644284
4711 19644284 19200651 18962655 18315813 18297237 18143928 17989035 18041963 17829141 17374901 17366653
4701 17366653 17121851 16862010 16655092 16464019 16123408 15464626 15206853 15966730 15858603
4692 15858603 15209974 14864758 15198715 14768514 14737563 15057461 14912216 14323087 13415587 13320807
4682 13320807 13533560 13502783 13210850 12738714 13020414 13092502 13145731 13387245 12602794 12530690
4672 12530690 12746683 12530709 12027427 12270098 12175994 12142331 11877358 11331944 11523219 11605213
4662 11605213 11421457 11516385 11552082 11790950 11058633 11098053 10834336 10666685 10540703 9997583
4652I997583l1729J27340k50405K86726J8316j32666n17021K31261K13361j205305
4642H737461K47314J96871k24355Q890J7971j9386l28338J00804k1681j88475
4632H527076M0482K55523J3156n74475O1867k86913J70704J75213j48314P94599
4622I028918n69543o42173K13980n06567J87655N21058J00791m27988m98614k27543
4612G179974K64469l77730L00189q3885L8705m90592J47787L58831l03653P8598
4602G112693Q8026J0446l76578M98361K8664K28100l23132k62577P24903N93148
4592H322054J37465j23234k66678J15013l95576l57663L49113N05839J8759k58999
4582H046093O91638K7987l02766k53420m30449J2113k13377n4857l15059M89269
$$ plain form
4652 9997583 9965854 10093194 9842789 10129515 10147831 10015165 9498144 9729405 9942766 8737461
4642 8737461 8984775 9181646 8957291 8966181 8984152 8964766 8636428 8737232 8715551 8527076
4632 8527076 8567558 8823081 8836237 8261762 8323629 8036716 8207420 8382633 8234319 9028918
4622 9028918 8459375 7817202 8031182 7524615 7712270 8233328 8334119 7906131 7407517 7179974
4612 7179974 7444443 7066713 7366902 7283017 7321722 6831130 6978917 7337748 7034095 7112693
4602 7112693 7200719 7211165 6834587 7332948 7361612 7589712 7266580 7004003 7728906 8322054
4592 8322054 8459519 8336285 8069607 8184620 7789044 7431381 7780494 8286333 8305092 8046093
4582 8046093 8737731 8765718 8462952 8209532 7779083 7791196 7577819 7522962 7207903 7697172
4572G697172K5934m90012j97471J16468j11885k20310l78218L45376k06190o36301
4562E944563j48446O23652M5433J32098K07279m68007o71682o6999J60020k93420
4552E464491L21469q11319j56580O22897K70350r04134N62433K02199l39510l19200
4542D913096J25964k8025l82768K64259L16606j83690M09350K09039j37078m40959
4532E065794o05175J99570J21970k57604J98886k65220n96448O02604M34202l06652
4522D591927j52351j37839J00329J17499m19775K4083J82446k42611P2807M67520
4512D604035M065n92745j13016M73071K09651k55629l29094j33852J11676j31563
4502C846599j81199O99153k49220k25911o5618O56805k43451p28217L88150P3669
$$ plain form
4572 7697172 7723106 7233094 7035623 7152091 7040206 6819896 6441678 6787054 6580864 5944563
4562 5944563 5796117 6419769 6465202 6597300 6804579 6336572 5664890 5597891 5757911 5464491
4552 5464491 5785960 4974641 4818061 5440958 5711308 4807174 5369607 5571806 5232296 4913096
4542 4913096 5039060 5011035 4628267 4892526 5209132 5025442 5434792 5643831 5506753 5065794
4532 5065794 4460619 4660189 4782159 4524555 4723441 4458221 3861773 4464377 4898579 4591927
4522 4591927 4439576 4301737 4402066 4519565 4099790 4123873 4306319 4063708 4136515 4604035
4512 4604035 4608100 4015355 3902339 4375410 4585061 4329432 4000338 3866486 3978162 3846599
4502 3846599 3665400 4364553 4115333 3889422 3823804 4480609 4237158 3508941 3897091 3970760
4492C970760q9881l32189J83778K19113O3047K1099k14790K01115j6109K89364
4482D295307O6892m92634j76680N32947j24437k7264m20012O5771K94726l64225
4472C650391P0732L72544K66447l7680n43519K20453J8887k34857J19905K39986
4462D143289J52908k01855J77033k11932K48718k35915J45477j45515j10659j48787
4452C812762J97262L17098J68721l25328m01411K41612J12449M45859R9531r6816
4442D571739j78387j25874L22295M57469L77140J92883R79714K37782L55333J124235
4432H314329n3988k64525j48648p86048n23177l98734k47473n91851n52223K39470
4422D987132o70666m85739K43629l09974l29461k84900K02751J22225j90229p7832
$$ plain form
4492 3970760 3880879 3548690 3732468 3951581 4014628 4035727 3820937 4022052 4005943 4295307
4482 4295307 4362199 3869565 3692885 4225832 4101395 4074131 3654119 3719890 4014616 3650391
4472 3650391 3721123 4093667 4360114 4322434 3778915 3999368 4018255 3783398 3903303 4143289
4462 4143289 4296197 4094342 4271375 4059443 4308161 4072246 4217723 4072208 3961549 3812762
4452 3812762 4010024 4327122 4495843 4170515 3769104 4010716 4123165 4569024 4668555 4571739
4442 4571739 4393352 4267478 4589773 5047242 5424382 5617265 6596979 6834761 7190094 8314329
4432 8314329 8260341 7995816 7847168 7061120 6537943 6139209 5891736 5299885 4747662 4987132
4422 4987132 4316466 3830727 4074356 3764382 3434921 3150021 3352772 3474997 3284768 3206936
4412C206936j63902M02893k47216k08952J09670k3455j97781q5618J98939J107
4402B992621k21023J42579j66182O10449P05613N0835l76087j6423k96845P8230
4392C503767M16956P3124j13564k68362K97233k26871J64415l06010j69295O07320
4382C978713o0691k63670l2431k06832N1005N73725k15909r2515R003k70749N51407
4371D021056j74237l38474k19724r6497m9899k52073N22267M99737n5725m58614
4361C397817m06308j62222j40000O23749P70719l43958l55548N47433K61178j23924
4351D068936K4113L9076k18396j05354k07642m7189L4511M91680O7469R9446O2998
4340D309648K04220n46155L52660M02732n4695M72046l75383R5857K06714m5085
$$ plain form
4412 3206936 3043034 3445927 3198711 2989759 3099429 3075974 2878193 2792575 2991514 2992621
4402 2992621 2771598 2914177 2747995 3358444 4064057 4114892 3738805 3722382 3425537 3503767
4392 3503767 3920723 3993847 3880283 3611921 3909154 3682283 3846698 3540688 3371393 3978713
4382 3978713 3918022 3654352 3621921 3415089 3466094 4039819 3823910 3731395 3740398 3469649 4021056
4371 4021056 3846819 3508345 3288621 3192124 3142225 2890152 3412419 3912156 3856431 3397817
4361 3397817 2991509 2829287 2689287 3313036 4083755 3739797 3384249 3931682 4192860 4068936
4351 4068936 4093049 4132125 3913729 3808375 3600733 3553544 3588055 4079735 4147204 4246650 4309648
4340 4309648 4513868 3967713 4320373 4723105 4668410 5140456 4765073 4860930 5067644 5022559
4330E022559m5079K42557P321K16059m93373m5749M38308K87811O28026q643l00895
4319E948902M66126N50992L27552J003904J163467J011819P4109K73847j3654
4310A0807064k99487j41198q9448J14082o02035m98533L8071l4410J03913L16523
4300I714542L74256N68531j19439N27219l7738O34105J198950N78836M58845R12389
4290A4810496O61544J188928J472292N47494J123300J577275J383203J567120
4282B4331652J948741J254930R22760J164892J572990J244667J156127J594072
4274C5190831R06547O47865J203191J063430N2897R47879P98957J412892R26317
4265D3150806J232464J101852J498711J554628J936681K438926K107080K400955
$$ plain form
4330 5022559 4977480 5220037 5227358 5443417 4950044 4904295 5342603 5630414 6258440 6249797 5948902
4319 5948902 6415028 6966020 7293572 8297476 9460943 10472762 10546871 10820718 10807064
4310 10807064 10507577 10366379 10276931 10391013 9788978 9290445 9328516 9294106 9398019 9714542
4300 9714542 10088798 10657329 10537890 11065109 11027371 11661476 12860426 13439262 13898107 14810496
4290 14810496 15472040 16660968 18133260 18680754 19804054 21381329 22764532 24331652
4282 24331652 26280393 27535323 28458083 29622975 31195965 32440632 33596759 35190831
4274 35190831 36097378 36745243 37948434 39011864 39064761 40012640 40811597 42224489 43150806
4265 43150806 44383270 45485122 46983833 48538461 50475142 52914068 55021148 57422103
4257E7422103K297175K299090K214021K175919K105297J884196J610344J791793
4249G3799938Q17714O43955K98113j7851k70661m56899o82449j531685j893459
4240G0706716r69291j482005k256989j652334q23759r33541j680191j378560q34175
4231E8695871k03620r39216q18833j152590j452662o09842j677040p33962j386858
4222D9721248j304218j557295j829675j864307j658645j429548j489144j742707
4214C6845709j279144j072552r54978j329808j367598j107465m44682r53961m16851
4205B7918670m01816p3392l00482r3058K86065j64332l68499k38671j78295J077538
4195B7463728J154334O82732L75687J055230J232485R24026J112556J172765J520184
$$ plain form
4257 57422103 59719278 62018368 64232389 66408308 68513605 70397801 72008145 73799938
4249 73799938 74617652 75261607 75559720 75541869 75271208 74814309 74131860 72600175 70706716
4240 70706716 69737425 68255420 65998431 64346097 63522338 62588797 60908606 59530046 58695871
4231 58695871 58492251 57553035 56734202 55581612 54128950 53519108 51842068 51108106 49721248
4222 49721248 48417030 46859735 45030060 43165753 41507108 40077560 38588416 36845709
4214 36845709 35566565 34494013 33539035 32209227 30841629 29734164 29289482 28335521 27918670
4205 27918670 27516854 27443462 27142980 27049922 27335987 27171655 26803156 26564485 26386190 27463728
4195 27463728 28618062 29300794 29676481 30731711 31964196 32888222 34000778 35173543 36693727
4186C6693727J721766J599474J376881J639423J311378J383989J795897J959136
4178D9481671J546261J504177J162739P90231R57696J310074N02287Q65569J477994
4169E9598699J160300J738378J927070J503109J873645K574964K792023K188637
4161G5356825K340219J782217J701168J236766J059858J18719j17305j109575
4153H2368892j286484j769685j561378j782402j966326j853946j516575j930446
4145F8701650j832729k036611j654828j702857r68334p01626j171286j645429
4137E6987950j090924o33670j300386j467952j313038j517885r31287q77224j293138
4128D6562446p57837r66563j013501r39916q74936R0541K15042N66272P93353
$$ plain form
4186 36693727 38415493 40014967 41391848 43031271 44342649 45726638 47522535 49481671
4178 49481671 51027932 52532109 53694848 54485079 55442775 56752849 57255136 58120705 59598699
4169 59598699 60758999 62497377 64424447 65927556 67801201 70376165 73168188 75356825
4161 75356825 77697044 79479261 81180429 82417195 83477053 83595772 83478467 82368892
4153 82368892 81082408 79312723 77751345 75968943 74002617 72148671 70632096 68701650
4145 68701650 66868921 64832310 63177482 61474625 60506291 59804665 58633379 56987950
4137 56987950 55897026 55263356 53962970 52495018 51181980 49664095 48732808 47855584 46562446
4128 46562446 45804609 44838046 43824545 42884629 42009693 42100234 42315276 42881548 43674901
4119D3674901K850449L492481K709970J209568q07092j315355j870028k335744
4111D7609150l648962k795346l072590l190410j546444o86193L99319J384785
4103C4453309J746557K555956K487534K329650J915910K307497K283998L112889
4095E3193300L833824L553432L899036M066970L073081J898534J614043K189883
4087G7322103K799777K939643L075553K833947R09610J94426o65442j811884k150746
4078H5446987j543837j672819j838252j962554l106687l399965l900054l468989
4070F4553830l342224m333506l355047l155595l527874l891233l170175k853398
4062C6924778l258343l947230k950558k661803k525445j459656j963942j781151
$$ plain form
4119 43674901 46525350 50017831 52727801 53937369 53130277 51814922 49944894 47609150
4111 47609150 43960188 41164842 38092252 34901842 33355398 32669205 33068524 34453309
4103 34453309 36199866 38755822 41243356 43573006 45488916 47796413 50080411 53193300
4095 53193300 57027124 60580556 64479592 68546562 71619643 73518177 75132220 77322103
4087 77322103 80121880 83061523 86137076 88971023 89880633 90075059 89409617 87597733 85446987
4078 85446987 83903150 82230331 80392079 78429525 75322838 71922873 68022819 64553830
4070 64553830 61211606 56878100 53523053 50367458 46839584 42948351 39778176 36924778
4062 36924778 33666435 29719205 26768647 24106844 21581399 20121743 18157801 16376650
4054A6376650j424462j396908l44813n2214j49917j042043p56038l58811j064826
4045I786618n00151m34129k04604m30074k51366R7482P6939l97314k81838M8493
4035G510056l52557m23144m80992J11652K22221j12372k78331l06990j04563L05575
4025F090555l01614l72284m55467n06383j25334m63814M27879J66149J64068j692
4015D622063n59532k84720Q9703M65487l6440P4921J34391n62788j83773K95589
4005D054901J95794p42459k25484J59794M1224j34684k24764l85907K11715q1250
3995B868880J34905J18337m84204K31984n256k42492L5298K88006K10647r9850
3985C056255p63230J45418l61176M68955K90714j47087j06388J06305L4913k44467
$$ plain form
4054 16376650 14952188 13555280 13210467 13158253 13008336 11966293 11210255 10851444 9786618
4045 9786618 9286467 8852338 8647734 8217660 7966294 8063776 8140715 7743401 7461563 7510056
4035 7510056 7157499 6734355 6253363 6365015 6587236 6474864 6196533 5889543 5784980 6090555
4025 6090555 5788941 5416657 4961190 4454807 4329473 3865659 4293538 4459687 4623755 4622063
4015 4622063 4062531 3777811 3867514 4333001 4296561 4371482 4505873 3943085 3759312 4054901
4005 4054901 4250695 3508236 3282752 3442546 3483770 3349086 3124322 2738415 2950130 2868880
3995 2868880 3003785 3122122 2637918 2869902 2864646 2622154 2657452 2945458 3156105 3056255
3985 3056255 2293025 2438443 2077267 2546222 2836936 2689849 2583461 2689766 2724679 2480212
3975B480212r0975m27940K55654k07442l173J23340L70686M48501L1397k548j04600
3964B873112k697m41604m12079r6665L19711L12353l52905m75273M95137j58356
3954B060734j96424K62834m4268L16632K93369m48177k90748l37692m92873N09761
3944A633148k01144L16430o6594J73257q221l5040N6388l07840K53829L7182j69192
3933A682203O5619Q5872K6026l16008l94721j4397l7522J61580R8186k7672L84126
3922A713292Q486j32133K2778l27721J33958L97261j06857m00605j40573N31234
3912A699120k13083j37683j59217J30429N23209j64825j88142j75898l41129J67070
3902A139851n9378k42489K46583J72752l88012q5133L0722K67109q3038k1042
$$ plain form
3975 2480212 2389237 1961297 2216951 2009509 2006336 2129676 2500362 2948863 2980260 2977712 2873112
3964 2873112 2870415 2428811 2016732 1920067 2239778 2552131 2199226 1723953 2219090 2060734
3954 2060734 1864310 2127144 2082876 2399508 2692877 2244700 1953952 1616260 1123387 1633148
3944 1633148 1432004 1748434 1681840 1855097 1846876 1811836 1868224 1560384 1814213 1851395 1682203
3933 1682203 1747822 1833694 1859720 1543712 1148991 1134594 1097072 1258652 1356838 1329166 1713292
3922 1713292 1721778 1589645 1612423 1284702 1418660 1815921 1709064 1308459 1167886 1699120
3912 1699120 1486037 1348354 1189137 1319566 1842775 1677950 1489808 1313910 972781 1139851
3902 1139851 1080473 837984 1084567 1257319 869307 784174 814896 1082005 998967 977925
3892I77925K613J42753k75089k00866m7296k55120j49134L57873L33889L8451
3882I25999o7341J4754M92266L35647j98821n58629k05437M65823K23296K48022
3872A675579Q729k90971L09223K4783j84413m32452L09033Q4469M135j58194K42811
3861A592732J8607M1362J09867j67824m126J27115L58178L25540l68241m12379
3851A620831k30836l42739j25849O54025j99432j30353P9161K17419J55905K4359
3841A722491N8762k0579P5065K53734m52225j45286L6871L87127m1897l11908
3831A562155K49958l4750J01263l98296M61462J40455m4095J87025m45139j55791
3821A624247L05420L6914J32809J62643K0337l83390P89714M05066J61290j45362
$$ plain form
3892 977925 980538 1123291 848202 647336 600040 344920 195786 553659 887548 925999
3882 925999 858658 873412 1365678 1701325 1502504 943875 738438 1204261 1427557 1675579
3872 1675579 1684308 1393337 1702560 1727343 1542930 1110478 1419511 1503980 1508115 1349921 1592732
3861 1592732 1611339 1652701 1762568 1594744 1590618 1717733 2075911 2401451 2033210 1620831
3851 1620831 1389995 1047256 921407 1575432 1376000 1245647 1324808 1542227 1698132 1722491
3841 1722491 1781253 1760674 1835739 2089473 1637248 1491962 1528833 1915960 1874063 1562155
3831 1562155 1812113 1777363 1878626 1480330 1941792 2082247 2038152 2225177 1780038 1624247
3821 1624247 1929667 1966581 2099390 2262033 2282370 1898980 2688694 3093760 3255050 3109688
3811C109688N21958M89765P6008P69138K55612M33538j48664Q86317O89714L4236
3801G117310M78802j19381j96070P50535K27657J31971M10594m51311R1800L40954
3791H782861j22200M22824k16143k23937j43181p00543n63222L30693q72659k97254
3781F397239j77580k9121j52371p05455n23781k79453m36922l89198n70880l08454
3771B824024k53168M68576K50933q91886k28335M83622K06346k11095l34214j70490
3761B144313j31064K87799M57516Q5674Q6565M7318J17072k8469r7619J44752
3751C113857k40254k05323K47981L8094N77667k21065L3525Q2219L69382m2364
3741C753719R1325J21196K67819k56569N61506l03446R8767M12826l94668p3487
$$ plain form
3811 3109688 3631646 4121411 4197419 4966557 5222169 5655707 5507043 6393360 7083074 7117310
3801 7117310 7596112 7476731 7280661 8031196 8258853 8390824 8801418 8350107 8441907 8782861
3791 8782861 8660661 9083485 8867342 8643405 8500224 7799681 7236459 7567152 6694493 6397239
3781 6397239 6219659 6190538 6038167 5332712 4808931 4529478 4092556 3703358 3132478 2824024
3771 2824024 2570856 3039432 3290365 2398479 2170144 2653766 2860112 2649017 2314803 2144313
3761 2144313 2013249 2301048 2758564 2844238 2930803 2978121 3095193 3066724 2969105 3113857
3751 3113857 2873603 2668280 2916261 2954355 3532022 3310957 3344482 3426701 3796083 3753719
3741 3753719 3845044 3966240 4234059 3977490 4538996 4235550 4334317 4747143 4352475 4278988
3731D278988M41321P35914M77299Q4061l0577J91837K26477m60345K04386K87612
3721F436973J90883j39136J07511Q7137J85571k22734M16415K23710m7996n75453
3711F662881K85646O67800j50619m31102l75618L13233j93417K92334k74655l70081
3701F426402J35120K06009M23124J69153p1870l21876J55883j83454k63196J30894
3691F806189n76817O67334N264q8971J7753P6451m6471n37312O84528m78720l78396
3680F150832K7394o29145M63672j45910l74035n64866O1366N91008K71210n27703
3670E323823J29925j95317j89858k36052l39856M32088J3853p12918m14725K1403
3660C832366K44298J91816l05500R067L3128k05769j1516M30625K06937m12744
$$ plain form
3731 4278988 4720309 5456223 5933522 6017583 5987006 6178843 6405320 5944975 6149361 6436973
3721 6436973 6627856 6488720 6596231 6683368 6868939 6646205 7062620 7286330 7238334 6662881
3711 6662881 6948527 7616327 7465708 7034606 6658988 6972221 6778804 7071138 6796483 6426402
3701 6426402 6561522 6767531 7190655 7359808 7287938 6966062 7121945 6938491 6675295 6806189
3691 6806189 6229372 6896706 6901970 6812999 6830752 6907203 6860732 6323420 7007948 6529228 6150832
3680 6150832 6178226 5549081 6012753 5866843 5492808 4927942 4989308 5580316 5851526 5323823
3670 5323823 5453748 5258431 5068573 4832521 4492665 4924753 4938606 4225688 3810963 3832366
3660 3832366 4076664 4268480 3962980 3972047 4005175 3799406 3787890 4218515 4425452 4012708
3650D012708m05781K79144j93515j58029k02734k56071K2139j53549P7801L87460
3640C409573R6971m14471j20810m23160M84169J6776j77677j12917r5524j47010
3630B515920r1021M1202J56527l50238J99377k58912K40832Q325j2637k16502
3620B232873J06877M18533j94205L17869k17506o28419j57244K28887K72749j3621
3610B366793j66658J6891J96134L56247k37989L55513r771o19556N53382k04478
3600B606508l43049K24961l75479L5596p7976m7424j09285M47869O8193j25858
3590B304056J50038m14736l15027K08950J15826j05700q2748N11973j21004O82412
3580B934040K62400j21023o5039K05040o07865q7095J84139J70313j570l78787
$$ plain form
3650 4012708 3606927 3886071 3692556 3534527 3331793 3075722 3097861 2944312 3022113 3409573
3640 3409573 3506544 3092073 2971263 2548103 3032272 3049048 2871371 2758454 2662930 2515920
3630 2515920 2424899 2466101 2622628 2272390 2471767 2212855 2453687 2462012 2449375 2232873
3620 2232873 2339750 2758283 2564078 2881947 2664441 2036022 1878778 2107665 2380414 2366793
3610 2366793 2200135 2217026 2413160 2769407 2531418 2886931 2877160 2257604 2810986 2606508
3600 2606508 2263459 2488420 2112941 2148537 2070561 2023137 1913852 2361721 2429914 2304056
3590 2304056 2454094 2039358 1724331 1933281 2049107 1943407 1860659 2372632 2251628 2934040
3580 2934040 3196440 3075417 3010378 3215418 2607553 2520458 2704597 2874910 2873340 2494553
3570B494553J43009K89580K9715n0105L43892m88449m9060M41484l18176k4985
3560B811458k0935n09595J83904j2627q9855J47873j21856l04602N15227q3980
3550B515012m30926M28405P55826k27740K59461L9707o37395J64559J41253J12881
3540C121043l5900q7485j02206j9786O91878M65462p9168L48109K49776j705K10559
3529D760577Q47578J58327L51001J275218K076694K680035L394215L593455K759028
3520B1896128Q88325l1497j85671m61502j747111k529456j821567j490333r40679
3511A3576637m07804j12459J060324L49140L45756J13509J70537J117414M49327
3502A6662381R57915j13966P4901Q79666L03819r36416l48934o56059r1660M26375
$$ plain form
3570 2494553 2637562 2927142 2956857 2906752 3250644 2762195 2713135 3154619 2836443 2811458
3560 2811458 2790523 2280928 2464832 2452205 2362350 2510223 2388367 2083765 2598992 2515012
3550 2515012 2084086 2512491 3268317 3040577 3300038 3339745 2702350 2866909 3008162 3121043
3540 3121043 3085143 2997658 2895452 2875666 3567544 4033006 3953838 4301947 4551723 4550018 4760577
3529 4760577 5608155 5766482 6117483 7392701 9469395 12149430 15543645 19137100 21896128
3520 21896128 22784453 22752956 22567285 22105783 20358672 17829216 16007649 14517316 13576637
3511 13576637 13168833 13056374 14116698 14465838 14811594 14925103 15095640 16213054 16662381
3502 16662381 17620296 17506330 17581231 18460897 18764716 17828300 17479366 16823307 16731647 17158022
3492A7158022j04254q2555k66845k71356j19934m61614o66699p25757n09737p60930
3482A3188341p88405r62970p42656j34687l73805n72095p25760j99679o37044
3473H051240K35826k49402m56083j6644O1882K94300K24888k24728K52603P22058
3463H895940m22013j72513K75322N72467J165406L57663J189655J635635J643696
3454A5141258J840368J788633J743380Q62289N99636m79103n2514p89965j641936
3445A9012046j304675r63666q37547p49884j89230k25728n8764j32438j72151
3436A4377963J62262O9295M05581K58221J47463N20443M73415K25646K96215N59139
3426A7495643O44281M47387J70248M49484L88949L32075L3098K17896P14902J61479
$$ plain form
3492 17158022 17053768 16971213 16704368 16433012 16313078 15851464 15184765 14459008 13949271 13188341
3482 13188341 12399936 11436966 10694310 10559623 10185818 9613723 8887963 8688284 8051240
3473 8051240 8287066 8037664 7581581 7564937 7626819 7921119 8146007 7921279 8173882 8895940
3463 8895940 8473927 8301414 8576736 9149203 10314609 10672272 11861927 13497562 15141258
3454 15141258 16981626 18770259 20513639 21375928 21975564 21496461 21443947 20653982 19012046
3445 19012046 17707371 16743705 15906158 15156274 14967044 14741316 14682552 14550114 14377963
3436 14377963 14540225 14609520 15015101 15273322 15420785 15941228 16414643 16640289 16936504 17495643
3426 17495643 18139924 18587311 18757559 19207043 19595992 19928067 19961165 20179061 20893963 21055442
3416B1055442l9087R23473R33569M58671L0300R30596R67860J394385J205928
3407B7861137J021227J529999J575882J836916J833327K339126K082570K112295
3399D2192479K807282K371240K218485K290225K212487K231756J572601J974466
3391E9871021J978678K176894J694985K008281J873811K571329L393679L189879
3383G8758557L315947L762736L734715M309248L733454L265337L193018K482254
3375A06555266K863063K365090K157766K279727K260928K388572K542326K631959
3367A26044697J847563J680072J361769R82310P31442j72255q12409j259981j797519
3358A28605689k295001k305929k231430k061081j716480k088766j874777j876722
$$ plain form
3416 21055442 21016355 21939828 22873397 23332068 23362368 24292964 25260824 26655209 27861137
3407 27861137 28882364 30412363 31988245 33825161 35658488 37997614 40080184 42192479
3399 42192479 44999761 47371001 49589486 51879711 54092198 56323954 57896555 59871021
3391 59871021 61849699 64026593 65721578 67729859 69603670 72174999 75568678 78758557
3383 78758557 82074504 85837240 89571955 93881203 97614657 100879994 104073012 106555266
3375 106555266 109418329 111783419 113941185 116220912 118481840 120870412 123412738 126044697
3367 126044697 127892260 129572332 130934101 131916411 132647853 132475598 131663189 130403208 128605689
3358 128605689 126310688 124004759 121773329 119712248 117995768 115907002 114032225 112155503
3350A12155503k336526k361492k735673l064871l785702l777903m370561l831706
3342H5891069l312851k936440k910479k788257j985220j556988k288099j421019
3334F6691716j765889k269052j658793j645544k423725k376131k148422k117720
3326E0286440j995277k455532j878083j523570j952899k208751j508164j015433
3318C5748731j226310r19447j349292j358454o74330q84827p71747m75665m21802
3309B7666857q20346J35000j04103k95884l08400M216k06642j109717m89002j76820
3299B4295159n51265q23193p23181K171q4275J23189n48202j61441k04478l70141
3289B0954343r1793k50482j49923J14512R2141m29160m87192o3626K12371j33124
$$ plain form
3350 112155503 109818977 107457485 104721812 101656941 97871239 94093336 89722775 85891069
3342 85891069 82578218 79641778 76731299 73943042 71957822 70400834 68112735 66691716
3334 66691716 64925827 62656775 60997982 59352438 56928713 54552582 52404160 50286440
3326 50286440 48291163 45835631 43957548 42433978 40481079 38272328 36764164 35748731
3318 35748731 34522421 33602974 32253682 30895228 30220898 29336071 28564324 28088659 27666857
3309 27666857 26846511 26981511 26877408 26581524 26273124 26277340 26070698 24960981 24471979 24295159
3299 24295159 23743894 22920701 22197520 22199691 22115416 22238605 21690403 21528962 21324484 20954343
3289 20954343 20862550 20612068 20462145 20576657 20668798 20239638 19752446 19688820 19901191 19768067
3279A9768067m97056l9299O84955m7439j20199M02949p44634j40142n2707r9672
3269A9114823j5534o77603j46070K24183K26k23576k9609k47254o00465j09084
3259A7290037n1223N5926k28561n36396m20851j021781p77004n57618k13197p00904
3249A2838428L3183l72175l4727k54246m32312o56029J97815j63249j049251P710
3239A0115147p97279q05717K48170J73260K86168r35658p06176N9171J0398J2397
3229G659881n11405m3126k01650j97580r6654l43715m6415m88528L3725r5556
3219E668977K4997M7993o78456p341l80708p2810k67939o2667j47253Q0385O0437
3208D265615j31988m8983l01990K55218r773m02911k2631K46881l44238l54598
$$ plain form
3279 19768067 19271011 19231712 19916667 19869228 19749029 20151978 19407344 19267202 19214495 19114823
3269 19114823 19099289 18421686 18275616 18499799 18500025 18276449 18246840 17999586 17399121 17290037
3259 17290037 17238814 17294740 17066179 16529783 16108932 15087151 14310147 13752529 13539332 12838428
3249 12838428 12871611 12499436 12464709 12210463 11778151 11122122 11319937 11156688 10107437 10115147
3239 10115147 9317868 8512151 8760321 8933581 9219749 8284091 7577915 7637086 7647484 7659881
3229 7659881 7148476 7105350 6903700 6706120 6609466 6265751 6219336 5730808 5764533 5668977
3219 5668977 5693974 5741967 5063511 5056170 4675462 4602652 4334713 4272046 4124793 4205178 4265615
3208 4265615 4133627 4084644 3782654 4037872 4028099 3625188 3602557 3849438 3505200 3150602
3198C150602j22095N7989P20345P0816m14124k29926M8942O10329J14445m88440
3188C518883j72570j81790O0942N53833k09101o6503k23784j015L17340l56496
3178C239739J6878J67204j36062l34810K61896m22048J68721l57010Q6934L9342
3168B730784k49623K17157l95299J64070J19365l48319j97459J62736N93270l02260
3158B494422n89008j63397n22606M01856O3042m38103J0727l43681K09145O66208
3148A788605P1541l78368j79024J21391k78857Q7275M94081j06826o47683K08477
3138A180612r428M09882k22479n56237m0045J42902j92674J54273k5038m0990
3128H00778J6868o330J11139J69893q9137m182R3473n10891M89543l29520J38705
$$ plain form
3198 3150602 3028507 3086496 3806841 3877657 3463533 3233607 3282549 3892878 4007323 3518883
3188 3518883 3346313 3164523 3225465 3779298 3570197 3503694 3279910 3278895 3596235 3239739
3178 3239739 3256617 3423821 3287759 2952949 3214845 2792797 2961518 2604508 2691442 2730784
3168 2730784 2481161 2698318 2303019 2467089 2586454 2238135 2040676 2203412 2796682 2494422
3158 2494422 1905414 1742017 1219411 1621267 1684309 1246206 1256933 913252 1122397 1788605
3148 1788605 1860146 1481778 1302754 1424145 1145288 1232563 1726644 1619818 972135 1180612
3138 1180612 1171184 1581066 1358587 802350 762305 905207 712533 866806 841768 800778
3128 800778 817646 811316 922455 1092348 1003211 999029 1092502 581611 1071154 741634 880339
3117H80339J54961N75161n83853k71737P11079j22601j88942r5982N6748K45317
3107A360490l27754m7521j94259K52606P2315j85052K85518j25616J8479l75893
3097G33313K41379O2918J47627N07769j88608q0779m20559p87300k27623Q52000
3087H40137m00509j97412K82337J75397j89814L05549Q59071k61416K4522M8364
3077A486226k74150k20458M24546j36265L90386J04881n77981K60543l51034m12935
3067F93759P36318J22482n82701l3269M18870m33925K85962N96693j73374j0696
3057A620119m19323l36002L88448K90318k44284N87794K41980p15227k22707k42566
3047I48550L49420J18145K24649M32352M29484K37185N13261l8555r0857J45172
$$ plain form
3117 880339 1035300 1610461 1026608 754871 1465950 1343349 1154407 1058425 1115173 1360490
3107 1360490 1032736 985215 790956 1043562 1115877 930825 1216343 1090727 1109206 733313
3097 733313 974692 1037610 1185237 1693006 1504398 1423619 1003060 215760 -11863 840137
3087 840137 439628 242216 524553 699950 510136 815685 1674756 1413340 1437862 1486226
3077 1486226 1212076 991618 1416164 1279899 1670285 1775166 1197185 1457728 1106694 693759
3067 693759 1430077 1552559 969858 936589 1355459 921534 1207496 1804189 1630815 1620119
3057 1620119 1200796 864794 1253242 1543560 1299276 1887070 2129050 1413823 1191116 948550
3047 948550 1297970 1416115 1640764 2073116 2502600 2739785 3253046 3214491 3123634 3268806
3037C268806j8271J1460R3953l71846J03960o64769J63661l8483m61054j40801
3027A946616N3761L26213k20626j71072p4835m97287j29154M20852j45306J77608
3017A686770J92034n37974J90604N73023O49807N44760N59245Q51733R77517R07669
3007F595188J39141K03057k10168k99906l54820o41151j019628n21072m77872
2998C412769k82666n48425k44410l64459k12372j77517K3286K90207l57401l8064
2988A500948j1235l39398J90516L44061j5685P4481P2680K78871j7655L70857
2978B448441N61451K80274K39932J72708K61791M19401K80264p93940n82886l98916
2968B888520k78088r2648L8895o43321r14665M06368M25404j25440q75207k84617
$$ plain form
3037 3268806 3250535 3261995 3355948 2984102 3088062 2423293 2586954 2548471 2087417 1946616
3027 1946616 2000377 2326590 2105964 1934892 1860057 1362770 1233616 1654468 1509162 1686770
3017 1686770 1878804 1340830 1531434 2104457 2754264 3299024 3858269 4710002 5687519 6595188
3007 6595188 6734329 6937386 6727218 6427312 6072492 5431341 4411713 3890641 3412769
2998 3412769 3130103 2581678 2337268 1972809 1760437 1582920 1606206 1896413 1539012 1500948
2988 1500948 1489713 1150315 1340831 1684892 1669207 1743688 1816368 2095239 2077584 2448441
2978 2448441 3009892 3290166 3530098 3702806 3964597 4383998 4664262 3870322 3287436 2888520
2968 2888520 2610432 2517784 2556679 1913358 998693 1405061 1830465 1705025 829818 545201
2958E45201Q02861m44628k28954J30337M14763J31022n57514o0581L33547K02960
2948A269014N9698j74927P33099m85645l11486k3626L85210M84924l13968l00462
2938A321831j60908k58949P7155J61240j77322j75018o953j9497K1957M48448
2928A231984j17428J3331j83735J0807r9473J70035P1841l8095J93672j77098
2918A075841m5293n06257o3248M0491M00496M02350P477J10235j04657J87054
2908A504489l4932j5224K07409K81188k46190K28118n0741l41588N38152l58891
2898A711790o4976j9675k85032N11031N6448l24783k0117M84620K73431j20787
2888B201950m52794J89708K84513o6445Q8601n6265K50492k20856L20038L49895
$$ plain form
2958 545201 1348062 903434 674480 804817 1219580 1350602 793088 732507 1066054 1269014
2948 1269014 1328712 1153785 1886884 1401239 1089753 1066127 1451337 1936261 1622293 1321831
2938 1321831 1160923 901974 979129 1140369 963047 788029 781076 761579 783536 1231984
2928 1231984 1114556 1127887 944152 954959 855486 1025521 1097362 1059267 1252939 1075841
2918 1075841 1030548 524291 461043 501534 902030 1304380 1311857 1422092 1317435 1504489
2908 1504489 1469557 1454333 1661742 1942930 1696740 1924858 1874117 1532529 2070681 1711790
2898 1711790 1646814 1627139 1342107 1853138 1909586 1584803 1564686 2049306 2322737 2201950
2888 2201950 1749156 1938864 2223377 2156932 2245533 2189268 2439760 2218904 2538942 2888837
2878B888837p15349l29642R99600O99730o24229M04492L52095n3228j25612K14576
2868C711270l80696k62829n10330j82767O29529J79692n19508p6398J2807l46540
2858B254230o22528l94373j43648L05322J77748Q972o14398k76258J19390M89936
2848A304393r2170o16097K6706o28521L41645M05578k44957O01116J484j21260
2838I77917m41266N2279L01525O2489K25726L7376K58605O3173o49660k44591
2828F43573k29583L95550L38698p29804R7297L34342K46537j32818j53967q524
2818H01301J47008J5671m23032n12217M57711l88977K26925O13921J32531J64575
2808A235417k06350o98778n3390j69174P08844O40696K51477m49121m39343k43250
$$ plain form
2878 2888837 2173488 1843846 2843446 3543176 2918947 3323439 3675534 3622306 3496694 3711270
2868 3711270 3330574 3067745 2557415 2374648 3004177 3183869 2664361 2587963 2600770 2254230
2858 2254230 1631702 1237329 1093681 1399003 1576751 1585723 971325 695067 814457 1304393
2848 1304393 1212223 596126 622832 -5689 335956 741534 496577 1097693 1099177 977917
2838 977917 536651 588930 890455 952944 1178670 1216046 1474651 1537824 888164 643573
2828 643573 413990 809540 1148238 418434 515731 850073 1096610 963792 809825 801301
2818 801301 948309 963980 540948 28731 486442 97465 324390 938311 1070842 1235417
2808 1235417 1029067 330289 276899 107725 816569 1457265 1708742 1259621 820278 577028
2798E77028n5438J28614N23664r4763n00806J2187J97237P3419k78948m72840
2788A09354l33830P73387p2928J27578J70917m04868l2003k13317j5411j29599
2778b0720j01655M46614L8939P1972J83143L71446k65878k84506J48633L73094
2768I61082j49311o0219o9554l07420n9216l45284r8062K08226k55453m92931
2758f68142Q67209M41281l80417J15581l60158j54138L97801J78902j45499k33257
2748E9163K64557k10240Q6415k18719j16541P7707p030Q31138l5052n28913l19573
2737a17088N8064J18073L83208K90401k86515l90922k33238J32378l67257k66438
2727f79334K19048K98397N23354j26493n62243o0849K514Q2165M29485l0913R0767
$$ plain form
2798 577028 521590 650204 1173868 1079105 578299 590486 787723 861142 582194 109354
2788 109354 -224476 548911 475983 603561 774478 369610 337607 124290 108879 -20720
2778 -20720 -122375 324239 363178 435150 618293 989739 723861 439355 587988 961082
2768 961082 811771 751552 681998 374578 315362 -29922 -127984 80242 -175211 -668142
2758 -668142 199067 640348 259931 375512 15354 -138784 259017 437919 292420 59163
2748 59163 323720 113480 199895 -18824 -135365 -57658 -64688 766450 731398 202485 -117088
2737 -117088 -59024 59049 442257 732658 446143 55221 -178017 -45639 -412896 -679334
2727 -679334 -460286 -161889 361465 234972 -327271 -388120 -385606 -303441 126044 95131 185898
2716A85898K18475L85632l36865m43185j49263K29253l0521o7314L17593O90508
2706A000211Q9014o93173J89920L9341K86663K23704l48079m41494j20414j08471
2696A17222l16738J76237j45023k5048K99170M96617l20729j35068L38872L84400
2686H69912M618o68566O7220Q966R5000j22927k25426P8631M92360m52941p0499
2675G6348r7151J31021N4432o9758J41237j25411l4091j19858K3970K9324O6789
2664G6852J76946o20637l72310M04687L34127J12625N2141r3382n6974p0528l22511
2653c78964L43783J98197j60835N8962p832m33164L15131L96218k59277j85939
2643a13720N6755j98485N88465l33302k22346L67956j35449l2043k81502M32443
$$ plain form
2716 185898 404373 790005 453140 9955 -139308 89945 59424 -7890 309703 1000211
2706 1000211 1089225 396052 585972 625313 911976 1135680 787601 346107 225693 117222
2696 117222 -199516 -23279 -168302 -193350 105820 602437 281708 146640 485512 869912
2686 869912 874530 205964 273184 282150 377150 254223 28797 107428 599788 146847 76348
2675 76348 -20803 110218 164650 94892 236129 110718 76627 -43231 -19261 10063 76852
2664 76852 253798 -366839 -739149 -334462 -335 112290 164431 71049 14075 -56453 -378964
2653 -378964 -35181 163016 2181 61143 53311 -379853 -64722 331496 72219 -113720
2643 -113720 -56965 -255450 333015 -287 -222633 145323 9874 -22169 -303671 128772
2633A28772O71379j44024p7212l72308q06091m89368J0703N90582L54408j46195
2623b79354K71731P5136M76044n90055j44055J87477K97690j99114r2637K3902
2613B6765k20495K98063j10164n4775L76855m1029k69244M83111n6013n44609
2603a11535o2522M04971k00250M81753l21719k65288K86528l90395m076N12968
2593C30435J52486J29762q4274K19257k178J2103l40601J37840k40431L00834
2583F15233k68489K4530j45023r7297Q846L8991L09241o71899k7926J4883k60647
2572d59557K9210L37839M26159K6197j28541j53869l36689m3737J71889K21583
2562I0484J46445k2770N15499M85623k87856Q145j90899k00685J09771J82155
$$ plain form
2633 128772 800151 656127 578915 206607 -599484 -1088852 -1078149 -487567 -133159 -279354
2623 -279354 -7623 67513 543557 -46498 -190553 -3076 294614 95500 2863 26765
2613 26765 -193730 104333 -5831 -60606 316249 275220 5976 489087 433074 -111535
2603 -111535 -174057 230914 30664 512417 190698 -74590 211938 -178457 -182533 330435
2593 330435 482921 612683 528409 747666 745488 757591 416990 554830 314399 615233
2583 615233 346744 371274 226251 128954 137800 176791 486032 -185867 -213793 -198910 -459557
2572 -459557 -430347 -92508 333651 359848 231307 77438 -259251 -302988 -131099 90484
2562 90484 236929 214159 729658 1215281 927425 935570 744671 543986 653757 835912
2552H35912l62718j80016O63133L74596J09267l61p67109N5678L67272l34074
2542G61580M61L9064r0732L65239l08701K06363N65721j26475j68054L0962K16474
2531A491902l2656n29490K9249l25171K08101J93250n60054j11573p0071P8161
2521C71648L29192j91761j8849k13429J33070k80533L88836K40949j44126P96
2511F15793N8302k04653k26115M8791M14870n007R0404k58115k73112Q50928J6861
2500A128947l81110n66931p8649N2817N33517r6170k37293M25213J38838k01077
2490G18102k83753j80622j51143K23243j64730J76908N20114N7338K65720o40669
2480E40508O1062P300l40850p63008N22277M01076K89515P6233p91864m943K80256
$$ plain form
2552 835912 473194 293178 956311 1330907 1440174 1439813 672704 728382 1095654 761580
2542 761580 762041 801105 710373 1075612 766911 973274 1538995 1412520 1244466 1275428 1491902
2531 1491902 1459246 929756 959005 633834 841935 1035185 475131 363558 293487 371648
2521 371648 700840 509079 490230 276801 409871 129338 518174 759123 614997 615793
2511 615793 674095 469442 243327 292118 706988 701981 792385 534270 261158 1112086 1128947
2500 1128947 747837 180906 102257 155074 688591 592421 355128 780341 919179 718102
2490 718102 434349 253727 102584 325827 161097 338005 858119 915457 1181177 540508
2480 540508 601570 608870 268020 -494988 27289 428365 717880 794113 2249 -2694 277562
2469B77562l2415M14696j76869m23668j94509k23086O1003L3147N61280J77103
2459D74244l42051m4067N54785k32464k18265j72061J8796n2622l25333J34512
2449b04526J70227K26537P2844k75772m71073l42412K85462M57301M32537L08723
2439F59848n61889j9679L12704p18329j54294N58727l34331p1631J16715K32463
2429B0304M8433j35791M64540k20175J31452k43055p57211M92736o6935j64815
2419d30517o9133j1971M36901N82251l45105r3981N90499j70358n23962j96974
2409b32350N92349J93598n55942m35898J63066K02774k48567J03921K45466k9124
2399g07Q6878m22469M46343J73549m25391L94779R3118p51407k03032j39471j83961
$$ plain form
2469 277562 245147 659843 482974 59306 -135203 -358289 -297286 -264139 297141 474244
2459 474244 132193 88126 642911 410447 192182 20121 38917 -13705 -339038 -204526
2449 -204526 -34299 192238 265082 -10690 -481763 -824175 -538713 -81412 351125 659848
2439 659848 97959 78280 390984 -327345 -481639 77088 -257243 -328874 -212159 20304
2429 20304 68737 -67054 397486 177311 308763 65708 -691503 -198767 -265702 -430517
2419 -430517 -499650 -511621 -74720 507531 162426 68445 658944 488586 -35376 -232350
2409 -232350 359999 553597 -2345 -438243 -275177 -72403 -320970 -217049 28417 -707
2399 -707 86171 -336298 110045 283594 -141797 252982 346100 -405307 -608339 -747810 -931771
2388i31771M45149N19905N7663j91815j58377m41864N98745L80342k28803n0504
2378a330J49378L41636m02260m84642l47187J6603R88704k21905o12554M20848
2368a52709K98017J45790m68755j30960J78220J23874m00619p945J54051o7233
2358c28269M19238K52252j7834k75316j53569j25706o24269M72163l41269m6867
2348g69446L44205J20042J99163m75962K23812R6087J57740K38718k82300r4628
2338b42569J71651N101p2887j99643j67844k0983J12387K83508M22943m36651
2328a44987m03499L77236K78491R6563l01164n41984k95737L75469M37133j23386
2318b45865l23351L26551K61633k23141K10123L85982o73901J6442k00711J31955
$$ plain form
2388 -931771 -486622 33283 90946 -100869 -259246 -701110 -102365 277977 49174 -1330
2378 -1330 148048 489684 87424 -397218 -744405 -727802 260902 38997 -573557 -152709
2368 -152709 145308 291098 -177657 -308617 -130397 -6523 -407142 -415087 -261036 -328269
2358 -328269 90969 343221 325387 50071 -103498 -229204 -853473 -381310 -722579 -769446
2348 -769446 -425241 -305199 -106036 -581998 -358186 -262099 -104359 134359 -147941 -242569
2338 -242569 -70918 -65817 -138704 -338347 -506191 -527174 -414787 -131279 291664 -144987
2328 -144987 -548486 -171250 107241 203804 -97360 -639344 -935081 -559612 -122479 -245865
2318 -245865 -569216 -242665 18968 -204173 5950 391932 -281969 -265527 -466238 -334283
2308c34283P49327l64549o24093J47434K21377m10742Q9060P66794N64466m61707
2298C43084o87670j9830M88528m91172M4985O7946q6062M18952o2331J64376k21951
2287d1145m03219K02994K6821J98234J55853j11087o89402J0119J89027N09903
2277D8098J91409J05143l18905K71338J80279j07650l54335k94287l4650k37076
2267e50636J2144K78382M43184K63130p19601l64784M58195K94095L39375q97115
2257d43631M9908L82073j12125j80300M34914P6626j9609k68206Q8167M32924
2247D40741l92685k9392o6361k9855k52576k08572p9334M80568Q5064l60188j95479
2236f08069J01783K49440N68301K94601n71302k59233L32233K10626j92399j73603
$$ plain form
2308 -334283 415044 50495 -573598 -426164 -204787 -615529 -526469 240325 804791 343084
2298 343084 -344586 -364416 124112 -367060 -322075 -254129 -340191 78761 16430 180806 -41145
2287 -41145 -444364 -241370 -214549 -16315 139538 28451 -660951 -650832 -461805 48098
2277 48098 239507 344650 25745 297083 477362 369712 15377 -278910 -313560 -550636
2267 -550636 -538492 -260110 183074 446204 -273397 -638181 -179986 114109 453484 -443631
2257 -443631 -393723 -11650 -123775 -304075 130839 207465 187856 -80350 7817 440741
2247 440741 48056 18664 -47697 -77552 -330128 -538700 -618034 -137466 -52402 -412590 -608069
2236 -608069 -506286 -256846 311455 606056 34754 -224479 107754 318380 125981 -47622
2226d7622R1145k0131n4176j8156j35100n17249J43884M75024K12370j5933o2732
2215E1324J84515j98786P3091k86987l23654M60476K10467r94180J12939J92277
2205e18518O11361l86833J98863j49891K4627K89272j54702K35339k27515O7213
2195a0784m1297q1507J45507k22333n72294O07740J62641k51220J4667j85516
2185d34396O0432k43024L95257M7715l37987Q1586J63635L17956k89252j5903
2175b53981j5501j38802O7089M81180l87210K03875j04091k97483J75876L03798
2165C4750l00927M7889L68720l52426l7751j08568n24514J03539O12686l76595
2155e33197L69974J74028K19660J66101p26350N4412K41051L30568n81431K51789
$$ plain form
2226 -47622 43523 23392 -30784 -48940 -184040 -701289 -557405 -82381 129989 114056 51324
2215 51324 235839 37053 110144 -176843 -500497 -40021 170446 -823734 -710795 -518518
2205 -518518 92843 -293990 -95127 -245018 -220391 68881 -85821 149518 -77997 -10784
2195 -10784 -52081 -133588 11919 -210414 -782708 -174968 -12327 -263547 -248880 -434396
2185 -434396 -373964 -616988 -221731 -174016 -512003 -430417 -266782 51174 -238078 -253981
2175 -253981 -269482 -408284 -341195 139985 -247225 -43350 -147441 -444924 -269048 34750
2165 34750 -266177 -218288 150432 -201994 -239745 -348313 -872827 -769288 -156602 -533197
2155 -533197 -163223 10805 230465 396566 -329784 -275372 -34321 296247 -285184 -33395
2145c3395Q9081l06764M62005M3052j60121l75125M49813K47522n33318p3226
2135a90476K14442K7751l6962J50617M08460R4400k74537n27856m20868p6260
2125f31289j54544j8489J94413O33282J01673m35468p3991K43740L75911J7861
2115B53099m085J04057O2268k55552k32637M1579K03150o3323k97358Q4001l4884
2104a39685J4722K19383q8532J5830k51297j80491j28445j41207M22561N1784
2094b05377r8413O19745j10167j75569l11395n49219J75608O37499l62174K92861
2084h6601k27410J97846L56809j65929k8574k01381j89822J95565j41214l56381
2074f47092M25469r9821J77551M59440j97943p0222j55097l23303N50278K95254
$$ plain form
2145 -33395 55686 -251078 210927 253979 93858 -281267 168546 416068 -117250 -190476
2135 -190476 23966 51717 14755 165372 573832 668232 393695 -134161 -555029 -631289
2125 -631289 -785833 -804322 -609909 23373 125046 -310422 -384413 -140673 235238 253099
2115 253099 249014 353071 415339 159787 -72850 -31271 171879 108556 -188802 -104801 -139685
2104 -139685 -124963 94420 5888 21718 -229579 -410070 -538515 -679722 -257161 -205377
2094 -205377 -303790 315955 205788 30219 -281176 -830395 -654787 -17288 -379462 -86601
2084 -86601 -314011 -116165 240644 74715 46141 -155240 -345062 -149497 -290711 -647092
2074 -647092 -221623 -321444 -143893 315547 117604 47382 -107715 -431018 119260 414514
2064D14514J41588M9401l11346K41404l31279k03664K44298k65489L47585n21272
2054a94260L07648L07983j33236o18968N4720P0706J92792l14112p3166J50562
2044b49331K64544J14198M717J64667J01068k85465q6648k26293L5291L95158
2034B31906k28531N04839j32475N09894l61047l04312j07378m47399N01071j9641
2024A46927o63562J19495L20517j73054j14289L03237J08055N2655J38679J68760
$$ plain form
2064 414514 556102 605503 294157 535561 204282 618 244916 -20573 327012 -194260
2054 -194260 113388 421371 288135 -330833 -276113 -205407 -12615 -326727 -399893 -249331
2044 -249331 15213 129411 134128 298795 399863 114398 27750 -198543 -163252 231906
2034 231906 3375 508214 375739 885633 524586 220274 112896 -334503 166568 146927
2024 146927 -516635 -397140 -76623 -249677 -363966 -60729 47326 99981 238660 407420
$$ [...]
##END NTUPLES=NMR SPECTRUM
##END=
