##TITLE=1H_EC-3385(3)
 200.13Hz, CDCl3.
 8 sc
 19.8.2026
##JCAMPDX= 6.0         $$ Bruker NMR JCAMP-DX V2.0
##DATA TYPE= NMR SPECTRUM
##DATA CLASS= NTUPLES
##ORIGIN= UXNMR, Bruker Analytische Messtechnik GmbH
##OWNER= pz
$$ XWIN-NMR		Version 3.5
$$ Wed Aug 19 12:20:05 2026 Russian Standard Time (UT+4h)  she@DPX200
##.OBSERVE FREQUENCY= 200.1313
##.OBSERVE NUCLEUS= ^1H
##.ACQUISITION MODE= SIMULTANEOUS
##.ACQUISITION SCHEME= undefined
##.AVERAGES= 8
##.DIGITISER RES= 18
##SPECTROMETER/DATA SYSTEM= spect
##.PULSE SEQUENCE= zg30
##.SOLVENT NAME= CDCl3
##.SHIFT REFERENCE= (INTERNAL, CDCl3, 0, 15.4957)
##AUDIT TRAIL= $$ (NUMBER, WHEN, WHO, WHERE, WHAT)
$$ ##TITLE= Audit trail, XWIN-NMR		Version 3.5
$$ ##JCAMPDX= 5.01
$$ ##ORIGIN= Bruker BioSpin GmbH
$$ ##OWNER= she
$$ F:/spectra/data/she/nmr/H-C/1/pdata/1/auditp.txt
$$ ##AUDIT TRAIL=  $$ (NUMBER, WHEN, WHO, WHERE, WHAT)
(   1,<2026-08-19 12:18:39.90 +0400>,<she>,<DPX200>,
      <created by zg, POWCHK disabled, PULCHK disabled
       configuration hash MD5:
       00 E9 B6 7A A2 85 ED C7 34 08 36 98 17 FE 4E 26
       data hash MD5: 16K
       CC 53 C2 26 D5 D6 CC FD 53 2A 33 1A 2A 0F 8D FA>)
(   2,<2026-08-19 12:18:48.62 +0400>,<she>,<DPX200>,
      <Start of raw data processing
       efp BC_mod = 2 LB = 0.25 FT_mod = 6 PKNL = 1 PHC0 = -4577.852 PHC1 = 7.592299 SI = 16K 
       data hash MD5: 16K
       92 E1 AF 7E 7C 6D 2C 73 D0 7E E1 74 C1 74 A7 A2>)
(   3,<2026-08-19 12:19:12.17 +0400>,<she>,<DPX200>,
      <pk PHC0 = 0.7273496 PHC1 = 0 
       data hash MD5: 16K
       FA 49 34 DA 4D 7F 7A 09 B5 F6 44 D1 A9 57 52 CB>)
(   4,<2026-08-19 12:19:16.21 +0400>,<she>,<DPX200>,
      <abs ABSG = 5 
       data hash MD5: 16K
       9C E0 B7 83 06 25 38 92 B8 9B DC 57 A4 8A 35 89>)
$$ ##END=
$$ 
$$ hash MD5
$$ BD ED 2B BE 4F 17 32 32 40 13 D9 62 BC 41 03 43
##$RELAX= 
##$RELAX= 
##$RELAX= 
##$RELAX= 
##$RELAX= 
##$RELAX= 
$$ Bruker specific parameters
$$ --------------------------
##$DU= <F:/spectra>
##$EXPNO= 1
##$NAME= <H-C>
##$PROCNO= 1
##$TYPE= <nmr>
##$USER= <she>
##$AMP= (0..31)
100 100 100 100 100 100 100 100 100 100 100 100 100 100 100 100 100 100 
100 100 100 100 100 100 100 100 100 100 100 100 100 100 
##$AQSEQ= 0
##$AQ_mod= 1
##$AUNM= <au_zg>
##$AUTOPOS= <>
##$BF1= 200.13
##$BF2= 200.13
##$BF3= 200.13
##$BF4= 200.13
##$BF5= 200.13
##$BF6= 200.13
##$BF7= 200.13
##$BF8= 200.13
##$BYTORDA= 1
##$CFDGTYP= 0
##$CFRGTYP= 5
##$CHEMSTR= <none>
##$CNST= (0..31)
1 1 145 1 1 1 1 1 1 1 1 1 1 1 1 1 1 1 1 1 1 1 1 1 1 1 1 1 1 1 1 1 
##$CPDPRG= <>
##$CPDPRG1= <>
##$CPDPRG2= <>
##$CPDPRG3= <>
##$CPDPRG4= <mlev>
##$CPDPRG5= <mlev>
##$CPDPRG6= <mlev>
##$CPDPRG7= <mlev>
##$CPDPRG8= <mlev>
##$CPDPRGB= <>
##$CPDPRGT= <>
##$D= (0..31)
0 0.7 0 0 0 0 0 0 0 0 0 0.03 0 0 0 0 0 0 0 0 0 0 0 0 0 0 0 0 0 0 0 0 
##$DATE= 1787127519
##$DBL= (0..7)
120 120 120 120 120 120 120 120 
##$DBP= (0..7)
150 150 150 150 150 150 150 150 
##$DBP07= 0
##$DBPNAM0= <>
##$DBPNAM1= <>
##$DBPNAM2= <>
##$DBPNAM3= <>
##$DBPNAM4= <>
##$DBPNAM5= <>
$$ [...]
##$SUBNAM3= <"">
##$SUBNAM4= <"">
##$SUBNAM5= <"">
##$SUBNAM6= <"">
##$SUBNAM7= <"">
##$SUBNAM8= <"">
##$SUBNAM9= <"">
##$SW= 18.0517328524113
##$SWIBOX= (0..15)
0 0 2 0 0 0 0 0 0 0 0 0 0 0 0 0 
##$SW_h= 3612.71676300578
##$TD= 16384
##$TD0= 1
##$TE= 0
##$TE2= 300
##$TE3= 300
##$TEG= 300
##$TL= (0..7)
0 120 120 120 120 120 120 120 
##$TP= (0..7)
150 150 150 150 150 150 150 150 
##$TP07= 0
##$TPNAME0= <>
##$TPNAME1= <>
##$TPNAME2= <>
##$TPNAME3= <>
##$TPNAME4= <>
##$TPNAME5= <>
##$TPNAME6= <>
##$TPNAME7= <>
##$TPOAL= (0..7)
0.5 0.5 0.5 0.5 0.5 0.5 0.5 0.5 
##$TPOFFS= (0..7)
0 0 0 0 0 0 0 0 
##$TUNHIN= 0
##$TUNHOUT= 0
##$TUNXOUT= 0
##$USERA1= <user>
##$USERA2= <user>
##$USERA3= <user>
##$USERA4= <user>
##$USERA5= <user>
##$V9= 5
##$VALIST= <valist>
##$VCLIST= <CCCCCCCCCCCCCCC>
##$VD= 0
##$VDLIST= <DDDDDDDDDDDDDDD>
##$VPLIST= <PPPPPPPPPPPPPPP>
##$VTLIST= <TTTTTTTTTTTTTTT>
##$WBST= 1024
##$WBSW= 4
##$XGAIN= (0..3)
0 0 0 0 
##$XL= 0
##$YL= 0
##$YMAX_a= 339533
##$YMIN_a= -358813
##$ZGOPTNS= <>
##$ZL1= 120
##$ZL2= 120
##$ZL3= 120
##$ZL4= 120
##$ABSF1= 15.49017
##$ABSF2= -2.56168
##$ABSG= 5
##$ABSL= 3
##$ALPHA= 0
##$AQORDER= 0
##$ASSFAC= 0
##$ASSFACI= 0
##$ASSFACX= 0
##$ASSWID= 0
##$AUNMP= <proc_1d>
##$AZFE= 0.1
##$AZFW= 0.1
##$BCFW= 0
##$BC_mod= 2
##$BYTORDP= 0
##$COROFFS= 0
##$CY= -3
##$DATMOD= 1
##$DC= 0
##$DFILT= <>
##$DTYPP= 0
##$F1P= 0
##$F2P= 0
##$FCOR= 1
##$FTSIZE= 16384
##$FT_mod= 6
##$GAMMA= 0
##$GB= 0
##$INTBC= 1
##$INTSCL= 3.241238e-09
##$ISEN= 128
##$LB= 0.25
##$LEV0= 0
##$LPBIN= 0
##$MAXI= 10000
##$MC2= 0
##$MEAN= 0
##$ME_mod= 0
##$MI= 1.114404
##$NCOEF= 0
##$NC_proc= -5
##$NLEV= 6
##$NOISF1= 3.799351
##$NOISF2= 2.8
##$NSP= 0
##$NTH_PI= 0
##$NZP= 0
##$OFFSET= 15.49568
##$PC= 1
##$PHC0= -4577.125
##$PHC1= 7.592299
##$PH_mod= 1
##$PKNL= yes
##$PPARMOD= 0
##$PSCAL= 0
##$PSIGN= 0
##$REVERSE= no
##$SF= 200.130005206931
##$SI= 16384
##$SIGF1= 3
##$SIGF2= 2
##$SINO= 0.751879
##$SIOLD= 32768
##$SREGLST= <19F.Aceton>
##$SSB= 0
##$STSI= 16384
##$STSR= 0
##$SW_p= 3612.71676300578
##$SYMM= 0
##$S_DEV= 0
##$TDeff= 16384
##$TDoff= 0
##$TI= <>
##$TILT= no
##$TM1= 0
##$TM2= 0
##$TOPLEV= 0
##$USERP1= <user>
##$USERP2= <user>
##$USERP3= <user>
##$USERP4= <user>
##$USERP5= <user>
##$WDW= 1
##$XDIM= 16384
##$YMAX_p= 274448459
##$YMIN_p= -181592
$$ End of Bruker specific parameters
$$ ---------------------------------
##NTUPLES= NMR SPECTRUM
##VAR_NAME=  FREQUENCY,     SPECTRUM/REAL,   SPECTRUM/IMAG
##SYMBOL=    X,             R,               I
##VAR_TYPE=  INDEPENDENT,   DEPENDENT,       DEPENDENT
##VAR_FORM=  AFFN,          ASDF,            ASDF
##VAR_DIM=   16384,         16384,           16384
##UNITS=     HZ,            ARBITRARY UNITS, ARBITRARY UNITS
##FACTOR=    0.220516191357247, 1,           1
##FIRST=     3101.15049013547, 0,            0
##LAST=      -511.566272870313, 0,           0
##MIN=       -511.566272870313, -181592,     0
##MAX=       3101.15049013547, 274448459,    0
$$ Real data points
##PAGE= N=1
##DATA TABLE= (X++(R..R)), XYDATA
$$ [...]
7072I3226n4029P1010j5183P278m7P212k8417J1469J2592k5857L1103l3873Q593
7059H5077l0706N6138K6574K5198r479J8548N5504j679K1565m9323j6663R9343
7047B80097k260l4151L2215J7709m9617j0388p318k0273P6354M1883j3866N723
7035C16108Q726N1031k5966P6693O1472K5573N1176o062N3891L0358N0478L0579
7023G24057k7878N0925K5536Q7804J8850P3436K8566q529j5447L6219P2843J3214
7011A079596P795j5960k210J0350l9066k9364k4984j3937J8118j4018L2440l8211
6999I70549p7903l5132J3489l4220l1351q7442m6687m3340l5459k4270J2528n039
6987E75723K0920p6170n14o0657m5181L2714l4175j0494l6493L0504n278k8209
$$ y = [93226, 39197, 110207, 95024, 102302, 102255, 109467, 81050, 92519, 105111, 79254, 110357, 76484, 85077, 54371, 110509, 137083, 162281, 152802, 171350, 226854, 225175, 246740, 197417, 180754, 280097, 277837, 243686, 275901, 293610, 243993, 233605, 226287, 206014, 282368, 324251, 310385, 316108, 324834, 375865, 349899, 426592, 488064, 513637, 564813, 558751, 612642, 643000, 693478, 724057, 696179, 747104, 772640, 860444, 879294, 952730, 981296, 972767, 957320, 993539, 1066382, 1079596, 1087391, 1071431, 1069221, 1079571, 1040505, 1011141, 986157, 972220, 990338, 976320, 1008760, 970549, 892646, 857514, 871003, 836783, 805432, 717990, 671303, 627963, 592504, 568234, 580762, 575723, 596643, 520473, 519959, 459302, 414121, 446835, 412660, 402166, 365673, 396177, 390899, 362690]
6975C62690P017l9931n7513m863o738O017N2928N0034p0051l7002K2020p757j2118
6962B64733l4221K4559n96k3802k5809k0694j804J4890k0734R761J1982m0577
6950A57688j2243K4023j1815M5789N3962m6787N2249J7005n9822m2738k2509n3825
6938A00977m159k1398K0893P2013q2034L4451J22423M6122k9683K0938n4392K1698
6926B47849L5794K930m4970R539N2686o4147M895j9201o200N1522L3228K385r635
6913B96675j8617J7362J2714Q2361k1414m2090n2288k4836J8867Q74p33o8338
6901B00537L0178k4252m4313n3398j3994N6467R82O4980J1259j8197M3014J9541
6889B72804j3478k5419K7284M0661L2959p79L2233L7641J1036L6713L0092K3345
$$ y = [362690, 369707, 329776, 272263, 267400, 260662, 266679, 319607, 369641, 299590, 262588, 284608, 276851, 264733, 230512, 255071, 254475, 230673, 204864, 184170, 182366, 197256, 176522, 186283, 198265, 157688, 145445, 169468, 157653, 203442, 257404, 210617, 262866, 279871, 220049, 177311, 154802, 100977, 96818, 75420, 96313, 168326, 86292, 120743, 243166, 289288, 259605, 280543, 226151, 247849, 283643, 286573, 241603, 251142, 303828, 239681, 244576, 225375, 219175, 270697, 303925, 306310, 296675, 278058, 295420, 308134, 390495, 369081, 326991, 274703, 249867, 268734, 269608, 268875, 200537, 230715, 206463, 162150, 108752, 94758, 151225, 152207, 217187, 228446, 210249, 253263, 272804, 259326, 233907, 261191, 301852, 334811, 334032, 366265, 403906, 414942, 451655, 481747, 505092]
6877E05092N3125L9335N0152o848m9556Q105L8783J7355l7960k3859Q733j4259
6865E88198m5844m6992j4247j947K668k1390n9943j5460o3574r210j650j839p5122
6852B33648p1158l005Q700q5130l7812L5047L1494j363n8456K0013J0035j4993
6840F7020m8150o261L5250J8453J191K2614L0810l1632Q170m9335j8261O2721
6828I2590q6973o442K7885j7920J0711N81J6217K4255n185q847l8022n0302J2755
6815b8697L7971J1907m3125q209P8171N6097o2886k9667K8708L177l4964n13P0327
6802G8297o033j634J4036n9374L4518j0258l7387L937J7213m2109m0016L9680
6790i130O4964L4293l3901p3368n5913L5674N5590J811k9200k6498L8279N5819
$$ y = [505092, 558217, 597552, 647704, 640856, 591300, 599405, 638188, 655543, 617583, 593724, 602457, 588198, 542354, 495362, 481115, 479168, 481836, 460446, 400503, 385043, 321469, 312259, 310609, 308770, 233648, 162490, 159485, 168185, 83055, 45243, 80290, 111784, 110421, 51965, 71978, 82013, 67020, 18870, 12609, 47859, 66312, 67503, 90117, 120927, 89295, 97465, 48130, 29869, 92590, 5617, -825, 27060, 9140, 19851, 20432, 36649, 60904, 55719, 46872, 8850, -41452, -28697, 9274, 21181, -21944, -30153, 48018, 104115, 41229, 11562, 40270, 43447, 8483, 7970, 78297, 72264, 70630, 84666, 25292, 59810, 49552, 12165, 16102, 33315, -8794, -48810, -9130, 55834, 90127, 56226, -17142, -73055, -37381, 18209, 20020, -9180, -35678, 2601, 58420]
6778E8420l1640n89j5166O0728k1692p8642J5033J0649N698N0455N560m4983N0060
6765F3891j3305J2556k4468K1025r761m394P475K0704m6950L3890M7807l6171
6753G2299m108j5272J0284J6432K2563l5279p5902L4138M0542J7782K3359j7259
6741H9579L7078o591m0778O562m703m3401K6712j9181j1228M7988M7378L0774
6729A60189j8816K8683j6030o145N761j9624Q1955k9645k2342o1364j8736N6215
6717A40101L3637N1053m750o7061n800M2533J1169k0044m6608n4628N1216O6932
6705A97750M6214r9879L9432O4752m1460J0549M4511p1846k2012k8091N0338K1082
6693B11340r1041l5319O1678Q2552m9461Q67P8301j6969K7864K8677k5702m3667
$$ y = [58420, 26780, 26191, 11025, 71753, 50061, -28581, -13548, -2899, 2799, 53254, 58814, 13831, 63891, 50586, 63142, 38674, 59699, 49938, 45544, 53019, 73723, 26773, 60663, 108470, 72299, 68191, 52919, 63203, 79635, 102198, 66919, -8983, 25155, 65697, 83479, 106838, 89579, 126657, 120066, 79288, 85850, 81147, 37746, 64458, 45277, 34049, 82037, 129415, 160189, 141373, 170056, 154026, 147881, 153642, 134018, 215973, 186328, 163986, 102622, 83886, 140101, 173738, 224791, 220041, 152980, 147180, 189713, 200882, 180838, 134230, 79602, 130818, 197750, 243964, 144085, 183517, 248269, 206809, 217358, 261869, 190023, 168011, 139920, 190258, 211340, 120299, 84980, 146658, 229210, 179749, 180616, 258917, 241948, 269812, 298489, 272787, 229120]
6681B29120j7165L8428M4061P5403p5069J3421J3649Q3200M1204r4957K4136K7369
6669D02800M9535j6240L3800M4307k9589J8195K6027j3040n4334P991L7938k3967
6657D83423Q497j5261r9004P1412q17n2502m2866O8580P90o0741N3365k026j2327
6644D00523m1696m2201l5612K3008l6945j8796R0394L4026M2819K7349l2020q1153
6632C29696n044N546K6172M0562K0125J0428K5084l7640q066l6051k5225P9480
6620D25067k3650m1139J5997k2632L0299R389k1599k3657L9779j4343O8533k0374
6608D21670p9413o8375j7160M0644k3K830r1558K5118m6092M0053L501L8012O230
6595B75437J103n2784k2633M8112j9405N9768J920k0113r136j2756K0340L8418
$$ y = [229120, 211955, 250383, 294444, 369847, 294778, 308199, 321848, 405048, 446252, 351295, 375431, 402800, 452335, 436095, 469895, 514202, 484613, 502808, 528835, 515795, 461461, 469452, 507390, 483423, 491920, 476659, 377655, 449067, 448250, 395748, 352882, 421462, 422252, 361511, 414876, 412850, 400523, 358827, 316626, 281014, 304022, 267077, 248281, 338675, 372701, 415520, 442869, 410849, 329696, 324652, 330198, 356370, 396932, 417057, 427485, 452569, 414929, 406863, 370812, 345587, 425067, 401417, 360278, 376275, 353643, 383942, 393331, 371732, 348075, 387854, 373511, 442044, 421670, 342257, 273882, 256722, 297366, 297343, 300173, 208615, 233733, 187641, 227694, 231195, 269207, 275437, 276540, 223756, 201123, 249235, 229830, 289598, 291518, 271405, 262269, 249513, 269853, 308271]
6583C08271m8417o1274k0594q388P1036J0301r7914j8186k5284O7709p513m2340
6571A27407L0638M4150l0871r2925N8661l2986k8876J05680J2999n6189L6281
6560A73969j892o176J1255l2898L0163O1196L8163m8176k0804N910M5015n704
6548B50021k2899L9428O8896j838l8666m5222P5337m2122p5033r905J03150m9274
6536B51873o8341j0257n0934j9097O9408Q470n3420L1920n0083K3589O7912M299
6524B05339j03764L6563l7221j8881K3673l318K9730l2499j5468O4605k9463l0240
6512H9056M511j1224m6129k562M7609m9737r732L6574k592m6569P5851O2525p5005
6499G2576k2834p5655o843l832O3277M7433m815O741J4704l4821J5774K6256j8105
$$ y = [308271, 259854, 198580, 177986, 169598, 240634, 250935, 153021, 134835, 109551, 177260, 169747, 127407, 158045, 202195, 171324, 78399, 137060, 104074, 75198, 180878, 193877, 137688, 173969, 172077, 165901, 177156, 144258, 174421, 235617, 273780, 225604, 204800, 210710, 255725, 250021, 227122, 266550, 335446, 333608, 294942, 249720, 325057, 282935, 207902, 197997, 301147, 251873, 183532, 173275, 122341, 103244, 172652, 181122, 127702, 159622, 109539, 133128, 201040, 205339, 101575, 138138, 100917, 82036, 105709, 102391, 132121, 99622, 84154, 148759, 119296, 89056, 93567, 82343, 36214, 33652, 81261, 31524, 21792, 58366, 55774, 9205, 85056, 147581, 72576, 49742, -25913, -32756, -36588, 26689, 74122, 69307, 76048, 90752, 55931, 71705, 97961, 79856]
6486G9856o3389K9626Q195m4834J076j8571P172M0725m5305m8279K568N4805j1196
6473g551M589R527K0876L5801k1067q6416k0754k0J8315L1473L8411J5359O3015
6460A01558q784j32161l0673O016P816M0708K2875K5420o142m992m7323K3461
6448b221j236o0320Q4880M9363j9902m0273k0600J4391J2255L4602O9847k6561
6436I4225n3264m162J4599p3683k9135J7582J6857J0937L4719n733r610k8844
6424a5512m822j2638L7666k0342l4539N4791M7109J3715M865l7419Q065n738P666
6411D2867j7280L0015j3207k4987j1594K9600m4206k2136N9878L2503j0015k6014
6399B5424k1338L7321j3752K381o6Q676j7582K7195K8713M74J0238K1300K302
$$ y = [79856, 16467, 46093, 54288, 9454, 10530, -8041, -869, 39856, -5449, -53728, -51160, 3645, -7551, -2962, 6565, 27441, 63242, 42175, -44241, -64995, -65015, -46700, -15227, 23184, 38543, 101558, 92774, -39387, -70060, -64044, -56228, -15520, 7355, 32775, 26633, 21641, -25682, -2221, -3457, -63777, 21103, 70466, 50564, 10291, -10309, 4082, 16337, 50939, 120786, 94225, 40961, 36799, 51398, -22285, -51420, -33838, -16981, -6044, 28675, 22942, 13332, -15512, -20334, -32972, 4694, -15648, -50187, 4604, 51713, 65428, 70293, 32874, 40939, 35201, 42867, 25587, 55602, 42395, 17408, 5814, 35414, -8792, -30928, 28950, 61453, 51438, 25424, 4086, 41407, 27655, 30036, 29970, 38646, 21064, 48259, 76972, 77446, 87684, 108984, 111286]
6386A11286J5321j1577k3178k1683l8095R738K0839L237J1387L6143j9974Q516
6374A01960k2086m9289L1962J34571k8692m7854n6435K8543k3965O522M8892l7017
6362H7112n3615j4009J3133M7092L9662m8110j8276j3054J5053N0031j9006J3717
6350I9730m4511j2275k2523M6953L5070p1577P2996k9938N2340M732K4408j1837
6338A43568m8098K0794K4463P689j08714l3198M4019J819j6192K7665P452J1708
6326H2975O6117K3159j1016l8828l7361K2765O3779j308j0026l627K9966K569
6314A89164J249K348k8931j1556k2138P9976l1787k617K2779n8141o6498o873
6302F6975k0761N9813p983K9532O083O835o2960K1510L5946m7369m4621J3878
$$ y = [111286, 126607, 115030, 91852, 70169, 32074, 41812, 62651, 65888, 77275, 113418, 93444, 101960, 79874, 30585, 62547, 197118, 168426, 120572, 64137, 92680, 68715, 75237, 124129, 87112, 33497, 19488, 32621, 79713, 119375, 71265, 52989, 39935, 54988, 105019, 86013, 99730, 55219, 42944, 20421, 67374, 102444, 30867, 103863, 73925, 126265, 130997, 155405, 143568, 95470, 116264, 140727, 148416, 39702, 6504, 50523, 52342, 36150, 63815, 71267, 82975, 149092, 172251, 161235, 122407, 85046, 107811, 171590, 170282, 160256, 156629, 186595, 189164, 190413, 192761, 163830, 152274, 130136, 210112, 178325, 175708, 198487, 140346, 73848, 66975, 46214, 106027, 98044, 127576, 133659, 140494, 77534, 99044, 134990, 87621, 43000, 56878]
6290E6878P2069j0914N2211M4417j0242o0296K3201O1648l2573k6371N5623L2107
6278B57758q4501K3377K8705j4437n7333m8555O9833j5949l4519J0783l1855k4307
6266G9000O6000p4367L5739K5035q2175l292M9333K8558l70k7592L95J7868o302
6253A07830L0060K6607M898Q776n926o0947k0674L6551K023m022j0378K251K8097
6240A45146j17222J423O6020m5850Q7721M2416k3574j1568n8903N4291L74L1288
6228A71562P8213k7520n4328j4055n369j6702N1293L0600k2978l1272m675J246
6216A56015j6398N2839L9034L9597o9461k3176M0182j2183Q217k6244k158j6576
6204A69688o0658P3118M7558k3539n5476K6686M2559p1648J8771k6958N5822N1859
$$ y = [56878, 128947, 118033, 170244, 214661, 204419, 144123, 167324, 228972, 196399, 170028, 225651, 257758, 173257, 196634, 225339, 210902, 153569, 105014, 174847, 158898, 124379, 135162, 103307, 79000, 145000, 70633, 106372, 131407, 49232, 45940, 95273, 123831, 123461, 95869, 96264, 114132, 107830, 137890, 164497, 169395, 178171, 172245, 111298, 90624, 127175, 129198, 125176, 114798, 117049, 145146, 27924, 29347, 95367, 49517, 137238, 179654, 156080, 144512, 85609, 139900, 140274, 171562, 249775, 222255, 167927, 153872, 148503, 131801, 183094, 213694, 190716, 159444, 154769, 156015, 139617, 192456, 231490, 271087, 201626, 178450, 218632, 206449, 214666, 188422, 186264, 169688, 109030, 182148, 229706, 206167, 150691, 177377, 219936, 148288, 167059, 140101, 195923, 247782]
6192B47782m404j7064m5527J8208K1396j4613M4038k7886m7780L9236k710K1177
6180B31853R612O680J9372j7517K9285J4501K5374o5758L0606l3200J8736O3314
6168C32858m9645p2939J6647j1424N7984M1713M1801m4414j7307n7429l1726L4661
6156B40780m83k045N504K4829l896J8335Q928J3234M1329l6984Q795J01941M4093
6143D64360j2441N0430P2090K3333K4284L4353M0446Q8143J26933M4971J47264
6132A104166J56302J88665R8982J09955M7107J45953Q7927J8313M2701Q1872M8339
6121B130282O8803l7191J6021P6070m7294o5927j3831o0339n7577j2247q8500
6110A908270j90565j11349r8607n6053n8630j16835m7490q7277r3826r432L5715
$$ y = [247782, 243378, 226314, 180787, 198995, 220391, 205778, 249816, 221930, 174150, 213386, 210676, 231853, 241465, 248145, 267517, 250000, 279285, 293786, 319160, 253402, 284008, 250808, 269544, 332858, 283213, 210274, 226921, 215497, 273481, 315194, 356995, 312581, 295274, 237845, 206119, 240780, 240297, 238252, 243756, 268585, 264689, 283024, 291952, 305186, 346515, 309531, 318326, 420267, 464360, 451919, 502349, 574439, 597772, 622056, 656409, 696855, 784998, 911931, 956902, 1104166, 1260468, 1449133, 1548115, 1658070, 1705177, 1851130, 1939057, 1957370, 2000071, 2081943, 2130282, 2199085, 2161894, 2177915, 2253985, 2206691, 2140764, 2126933, 2066594, 2009017, 1996770, 1908270, 1717705, 1606356, 1507749, 1451696, 1393066, 1276231, 1228741, 1141464, 1047638, 1038206, 1073921]
6099A073921K3207n6616k7690P268q9703l9471m0911L5956m6548O867q4961r3903
6087F67416J2994k9679l1188j1143K2251n2482p6233J7092N070o053l9522l2811
6075D45712k2094k5309k7690K7070k9424k294K4833q6834n6205O477N6705p7746
6063B33201K9182L3079k6137k0146R8624n978j9289j4181l8842K5672n225L419
6051B93379n7444K5104R5639n1990m8572m6323m1929K3400k5946P3946j0834l8953
6039A89477P6232L6712k2374k0935k5111L5208N9761L2481Q155L1344M8314M5480
6027D94744k231J71811J05466K0427M9933m7119K7065q2171p2482j6305O330k4509
6015F30959p7838j01887o9888k1347L1131q141n5885K7299m1326J5781k109j3926
$$ y = [1073921, 1097128, 1040512, 1012822, 1020090, 930387, 890916, 850005, 885961, 839413, 846280, 761319, 667416, 680410, 650731, 619543, 608400, 630651, 578169, 501936, 519028, 524098, 518045, 478523, 445712, 423618, 398309, 370619, 397689, 368265, 365971, 390804, 303970, 247765, 254242, 310947, 233201, 262383, 295462, 269325, 249179, 347803, 341825, 322536, 308355, 269513, 295185, 289960, 293379, 235935, 261039, 356678, 304688, 256116, 209793, 167864, 191264, 165318, 239264, 228430, 189477, 265709, 302421, 280047, 259112, 234001, 269209, 328970, 361451, 369606, 400950, 449264, 494744, 492513, 664324, 769790, 790217, 840150, 793031, 820096, 737925, 665443, 649138, 655468, 630959, 553121, 451234, 381346, 359999, 391130, 382989, 327104, 354403, 313077, 328858, 326749, 312823]
6003C12823M6164N566p022K661J3176j3218P878L1248L3689k7163k4047K8414
5991D10169J8044K2548m622k2715J8304m006J1257l8101L991R665k3909j6067
5979C84558L2678K6210l1386M1460J7943K2778O9757N1007l4952L2193J7925m0012
5967E90159k0763L9638k2877k1311M2325P9316L5870L4711l9120L5271M890L0246
5955G88355P3421K3110p182j6338K3792j7842N9794L3780K4554m410J07913L4067
5943A123014n4243j4092J1049Q6916K6061k044Q0109J74093O0291P2836J36300
5932A700290K04243J89941J92573K86756J99780J34267M716K8858K6369J6770
5922B984563K8120k7764K0736O002r3393p8179o2661M342K524o6520k903J40127
$$ y = [312823, 358987, 364553, 357531, 360192, 373368, 360150, 368028, 399276, 432965, 405802, 381755, 410169, 428213, 450761, 446139, 423424, 441728, 437722, 448979, 410878, 414869, 424534, 400625, 384558, 417236, 443446, 412060, 453520, 471463, 494241, 563998, 615005, 580053, 612246, 630171, 590159, 569396, 609034, 586157, 564846, 607171, 686487, 722357, 757068, 717948, 753219, 758109, 788355, 861776, 884886, 877704, 861366, 885158, 867316, 927110, 960890, 985444, 981034, 1088947, 1123014, 1068771, 1054679, 1065728, 1152644, 1178705, 1176661, 1256770, 1430863, 1491154, 1563990, 1700290, 1904533, 2094474, 2287047, 2573803, 2773583, 2907850, 2912566, 2941424, 2967793, 2984563, 3012683, 2984919, 3005655, 3011657, 2918264, 2840085, 2777424, 2781766, 2784290, 2717770, 2714867, 2854994]
5910B854994J67181K08311K39536J40239M7610J2203K6884J17439K22669K75935
5900D313001L65359M14312M42544K66705k8604k63817j96552j74687k09166k41200
5890D687895l42299k65255k01061k80175k17714r344N7061Q5579J02921K26179
5880C843787L65748M18601O92610J101149J466048J726409J866393J912981J178631
5871A4572357m0725n24431m67953o36958r82335j089408j122142j177983j149155
5862G381267j131730r42062o36906m21879l93192l13234k05550j88654k27550
5853B920510j50451j40257k7755m1560j00268j30257l1405m3487k4K2507R846
5842B287399J5809k5968p953o731J8462J4447l631k611j21767P302k273m8919
$$ y = [2854994, 3022175, 3230486, 3470022, 3610261, 3657871, 3670074, 3696958, 3814397, 4037066, 4313001, 4678360, 5092672, 5535216, 5801921, 5773317, 5509500, 5312948, 5138261, 4929095, 4687895, 4345596, 4080341, 3879280, 3599105, 3381391, 3372047, 3429108, 3514687, 3617608, 3843787, 4209535, 4628136, 5320746, 6421895, 7887943, 9614352, 11480745, 13393726, 14572357, 14531632, 14007201, 13539248, 12902290, 11919955, 10830547, 9708405, 8530422, 7381267, 6249537, 5307475, 4670569, 4248690, 3855498, 3542264, 3336714, 3148060, 2920510, 2770059, 2629802, 2602047, 2560487, 2460219, 2329962, 2298557, 2255070, 2255046, 2277553, 2287399, 2303208, 2277240, 2269287, 2262556, 2281018, 2295465, 2291834, 2289223, 2167456, 2174758, 2172485, 2123566]
5830B123566j2154k3182J28330K7468o4398L3488K9457p5394Q851j56580j5803
5819B003649L5572p509L377l9725k8221J45119O3763N7797M2749N7961l2699j6368
5807B285465J2332m7326J8343K252O962L8401K9486N5052R8340J91807K32116
5796B923230L17523M78863N11735N19535M78848M51946J95589o2668k29967k12753
5786E371881k24015l65126m30726l22105m29166m10480k93462l30237k37535k32898
5776B096131j41376j10510j14057p3467m7699j17939q1503m9451o1967J5575k9681
5765A284056k7113o8921M996J518j3039n7648O805l4071L3761N9123p8828J1080
5753A121719N4846n2324p7887L1120m3069Q1956N7507O0999L7704l6879K3319
$$ y = [2123566, 2111412, 2088230, 2216560, 2244028, 2179630, 2213118, 2242575, 2167181, 2176032, 2019452, 2003649, 2039221, 2031712, 2035089, 1995364, 1967143, 2112262, 2176025, 2233822, 2276571, 2334532, 2301833, 2285465, 2297797, 2250471, 2268814, 2271066, 2278028, 2316429, 2345915, 2400967, 2499307, 2691114, 2923230, 3240753, 3719616, 4231351, 4750886, 5229734, 5681680, 5877269, 5814601, 5584634, 5371881, 5147866, 4782740, 4352014, 4029909, 3600743, 3190263, 2896801, 2566564, 2329029, 2096131, 1954755, 1844245, 1730188, 1656721, 1609022, 1491083, 1409580, 1360129, 1298162, 1313737, 1284056, 1256943, 1188022, 1193018, 1194536, 1181497, 1123849, 1130654, 1096583, 1130344, 1189467, 1110639, 1121719, 1176565, 1124241, 1046354, 1077474, 1034405, 1116361, 1173868, 1234867, 1272571, 1235692, 1259011]
5742A259011k9966k3038N8555K9050k947k2952l495P1652L5771Q022o6580N1208
5730A364291m0507q5090K5907K2713k4787K6910L2082N4914L606R203J6662L1239
5718A437143M8655k4518N5592K64570J37931O6736N6646R99l9665j7713n2712
5707A933664r1352j06883n0844j18886j07398o9203j48602n6289m4888J8514l0323
5696A127510q2696l4390l5061R521L1231j7689N8757j6254M0267Q279N8776Q1794
5684A230045R1252J05423R5514K08656J47996o87l7956p714k6762j66025o9421
5673A570321m2286m3597j32376o4260l410k8336n1812m0121J8427J2921l74l1332
5661A163765N930o2809j1095k0166n3364N2932J6622J8191K9957J037o4713O0169
$$ y = [1259011, 1229045, 1206007, 1264562, 1293612, 1290665, 1267713, 1264218, 1335870, 1371641, 1379663, 1313083, 1364291, 1323784, 1238694, 1264601, 1287314, 1262527, 1289437, 1321519, 1376433, 1380039, 1389242, 1405904, 1437143, 1485798, 1461280, 1516872, 1781442, 1919373, 1986109, 2042755, 2043754, 2004089, 1986376, 1933664, 1842312, 1735429, 1684585, 1565699, 1458301, 1389098, 1240496, 1184207, 1139319, 1157833, 1127510, 1044814, 1010424, 975363, 984884, 1016115, 998426, 1057183, 1040929, 1081196, 1089475, 1148251, 1230045, 1321297, 1426720, 1522234, 1730890, 1878886, 1878199, 1840243, 1832529, 1805767, 1639742, 1570321, 1528035, 1484438, 1352062, 1287802, 1284392, 1256056, 1204244, 1164123, 1182550, 1195471, 1195097, 1163765, 1169695, 1106886, 1095791, 1075625, 1022261, 1075193, 1091815, 1110006, 1139963, 1141000, 1076287, 1136456]
5649A136456R4983R604l7172p7218k3935K1741n6134o5564n4447l6397q3480j19692
5637G08745J1633N2138m7731l0904l5753l7464K4410Q55m6457k7122m566M0489
5625F08273n1758m1976K2018j1824m1542k9958R9583L7663n3314J4607J1979p2063
5613D91688m0198L0545N6162q5097K3401o134l9932Q368L3796K5454N503l1397
5601D72159M4010K2677k5458l6179K4572l9375q6507K2931N9510J4126O6800k5753
5589E13513p8846O2705m4163l4440o2844m3105O1886N5949L3j5381J1866J590
5577D28763o9525k5405J9613O6038N086J7151J02663m8904p3132O0626j6591k3738
5565D42645M3962L4812M8620j2300P194K7445M4144l0819J8504j0261L6470K1866
$$ y = [1136456, 1231439, 1241043, 1203871, 1126653, 1102718, 1124459, 1068325, 1002761, 948314, 911917, 828437, 708745, 720378, 772516, 724785, 693881, 658128, 620664, 645074, 645929, 599472, 572350, 567784, 608273, 556515, 514539, 536557, 524733, 483191, 453233, 552816, 590479, 537165, 551772, 563751, 491688, 451490, 482035, 538197, 453100, 476501, 470367, 430435, 438803, 472599, 498053, 503556, 472159, 516169, 538846, 513388, 477209, 501781, 462406, 375899, 398830, 458340, 472466, 539266, 513513, 434667, 497372, 453209, 418769, 355925, 312820, 374706, 430655, 430688, 415307, 427173, 428763, 359238, 333833, 353446, 419484, 424570, 441721, 544384, 495480, 422348, 482974, 466383, 442645, 486607, 521419, 570039, 557739, 564933, 592378, 636522, 605703, 624207, 613946, 650416, 672282]
5553F72282L0388J7539R380k2489j2173j0272p194p0616J0116J4686O0410K1533
5541G13590j2881o165N0398K5993k8579L9301j1199M2227m5728J8412K7889j1311
5529H01947J8454n7948J2820O0174k4514N279j3092K8273n8427N3553J8095o9316
5517G75298K5967M1167K9087J9881n7336k2796r319J1234q538P268L458J6874
5505H32245J7275K4865K5229k2445O396L955j1456L4592O4926N4244L257q558
5493A024525M3567l7330J717R6845N2432Q0517K6229J6460j9774j9095J29167
5482A395260M2187N786M0112L9638J00187M5246M4076M6563M560j5049O638J253
5470A756457M0124J6347J7111o7360K1013O6919j2530l176P6370L8140O2040R9953
$$ y = [672282, 702670, 720209, 729589, 707100, 694927, 684655, 677461, 606845, 616961, 631647, 692057, 713590, 700709, 694544, 744942, 770935, 742356, 781657, 770458, 812685, 766957, 785369, 813258, 801947, 820401, 762453, 775273, 835447, 810933, 816212, 803120, 831393, 772966, 826519, 844614, 775298, 801265, 842432, 871519, 891400, 834064, 811268, 801949, 813183, 804645, 811913, 815371, 832245, 849520, 874385, 899614, 877169, 883565, 887520, 876064, 910656, 975582, 1029826, 1033083, 1024525, 1068092, 1030762, 1032479, 1129324, 1181756, 1262273, 1288502, 1304962, 1285188, 1266093, 1395260, 1437447, 1443233, 1483345, 1522983, 1623170, 1668416, 1712492, 1759055, 1763615, 1748566, 1755204, 1756457, 1796581, 1812928, 1830039, 1762679, 1783692, 1850611, 1838081, 1834905, 1911275, 1949415, 2011455, 2111408]
5458B111408O2807P1366N7210R7366J10167J11134J62454J65147J34604J91632
5448C275295J60886K48273K56325M02112L52365M18700K88241L40395M12912M69502
5438F625006O28387N63468Q47766Q74906J098436J352365J510639J899282K504020
5429A7904275L439716M771049O356942P825185Q373029Q070146N828510K043054
5421F4611906o23751j050478r27014q70610k47878Q77377J987275K918744L189762
5412F9865333K154332o24969l520642m410818m285399m624212n215928n457995
5404D3879702n702635n508478n246842m621332l799178k846632k151895j545620
5396A2457090j360496j124127j022138p49804o71471n97712m48539m26429l13855
$$ y = [2111408, 2174215, 2245581, 2302791, 2400157, 2510324, 2621458, 2783912, 2949059, 3083663, 3275295, 3436181, 3684454, 3940779, 4342891, 4695256, 5113956, 5402197, 5742592, 6155504, 6625006, 7253393, 7816861, 8664627, 9539533, 10637969, 11990334, 13500973, 15400255, 17904275, 21343991, 26115040, 32471982, 40297167, 48670196, 56740342, 62568852, 64611906, 63988155, 62937677, 62010663, 61140053, 60892175, 61769552, 63756827, 66675571, 69865333, 72019665, 71394696, 67874054, 63463236, 59177837, 54553625, 49337697, 43879702, 38177067, 32668589, 27421747, 22800415, 19001237, 16154605, 14002710, 12457090, 11096594, 9972467, 8950329, 8200525, 7529054, 6931342, 6482803, 6056374, 5742519]
5387E742519l36796k57204k90426k06130k65580k11854j53952k03323j94544j12073
5377C510637j31086j44916j15070j05250j02006j00925r8102r0905j01437P882
5367B528822m7358j05137r1114o8191j01094j15680l8632r8299n7561m4722k2937
5356A738097o4818j8006n9817r6055K6369m5723n5397j5689l9898r7190m4498
5345A227375l0742J3656N3639n7250q4772l0611j8726m4686l5623J1404l8899
5334I64765j4067l3032J9559L8290j4370l1190j01226k7542m067j2916L0835l3262
5322G81777k0759K6749n4144k5907K0221m2350O2220j7673m8501n3670J41K8569
5310F56673j14574o072P9438K3967j22838j1912L3398O109j4481j2113m4740o7271
$$ y = [5742519, 5405723, 5148519, 4858093, 4651963, 4386383, 4174529, 4020577, 3817254, 3622710, 3510637, 3379551, 3234635, 3119565, 3014315, 2912309, 2811384, 2713282, 2622377, 2520940, 2528822, 2481464, 2376327, 2285213, 2217022, 2115928, 2000248, 1961616, 1863317, 1805756, 1761034, 1738097, 1673279, 1655273, 1595456, 1499401, 1525770, 1480047, 1424650, 1408961, 1369063, 1271873, 1227375, 1196633, 1210289, 1263928, 1206678, 1121906, 1091295, 1072569, 1027883, 992260, 1003664, 964765, 950698, 917666, 937225, 975515, 961145, 929955, 828729, 801187, 797120, 784204, 815039, 781777, 761018, 787767, 733623, 707716, 727937, 685587, 747807, 730134, 681633, 627963, 628104, 656673, 542099, 536027, 615465, 639432, 516594, 504682, 538080, 544189, 529708, 517595, 472855, 405584]
5298D05584L7085j8435k268L4007l6119M3644o9693l0562j6268K0499K0339k4670
5286C63143L5544l3844Q142k5423J0703Q834m8678q2903M1907j016P9547L1099
5274C87055j09340l8726J4705N9232k2689n5026K7331j9741k1061J689K4409k9323
5262B18515O1542l8793M4611L8060l4508K5932O945K8531l8779N980J3416q658
5250C22794m8303m2866N4590j6583l8145J4326J8268L023k8951J5809l7698m2894
5238A73370j2996M4590N7802l0357q9117K1051o626j7770P681j420L123l559o5919
5225G9853m622L1166j0249l754k5580k3290J02757l5097L4602M4497n767n0864
5213A33652l0894N9543n0061J3811j0305j2471M5453j9557Q435J02456l7683m4485
$$ y = [405584, 442669, 424234, 421966, 455973, 419854, 463498, 393805, 363243, 346975, 367474, 387813, 363143, 398687, 364843, 372985, 347562, 358265, 367099, 318421, 235518, 277425, 276409, 355956, 387055, 277715, 238989, 253694, 312926, 290237, 235211, 262542, 242801, 221740, 223429, 247838, 218515, 280057, 241264, 285875, 323935, 289427, 315359, 322304, 350835, 312056, 318036, 331452, 322794, 274491, 231625, 286215, 269632, 231487, 245813, 264081, 267104, 238153, 253962, 216264, 173370, 160374, 204964, 262766, 232409, 143292, 164343, 157717, 139947, 147628, 146208, 149331, 145772, 79853, 75231, 106397, 96148, 92394, 66814, 43524, 146281, 111184, 145786, 190283, 184516, 133652, 102758, 162301, 112240, 126051, 115746, 103275, 148728, 129171, 137606, 240062, 202379, 157894]
5201A57894n1323j0380N2157N820J9832J7727O082l6110M0818M3203j2646J9576
5189B52650l2047m048m2707l3412m891n20N8804J64k9371R4500K2769K7931P696
5176C17518j5140J2495l421M1117L6472k1156k9841L8199m1845J0885m5958N946
5164C05271p767k7507M0485K423P5980o0428p7230L028r994J2919j2873P5483
5152C19790L6555j9918L3664M3988P274K9728K5283L3630J5002j4195K0304J3541
5140E44646K0572l4766o8782n4539J2825k3729l2864K4664m0445O252k504J2542
5128C63872m4930j78K0472q469p623j0244O9015j1930J06639p0622l815Q9353
5116D91540k2549K7603o427n7869L3080O1791J4410K0632L3094M7476m8499p9433
$$ y = [157894, 106571, 96191, 148348, 154168, 174000, 191727, 197809, 161699, 202517, 245720, 233074, 252650, 220603, 216555, 173848, 140436, 135545, 135025, 193829, 193993, 164622, 259122, 281891, 309822, 317518, 302378, 314873, 311452, 352569, 389041, 367885, 338044, 376243, 334398, 345283, 299325, 305271, 297504, 269997, 310482, 312905, 388885, 328457, 251227, 254255, 244261, 257180, 244307, 319790, 356345, 336427, 370091, 414079, 421353, 451081, 476364, 509994, 524996, 510801, 531105, 544646, 565218, 530452, 461670, 407131, 419956, 396227, 363363, 388027, 347582, 353834, 351330, 363872, 318942, 318764, 339236, 330767, 323144, 312900, 381915, 369985, 476624, 406002, 402187, 491540, 468991, 496594, 490167, 432298, 465378, 527169, 541579, 562211, 595305, 642781, 594282, 514849]
5104E14849n4400q649M7236L6731k9824L2927J7446K1058K1860M036p8175n7199
5092D67896l5434p5564j1112k7694m9559L331K0449K730p1881j4364m2053o568
5080A60177J3947L0192K8484N3918n4007k8190O435m5069O1478k6970k3511N4265
5068B31149J7436n8619l5195J0665k4159k505Q995l5070M6466j2549K4394M4666
5056B15674K8224m6831N4410m574j4511j6828J9687l366m178J7123R780L6709
5044B91319m685K6393l6136K1291Q661o312p669P584p1056k9914O409k2817M4018
5031B27086m32M701l038n627j1001J3310r659Q212o4339M818l6530k196L7038
5018A62343K3366J1429O3503N4621r178j9595j3036O0705l5827K4019k1983q321
$$ y = [514849, 460449, 451800, 499036, 535767, 505943, 538870, 556316, 577374, 599234, 603270, 525095, 467896, 432462, 356898, 345786, 318092, 268533, 271864, 292313, 295043, 223162, 208798, 166745, 160177, 174124, 204316, 232800, 286718, 232711, 204521, 210956, 165887, 227365, 200395, 176884, 231149, 248585, 189966, 154771, 165436, 141277, 138772, 147767, 112697, 159163, 146614, 171008, 215674, 243898, 197067, 251477, 246903, 232392, 215564, 235251, 231885, 227707, 244830, 254610, 291319, 286634, 313027, 276891, 298182, 306843, 300531, 292862, 300446, 229390, 199476, 205885, 183068, 227086, 226654, 231355, 228317, 222690, 211689, 224999, 215340, 223552, 159213, 164031, 127501, 125305, 162343, 185709, 197138, 260641, 315262, 306084, 286489, 273453, 334158, 298331, 322350, 300367, 292046]
5006B92046J4874j3474p613o316j0244n6260J3039k2403N3979J4540k2915k6583
4994B22670l3084M689m021l163L8156J1636j02837K7761o0462O2795K9002J2143
4982B05285L6897j8693m1953l1919J2148l205M5320N2504l966J3762p1924K989
4970A97245k7113r059M135J9200o1775j7197J8477L8655k140j5090R8240J0738
4958B54316o4281k2205Q0770Q114M6j9089k8719N4605J3928J796m153l2772J5704
4945B58060J4423N8287k4244Q538k7891J2809L9411M4032p247l6210J9219P5896
4933D35083k872n7437K8777j7916m529l0732l401P0678O0003J7951n5905o8896
4921C70804N473P8157m7805l2149j3004N6678Q8034l9416j099k3399j6048K1136
$$ y = [292046, 306920, 293446, 285833, 279517, 269273, 213013, 226052, 203649, 257628, 272168, 249253, 222670, 189586, 194275, 190254, 187091, 225247, 236883, 134046, 161807, 101345, 164140, 193142, 205285, 242182, 223489, 181536, 149617, 161765, 158560, 203880, 256384, 252418, 266180, 194256, 197245, 170132, 161073, 165208, 184408, 122633, 105436, 123913, 162568, 160428, 145338, 243578, 254316, 190035, 167830, 248600, 256714, 256760, 237671, 208952, 263557, 277485, 279281, 275128, 242356, 258060, 272483, 330770, 306526, 315064, 287173, 299982, 339393, 383425, 376178, 339968, 359187, 435083, 432211, 374774, 403551, 385635, 381106, 350374, 346973, 417651, 477654, 495605, 439700, 370804, 376277, 454434, 406629, 374480, 361476, 418154, 506188, 466772, 465673, 442274, 426226, 447362]
4909D47362O6624K9279k0913K0766M3472R8338M7265o331P854M7217L8548j7391
4897H02090J7615J02228R166N3808J08092R2548L2090M5356R4138O8569O2759
4886A488459Q6694K8113O3345O5184O2679O6667j1398M6542R8204O4693N7214
4875B116396R461M1760Q0277L4307J11008L6889N6499J32904J04783J00800K34
4864B825318O1526Q4495O4703J43223R2996J19357J40464O7736N3417O15J890
4853C655740l6238J750k9887n877l3132m7756M7912p9598j57564p2597l798q2524
4841C156431q159K2988l6541n4278m428k8671j6328n9799o3038o7674l9920l9578
4829B761005J0699r3221q9034n1193l3622r5041l0230J6798l3588p5886q4145
$$ y = [447362, 513986, 543265, 522352, 543118, 586590, 684928, 732193, 725862, 733716, 780933, 819481, 802090, 819705, 921933, 931099, 984907, 1092999, 1185547, 1217637, 1262993, 1357131, 1425700, 1488459, 1575153, 1603266, 1666611, 1731795, 1794474, 1861141, 1849743, 1896285, 1994489, 2059182, 2116396, 2125857, 2167617, 2247894, 2282201, 2393209, 2430098, 2486597, 2619501, 2724284, 2825084, 2825318, 2886844, 2971339, 3036042, 3179265, 3272261, 3391618, 3532082, 3599818, 3653235, 3653850, 3655740, 3619502, 3621252, 3591365, 3585488, 3552356, 3504600, 3552512, 3472914, 3315350, 3242753, 3238955, 3156431, 3148272, 3171260, 3134719, 3080441, 3076013, 3047342, 3031014, 2971215, 2908177, 2840503, 2800583, 2761005, 2771704, 2678483, 2589449, 2538256, 2504634, 2409593, 2379363, 2396161, 2362573, 2286687, 2202542]
4818B202542m605l7137p8058n3209K5697O7489K4867m4822l810m0664j7059N4168
4806B095399l7213N3665L3854K8550j611j2981O5737Q7362N600J6422O4553M1354
4794B440691O2360R6898P8279J22916J06649M7946J19993J42567R3585J23933
4784C435817J25584P1576J28827O0176R5206P4624O1473P0295N3154q997O9412
4773D237147N798q9454K7252R9324O554J072P6909P5869N0408Q8135K2112j7318
4761D583808O2511J24264L880n015J9611K2876j8103n9804j6058k3373j07789
4750D586808j09351j26196j82142j15693j46194j14210p1193j29896j34613j18150
4740C339170n4883j35796k5512o7556j20678L975j4663l6555p426l0011l5456
$$ y = [2202542, 2197937, 2160800, 2082742, 2029533, 2055230, 2122719, 2147586, 2102764, 2098954, 2058290, 2041231, 2095399, 2058186, 2111851, 2145705, 2174255, 2172644, 2159663, 2225400, 2312762, 2318362, 2334784, 2399337, 2440691, 2503051, 2599949, 2678228, 2801144, 2907793, 2955739, 3075732, 3218299, 3311884, 3435817, 3561401, 3632977, 3761804, 3821980, 3917186, 3991810, 4053283, 4123578, 4176732, 4167735, 4237147, 4242945, 4153491, 4180743, 4280067, 4286621, 4287693, 4364602, 4440471, 4490879, 4579014, 4601126, 4583808, 4646319, 4770583, 4774463, 4769448, 4789059, 4811935, 4793832, 4734028, 4717970, 4694597, 4586808, 4477457, 4351261, 4169119, 4053426, 3907232, 3793022, 3721829, 3591933, 3457320, 3339170, 3284287, 3148491, 3122979, 3055423, 2934745, 2938720, 2924057, 2887502, 2880076, 2850065, 2814609]
4729B814609q0651o6271J5693m7960j00934k6341l4196n9781n2783k9539r0887
4718B240959P958p9715o6874l9279K9482M3372o8298l9088q4809J6290k3048k7777
4706A909173L8086O6870m8315J2706L6338m2773L0292P6206P897P412P500K1098
4694B122490N5709O4866j0144L3542K7352K0833K0687K3283k0120N9733K3493
4683B421724P951J2821j18805n9933j4579o0727l5799k659r5013n0620L5160p2039
4671A967482K6273q335p8162p0093j6220N8177m8473l2226k974p4581M5378K0550
4659A786796m5641l6486j2931q335k0257k1238n3645l9433K139m7675j1251q7385
4647A404658r2874k1178r337m9667r9859R88j6149l1291l8894k7878o6169J559
$$ y = [2814609, 2733958, 2667687, 2683380, 2635420, 2534486, 2508145, 2473949, 2414168, 2361385, 2331846, 2240959, 2248917, 2169202, 2102328, 2063049, 2092531, 2135903, 2067605, 2028517, 1943708, 1959998, 1936950, 1909173, 1947259, 2014129, 1965814, 1978520, 2014858, 1972085, 2002377, 2078583, 2086480, 2093892, 2101392, 2122490, 2178199, 2243065, 2232921, 2266463, 2293815, 2314648, 2335335, 2358618, 2338498, 2398231, 2421724, 2429675, 2442496, 2323691, 2263758, 2249179, 2188452, 2152653, 2149994, 2054981, 2004361, 2039521, 1967482, 1993755, 1985420, 1907258, 1837165, 1820945, 1879122, 1830649, 1798423, 1795449, 1720868, 1766246, 1786796, 1741155, 1704669, 1691738, 1683403, 1663146, 1641908, 1588263, 1548830, 1550969, 1503294, 1492043, 1404658, 1311784, 1290606, 1281269, 1231602, 1131743, 1132731, 1116582, 1085291, 1046397, 1018519, 952350, 953909]
4635I53909o1189j92r815m5740k5527j6913P1784l0451m1465l4908n9N8791J9204
4622H37429l1795l0473J2519m2285l1528k5714J4830M6736m2951J7268j3912R562
4610G19686l2666L1940K5193p4200q654M8787N8883j1911q23K5644q388o1716
4598G11775j0847J9088j1741k253l5167q904o8151l8314N9212L3825J9445m4326
4586F23642K7302j1019O828N0567q2943M1779J9230p1865K3212p288k2320J7432
4574F14557L7535O4903k2164n5211K5681J1391j1575n2372R38m0545K4049n6115
4562E41072K7913M2230k8360k0050j4587O1684k6594K2094R897n4233M044J5473
4550E80583J4993N70P445l6044J8041J0173J1648o1636K0831J5540J6374l4894
$$ y = [953909, 892720, 892528, 882713, 836973, 811446, 794533, 866317, 835866, 794401, 759493, 759434, 818225, 837429, 805634, 775161, 787680, 745395, 713867, 688153, 702983, 749719, 706768, 724036, 710124, 719686, 687020, 718960, 744153, 669953, 661299, 710086, 768969, 757058, 756235, 781879, 773491, 711775, 700928, 720016, 708275, 706022, 670855, 661951, 593800, 555486, 614698, 648523, 667968, 623642, 650944, 639925, 646753, 697320, 614377, 656156, 675386, 603521, 626733, 619445, 597125, 614557, 652092, 716995, 694831, 639620, 665301, 676692, 665117, 612745, 613683, 573138, 597187, 541072, 568985, 611215, 582855, 562805, 548218, 609902, 583308, 605402, 615299, 561066, 565110, 580583, 595576, 596146, 603591, 567547, 585588, 595761, 607409, 545773, 566604, 582144, 598518, 563624]
4538E63624M123L0828R790M6349K5296J6344J3231L4984k6260j2871L1752M8777
4526G85967K4930M5368l0094j1238Q914K2099j8437N544L0351K1919O2557O0916
4514A008796M224n146L8168M2753k583K6700n464Q8386M4123l1094R538o002L3687
4501A246086O7641N0002j0644M5332Q595O1362L8654N0985J04075J4667j044Q4014
4489A759725J8923L8749J00540P5485J05184L7798M3313j2625J8404K7373k5106
4478B187763k6843n1874j7166k392j10187m1373k282l0825o6736l6788J5162l1541
4466A784918j04629m1455n713r236k6957N236l025k7211K6117J3750m7072k5307
4454A539416K7088j8973N368J4309J8122L4457J5988j2943K465Q6359J8640K9478
$$ y = [563624, 567747, 598575, 608365, 654714, 680010, 696354, 709585, 744569, 718309, 705438, 737190, 785967, 810897, 856265, 826171, 814933, 823847, 845946, 827509, 833053, 863404, 885323, 947880, 1008796, 1013020, 1007874, 1046042, 1088795, 1086212, 1112912, 1107448, 1195834, 1239957, 1208863, 1218401, 1212399, 1246086, 1313727, 1363729, 1353085, 1398417, 1407012, 1468374, 1507028, 1558013, 1662088, 1676755, 1675711, 1759725, 1778648, 1817397, 1917937, 1993422, 2098606, 2136404, 2179717, 2167092, 2185496, 2212869, 2187763, 2160920, 2109046, 2091880, 2089488, 1979301, 1937928, 1935646, 1904821, 1838085, 1801297, 1816459, 1784918, 1680289, 1638834, 1633121, 1623885, 1596928, 1602164, 1599139, 1571928, 1598045, 1611795, 1564723, 1539416, 1566504, 1547531, 1552899, 1567208, 1585330, 1619787, 1635775, 1622832, 1625297, 1711656, 1730296, 1759774]
4442A759774m3932q166P268L3299K3957J1669M3307J05092R7599L1732O9984M0072
4430B171655R1510P3049J05302Q4667P0579O4367m3966O0811J21112J63203J55419
4419C117708J52498J78390J65414J87281J67084K12683K34302L69529L26937K94301
4409E406127L39214L63854L71830L13571L22265K15770K65512J45434J49359J83642
4399H076578J62222J67812O8796J06475J38176J12894J04330P3140j09741n2443
4389H848239r6221k13787k29585k67501l11344k62223l23081k64515l00306l50248
4379F229428k34839j87742j81217j19663j28156q8392j39801j04343p1346m7649
4369D926280j8859n4811l7383q279J5365J9468m1644j3772R4807N0251K4707n4332
$$ y = [1759774, 1715842, 1707676, 1714944, 1748243, 1772200, 1783869, 1827176, 1932268, 2029867, 2061599, 2131583, 2171655, 2263165, 2336214, 2441516, 2526183, 2596762, 2661129, 2617163, 2677974, 2799086, 2962289, 3117708, 3270206, 3448596, 3614010, 3801291, 3968375, 4181058, 4415360, 4784889, 5111826, 5406127, 5745341, 6109195, 6481025, 6794596, 7116861, 7332631, 7598143, 7743577, 7892936, 8076578, 8238800, 8406612, 8475408, 8581883, 8720059, 8832953, 8937283, 9010423, 8900682, 8848239, 8752018, 8538231, 8308646, 8041145, 7729801, 7467578, 7144497, 6879982, 6579676, 6229428, 5994589, 5806847, 5625630, 5505967, 5377811, 5289419, 5149618, 5045275, 4973929, 4926280, 4907421, 4852610, 4815227, 4806948, 4822313, 4841781, 4800137, 4786365, 4881172, 4931423, 4956130, 4901798]
4357D901798k7594N9160P9267P3194L3564J7344k6919n935N8054M7457N4248O5367
4345E329005K2565P1875O5675j1457R205N8161P9028J04516J33714J28974R0459
4334F081720O0388J54789J95617J45594K07740J72538M07531M27350N23225O81743
4324I058235R69789J429136J913363K386555K519979K488008J682541L90117k9227
4315B2808496J72904L46272N84751J157091K060840K739073L201355L393851K400328
4306C8864961j20196j699054j542045j160710j433797j481125j129805q31526
4298B9466703o31210k79883l83623j020842j654110j636272j364778j392001j541897
4289A9562087j548004j619281j604388j339512j236662r76103o80385m74476l32159
$$ y = [4901798, 4874204, 4933364, 5012631, 5085825, 5119389, 5136733, 5109814, 5103879, 5161933, 5209390, 5263638, 5329005, 5351570, 5423445, 5489120, 5477663, 5486868, 5545029, 5624057, 5728573, 5862287, 5991261, 6081720, 6142108, 6296897, 6492514, 6638108, 6845848, 7018386, 7425917, 7853267, 8376492, 9058235, 10028024, 11457160, 13370523, 15757078, 18277057, 20765065, 22447606, 22837723, 22808496, 22981400, 23327672, 23912423, 25069514, 27130354, 29869427, 33070782, 36464633, 38864961, 38744765, 37045711, 35503666, 34342956, 32909159, 31428034, 30298229, 29466703, 28835493, 28555610, 28171987, 27151145, 25497035, 23860763, 22495985, 21103984, 19562087, 18014083, 16394802, 14790414, 13450902, 12214240, 11238137, 10557752, 10083276, 9751117]
4280I751117k50697k38904j76371j12276j78439j08445m9041j61599m8212o7800
4270H359333q747l0258j00335j3427j9263m3449k4161K0304M4422N8098j1418
4259H231099N8287M4159N1550R7611O4507R0394K10561J66685K14161K12960K72492
4248I714466L30661K58558L52783M81083M91061M54425N22060N90495O40070P12416
4238A4548078Q26790Q35218Q66893R23431R78634J053337J088779J131192J285836
4229B3538188J226582J255204J322618J339302J384169J475429J565533J513756
4221C4620781J599675J595291J552264J573083J528093J437009J376959J401629
4213D6684784J255792J242239J192999J140401J023872R42640R09162P83875P33050
$$ y = [9751117, 9500420, 9261516, 9085145, 8972869, 8794430, 8685985, 8636944, 8475345, 8427133, 8359333, 8350586, 8320328, 8219993, 8206566, 8187303, 8143854, 8119693, 8139997, 8184419, 8242517, 8231099, 8289386, 8333545, 8385095, 8482706, 8547213, 8637607, 8848168, 9014853, 9229014, 9441974, 9714466, 10045127, 10303685, 10656468, 11137551, 11628612, 12083037, 12605097, 13195592, 13835662, 14548078, 15374868, 16210086, 17076979, 18000410, 18979044, 20032381, 21121160, 22252352, 23538188, 24764770, 26019974, 27342592, 28681894, 30066063, 31541492, 33107025, 34620781, 36220456, 37815747, 39368011, 40941094, 42469187, 43906196, 45283155, 46684784, 47940576, 49182815, 50375814, 51516215, 52540087, 53482727, 54391889, 55175764, 55908814]
4204E5908814O05660M43843J68969M3614j5861j56916l28054l82162m45694o25365
4194E5216848o96494p79095q95678q83951j071307j186845j210911j382376j398637
4185D5711554j469989j577271j520221j615241j600024j576386j574276j529675
4177C3248471j590943j548734j471218j484586j436017j257348j326038j291649
4169B1841938j210560j097885j124335j036586j013090r58824r00718q69400p86381
4160A2844159p27409o23330o54529n64778n26136n73987m68940m07726m23400
4151G873924l76345k42116k72161k68605k41846k34738k24717k51529j51060k03316
4141E407491j30353j73071j15630j20149j35182n3422j4512l3808r4316q8428
$$ y = [55908814, 56514474, 56958317, 57127286, 57170900, 57155039, 56998123, 56670069, 56287907, 55842213, 55216848, 54520354, 53741259, 52845581, 51961630, 50890323, 49703478, 48492567, 47110191, 45711554, 44241565, 42664294, 41144073, 39528832, 37928808, 36352422, 34778146, 33248471, 31657528, 30108794, 28637576, 27152990, 25716973, 24459625, 23133587, 21841938, 20631378, 19533493, 18409158, 17372572, 16359482, 15400658, 14499940, 13630540, 12844159, 12116750, 11493420, 10838891, 10274113, 9747977, 9173990, 8705050, 8297324, 7873924, 7497579, 7255463, 6983302, 6714697, 6472851, 6238113, 6013396, 5761867, 5610807, 5407491, 5277138, 5104067, 4988437, 4868288, 4733106, 4679684, 4665172, 4631364, 4537048, 4448620]
4131D448620q9507m170k1472l8969O137o1454j1177o1781m942j7194l0495j4392
4119D099204n6746O2355l990J5113O2103O1726Q5755M1067J8367M7620J7775J01843
4107D552192L6841l5679k919N1890M7338m737K0914K5457N94k7088n2710J8855
4095D630948k7969j18315p272K1853k8068O1249M253q1191n2021j8969P6848K8598
4083D489944O0954M2257K6088M6274J79096R2637P0683J59958M2138J048M2137
4072E253214J1706p496K5919L5920k2597m1536q9083K2642n893K9647R580m8929
4060E173094K1510K5197j16785j03182m6680p7491r7426p6831p6594j26576o4087
4049D434149j32777q3299j11281k3415k8261p1129l700Q260O583P7031p5974O6990
$$ y = [4448620, 4359113, 4354943, 4333471, 4294502, 4300639, 4239185, 4228008, 4166227, 4161285, 4144091, 4113596, 4099204, 4042458, 4104813, 4100823, 4115936, 4178039, 4239765, 4325520, 4366587, 4384954, 4432574, 4450349, 4552192, 4589033, 4553354, 4550435, 4602325, 4649663, 4644926, 4665840, 4691297, 4691891, 4664803, 4612093, 4630948, 4602979, 4484664, 4477392, 4499245, 4471177, 4532426, 4536679, 4455488, 4403467, 4384498, 4461346, 4489944, 4550898, 4593155, 4619243, 4665517, 4844613, 4937250, 5007933, 5167891, 5210029, 5211077, 5253214, 5264920, 5257424, 5283343, 5319263, 5296666, 5255130, 5166047, 5188689, 5182796, 5212443, 5222023, 5173094, 5194604, 5219801, 5103016, 4999834, 4953154, 4875663, 4778237, 4701406, 4624812, 4498236, 4434149, 4301372, 4218073, 4106792, 4083377, 4055116, 3983987, 3980287, 3988547, 3995130, 4072161, 3996187, 4063177]
4037D063177L4043L1529n2740o718L5861j5087J6801m2975k0635L430M2028M3152
4025D131866j4871n921M6613k8816m292k9715O0818P5006J9884J5994p3254k512
4013D190800Q2451j5618O2629O0117M7744L3180J5428J42318J48657O6772L0933
4002D865411J30031J33436J64614J36710K09487J56419J46935J56127J28400J57280
3992F384850J32827J32473J22179J79317R9181J10628N5405J70869R3308R4431
3982G575468J13727N8426J46747J88665K29499J62651K20453K25140K92782K00322
3972I413880Q8482J03884J12753J69394J87218J44019J75356K27290K24727K20755
3962A1067758K10967K73519K87572K80149J19860J20654R5471R8942Q1375k6910
$$ y = [4063177, 4097220, 4128749, 4076009, 4069291, 4105152, 4090065, 4106866, 4063891, 4043256, 4046686, 4088714, 4131866, 4116995, 4111074, 4157687, 4128871, 4124579, 4094864, 4155682, 4230688, 4250572, 4266566, 4193312, 4190800, 4273251, 4257633, 4320262, 4380379, 4428123, 4461303, 4476731, 4619049, 4767706, 4834478, 4865411, 4995442, 5128878, 5293492, 5430202, 5639689, 5796108, 5943043, 6099170, 6227570, 6384850, 6517677, 6650150, 6772329, 6951646, 7050827, 7161455, 7216860, 7387729, 7481037, 7575468, 7689195, 7747621, 7894368, 8083033, 8312532, 8475183, 8695636, 8920776, 9213558, 9413880, 9502362, 9606246, 9718999, 9888393, 10075611, 10219630, 10394986, 10622276, 10847003, 11067758, 11278725, 11552244, 11839816, 12119965, 12239825, 12360479, 12455950, 12554892, 12636267, 12609357]
3952A2609357j084m5523n0774Q997P2815N9223j4446j846N9035l9025j30958n3802
3940A2471969o5028K4408p3860M731l7079m2185r7211J8188J5986R0797L3645
3929A2344361J3525J09263L8985J14077P3790Q5736K2542J631O83J06436L1540
3918A2942569l692N2196O169J08477J03059O7009J09130N3959J04131Q7240J54425
3907A3784672J49743J60780K02655J96394J06446J42290K26956J67716K12796
3898A5350448L01548K28764L12991L06763L96247M11389M64003N54905N54894
3889A8881952N42588N61355N81560N54689N44101N83980N83094O28735N90958
3880B4053012N29984N48325N44415N66534O48307N90014N93105O65758N27093
$$ y = [12609357, 12608273, 12562750, 12511976, 12520973, 12593788, 12653011, 12638565, 12636719, 12695754, 12656729, 12525771, 12471969, 12406941, 12431349, 12357489, 12362220, 12325141, 12282956, 12185745, 12203933, 12219919, 12310716, 12344361, 12357886, 12467149, 12506134, 12620211, 12694001, 12779737, 12802279, 12803910, 12804593, 12911029, 12942569, 12938877, 12991073, 12997242, 13105719, 13208778, 13275787, 13384917, 13438876, 13543007, 13630247, 13784672, 13934415, 14095195, 14297850, 14494244, 14600690, 14742980, 14969936, 15137652, 15350448, 15651996, 15880760, 16193751, 16500514, 16896761, 17308150, 17772153, 18327058, 18881952, 19424540, 19985895, 20567455, 21122144, 21666245, 22250225, 22833319, 23462054, 24053012, 24582996, 25131321, 25675736, 26242270, 26890577, 27480591, 28073696, 28739454, 29266547]
3871B9266547M77471L58226L67847L27286K10925J54677R2756N8945j3933l8720
3861C1262027j1516o170m3161n5775q079L3676J25624J17138J12176J45782J43600
3850C1815322K32607L35583M48785N75600O17446Q11059J048373J209383J450186
3841C8544344J679803K080151K391211K769128L252650L769394M398640N066272
3833F3951593N887216O850901P996337R352414J1007712J2858700J4691971J6185570
3825A48782414J7222301J7343718J6419552J4991452J3068659J1139924R097989
3818B48066009P041410N231053L670873K469178J729569J293896J078736J138570
3810B71719294J149004R77305O02856k20914j604540l703795o306736r093148
$$ y = [29266547, 29744018, 30102244, 30470091, 30797377, 31008302, 31162979, 31255735, 31314680, 31300747, 31262027, 31250511, 31244341, 31201180, 31145405, 31137326, 31171002, 31296626, 31413764, 31525940, 31671722, 31815322, 32047929, 32383512, 32832297, 33407897, 34025343, 34836402, 35884775, 37094158, 38544344, 40224147, 42304298, 44695509, 47464637, 50717287, 54486681, 58885321, 63951593, 69838809, 76689710, 84686047, 94038461, 105046173, 117904873, 132596844, 148782414, 166004715, 183348433, 199767985, 214759437, 227828096, 238968020, 248066009, 255107419, 260338472, 264009345, 266478523, 268208092, 269501988, 270580724, 271719294, 272868298, 273845603, 274448459, 274227545, 272623005, 268919210, 262612474, 253519326]
3802B53519326j1227643j2313482j2822780j2749843j2557486j2043951j1270066
3795A68534075j0271563r237168q089160p043550o032162n202442m695372m379107
3787A13583551m078190m050128l998186l845889l844474l784033l625713l456677
3779H2900261l345311l103847l058632l008209k839028k786367k848096k871515
3771E9039256k897928k803552k837642k746651k664027k473541k329402k217854
3763C8068659k018066j798379j654835j427028j190647j017141p71813o57058
3755B7533692n20246m56467k92380j65918j49984j22932j44603j91588j06537
3746B5383037j71021j73549q1268j0919m2083R870O249L5317J55682K2882j3873
$$ y = [253519326, 242291683, 229978201, 217155421, 204405578, 191848092, 179804141, 168534075, 158262512, 149025344, 140936184, 133892634, 127860472, 122658030, 117962658, 113583551, 109505361, 105455233, 101457047, 97611158, 93766684, 89982651, 86356938, 82900261, 79554950, 76451103, 73392471, 70384262, 67545234, 64758867, 61910771, 59039256, 56141328, 53337776, 50500134, 47753483, 45089456, 42615915, 40286513, 38068659, 36050593, 34252214, 32597379, 31170351, 29979704, 28962563, 28190750, 27533692, 27013446, 26556979, 26264599, 26098681, 25948697, 25825765, 25681162, 25489574, 25383037, 25212016, 25038467, 24957199, 24946280, 24904197, 24914067, 24920316, 24955633, 25111315, 25134197, 25120324]
3735B5120324M040o8492k10087k49110l09652m09024m41064n37983n28737o10779
3725B1759436n69835o00239n43482n29895m79310n35310o06761n94391o00933
3716A6699280o25034n24816o18821n93742n64585n55186n38795n91606m79328
3707A1607367m93642m37643m32305l16478l21196k61297k59621l03592k52702
3698H528891k36426k22688j39042j96574j83156j78137j35680j60790k06167j46363
3688F723868j25550q6396j29592o9321p8356r3295j34192j79402j04377p2732
3678E650655p8132q5471j01334j0126j11385r4385j12213n2903l7698j20979p0807
3667D775222o6259m4953m1425j9346q1363j1724o3172m8679R165N651r2641p019
$$ y = [25120324, 25124364, 25055872, 24845785, 24596675, 24287023, 23877999, 23436935, 22898952, 22370215, 21759436, 21189601, 20589362, 20045880, 19515985, 19036675, 18501365, 17894604, 17300213, 16699280, 16074246, 15549430, 14930609, 14336867, 13772282, 13217096, 12678301, 12086695, 11607367, 11113725, 10676082, 10243777, 9927299, 9606103, 9344806, 9085185, 8781593, 8528891, 8292465, 8069777, 7930735, 7734161, 7551005, 7372868, 7237188, 7076398, 6870231, 6723868, 6598318, 6511922, 6382330, 6313009, 6234653, 6141358, 6007166, 5827764, 5723387, 5650655, 5572523, 5487052, 5385718, 5375592, 5264207, 5169822, 5057609, 5004706, 4967008, 4846029, 4775222, 4708963, 4664010, 4622585, 4603239, 4521876, 4510152, 4446980, 4398301, 4407466, 4413117, 4320476, 4313457]
3655D313457n5592k9457j16370k5594k3704l5209j5072k3275M765k6964o3715
3644C903270q4776j11934o1762k1859K0523o4171j6710l1970r6367k7127j7355
3633C389762k8606p9523j8021n6526j32890m5927l3963l2643k8896k9457l5986
3622B867324o2308j2005l1923l8506Q60l9245L263L8240L6161o1639n4712n4208
3610B591302m3525O9303J7154q256p3780K0308l0383M3042N7083M6287j4138m101
3598B670296o4516q0971m8507q5695l498L8364l6381n5756L517K6728p6153n5790
3586B231638m5674Q0455N297n0037n2681k122j2451m5084j6249l5440P2169j0066
3574B119755N783L4268p1775j4833J6995P4627M8514o8432O864R34j7407r1713
$$ y = [4313457, 4257865, 4228408, 4112038, 4086444, 4062740, 4027531, 4012459, 3989184, 3993949, 3966985, 3903270, 3818494, 3706560, 3644798, 3622939, 3643462, 3579291, 3562581, 3530611, 3434244, 3407117, 3389762, 3361156, 3281633, 3263612, 3207086, 3074196, 3028269, 2994306, 2961663, 2932767, 2903310, 2867324, 2805016, 2793011, 2761088, 2722582, 2723442, 2684197, 2687460, 2725700, 2761861, 2700222, 2645510, 2591302, 2547777, 2617080, 2634234, 2625978, 2552198, 2572506, 2542123, 2585165, 2642248, 2688535, 2674397, 2670296, 2605780, 2524809, 2476302, 2390607, 2387109, 2425473, 2389092, 2333336, 2336853, 2363581, 2287428, 2231638, 2185964, 2266419, 2271716, 2221679, 2168998, 2166876, 2154425, 2109341, 2093092, 2057652, 2129821, 2119755, 2125538, 2159806, 2088031, 2073198, 2090193, 2164820, 2213334, 2144902, 2151766, 2152700, 2135293, 2043580]
3562B043580N378L8372m6069M2736o4348J3187L053J937O994k7403l3647j1836
3550A971934P7823N6879j0631O4894m558l4564j2103N1849J17389O5961M8957
3539B393830Q128N9650P2325J34671J02397Q163Q4582P0909K5483R7954N4697
3528C112789R2553J3879l329K5367k9904N1591J9169K2588M7454k8292K892p6575
3516C250182j0481M0095l7026k6147p3629k4696j3274k0347K746k6858m0293n8295
3504B961977p0118M55j2287m6160j1318L281Q220m4319L9997O4342K8937p8940
3492B844067j5342J6510L2388l948J21089N9753J6824Q6760Q219J42130J95746
3481C504196J44306J94647K07611J28559j4080l8090K2624L8814N6127k8432m1758
$$ y = [2043580, 2048958, 2087330, 2041261, 2083997, 2019649, 2032836, 2035889, 2037826, 2044820, 2017417, 1983770, 1971934, 2049757, 2106636, 2096005, 2160899, 2156341, 2121777, 2109674, 2161523, 2278912, 2344873, 2393830, 2401958, 2461608, 2533933, 2668604, 2771001, 2779164, 2863746, 2934655, 2960138, 3058092, 3112789, 3205342, 3219221, 3215892, 3241259, 3211355, 3262946, 3282115, 3304703, 3352157, 3323865, 3326757, 3250182, 3239701, 3279796, 3242770, 3216623, 3142994, 3118298, 3105024, 3084677, 3087423, 3060565, 3020272, 2961977, 2891859, 2892314, 2880027, 2833867, 2822549, 2825830, 2834050, 2789731, 2829728, 2894070, 2923007, 2844067, 2828725, 2845235, 2877623, 2873675, 2994764, 3054517, 3071341, 3158101, 3166320, 3308450, 3504196, 3648502, 3843149, 4050760, 4179319, 4165239, 4127149, 4149773, 4188587, 4244714, 4216282, 4174524]
3470D174524N1685J00862M2923Q9541K25393K31032K19048K55190K64570L27340
3460E982108L59537M54660M52141M34410L51665K41281K63244J30596K4170K1785
3450H715597j3871j06054j05615k14717l70180n60508o17873n57988m91434n50702
3440E126655m88570l69283m47719l56350l22985k97225k05595j34677j07936j54324
3430B241991j65996q1394l3802p6983l3286N458m1932p3001l9109N9512r985J7193
3418A768666J39840P9341J35217N7381p8490k7655o7007j12746j22299j15263
3408A656985o8964o500j18373j30349o5128r1926m0434L0180k4328n2544p5949
3397A012670o1241j243M2756n939m2924p2347k4355L7857m1562L9420k5991n6791
$$ y = [4174524, 4226209, 4327071, 4369994, 4459535, 4684928, 4915960, 5135008, 5390198, 5654768, 5982108, 6341645, 6796305, 7248446, 7682856, 8034521, 8275802, 8539046, 8669642, 8693812, 8715597, 8701726, 8595672, 8490057, 8275340, 7905160, 7344652, 6726779, 6168791, 5677357, 5126655, 4638085, 4268802, 3821083, 3464733, 3141748, 2844523, 2638928, 2504251, 2396315, 2241991, 2075995, 1994601, 1960799, 1883816, 1850530, 1855988, 1814056, 1741055, 1701946, 1761458, 1751473, 1768666, 1908506, 1987847, 2123064, 2180445, 2101955, 2074300, 2007293, 1894547, 1772248, 1656985, 1588021, 1581521, 1463148, 1332799, 1267671, 1175745, 1135311, 1165491, 1141163, 1088619, 1012670, 951429, 950186, 992942, 987003, 944079, 871732, 847377, 885234, 843672, 883092, 857101, 800310]
3385H00310l304j5970l2163l4576P1994J0982o1090J5722P603q565J5856k2623
3373G44176k2775M464K66p3131k9485L2486O588P13P2457o4618p8868L8807N4222
3360F85302q4613p1172j0605p689O3803P527q5426j9260j2411K3643K6832J6107
3348E32038L7358o063k745M443j8243r2735q335P180M0393l8245M0657L6389o1253
3335D70839j800O297J5280k8445l0926L650L6848K3923m0111m29P020n0149r65
3322D11032L1617J1472M8862l9435o8358J4259K2906o5620l3136M3295M6837k6312
3310C97419n4779m6138k7041L1262N2794Q538J6124P859l8400m6403k5517J6216
3298B91934K5957O1295J8309l1435K6399p929p0966o675j6400L4833J7765L115
$$ y = [800310, 797006, 781036, 748873, 714297, 786291, 797273, 736183, 751905, 759508, 750943, 766799, 744176, 721401, 725865, 726131, 653000, 623515, 656001, 662589, 663302, 735759, 671141, 592273, 631080, 685302, 600689, 529517, 518912, 511223, 575026, 582553, 497127, 477867, 465456, 489099, 515931, 532038, 569396, 563333, 560588, 565031, 546788, 454053, 445718, 452898, 493291, 455046, 495703, 532092, 470839, 469039, 475336, 490616, 462171, 431245, 434895, 471743, 495666, 455555, 455126, 462146, 411997, 411032, 442649, 454121, 502983, 463548, 395190, 409449, 432355, 366735, 333599, 376894, 423731, 397419, 342640, 296502, 269461, 300723, 353517, 362055, 378179, 386038, 347638, 301235, 275718, 291934, 317891, 379186, 397495, 366060, 392459, 384530, 313564, 306889, 290489, 325322, 343087, 346202]
3286C46202m7286J5383L4137l6997J9727l2911K5556r146N598l3155r5399N8058
3274B49767N7474M6525m4056M4758K2370j4045l2284p0104m6127M253N8333q065
3262B68799K6402m6469n47L3539l3262K1996L3001l3827L4799j4070n9596K5602
3250B56367m716n1189l6413M0156M7128j255J334K5761K550m6343j0963J5298
3238B37715M2329L173N6029l6101l9096K8214l4936K1590K4559j3042j5635l8576
3226B36223q444M1899R936J4250p253k6725k7146L4461K7161M7963K1198K3931
3214C87454l0462k8908k5639m6443R811N490K6058k5797m5714L551L7864m4600
3202B22665Q627M7866L076m3230n8177R021P5627J8755J4205J3888l0522P908
$$ y = [346202, 298916, 314299, 348436, 311439, 331166, 298255, 323811, 314665, 320263, 287108, 191709, 249767, 307241, 353766, 309710, 354468, 376838, 362793, 330509, 260405, 214278, 218531, 276864, 268799, 295201, 248732, 248185, 281724, 248462, 270458, 303459, 269632, 304431, 290361, 230765, 256367, 251651, 200462, 164049, 204205, 251333, 250078, 251412, 277173, 279723, 233380, 222417, 237715, 280044, 283217, 339246, 303145, 264049, 292263, 257327, 278917, 303476, 290434, 274799, 236223, 227779, 269678, 279614, 293864, 286611, 259886, 232740, 267201, 294362, 342325, 363523, 387454, 356992, 328084, 302445, 256002, 265813, 271303, 297361, 271564, 225850, 229401, 267265, 222665, 231292, 279158, 282234, 239004, 180827, 189848, 265475, 284230, 298435, 312323, 281801, 289709]
3190B89709p157O115l1104K0682k9j6187M0712N1955k0593m9297o1765N3065O6448
3177C42554J7927j5021l3075m8423m8160O2236N3181j2295n5503J10261n2321
3166C21361l9514K0697J6613P946R160M2216K3849M4212p795J412K6412J1832
3154D78401J1907M9600Q761k2224J5131P0438l4236k6026O0687M1959K9163k7879
3142F55682j2601J7435R8368m8909l2044O196N4519K74m1532J9181j5910L7454
3130G38113J1978M6323M911K1826N5254J2357K0146N0250k1445M786o16P5187
3118A019070J05324R3073L588l2575k5779k3927m7382k5992q4017j10675l0375
3107H40333q791l378o2804L922J7210l601J1722j6938m6302k1360N0657K5596
$$ y = [289709, 282552, 288667, 257563, 278245, 278216, 262029, 302741, 354696, 334103, 284806, 223041, 276106, 342554, 360481, 345460, 312385, 263962, 215802, 278038, 331219, 318924, 263421, 373682, 321361, 281847, 302544, 319157, 327103, 336263, 378479, 402328, 446540, 438745, 440157, 466569, 478401, 490308, 539908, 548669, 526445, 541576, 612014, 577778, 551752, 612439, 654398, 683561, 655682, 643081, 660516, 758884, 709975, 677931, 684127, 738646, 738920, 697388, 716569, 700659, 738113, 750091, 796414, 801325, 823151, 878405, 890762, 910908, 961158, 939713, 944499, 943883, 1019070, 1124394, 1217467, 1221055, 1188480, 1162701, 1138774, 1091392, 1065400, 981383, 870708, 840333, 831542, 828164, 765360, 769282, 786492, 782891, 794613, 777675, 731373, 710013, 760670, 786266]
3095G86266n2930N2461K8377R375l2129j1878M5480M5392K1406m2822j707l1202
3083H16089o0228k8320l6359k9351L9477q0272K2018k4920k9040o9777n6470L6220
3071D99067k2012n8027m048K3097R8867J394n7335k3551m3464m5315m0880r892
3059C17901p120N1174j2667L8147L1304q83l6602J332p8620j5292k0784l1453
3047B36437j8517K291J3296m1391O3009k6269L6095l98k0673N6793p2492o1903
3035A66278L2547K2862j2854l3275J4632k0562n85L4699m7534K5600l998N094
3023A82904n0835J2905O683k5301m318K3776o4440n268K6908k4052p402K7936
3011I9496L2611L4260m0805j0269m832l256O7445j10583o625N6892L7705l3718
$$ y = [786266, 733336, 785797, 814174, 823549, 791420, 779542, 825022, 870414, 891820, 848998, 847291, 816089, 755861, 727541, 691182, 661831, 701308, 621036, 643054, 618134, 589094, 519317, 462847, 499067, 477055, 419028, 414980, 438077, 536944, 538338, 481003, 457452, 413988, 368673, 327793, 317901, 310781, 361955, 349288, 387435, 418739, 417856, 381254, 382586, 303966, 288674, 267890, 236437, 217920, 220211, 233507, 192116, 255125, 228856, 264951, 264553, 243880, 300673, 228181, 166278, 198825, 221687, 208833, 175558, 190190, 169628, 169043, 203742, 156208, 181808, 177810, 182904, 132069, 144974, 151657, 126356, 122038, 145814, 81374, 76106, 103014, 78962, 71560, 99496, 132107, 166367, 125562, 115293, 110461, 107205, 174650, 64067, 57442, 114334, 152039, 118321]
2999A18321j4886M8746l2021j5627Q912p3250j7369L7034q765j3919N446j1958
2987C0664j2949J2049N1934k020m0697m8487L2559K4621L5999l8125P020P790
2975F0358l133k1574k9695M2197l3004N6357J7499l1893j8670P959m6344k403
2963b346M4107j1949J0440K5738J6071p766l8054k6962n505L8822l5760J040J058
2950H934l0301k2250P8979L6750m0579N5820J568j8189J4159k4587k4358J7541
2938E3487P402j4434J5636l941J4467K0854L466K2960K0552n0929k0883M4669
2926A13306n6871l0108K2959O197n0215K4598M9839m3425j521M6618J1098P735
2914A00210M546n9937j9552K8197j443k8277n764m9462K8871N4249M254j6276
$$ y = [118321, 103435, 152181, 120160, 104533, 113445, 40195, 22826, 59860, 51095, 37176, 42622, 30664, 17715, 29764, 81698, 79678, 38981, -9506, 23053, 47674, 83673, 45548, 52568, 60358, 57225, 35651, 5956, 48153, 15149, 71506, 89005, 57112, 38442, 46401, 57, -2346, 41761, 29812, 40252, 65990, 82061, 74295, 36241, 9279, 3774, 42596, 6836, 7876, 8934, -21367, -43617, 35362, 72112, 31533, 87353, 88921, 70732, 84891, 60304, 35946, 53487, 60889, 46455, 62091, 58150, 72617, 93471, 96937, 119897, 140449, 89520, 68637, 113306, 56435, 26327, 49286, 55483, 5268, 29866, 79705, 36280, 34759, 81377, 92475, 100210, 104756, 44819, 25267, 53464, 52021, 23744, 17980, -31482, -2611, 51638, 55892, 39616]
2902C9616J1950j8960r222m4776J6895O7723j4438L6905l2820k1252N8295n494
2890H4422m2261N9369o2077m4502L5549L6450k7908j5282M9771k1060j3759r055
2878B9657n3804j8650K0725O5170m716j6724J0372O6236q7921k8397J04821J2125
2866I8894K3827j5215o8540m5569j4062J3757k8632N2007m1738n407N7421M384
2854C1127k3292K0677k3479m9720K2723K7932M0114l7363k4025N9557m547o3047
2842b3343l667k5558R084L5656j4783j018O7635K6752p9852O728K9738L5558n2309
2829A0621j03844M8378J5936R9631l559J7221J6442k1393o9256k9171J5875q154
2817a1273n121N632O4824J1314p1379j5556J1916j1304jl736k631M1204k9878
$$ y = [39616, 51566, 32606, 23384, -21392, -4497, 63226, 48788, 85693, 52873, 31621, 89916, 84422, 42161, 101530, 39453, -5049, 30500, 66950, 39042, 23760, 73531, 52471, 38712, 29657, -24147, -42797, -22072, 43098, 38382, 21658, 32030, 98266, 10345, -18052, 86769, 98894, 122721, 107506, 38966, -6603, -20665, -6908, -35540, 16467, -25271, -30678, 26743, 31127, 7835, 28512, 5033, -44687, -21964, 5968, 46082, 8719, -15306, 44251, 39704, -23343, -27010, -52568, -43484, -7828, -22611, -23629, 44006, 70758, -9094, -2366, 27372, 62930, 10621, -93223, -44845, -28909, 70722, 67163, 84384, 100826, 79433, 10177, -18994, -3119, -11273, -16394, -10762, 54062, 65376, -6003, -21559, -9643, -20947, -20948, -24684, -27315, 13889, -15989]
2804a5989M2068O5787m6873l2178L0296m1812k0346R292L1728l2963k0755O7643
2792C5898j6444l4566J5123K1559m2837Q328J4048k525j5326R023k0054j7975
2780d5748P956q832m365j1075o33L119k0023J0965K2639Q3953J4008m9954k5062
2767b3052K6145J1611r332M1515M1857l2713n8898L2685m888k7303J8170m749
2755A1048l2505M954q801M1991P739o6280J7733K4103Q85j8395j3836M7309J9994
2742C5939p586m8518J6844O653L9367J9190K5965o0416p2015K2409J9761l6506
2730c8913J0077K8058k0243R320O502M6518k9862Q877J2355J4710n6145n1213
2718e9959L7738L8567o8570j9934M9917J8849p413N5110K0438k4170m2428n7224
$$ y = [-15989, 26079, 91866, 44993, 12815, 43111, 1299, -19047, -9755, 21973, -10990, -31745, 35898, 19454, -15112, 11, 21570, -21267, -12939, 1109, -1416, -16742, -7719, -27773, -45748, -37792, -46624, -50989, -62064, -62697, -59578, -79601, -68636, -45997, 37956, 51964, 2010, -23052, 3093, 14704, 5372, 46887, 88744, 56031, -2867, 29818, 24930, -2373, 15797, 11048, -21457, -16503, -25304, 16687, 24426, -41854, -24121, -18, 867, -17528, -31364, 15945, 35939, 28353, -20165, -3321, 3332, 42699, 61889, 87854, 27438, -44577, -22168, -2407, -38913, -28836, -778, -21021, -11701, -5199, 41319, 11457, 20334, 32689, 47399, -8746, -59959, -22221, 16346, -52224, -72158, -22241, -3392, -10805, 44305, 64743, 40573, -1855, -59079]
2706e9079O6202K2043q581K037L2359l8488p0954L0100J5045k1944m4993j2876
2694h9129N8441R698j5074J4473J3911M4343J7422j9251n3756m7086p042K1247
2682e1803O0723l131l177J6431R654L2569l2772l842K2596n808o3150O911l1647
2669d6446m0546N7973K9149P487J5290q389P603m739k4363P239m834M0837m854
2656C1407o774K4879m7799J3461O7870m9590n6315k313l7974O4425k4111k9880
2644e2714K6456J13439J296j9554K6597o1143N9017k095j8703J754j5532J2295
2632G1113j9878m031J6910m5508N4803o7885q716O612j5829K6500q8298j5322
2620h9529N0321K5547J5511L5904m6511j9631R203K3457j3717L5895K3172k1627
$$ y = [-59079, 7123, 29166, 20585, 22622, 54981, 16493, -54461, -24361, -9316, -31260, -76253, -89129, -30688, -20990, -36064, -21591, -7680, 36663, 54085, 34834, -18922, -66008, -73050, -51803, 8920, 5789, 2612, 19043, 28697, 61266, 28494, 24652, 47248, 41440, -21710, -14799, -46446, -86992, -29019, 130, 7617, 22907, 14518, 22121, 17382, -6981, 258, -4576, 36261, 31407, 24633, 49512, 1713, 15174, 83044, 33454, -22861, -25174, -63148, 1277, -22834, -52714, -26258, 87181, 88477, 68923, 95520, 34377, 93394, 91299, 72596, 74350, 58818, 71113, 51235, 47204, 64114, 18606, 73409, 5524, -3192, 3420, -12409, 14091, -74207, -89529, -39208, -13661, 1850, 37754, -8757, -28388, -19185, 4272, -9445, 26450, 49622, 27995]
2608B7995k1798k1236N1223J6436J6311J1859K1322P004j15940Q446K4813J6134
2596D2569Q0487j7238J541k0661l9130M7409m546l4029L1718J0994Q8062r437
2584A77739j3522p303l0528n6898J1923P4143j505m4163m9888m8003m9677k9118
2572f6800N916Q5479L2616n9123Q142K5618k5613n1079k708p915L4011Q2631o4404
2559c229k4713L2006k5070l9063L4194N9011k6079m5665P9571N5184k5096L7548
2547A08599J8658j02268l1069l6932o559M4505P318J2352J0305M2043m6358J5515
2535C6109k2638j1266l8611k1445K9244P1633Q403n0032m1129O4083j4389j0070
2523a08L2530r208j3235J2504L4196k5857n800l2242k222P5456k4444k2334j35
$$ y = [27995, 6197, -15039, 36184, 52620, 68931, 80790, 102112, 109116, -6824, 1622, 26435, 42569, 123056, 105818, 107359, 86698, 47568, 94977, 90431, 56402, 88120, 99114, 187176, 177739, 164217, 156914, 126386, 69488, 81411, 155554, 154049, 109886, 59998, 11995, -37682, -66800, -60884, 24595, 57211, -1912, 6230, 31848, 6235, -44844, -47552, -55467, -21456, 61175, -3229, -27942, 4064, -21006, -60069, -25875, 33136, 7057, -38608, 40963, 96147, 71051, 108599, 127257, 24989, -6080, -43012, -49571, -5066, 2252, 14604, 24909, 66952, 20594, 36109, 13471, 2205, -36406, -57851, -28607, 43026, 51429, 1397, -39732, 24351, 9962, -108, 32422, 23214, 9979, 22483, 56679, 30822, 25022, -7220, -9442, 66014, 41570, 19236, 19101]
2510A9101k778O7054K943j4156n4007j9827r253J3968L8432J0317l9521J2720
2498B4993J0830j6082N3534L910K702l3212n7713L6830L4468m660k5001K1472
2486E2071K7408J2685p9540j9864q92j0264O983n328L34m9583Q264J66599j5126
2473I3747J13p2350m3417R130k2585M3504k0608K757L1040j5559N7197k2506l5434
2460E029J9624r731P7472K323j1021q150J5645K449O3423j5788k2388N7422n5507
2447A20802m5470M504N4050p416K500r985n3836K2274n011K6736Q818l2012N913
2434I1867J8454m6231n8016j00712L6531J10928J1357K1094O658k2999K6381M4739
2422A40051J853M322k6729O758o5931j4032M3548R8825l0682N329K7930o6891
$$ y = [19101, 16323, 83377, 86320, 72164, 18157, -1670, -10923, 3045, 41477, 51794, 12273, 24993, 35823, 19741, 73275, 77185, 79887, 46675, -11038, 25792, 60260, 55600, 30599, 52071, 79479, 92164, 12624, -7240, -8132, -18396, -11413, -16741, -16407, -65990, -57726, 108873, 93747, 93860, 21510, -21907, -12777, -35362, 8142, -12466, -9709, 21331, 5772, 62969, 40463, 5029, 24653, 14922, 92394, 94717, 83696, 75546, 91191, 93640, 157063, 141275, 118887, 176309, 120802, 75332, 79836, 133886, 126470, 128970, 118985, 65149, 87423, 82412, 109148, 117966, 85954, 91867, 110321, 64090, 6074, -94638, -58107, 52821, 64178, 85272, 91930, 68931, 95312, 140051, 141904, 146226, 119497, 126255, 60324, 46292, 89840, 188665, 157983, 163312, 191242, 124351]
2410A24351m702M651N671k4161J9191k7715K080L1700k713L3253n0411L462L5845
2397A50502n210P3524M9916o553k5227N8366M7518j6794m6769k4705N1352K0512
2385C26432j9799N2093J9130m9229m5496J7453o1960J9408N7962J0516M4053l7639
2373C32924k3161L4666r04j7090o966K0881J4963L8347J3154Q9078k3514L6342
2361E08720L0973M345k6908J1282M131r552K7270J7861M4983Q2737O0246L2812
2349G88900N3484R4795P8915L4582M3423O2073J68908J28104Q6689J35088K22046
2338A897007K69815K97207L04112K74307L33497K85851K40966K36310L50526L71524
2328D861122N59551Q27346J018694J609402K652926M157822N273360N776433O397766
$$ y = [124351, 119649, 124300, 129971, 105810, 125001, 97286, 99366, 131066, 128353, 161606, 111195, 114657, 150502, 145292, 218816, 268732, 262179, 236952, 295318, 342836, 326042, 279273, 254568, 305920, 326432, 306633, 358726, 377856, 328627, 283131, 300584, 238624, 258032, 315994, 326510, 370563, 332924, 309763, 344429, 343525, 326435, 319469, 340350, 355313, 393660, 406814, 495892, 472378, 508720, 539693, 544038, 517130, 528412, 532543, 522991, 550261, 568122, 613105, 695842, 756088, 788900, 842384, 937179, 1016094, 1050676, 1094099, 1156172, 1325080, 1453184, 1539873, 1674961, 1897007, 2166822, 2464029, 2768141, 3042448, 3375945, 3661796, 3902762, 4139072, 4489598, 4861122, 5420673, 6248019, 7266713, 8876115, 11529041, 15686863, 20960223, 26736656, 33134422]
2319C3134422M983163m31384l113464k085095j726097k568801l150031l322723
2311B1719990l389916l311580l066991k676195j965669j056853o40994n02136
2303E109656n31179n33896m70481l57815l30452k77871k23859k20531k45831j57815
2293A759926j40341j70384j46363p4891m1052k5259p3476o7833L311M3742m8251
2282A019129q9993k8919m8894n4071k6323p739O8174o1114n4179j5952j3556l7562
2270F49001m9441m9605o5635J5831J4266K2528k8207o5014k5404O0746k1964l1527
2258D25575k8436p788j3407r854J4626R238k5904n4564K5405j7444l2460r700
2246B75287r849N1516l7214m3958j307q6880M0017K0117N78q374Q843Q664k5410
$$ y = [33134422, 38117585, 37686201, 34572737, 32487642, 30761545, 28192744, 25042713, 21719990, 18330074, 15018494, 11951503, 9275308, 7309639, 6252786, 5611792, 5109656, 4578477, 4044581, 3574100, 3216285, 2885833, 2607962, 2384103, 2163572, 1917741, 1759926, 1619585, 1449201, 1302838, 1227947, 1186895, 1161636, 1088160, 1020327, 1023638, 1067380, 1019129, 929136, 900217, 851323, 797252, 770929, 763190, 831364, 770250, 716071, 700119, 686563, 649001, 599560, 549955, 484320, 500151, 514417, 536945, 508738, 443724, 418320, 479066, 457102, 425575, 397139, 389351, 375944, 366090, 380716, 389954, 364050, 309486, 334891, 317447, 284987, 275287, 265438, 316954, 279740, 235782, 234475, 147595, 187612, 207729, 208307, 199933, 208776, 217440, 192030]
2233A92030J7515N802J6523J9988j2206j8478m5046j9327M1165j21500M185N8943
2221A39594k4636m1903J9804O2574q78k1911k5133K4418m2199j239m5017L2591
2209G6065O0630O969r340k7519N9902N670k7480p6635r253p401N74L399n1593
2196C988M7381J907l7567j0836N1388J8877m4301Q638L9863l515J4432m7518l6618
2183F119O5953k8303j0517m437r947n831K291k3895l4119L372k4131R7826K2237
2170E6618l742N670l1577N1027k9505k1020j4609j7686N2628l0153k177L9511
2158E4985j5099m2705L4098n1574j0720Q2248L2465j3043n9237m0844K6961K719
2146B54N7165N2211j08115K1727j2272o441J289P4715j1574m3038k325O7482k4594
$$ y = [192030, 209545, 215347, 231870, 251858, 239652, 221174, 176128, 156801, 197966, 76466, 80651, 139594, 114958, 73055, 92859, 155433, 154555, 132644, 107511, 131929, 89730, 88491, 43474, 76065, 136695, 143664, 134324, 106805, 166707, 172377, 144897, 68262, 59009, 51608, 52182, 55581, 3988, 51369, 53276, 15709, 4873, 56261, 75138, 30837, 39475, 79338, 75823, 90255, 42737, 6119, 72072, 43769, 33252, 28815, 18868, 13037, 15328, -8567, -42686, -39314, -63445, 34381, 56618, 52876, 58546, 26969, 77996, 48491, 27471, 12862, -4824, 47804, 17651, 15474, 54985, 39886, -2819, 31279, -20295, -31015, 51233, 83698, 70655, 11418, -29426, -2465, 254, 57419, 109630, 1515, 23242, 10970, 4529, 5818, 80533, 68959, 25921, 23596, 91078, 66484]
2133F6484k4986J7208k3998K4940o2258o6733j098K3867j4517m9235J8702l3371
2121a24995K3757O6145K1213k4691N524O094Q482o963l8656R6481j0331L099P568
2108C2727J0009j6218l8594n4549J6660M9750J8073J6291p846j663K7904k1840
2096C0704q368P3286k2900j3493m2289n3285J6421m3077M4054L4111L8448n8316
2084d704l9561J6538K3995m1008k5803l697L7913q471J3077m4436K7316Q0572
2072C1731L963j8311l732J105l2894J5460J14O478k2977k3114K1178K2630n610
2059c979N5975J638q259J1668J1186j169l4921N0751O4364j3823M2798K5462l1098
2046A70593l5497J3159k5120N652o095M7733m6782n0298l6437n4872l6780j8348
$$ y = [66484, 41498, 58706, 34708, 59648, -2610, -69343, -70441, -46574, -61091, -110326, -91624, -124995, -101238, -35093, -13880, -38571, -33047, -26953, -18471, -25434, -64090, 32391, 22060, 25159, 32727, 42736, 26518, -12076, -66625, -49965, -215, 17858, 34149, 26303, 24640, 52544, 30704, 22336, 95622, 72722, 59229, 16940, -36345, -19924, -63001, -18947, 15164, 53612, -4704, -44265, -27727, -3732, -44740, -70543, -74240, -36327, -44798, -31721, -76157, -48841, 31731, 35694, 17383, 13651, 14756, -18138, -2678, -2564, 3914, -19063, -42177, -20999, 1631, -3979, 51996, 53634, 45375, 57043, 68229, 67060, 32139, 82890, 147254, 133431, 176229, 201691, 170593, 135096, 148255, 123135, 128787, 122692, 170425, 123643, 73345, 36908, -17964, -54744, -73092]
2034g3092J11773j8824j9252P3604r2445J6207k4603j11186K7919Q6087N9696
2023C5884q880J3410J1207O61n4129k7161M0615l1787L105K113k391M380k8278
2010d1251L1201J1356q1601k2698O1190N4364J3499l4045J3193o507m2819j6168
1998f0286k8784P9088j2808l0540J0620k5662O7914l1525o3650J1885Q300O6705
1986h743m7284J1809J231j9757k1696K5331P46J8002M1983k6822m5673J7871N3900
1973H98m4046O0994l4975n6781P240O0962k4953M2461k546q7511J2922M1524m2531
1960f6342N1881J5213k3972l8173K811L3499n0670L482J9595K4237l666m8883
1948h0988K7729M8013J6572j410p79n7938o032Q5872K8117n6448p3038l0897l7497
$$ y = [-73092, 38681, 19857, 605, 74209, -18236, -2029, -26632, -137818, -109899, -23812, 35884, 27004, 40414, 51621, 52282, -1847, -29008, 11607, -20180, -17075, -14962, -17353, -12973, -41251, -10050, 1306, -80295, -102993, -41803, 12561, 26060, -7985, 5208, -1299, -44118, -60286, -89070, -9982, -22790, -53330, -42710, -68372, -458, -31983, -95633, -83748, -75448, -8743, -56027, -44218, -42987, -62744, -84440, -59109, -58363, -40361, 1622, -25200, -70873, -53002, 898, -43148, 17846, -17129, -73910, -66670, -5708, -30661, 11800, 9254, -78257, -65335, -23811, -66342, -14461, 752, -23220, -61393, -58582, -25083, -75753, -72271, -52676, -28439, -32105, -80988, -53259, -5246, 11326, 9916, 9137, -48801, -54833, 31039, 59156, 2708, -70330, -101227, -138724]
1935a38724O5266J7185K9120j917l0397J7805K0912L5128l0498k7227n4307L0874
1923f6780N3934j375j253j3673J1003l1977J161P7563k128n6472j7248J9118J0353
1910a7774L2535K4696n7292r217L3855m1490m3019L0413O3299M4728m869p5518
1898a9653j0707n2109M3065N7892j1702j0988p507o343N5763n3674m4389K9777
1886c0575j5424J0958j2976J8868k4797K5823m8598J9532O673m1853L2032K1878
1874c8459k3065J7186O9390M412n465q515k817l9647j1789J6749L1228K2509l2491
1861g74p580o920k9091m3513J3440O9280L6181k6035j4532j140j3845j4370N0475
1848A1576j2474M892K9327M6814p1346j7351m174q1557P327J2537M9440K2526
$$ y = [-138724, -73458, -56273, -27153, -29070, -59467, -41662, -20750, 14378, -16120, -43347, -97654, -66780, -12846, -14221, -15474, -29147, -18144, -50121, -48960, 28603, 26475, -29997, -47245, -28127, -17774, 14761, 39457, -17835, -27052, 6803, -34687, -77706, -47293, 16006, 60734, 55865, -19653, -30360, -82469, -39404, 18488, 6786, -4202, -11709, -18052, 37711, -15963, -60352, -30575, -45999, -35041, -48017, -29149, -53946, -28123, -76721, -57189, -50516, -92369, -60337, -38459, -61524, -44338, 25052, 29464, 23999, 15484, 12667, -26980, -38769, -22020, 9208, 31717, -774, -8354, -15274, -44365, -87878, -74438, -5158, 31023, 4988, -9544, -10684, -24529, -38899, 11576, -898, 3994, 33321, 80135, 8789, -8562, -12736, -94293, -86966, -74429, -24989, -2463]
1836b463j2588q883n3598R285k605J1116J8890K5846q1366N961O4457j2851k6045
1823f4844m1057M7655J844Q318J1169j9463N9713r710k9342l4290K182k5997R6984
1810C162M3119j2288k07n8802m496J0842p291J3211k1524J7447O5812o8388M7620
1797B8217n2006K9347m5357M960M7048M4477n9076m9566j9506P3019J4490k2714
1785f667m4931J006K2672K4906O56k0728n700m0446K4205J3949j6853L3284K0375
1772E728l4111L5215m1688o0553J631M4371J1141J7458Q475O268m8228M2772L0973
1759A9452k858L3288o0364L1183l4647r8365K5972R6802N3819r0316N520M0335
1747A9821q40J6351n0637r0931k328M1643k405M0187M712k3787K1527j2400l1737
$$ y = [-2463, -15051, -23934, -77532, -68247, -70852, -59736, -40846, -15000, -96366, -90405, -25948, -38799, -64844, -105901, -58246, -56402, -48084, -36915, -56378, 3335, -6375, -35717, -70007, -67825, -93822, 3162, 46281, 33993, 33786, -25016, -29512, -18670, -25961, -12750, -34274, -16827, 48985, -19403, 28217, -23789, 5558, -39799, -34839, 12209, 56686, -2390, -51956, -71462, 1557, 16047, -6667, -51598, -50592, -27920, -3014, -2358, -23086, -28786, -69232, -45027, -31078, -47931, -14647, 5728, -28383, 6832, -34856, -95409, -93778, -49407, -38266, -20808, -12333, -6065, -54293, -11521, 19452, 16594, 49882, -10482, 20701, -13946, -112311, -86339, 10463, 64282, -26034, -20514, 19821, 18981, 35332, -15305, -106236, -108564, -66921, -69326, -29139, -24427, -48214, -26687, -39087, -70824]
1734g0824R1570n162j16413K6619k477K8562n124L817M2268J6055k9618n7790
1722g8517L3947Q9798J6041m2917j6111j9195L2041o3906k2128P2804j3890J506
1710a0527l5055L1400o2654M317L8636j0485K7465M2317j2135m7672j5954O5937
1698A5590K542k4978k9629k8348K5655M0741j29122k575J05315L5303o068q5837
1686h1411O4443k9246o846r687J3565K1097J9704n8759J7636M0403K4229L6757
1674E1885o6441K6993n0467l6879N6083K0139L7322o0639k4306k8071j2877R7849
1662A0591k8822q2105k3743N3670O8791L8621l0056N6711k8431o9827L7044j0707
1650h263J9421j0062j8030K3218k3672o6890O5442K6940L1132l1655n0769j108
$$ y = [-70824, 20746, 15584, -100829, -74210, -76687, -48125, -53249, -49432, -7164, 8891, -20727, -78517, -44570, 45228, 61269, 18352, 2241, -16954, 15087, -48819, -70947, 1857, -12033, -10527, -45582, -14182, -76836, -72519, -33883, -44368, -16903, 25414, 13279, -34393, -50347, 15590, 18132, -6846, -36475, -64823, -39168, 1573, -127549, -130124, -24809, 10494, 4426, -81411, -16968, -46214, -53060, -62747, -49182, -28085, -8381, -67140, -49504, -9101, 15128, 51885, -14556, 12437, -38030, -74909, -18826, 1313, 38635, -22004, -46310, -74381, -87258, 10591, -18231, -100336, -124079, -70409, -1618, 37003, 6947, 63658, 35227, -34600, 2444, -8263, 11158, 1096, -16934, 6284, -17388, -84278, -18836, 8104, 39236, 7581, -43188, -44296]
1638d4296K6897p494n798r044j6381L9084Q298j9586q992L8961J6820j084L7313
1625E4698K6351j04321n0591N785J2967K4997Q7679r879l3606M142o9413P235
1613d3956J4490L6681P258o28j9214J5767K9419l5687l9940j9451K4412K5583
1601e266q866N0233k2353K9607n1498M798J7457n3154K6444p3282K2761R6276
1589C3157l9980R584J7690j4717n5136j5523N3984k9892j5614k0101k2437L7660
1577f1325P5397q892J1037k4951M572k2419J1819j7516J3009n4j8577r385K033
1564d5252K4470M0384o8266n5542P0440j1541J0156j1689P425O2243L9555q5126
1552b2743o059O3467r69m7991k7799K2997o928J0766M047m0120k579N3621R616
$$ y = [-44296, -17399, -24893, -30691, -39735, -56116, -17032, -8734, -28320, -37312, 1649, 18469, 17385, 54698, 81049, -23272, -73863, -68078, -55111, -30114, 57565, 47686, 14080, 18222, -51191, -43956, -29466, 7215, 14473, 13845, -5369, 10398, 39817, 4130, -35810, -55261, -30849, -5266, -14132, 36101, 13748, 43355, -8143, -3345, 14112, -39042, -12598, -85880, -63119, 33157, -6823, 2761, 20451, 5734, -49402, -64925, -10941, -40833, -56447, -76548, -98985, -61325, 14072, 5180, 16217, -8734, -4162, -26581, -14762, -32278, -19269, -19323, -37900, -47285, -45252, -20782, 19602, -48664, -104206, -33766, -45307, -35151, -46840, -39415, 22828, 62383, -22743, -28802, 34665, 33696, -14295, -42094, -19097, -26025, -15259, -11212, -51332, -53911, -290, 9326]
1539I326m1040q561j5356o4626J4038M6843L8179m8626K8819M8939m455P013L792
1526A4285j1664J148p8875j1193P5969K8574J3589O965k7123k5220l3624r952
1514e7121N5706j610O6867N159O383n2367o8191M3003J2743r204j2232k5857M4234
1501G513O1408m1591k4933m0102j0649K9407r097O0589J5292l5062m1311j6428
1489d4964K5635j0474j0997l511K2126K4358m3276j1579j5680L5065l4302K2119
1477d5480P6607k1921l5165L5331j179l5361k0854k4870k2894l3835O7863J4363
1465d7395O546J3468J09500L2630q7005J303L521p4181j0741J5817J0949R784
1453a5804K8507m8435j1753k5371M9155L6754N0482n0421q5126k20p511M2302
$$ y = [9326, -31714, -40275, -55631, -120257, -106219, -59376, -21197, -69823, -41004, 7935, 3480, 10493, 14285, 2621, 3769, -75106, -86299, -10330, 18244, 31833, 38798, 11675, -13545, -47169, -57121, -1415, -3025, 63842, 69001, 75384, 23017, -45174, -2171, 10572, 1368, -10864, -36721, 7513, 68921, 27330, 2397, -37705, -48354, -18947, -28044, 32545, 47837, 12775, -28536, -44964, -19329, -29803, -40800, -44311, -22185, 2173, -41103, -52682, -68362, -33297, -67599, -45480, 31127, 9206, -25959, 9372, 8193, -27168, -48022, -72892, -95786, -129621, -61758, -47395, -40849, -27381, 82119, 114749, 27744, 29047, 32568, -41613, -52354, -36537, -25588, -15804, 12703, -35732, -47485, -72856, -23701, 13053, 63535, 13114, -72012, -72232, -79743, -37441]
1441c7441J3169J9963J2954j690l5107K0160o4702k0477J21610K7349j07379R684
1429d1907j1375k27j6591k6346j4586N2944J2811L2837l4000M386L155l4486J6587
1416e6798L7304p886r41k794j4728p4862N5980P6980p047J0286K0243J4940j3765
1403C6912j9996M8579n180k8991N9020m0402j1388n4311o1057J6025M058M4891
1391a1840J3890k2716J440l0544J9160K8041L0703q827o9035n416l0312L4688
1379e0768N5945p178O707M2194n626m5657K17k4320J670J6188K0272j1172L8864
1366C7336n9787M2107j9060R052j1188L2771J547Q041K5190j5971m661N696o2848
1353a1775O831o9121k8148P9494J065j4783L3933L0820l6667o1654J3044J5429
$$ y = [-37441, -24272, -4309, 8645, 6955, -28152, -7992, -72694, -93171, 28439, 55788, -51591, -41907, -53282, -53509, -70100, -96446, -111032, -58088, -45277, -12440, -46440, -42054, -38899, -73385, -56798, -19494, -27380, -28321, -31115, -45843, -120705, -64725, 12255, 5208, 15494, 35737, 50677, 36912, 16916, 65495, 60315, 31324, 90344, 49942, 38554, -15757, -76814, -60789, -56731, -11840, 2050, -20666, -19226, -49770, -30610, -2569, 28134, 19307, -49728, -55144, -85456, -50768, 5177, -2001, 4706, 46900, 41274, -4383, -4166, -28486, -26816, -10628, 9644, -1528, 37336, -22451, 19656, 596, 9648, -1540, 31231, 32778, 40819, 66009, 50038, 45377, 51073, -11775, -4944, -74065, -102213, -22719, -21654, -36437, -2504, 28316, -8351, -70005, -56961, -41532]
1341d1532r972l9513o1377O6351M1625K8379N3970m86k0030j0221j4162K1942
1329A4974q6025l8452K1306N2761l0626K2858Q583J3852J6812L3921j9574K8880
1317C9270n3297j1692K4428p5344L2399J5859m3577l7525P690P6270K131j9489
1305d2877M7449O1410k3913l0752m4678l1770K4600k6885N3477j891k4677m0695
1293h1202L0002Q3240k335l1696m345K0152n8349P3134M9020o9607M311L3634
1281D5959p777l9095J2371j8266L2271k2362Q372o3600P025l4167P456N9294m8130
1268f0649J1305k7603M262K4512O224L7972q32j3108m7668J2550L9273m7423O3151
1255A966n459J4091l435j7035q1139P21O6913j7861n2847L260K1074L6766k330
$$ y = [-41532, -51504, -91017, -152394, -86043, -44418, -16039, 37931, 37445, 17415, 7194, -6968, 14974, -71051, -109503, -88197, -35436, -66062, -43204, -34621, -20769, -3957, 29964, 10390, 39270, -14027, -25719, -1291, -76635, -44236, -28377, -71954, -109479, -101789, -25519, -23388, -42877, 4572, 65982, 42069, 11317, -33361, -65131, -40531, -67416, -13939, -15830, -40507, -81202, -51200, 32040, 29705, -1991, -6336, 13816, -44533, 28601, 77621, 8014, 12325, 45959, 38182, -913, 11458, -6808, 25463, 3101, 11473, -52127, -45102, -79269, -71813, -12519, -60649, -49344, -76947, -72685, -48173, -41949, -3977, -4809, -17917, -65585, -53035, -13762, -61185, 1966, -3493, 10598, 7163, -9872, -91011, -90290, -23377, -41238, -94085, -90825, -69751, -32985, -35315]
1242c5315K4961J6105k2832O1976o742r992k5415J1173q1937M8248P7503l1238
1230B6495K9193l3342O697L4571m7510j8253j4734N06J4080n3216l3943R8321
1218H865J0866j1244K1702K5857j6970N669J3143m5473J7165m5039K4363n9117
1206e0213k4338K0484J9956J2970k019n7367j7032L6808O2721J1430l2933K7768
1194H235k7425j1782L658K0842P268p774L372l5187J7605K2727j2780N1229K9219
1181F9207q517L1181o4028l9767n488l8714N8317J9506n0105J7253P369k4515
1169b8301L1233K2697n6057l4880L1075o423J4471J4623Q0588N535o7864l7182
1157c0485M4607J7419m2947O875J9881n094n5878r29K834l0516j7859R5694n921
$$ y = [-35315, -10354, 5751, -17081, 44895, 38153, 28161, 2746, 13919, -68018, -19770, 57733, 26495, 55688, 22346, 29043, 63614, 16104, -2149, -16883, -16377, -2297, -55513, -89456, 8865, 19731, 8487, 30189, 56046, 39076, 44745, 57888, 12415, 29580, -15459, 8904, -50213, -74551, -54067, -34111, -21141, -23160, -80527, -97559, -60751, 1970, 13400, -19533, 8235, -19190, -30972, -27314, -6472, 796, -6978, -3606, -38793, -21188, 1539, -11241, 39988, 69207, 60690, 91871, 27843, -11924, -17412, -56126, 2191, 21697, -28408, -11155, -3786, -28301, 2932, 25629, -30428, -65308, -34233, -40656, -26185, -11562, 69026, 74561, 6697, -30485, 14122, 31541, -11406, -4531, 15350, 10256, -45622, -46551, -43717, -74233, -92092, 3602, -2319]
1144b319l3185j4793k3432K1804K8238N4814P811Q474K6699R431n4063O117L7263
1131G2859m6037L9968K3662l1686p535l5285m042p312n7300K7330O9710p6646
1119c2314N9670k0432n1646J4784p0015Q0129P0184l8089L5949o954m84m7178
1107f396K9537K5463n3888l283L48l6296L2768m572k6428J1565K3015l8097l8889
1094h5153P7600J0787R468k0615j1428J3561N3163J8717k5134L9753o0838p8992
1082e9111M0015N0866J872j6770k5377j1727J2126M693K2289L8681n6084K4701
1070B6174J4499k980J4646M1929k2398l3502q824p4770l3885K9511M7581p926
1058i945L29l9444L0109M724R914J166q9405M1344O6519m4638l886l7097j5554
$$ y = [-2319, -35504, -50297, -73729, -51925, -23687, 31127, 38938, 47412, 74111, 83542, 29479, 35596, 72859, 26822, 66790, 90452, 58766, 51231, 15946, 11904, 4592, -52708, -25378, 44332, -32314, 27356, 6924, -44722, -29938, -99953, -19824, 50360, 12271, 48220, 41266, 40782, -6396, 23141, 48604, -5284, -8567, -8219, -44515, -11747, -16319, -42747, -31182, -8167, -46264, -85153, -7553, 3234, 12702, -7913, -19341, -5780, 47383, 66100, 40966, 80719, 19881, -59111, -19096, 31770, 33642, 16872, -8505, -20232, -8106, -3413, 18876, 57557, 1473, 26174, 40673, 37693, 52339, 94268, 71870, 38368, 29544, -45226, -79111, -49600, -2019, -9945, -9616, -49060, -18951, -14227, -4313, -3147, -92552, -51208, 15311, -29327, -33213, -70310, -85864]
1045h5864L5205O7862J3227k1494J4798m4605o839K2727k9768L340M4592L7489
1033E0670P461n5002l4792k364k3419L6922J8379K2232j4919M5394o235m88j8521
1020B5318J8563o1762L2490j434J5306p459p693k6860l3333M714L4026N1099k0494
1007B2481O0081Q349j4856l6755n16l7348k1945k2647M1303L7502l1739l9611
995c5701j4202r756K7056n7171L0066O4963m2835k9738O2797M0666j4727r402
983A2016N7323l2266r0201M608k9203N9474R1948k4662q4952n2888R435O3084
971a6284K3321p2920K1103N8267M1629l9169o3958M1643J9044j4799n1076M2993
959a0206j08391M3902M7031m0028M2063J9932N1841l7426L7019K8146q238J6459
$$ y = [-85864, -50659, 17203, 30430, 8936, 23734, -20871, -27710, -4983, -34751, -31411, 13181, 50670, 58131, 3129, -31663, -34027, -57446, -20524, -2145, 20087, 5168, 50562, 44327, 43839, 25318, 43881, -17881, 14609, 13175, 28481, 21022, 13329, -13531, -46864, -42150, -8124, 42975, 22481, 82562, 90911, 76055, 39300, 38784, 1436, -20509, -43156, -1853, 35649, 3910, -35701, -49903, -59659, -32603, -89774, -59708, 5255, -37580, -67318, -4521, 36145, 21418, 12016, 69339, 37073, -53128, -48520, -77723, -18249, 73699, 49037, -35915, -88803, -79368, -16284, 7037, -65883, -44780, 13487, 55116, 15947, -48011, -6368, 12676, -2123, -53199, -10206, -118597, -74695, -27664, -67692, -25629, -5697, 46144, 8718, 45737, 73883, 65645, 82104]
947H2104k566n8507m4300P4070R830k6957J0612J2037j4308k9497J8539k7414
935C643j5932m9395M9453N9663K114j3722o4272r835j5402M9135M3429j3395J1713
922C7197j1549K7873k7017J7816p7276M6532J9155K783l4001Q853K6019l9110
910b725q343M0377J0137J2765o9640k3984N7246L3665m5334n1523k8468M5601
898c0226M0248L6898l9534j8781K1630J1282M0393n8965l7730L8616k2097k8075
886d6341m1768L5567R9860r8797O563n123M1038K4777k6929K517J6440o543q55
873D06k4626K903l2787J0505l431O0347l3180j846J2595O520k7131J2822J3989
860b914M6674k9036l0211Q533M5903J8082j2991m9223M5815m7580j8721L9103
$$ y = [82104, 79538, 21031, -23269, 50801, 60631, 33674, 44286, 56323, 42015, 12518, 31057, 3643, -12289, -61684, -12231, 47432, 49546, 35824, -28448, -38283, -53685, -4550, 38879, 25484, 37197, 25648, 53521, 26504, 44320, -32956, 13576, 32731, 35514, 1513, 10366, 36385, -2725, -11068, 29309, 39446, 52211, -17429, -41413, 15833, 49498, 4164, -47359, -75827, -30226, 10022, 46920, 7386, -11395, 10235, 21517, 61910, 2945, -34785, 3831, -18266, -46341, -88109, -52542, 47318, -51479, -44916, -50039, -9001, 15776, -11153, -8636, 7804, 1261, 406, -24220, -21317, -54104, -43599, -47030, 13317, -19863, -21709, -9114, -2594, -29725, -16903, -2914, 43760, 14724, -15487, -6954, 38949, 57031, 44040, -5183, 40632, -6948, -25669, 13434]
848A3434j1658n706j2914j8484j0331M1565Q28K0666l4931J0275J2589M1174l4727
835A1780n3939j2897Q1454j140m8548L7423J7089k9462N8710n4793j7244L2877
823B1310l0663K0990K7124k3435p7390j9706O9746L4088j4655q601n518r357J2723
810c344J0779J573K7263m4086J2049N453q070n42q5492j2411J04098N1285o0270
797a715j9308O0562k3666L2141M4506m0745p2333j6286K7034J0644J5311J8406
785C4551o3641p4034r385M8053L2039r5L5923K9437l5477k9646K1247N9058J8761
772F6791K3704k6459l1701N4912o0792k6578j4959J2645L0925L8796l272L299
760F7311P884m4147k3219J9190K7396j4255m8416L7221n281J7484P1276j9865
$$ y = [13434, 1776, -3930, -16844, -35328, -45659, -4094, -3266, 17400, -17531, -7256, 5333, 46507, 11780, -42159, -55056, 26398, 25258, -23290, 14133, 31222, 1760, 60470, 5677, -11567, 21310, -9353, 11637, 38761, 15326, -62064, -81770, -12024, 22064, 7409, -1192, -6710, -16067, -3344, 7435, 9008, 36271, -7815, 4234, 9687, 1617, 1075, -84417, -96828, 7270, 58555, -1715, -21023, 39539, 15873, 48014, 92520, 51775, -20558, -36844, -9810, 834, 16145, 34551, -29090, -103124, -112509, -64456, -32417, -32512, 3411, 32848, -2629, -32275, -11028, 48030, 66791, 90495, 64036, 32335, 87247, 26455, -123, -15082, -2437, 28488, 67284, 64012, 67311, 75195, 31048, 7829, 27019, 54415, 40160, -8256, 28965, 23684, 41168, 112444, 92579]
748I2579k4133J7768k9575p943M196J5444k6626o0242n6757n683K0535N3453O768
735b16o400M8627l4654q745M7838k3404j4663K9004L498o9317p1537N6994P7818
722C4843k4650N7997k0549k0203j2826j1172N700j3286K1264m1476j7922L7375
710d905j1792L5109J9444m6185m5389M3280N4144m1899R147O409j6935J422R380
697A1230j7783J1160L0747l1465j3756L5525L4468n1584N910m4835L809N1376
685B4802j4796m5740O0610K8962r5720N0363K5550j660j5427m4768p5634M5409
673e8049J1233K1932N5378N505k2282J8239K991k8557p905J881J103K8205K6608
660E6282m4762l9726N4606k4767R218K6225L2881k7542J2178m1405K8785r216
$$ y = [92579, 68446, 86214, 56639, 48696, 52892, 68336, 41710, -18532, -75289, -80972, -60437, -6984, -216, -6616, 42011, 7357, -1388, 46450, 23046, 8383, 37387, 40885, -28432, -99969, -42975, 34843, 10193, 68190, 47641, 27438, 14612, 3440, 9140, -4146, 17118, -24358, -42280, -4905, -16697, 18412, 37856, -8329, -53718, -10438, 43706, 1807, 10954, 17363, 428, 1850, 11230, -6553, 4607, 35354, 3889, -9867, 25658, 60126, 8542, 14452, -30383, -26574, 24802, 10006, -35734, 24876, 53838, -41882, 8481, 34031, 32371, 16944, -27824, -103458, -58049, -46816, -24884, 30494, 35999, 13717, 31956, 34947, 6390, -1515, 366, 1469, 29674, 56282, 11520, -28206, 26400, 1633, 10851, 37076, 69957, 42415, 54593, 13188, 41973, 32757]
648C2757M1549N0786j03725n0242Q4408k9672n7078k8825N9739P7717j1003l3423
636C2988j9988O3787k7042m4551J0945J284j2872m1814L5443O9746M0549n6776
624E1699m1087P897M5209M0563P291m0184o3275L6876K7669o190l7738m400j058
611B3272L5642m5859m7816k5671j0703L2648K6595M1206r000J3870j0329m2601
599a8746L1499j2759M1187n0906n8967q885K3904J0209L3791P222k6172J8677
587i946N7692k0968r393L035J798k6631j7694K4691J717k8420N444L4059q90l8781
573b4287j8892q356L1302M4383K8221k6792j6881K0180L6894J6139l7736k5571
561A8604m5876l0012K4825L0029N5376o0153k2992N9687M928m1901k734J270J1282
$$ y = [32757, 74306, 125092, 21367, -28875, 55533, 25861, -31217, -60042, -303, 77414, 66411, 32988, 13000, 76787, 49745, 5194, 16139, 17423, 4551, -37263, -1820, 67926, 108475, 51699, 10612, 18509, 63718, 104281, 111572, 71388, 8113, 44989, 72658, 66468, 28730, 24330, 23272, 58914, 13055, -34761, -60432, -71135, -38487, -11892, 29314, 20314, 34184, 23855, -18746, 12753, -6, 41181, -9725, -68692, -77577, -53673, -43464, -9673, -2451, -28623, -9946, 47746, 26778, 17385, 20420, 22218, -4413, -22107, 2584, 4301, -24119, -18675, 15384, 14494, -24287, -43179, -51535, -20233, 24150, 52371, 25579, 8698, 28878, 65772, 81911, 44175, 18604, -27272, -57284, -32459, -2430, 52946, -7207, -30199, 29488, 34416, -7485, -10219, -8949, 2333]
548B333L0048L0674L8145q3250k9425M9818O770L810o8070l9709Q7564K2881L2666
535H4255J4496p8195J6664K4439K5006k9686J84j8765n0967M2295K4001o6014
523a2287L5458j7771k4183M8789k869j4681J4597l250L821K4533M9091l1661o7281
510B306O1764p257k8331m3681l8864N0232J0493j0750L7242J683k6421m9018M4390
497C788L4722k0763K129j3366m7528N0871k9613J1028m6912J5941O6750j6410
485A0637l4279L0649k8465m6143J2581J1900N9293J6898l8978O3844L8305J4958
473A11200l4270n7953k920L4339m9916l5059k0702M3133o901J5614K9515J2392
461C8472J1564l5782k7911O9267J3691o9936j8720N11j4452O4654J7209m8030
$$ y = [2333, 32381, 63055, 101200, 17950, -11475, 38343, 45113, 48923, -19147, -58856, 28708, 51589, 84255, 98751, 20556, 37220, 61659, 86665, 56979, 57163, 38398, -12569, 29726, 53727, -12287, 23171, 5400, -18783, 30006, 27137, 12456, 27053, 23803, 27624, 52157, 101248, 69587, 2306, 64070, 56813, 28482, -15199, -54063, -3831, 6662, -4088, 33154, 34837, 8416, -40602, 3788, 38510, 17747, 19876, 6510, -41018, 9853, -19760, -8732, -55644, -39703, 27047, 10637, -23642, 7007, -21458, -67601, -55020, -43120, 16173, 33071, -5907, 57937, 96242, 111200, 76930, 18977, 16057, 50396, 480, -34579, -55281, -12148, -19049, -3435, 26080, 38472, 50036, 14254, -13657, 55610, 69301, -635, -19355, -18844, -33296, 31358, 48567, 537]
449E37L3847k9899O3043l584r0070l519N5626J0181j7180M563L2034L834L971
436F3384j5859j3309Q195l8714j5734J3091L2667L4262j4279K8338m2770P269
424D6541M69J5230o147l1023n2498O635P4157J4787M1342M3589p5300l7741o4253
411b4212O6884N1248r0090m1306K726M6712n3J0978O4057J8259Q195m6802o2349
398D247r601N3259L306l7643j6876M7363k4911R476N273J101K1443m9459j1424
385d446j0857O1093l7979J9123L3811j6899j257j9533K1346j5932M4712l9215
373C3967l940M6560L3969k9720m2536j3438o1596N8784N44J2559k7613q452l3784
$$ y = [537, 34384, 4485, 67528, 63944, -26126, -29645, 25981, 36162, 18982, 23545, 55579, 59413, 63384, 47525, 34216, 42411, 3697, -12037, 1054, 33721, 67983, 53704, 82042, 39272, 46541, 47010, 62240, 56093, 25070, -27428, -20793, 53364, 68151, 109493, 153082, 77782, 40041, -24212, 42672, 93920, 3830, -37476, -34750, 11962, 11909, 22887, 86944, 105203, 113398, 66596, 4247, -5354, 47905, 51211, 13568, -3308, 44055, 19144, 28620, 33893, 34994, 56437, 6978, -4446, -15303, 45790, 7811, 26934, 60745, 43846, 42589, 23056, 44402, 28470, 73182, 33967, 30027, 76587, 110556, 80836, 38300, 24862, -36734, 22050, 22594, 35153, 7540, -912, -34696]
$$ [...]
##END NTUPLES=NMR SPECTRUM
##END=
