##TITLE=1H_EC-3384oc
 200.13Hz, DMSO-d6.
 8 sc
 30.6.2026
##JCAMPDX= 6.0         $$ Bruker NMR JCAMP-DX V2.0
##DATA TYPE= NMR SPECTRUM
##DATA CLASS= NTUPLES
##ORIGIN= UXNMR, Bruker Analytische Messtechnik GmbH
##OWNER= pz
$$ XWIN-NMR		Version 3.5
$$ Tue Jun 30 13:22:04 2026 Russian Standard Time (UT+4h)  she@DPX200
##.OBSERVE FREQUENCY= 200.1313
##.OBSERVE NUCLEUS= ^1H
##.ACQUISITION MODE= SIMULTANEOUS
##.ACQUISITION SCHEME= undefined
##.AVERAGES= 8
##.DIGITISER RES= 18
##SPECTROMETER/DATA SYSTEM= spect
##.PULSE SEQUENCE= zg30
##.SOLVENT NAME= DMSO
##.SHIFT REFERENCE= (INTERNAL, DMSO, 0, 15.499)
##AUDIT TRAIL= $$ (NUMBER, WHEN, WHO, WHERE, WHAT)
$$ ##TITLE= Audit trail, XWIN-NMR		Version 3.5
$$ ##JCAMPDX= 5.01
$$ ##ORIGIN= Bruker BioSpin GmbH
$$ ##OWNER= she
$$ F:/spectra/data/she/nmr/H-C/1/pdata/1/auditp.txt
$$ ##AUDIT TRAIL=  $$ (NUMBER, WHEN, WHO, WHERE, WHAT)
(   1,<2026-06-30 13:20:48.48 +0400>,<she>,<DPX200>,
      <created by zg, POWCHK disabled, PULCHK disabled
       configuration hash MD5:
       00 E9 B6 7A A2 85 ED C7 34 08 36 98 17 FE 4E 26
       data hash MD5: 16K
       6E D0 82 F3 A2 DF 69 29 C7 CE 86 57 C2 0F EE 68>)
(   2,<2026-06-30 13:20:50.95 +0400>,<she>,<DPX200>,
      <Start of raw data processing
       efp BC_mod = 2 LB = 0.25 FT_mod = 6 PKNL = 1 PHC0 = -4379.426 PHC1 = 12.1923 SI = 16K 
       data hash MD5: 16K
       37 37 A8 ED C7 36 CA 18 C8 28 F0 3E E5 31 F6 EE>)
(   3,<2026-06-30 13:21:10.73 +0400>,<she>,<DPX200>,
      <pk PHC0 = -1.501459 PHC1 = 0 
       data hash MD5: 16K
       04 DB 3A F6 D8 20 A0 91 82 CE 28 AA 3C 05 88 8A>)
(   4,<2026-06-30 13:21:14.62 +0400>,<she>,<DPX200>,
      <abs ABSG = 5 
       data hash MD5: 16K
       B8 4E 51 8F A4 B5 F6 C3 F6 37 A1 84 25 3F FF BF>)
$$ ##END=
$$ 
$$ hash MD5
$$ E7 F6 EF FA EE 9B 8F E1 11 51 44 B0 C7 51 DF 4D
##$RELAX= 
##$RELAX= 
##$RELAX= 
##$RELAX= 
##$RELAX= 
##$RELAX= 
$$ Bruker specific parameters
$$ --------------------------
##$DU= <F:/spectra>
##$EXPNO= 1
##$NAME= <H-C>
##$PROCNO= 1
##$TYPE= <nmr>
##$USER= <she>
##$AMP= (0..31)
100 100 100 100 100 100 100 100 100 100 100 100 100 100 100 100 100 100 
100 100 100 100 100 100 100 100 100 100 100 100 100 100 
##$AQSEQ= 0
##$AQ_mod= 1
##$AUNM= <au_zg>
##$AUTOPOS= <>
##$BF1= 200.13
##$BF2= 200.13
##$BF3= 200.13
##$BF4= 200.13
##$BF5= 200.13
##$BF6= 200.13
##$BF7= 200.13
##$BF8= 200.13
##$BYTORDA= 1
##$CFDGTYP= 0
##$CFRGTYP= 5
##$CHEMSTR= <none>
##$CNST= (0..31)
1 1 145 1 1 1 1 1 1 1 1 1 1 1 1 1 1 1 1 1 1 1 1 1 1 1 1 1 1 1 1 1 
##$CPDPRG= <>
##$CPDPRG1= <>
##$CPDPRG2= <>
##$CPDPRG3= <>
##$CPDPRG4= <mlev>
##$CPDPRG5= <mlev>
##$CPDPRG6= <mlev>
##$CPDPRG7= <mlev>
##$CPDPRG8= <mlev>
##$CPDPRGB= <>
##$CPDPRGT= <>
##$D= (0..31)
0 0.7 0 0 0 0 0 0 0 0 0 0.03 0 0 0 0 0 0 0 0 0 0 0 0 0 0 0 0 0 0 0 0 
##$DATE= 1782811247
##$DBL= (0..7)
120 120 120 120 120 120 120 120 
##$DBP= (0..7)
150 150 150 150 150 150 150 150 
##$DBP07= 0
##$DBPNAM0= <>
##$DBPNAM1= <>
##$DBPNAM2= <>
##$DBPNAM3= <>
##$DBPNAM4= <>
##$DBPNAM5= <>
$$ [...]
##$SUBNAM3= <"">
##$SUBNAM4= <"">
##$SUBNAM5= <"">
##$SUBNAM6= <"">
##$SUBNAM7= <"">
##$SUBNAM8= <"">
##$SUBNAM9= <"">
##$SW= 18.0517328524113
##$SWIBOX= (0..15)
0 0 2 0 0 0 0 0 0 0 0 0 0 0 0 0 
##$SW_h= 3612.71676300578
##$TD= 16384
##$TD0= 1
##$TE= 0
##$TE2= 300
##$TE3= 300
##$TEG= 300
##$TL= (0..7)
0 120 120 120 120 120 120 120 
##$TP= (0..7)
150 150 150 150 150 150 150 150 
##$TP07= 0
##$TPNAME0= <>
##$TPNAME1= <>
##$TPNAME2= <>
##$TPNAME3= <>
##$TPNAME4= <>
##$TPNAME5= <>
##$TPNAME6= <>
##$TPNAME7= <>
##$TPOAL= (0..7)
0.5 0.5 0.5 0.5 0.5 0.5 0.5 0.5 
##$TPOFFS= (0..7)
0 0 0 0 0 0 0 0 
##$TUNHIN= 0
##$TUNHOUT= 0
##$TUNXOUT= 0
##$USERA1= <user>
##$USERA2= <user>
##$USERA3= <user>
##$USERA4= <user>
##$USERA5= <user>
##$V9= 5
##$VALIST= <valist>
##$VCLIST= <CCCCCCCCCCCCCCC>
##$VD= 0
##$VDLIST= <DDDDDDDDDDDDDDD>
##$VPLIST= <PPPPPPPPPPPPPPP>
##$VTLIST= <TTTTTTTTTTTTTTT>
##$WBST= 1024
##$WBSW= 4
##$XGAIN= (0..3)
0 0 0 0 
##$XL= 0
##$YL= 0
##$YMAX_a= 140247
##$YMIN_a= -181592
##$ZGOPTNS= <>
##$ZL1= 120
##$ZL2= 120
##$ZL3= 120
##$ZL4= 120
##$ABSF1= 15.48797
##$ABSF2= -2.563879
##$ABSG= 5
##$ABSL= 3
##$ALPHA= 0
##$AQORDER= 0
##$ASSFAC= 0
##$ASSFACI= 0
##$ASSFACX= 0
##$ASSWID= 0
##$AUNMP= <proc_1d>
##$AZFE= 0.1
##$AZFW= 0.1
##$BCFW= 0
##$BC_mod= 2
##$BYTORDP= 0
##$COROFFS= 0
##$CY= -3
##$DATMOD= 1
##$DC= 0
##$DFILT= <>
##$DTYPP= 0
##$F1P= 0
##$F2P= 0
##$FCOR= 1
##$FTSIZE= 16384
##$FT_mod= 6
##$GAMMA= 0
##$GB= 0
##$INTBC= 1
##$INTSCL= 3.241238e-09
##$ISEN= 128
##$LB= 0.25
##$LEV0= 0
##$LPBIN= 0
##$MAXI= 10000
##$MC2= 0
##$MEAN= 0
##$ME_mod= 0
##$MI= 1.114404
##$NCOEF= 0
##$NC_proc= -6
##$NLEV= 6
##$NOISF1= 3.799351
##$NOISF2= 2.8
##$NSP= 0
##$NTH_PI= 0
##$NZP= 0
##$OFFSET= 15.49899
##$PC= 1
##$PHC0= -4380.927
##$PHC1= 12.1923
##$PH_mod= 1
##$PKNL= yes
##$PPARMOD= 0
##$PSCAL= 0
##$PSIGN= 0
##$REVERSE= no
##$SF= 200.130004547207
##$SI= 16384
##$SIGF1= 3
##$SIGF2= 2
##$SINO= 0.751879
##$SIOLD= 32768
##$SREGLST= <19F.Aceton>
##$SSB= 0
##$STSI= 16384
##$STSR= 0
##$SW_p= 3612.71676300578
##$SYMM= 0
##$S_DEV= 0
##$TDeff= 16384
##$TDoff= 0
##$TI= <>
##$TILT= no
##$TM1= 0
##$TM2= 0
##$TOPLEV= 0
##$USERP1= <user>
##$USERP2= <user>
##$USERP3= <user>
##$USERP4= <user>
##$USERP5= <user>
##$WDW= 1
##$XDIM= 16384
##$YMAX_p= 335373506
##$YMIN_p= -288185
$$ End of Bruker specific parameters
$$ ---------------------------------
##NTUPLES= NMR SPECTRUM
##VAR_NAME=  FREQUENCY,     SPECTRUM/REAL,   SPECTRUM/IMAG
##SYMBOL=    X,             R,               I
##VAR_TYPE=  INDEPENDENT,   DEPENDENT,       DEPENDENT
##VAR_FORM=  AFFN,          ASDF,            ASDF
##VAR_DIM=   16384,         16384,           16384
##UNITS=     HZ,            ARBITRARY UNITS, ARBITRARY UNITS
##FACTOR=    0.220516191357247, 1,           1
##FIRST=     3101.81295096456, 0,            0
##LAST=      -510.903812041222, 0,           0
##MIN=       -510.903812041222, -288185,     0
##MAX=       3101.81295096456, 335373506,    0
$$ Real data points
##PAGE= N=1
##DATA TABLE= (X++(R..R)), XYDATA
$$ [...]
8640d0780L4993m1757q481M3988m0612n3483K7050J18403O3363L588n2909m9102
$$ -40780 -5787 -47544 -56025 -12037 -52649 -106132 -79082 39321 102684 106272 53363 4261
8628D261p8738N94N3036K6349k0118o7296Q7234N6011M234o8731q4797R0463l459
$$ 4261 -74477 -73883 -20847 5502 -14616 -81912 5322 61333 65567 -3164 -87961 2502 -957
8615i57l2491O928Q2q7483O6153J8473q061j6392J0103m7921L5523J21060m3000
$$ -957 -33448 -26520 -26438 -113921 -47768 -29295 -37356 -53748 -43645 -91566 -56043 65017 22017
8602B2017p8676Q7764k2161o796O0107l5584m5317l0540m4255M030J10973l2929
$$ 22017 -56659 31105 8944 2148 62255 26671 -18646 -49186 -93441 -89411 21562 -11367
8590a1367p9781M6067Q7822n6144o527N5190m7437J0470N4443l4912j03361j9071
$$ -11367 -91148 -45081 42741 -13403 -19930 35260 -12177 -1707 52736 17824 -85537 -104608
8578a04608o6900k2516R3206j279L220J9002J39199j2196o1203k6168J4643J2699
$$ -104608 -171508 -194024 -100818 -102097 -98877 -79875 59324 47128 -14075 -40243 -25600 -12901
8566a2901m7327O0786L992L693N5099j6990k2248O0603k0213k8176j7155m8307
$$ -12901 -60228 558 4550 8243 63342 46352 24104 84707 64494 36318 19163 -29144
8554b9144l3914N0996M2172m8753N1607k6114o9215m294N2347N931m4204M6634
$$ -29144 -63058 -12062 30110 -18643 32964 6850 -62365 -66659 -14312 -8381 -52585 -5951
8542e951l32l9073J20656J8382j16081k046P2381r9177L1512m4587o2434J14583
$$ -5951 -6283 -45356 75300 93682 -22399 -24445 47936 -51241 -19729 -64316 -126750 -12167
8530a2167Q4320j06692P2452J18257r1097r6003O9084n9709J0255M7605q9311
$$ -12167 72153 -34539 37913 156170 65073 -30930 38154 -21555 -11300 36305 -53006
8519e3006M4527N2673L7805j71715J45736K1486j03101R7121L1305j47010K0447
$$ -53006 -8479 44194 81999 -89716 56020 77506 -25595 71526 102831 -44179 -23732
8508b3732Q6442k4584n2467j3812l9509O787Q0627J5626j20718O9531N5605j52204
$$ -23732 62710 38126 -14341 -28153 -67662 -60875 19752 35378 -85340 -15809 39796 -112408
8496a12408K9575M4869j3590l4856Q1302j4291j2544R6638k3165o7525Q4010r999
$$ -112408 -82833 -37964 -51554 -86410 -5108 -19399 -31943 64695 41530 -25995 58015 48016
8484D8016o5865L1652l3104l8870j1329N7488m9335j3329O6100Q979L537J19070
$$ 48016 -17849 13803 -19301 -58171 -69500 -12012 -61347 -74676 -8576 403 3940 123010
8472A23010p3742j03963J43292j2935l4635O9013j00912r8964R3618R0251n6294
$$ 123010 49268 -54695 88597 75662 41027 110040 9128 -89836 3782 94033 37739
8461C7739p3499M9579o2850k4374Q0397J0667m8239N8423m4757l689J28566k4194
$$ 37739 -35760 13819 -49031 -73405 6992 17659 -30580 27843 -16914 -20603 107963 83769
8449H3769j06710o7767N3212r677o1487O5535q3430m2212J10297Q3085o6005Q283
$$ 83769 -22941 -90708 -37496 -47173 -108660 -43125 -126555 -168767 -58470 24615 -41390 -33107
8437c3107M7647q8412L0881R0024n3689p6646R893P2041q204N3174p1144l3385
$$ -33107 14540 -73872 -42991 47033 -6656 -83302 -73409 -1368 -9572 43602 -27542 -60927
8425f0927Q5618M5712Q53j5319k5777p8093n5105R9892L5449n250k5491j41492
$$ -60927 24691 70403 71256 55937 30160 -47933 -103038 -3146 32303 27053 1562 -139930
8413a39930K7053J10625N9391K554l9115j10203p6179N3745P9539J6061p6168
$$ -139930 -112877 -2252 57139 59693 20578 -89625 -165804 -112059 -32520 -16459 -92627
8402i2627j351M9963L9831O1543q0621n4215k558M2486M2453L8584p5866j920
$$ -92627 -93978 -44015 -4184 57359 -23262 -77477 -80035 -37549 4904 43488 -32378 -34298
8390c4298q3134J7451J44226m7920o0731m327L7077J51417m523n2507j11923p6798
$$ -34298 -117432 -99981 44245 -3675 -64406 -68733 -31656 119761 115238 62731 -49192 -125990
8378a25990P2408L4505j3136k354j14437J0301J24299K9616j6228n9593q0595
$$ -125990 -53582 -19077 -32213 -34567 -149004 -138703 -14404 15212 -1016 -60609 -141204
8367a41204O1160J88424M2238j51434m6170M1448k3141Q0956o0652j00307L5415
$$ -141204 -80044 108380 150618 -816 -46986 -5538 -28679 52277 -8375 -108682 -73267
8356g3267r020K9611O7890P7993p9006j11112K1981J36058n920J8900q1400j80580
$$ -73267 -82287 -52676 15214 93207 14201 -96911 -74930 61128 55208 74108 -7292 -187872
8344a87872N6053J35694L184m5041o8810l7377R8855J45581j5110j58930m1911
$$ -187872 -131819 3875 7059 -37982 -106792 -144169 -45314 100267 85157 -73773 -115684
8333a15684q8768J38434J48386l859j64281n7131M1000N4959M1779l6227j04351
$$ -115684 -204452 -66018 82368 78509 -85772 -142903 -101903 -46944 -5165 -41392 -145743
8322a45743l5182J59618R0622K0032j3965j87572o9981J17960J44817k0034p6471
$$ -145743 -180925 -21307 69315 89347 75382 -112190 -182171 -64211 80606 60572 -15899
8311a5899q3783l5851J04200K21514o8126k02972Q746N4002P6181J16849j57042
$$ -15899 -99682 -135533 -31333 190181 122055 -80917 -72171 -18169 58012 174861 17819
8300A7819k60615J15258J18841N9345P3914n1144j98049M156J20222O4712l1844
$$ 17819 -242796 -127538 -8697 50648 124562 73418 -124631 -120475 -253 64459 32615
8289C2615m3066j22531m9397K42099L6221r1749o088l4461k6574R9623P5259j13282
$$ 32615 -10451 -132982 -182379 59720 95941 4192 -1896 -36357 -62931 36692 111951 -1331
8277a331p2005O116L5067R8976K4588j75507j07967J20131J03035r150M2137n7732
$$ -1331 -73336 -67220 -32153 66823 91411 -84096 -192063 -71932 31103 21953 64090 6358
8265F358k16182J52381J91574m2189j669p1473j16234O3193J57072j12418j40321
$$ 6358 -209824 -57443 134131 91942 90273 18800 -97434 -34241 122831 10413 -129908
8254a29908J2949M383K3003K19151q0729k47522O0422J03082Q5561M0836n632
$$ -129908 -116959 -112576 -89573 129578 48849 -198673 -138251 -35169 50392 91228 85596
8243H5596j73995J1138J53869j9546O731K0343k37124l4634K00339N7578o4912
$$ 85596 -88399 -77261 76608 57062 63793 84136 -152988 -187622 12717 70295 5383
8232E383m4729q5880l2851J83520Q6725j44572j99478R042J29206J79662O0642
$$ 5383 -39346 -125226 -158077 25443 112168 -32404 -231882 -222840 -93634 86028 146670
8221A46670j24305j67476L2236J81575M5854O526l7320j87861K0449J91358m1081
$$ 146670 22365 -145111 -112875 68700 114554 121080 83760 -104101 -83652 107706 66625
8210F6625j17134K5409n2746j00396K20609O3639j03493p2758O0016M1509P3424
$$ 66625 -50509 -25100 -77846 -178242 42367 106006 2513 -70245 -10229 31280 104704
8199A04704J08222k99299k01812J49284J8987N6549m9914j36338J08937R7476
$$ 104704 212926 -86373 -288185 -138901 -119914 -63365 -113279 -249617 -140680 -43204
8189d3204J21658j0189Q422j18684j12898J73591K27349j10164j21701r003o1404
$$ -43204 78454 68265 76687 -41997 -154895 18696 246045 135881 14180 5177 -56227
8178e6227P1917J31045j9401r5817j18658o3954J38105J81815r0361j75812m4014
$$ -56227 15690 146735 127334 31517 -87141 -151095 -12990 168825 78464 -97348 -141362
8167a41362L3407N6574N7212m4186j33644N9166J01557P8431K4523j31056o8564
$$ -141362 -107955 -51381 5831 -38355 -171999 -112833 -11276 67155 91678 -39378 -107942
8156a07942K3987J05467P1231n475j09130j54931N3058R2148O0797K8938j45113
$$ -107942 -83955 21512 92743 87268 -21862 -176793 -123735 -31587 29210 58148 -86965
8145h6965o7773J73348N9710j1863q461q9731n6228J19762O7088q5987Q01p6847
$$ -86965 -154738 18610 78320 66457 57996 -31735 -87963 31799 98887 12900 13701 -63146
8133f3146j33415J80580J57706r2999J8165o6062q1730R0025J03059p3711j63704
$$ -63146 -196561 -15981 141725 48726 66891 829 -80901 9124 112183 38472 -125232
8122a25232P6368l4723K3291R0247o7211m1312Q5721L2151M977M9395m3440j49656
$$ -125232 -48864 -83587 -60296 29951 -37260 -78572 7149 39300 44277 93672 50232 -99424
8110i9424J6760Q0031M357M7249n5810j06413O0783P2305O946J07228o8838q1457
$$ -99424 -82664 -2633 1724 48973 -6837 -113250 -52467 19838 26784 134012 65174 -16283
8098a6283p21O9172l3979k7627r1442n0986J11778R1969q2799R1628J6348j42616
$$ -16283 -17004 52168 18189 -9438 -100880 -151866 -40088 51881 -30918 60710 77058 -65558
8086f5558J12477J6211q9188j0420o9535m078J43940P1419j57624q0919R246m9969
$$ -65558 46919 63130 -26058 -36478 -106013 -110091 33849 105268 -52356 -133275 -124029 -173998
8074a73998J61490J08395n4941m9658o496k7332L1055M2669j12841p0015J01396
$$ -173998 -12508 95887 40946 -8712 -15208 -42540 -11485 31184 -81657 -151672 -50276
8063e0276k437m7230R2508k372j24851Q3405R7072J8421j5775l8275r4985M4219
$$ -50276 -52713 -99943 -7435 -9807 -134658 -51253 45819 64240 48465 10190 -84795 -40576
8051d0576P1407m3101r0494j7878q9501L8504J46475N9634m3927J4621n7183Q3585
$$ -40576 30831 -12270 -102764 -120642 -210143 -171639 -25164 34470 -9457 5164 -52019 31566
8039C1566P6250r1224p4195l2665L8614O4453M0284k5545j00655p9596R0721P9120
$$ 31566 107816 16592 -57603 -90268 -51654 12799 53083 27538 -73117 -152713 -61992 17128
8027A7128P0463K7071r0099m2938J3709K2091j8015q5333k7977O1770J03998L8537
$$ 17128 87591 114662 24563 -18375 -4666 17425 -590 -85923 -113900 -52130 51868 90405
8015I0405j7352r7561n8830k0680N4034P2492P8346j21771r5356L9260Q5272L0407
$$ 90405 73053 -24508 -83338 -104018 -49984 22508 100854 -20917 -116273 -77013 8259 38666
8003C8666L1698r9887j34716J65829R4291l9205j4549l0325j27192O6231J56990
$$ 38666 70364 -29523 -164239 1590 95881 56676 42127 11802 -115390 -49159 107831
7992A07831q0309q5096j3541m9372J17306R0831j90880L4238R0966n8549J8004
$$ 107831 27522 -57574 -71115 -120487 -3181 87650 -103230 -68992 21974 -36575 -18571
7981a8571R3902N263j39635l3536P9721j4912L3924N730j22340K6379P6223L1499
$$ -18571 75331 80594 -59041 -92577 -12856 -27768 6156 11886 -110454 -84075 -7852 23647
7969B3647L582o1554J122k5287N5880p899j2139n0881M337P4799M0959K6632r8105
$$ 23647 27229 -34325 -33203 -58490 -2610 -10509 -22648 -73529 -69192 5607 46566 73198 -24907
7956b4907m8702J06777R4314k2883m3863o6443j24627O2667J19469n4268k3991
$$ -24907 -73609 33168 127482 104599 60736 -5707 -130334 -67667 51802 -2466 -26457
7945b6457m0668m102J04439J14247m2159j07309l1734Q742P6967P809k952o0953
$$ -26457 -67125 -71227 33212 147459 105300 -2009 -33743 -25001 51966 59775 56823 -4130
7933d130r9282K5618R2487R7408o2193j20939P8895K0074l8863O9850m1978j03729
$$ -4130 -103412 -77794 14693 112101 49908 -71031 7864 27938 -10925 58925 16947 -86782
7921h6782N6058P5123J6793L6806o3520j04545K2965K2519k7795J11140l4760
$$ -86782 -30724 44399 61192 97998 34478 -70067 -47102 -24583 -52378 58762 24002
7910B4002q5741R2204J13945j23245O913q063r1560P7383J48769r4231q1394M5079
$$ 24002 -61739 30465 144410 21165 28078 20015 -71545 5838 154607 60376 -21018 24061
7898B4061n5361N3070J11030n9037q1678P6596l8536J8532J17022r5780j09646
$$ 24061 -31300 21770 132800 73763 -7915 68681 30145 48677 165699 69919 -39727
7887c9727J13164P7315n3749j5737n3784j30508L1017J42840l4176l4403p2541
$$ -39727 73437 150752 97003 81266 27482 -103026 -72009 70831 36655 2252 -70289
7876g0289l3205J17422J56755j6488r9544R331n4545J3539Q9712o3914l0241P3689
$$ -70289 -103494 13928 170683 154195 54651 63982 9437 22976 112688 48774 18533 92222
7864I2222r853o1615L001K2667q155n4995j1274J12518J6229j21595L775o351
$$ 92222 82369 20754 23755 46422 38267 -16728 -28002 84516 100745 -20850 -17075 -23426
7852b3426K6960J42290P021j13630L0537J05621m9063O9721J03213p1985j4639
$$ -23426 3534 145824 152845 39215 69752 175373 126310 196031 299244 227259 212620
7841B12620R6715j20239k6290J41194j75830j47346J40197j5222n0504Q0060l5508
$$ 212620 309335 189096 162806 304000 128170 -19176 121021 105799 55295 135355 99847
7830I9847j24541J31228k9539j06530N7128J0677o4207J31755J37431j70985O7903
$$ 99847 -24694 106534 76995 -29535 27593 38270 -25937 105818 243249 72264 140167
7819A40167N7885j96950J8414J66238N963k4169Q7186J1040k5985J01607k8826
$$ 140167 198052 1102 19516 185754 191717 167548 254734 265774 239789 341396 312570
7808C12570j61590Q6013M7504p8310J23831o4979j66784L5218k9926L772n4507
$$ 312570 150980 236993 284497 206187 330018 265039 98255 133473 103547 107319 52812
7797E2812L3906j3702j2977N4069o3638o0685O7030M0437j06314O6121J22658
$$ 52812 86718 73016 60039 114108 50470 -10215 56815 97252 -9062 57059 179717
7786A79717j72025k6738Q3431L7442j6872L5311L7450k886j6409j5243n9614l8797
$$ 179717 7692 -19046 64385 101827 84955 120266 157716 154830 138421 123178 63564 24767
7774B4767J16362n7481j9946M0793m6203l6449P7074q8051l5536P4901M9098j58077
$$ 24767 141129 83648 63702 104495 58292 21843 98917 10866 -24670 50231 99329 -58748
7762e8748L3174r28j13839R7367J28076o9126j9740J23039q6380n897J04740j24912
$$ -58748 -25574 -26502 -140341 -42974 85102 15976 -3764 119275 32895 26998 131738 6826
7750F826q6827J18424j2011r4128J50186K1071j29592K9255N2581o5238O3202
$$ 6826 -80001 38423 26412 -67716 82470 103541 -26051 3204 55785 -9453 53749
7739E3749k3370q2445J0497M5811m1600k6021J19032m2778j87N7146k8250r3843
$$ 53749 30379 -52066 -41569 4242 -37358 -63379 55653 12875 12688 69834 41584 -52259
7727e2259j546L3250J8787j8220J626p6534J4597L5016n784O8003O7022o713j01619
$$ -52259 -53805 -20555 -1768 -19988 -18362 -94896 -80299 -45283 -51067 16936 83958 77245 -24374
7714b4374n4011O5151P8413j8069j1193k1649l232M8700q839K7912O936o3473
$$ -24374 -78385 -13234 65179 47110 35917 14268 11036 59736 50897 78809 85745 22272
7702B2272l2980M7168p900o7237J2072J00251p8860M9672L1194j22967K1559N0051
$$ 22272 -10708 36460 28560 -38677 -26605 73646 -5214 44458 75652 -47315 -25756 24295
7690B4295j4973m8102K6711p9541L4184J15099K1084r4078k0244r6100k2342N2095
$$ 24295 9322 -38780 -12069 -91610 -57426 57673 78757 -15321 -35565 -131665 -154007 -101912
7678a01912Q0177l9561L9765M7047n3025K3946O3941J2844j28941L1014q993L4185
$$ -101912 -21735 -61296 -21531 25516 -27509 -3563 60378 73222 -55719 -24705 -33698 487
7666D87J7781j3213p6833R7412l6303k6949J17578J543q5980N3824M9530r2988
$$ 487 18268 5055 -71778 25634 -10669 -37618 79960 81503 -4477 49347 98877 5889
7654E889m0480N314l4207K6000L4325n2691n950M6698n4778K2421l7600J2335
$$ 5889 -34591 -29277 -63484 -37484 -3159 -55850 -61800 -15102 -69880 -47459 -85059 -72724
7642g2724L9330p9983O6225J3389K0540o1635K9301n5487m3940Q5049O4109j8591
$$ -72724 -33394 -113377 -47152 -33763 -13223 -74858 -45557 -101044 -144984 -59935 4174 -14417
7630a4417k174J106m2437J917M3682N3425L2456K1724j0253l627n390m9436o1146
$$ -14417 -16591 -15485 -57922 -56005 -12323 41102 73558 95282 85029 81402 76012 26576 -34570
7617c4570J6270o074Q7643K9072o9393K182n2743J0882l6632K7583n1645l9384
$$ -34570 -18300 -24374 63269 92341 22948 25130 -27613 -16731 -53363 -25780 -77425 -116809
7605a16809O8469M0685j0171Q0613n9594q3885P2014J13674L429r6120k3603n5575
$$ -116809 -48340 -7655 -17826 62787 3193 -80692 -8678 104996 108425 12305 -11298 -66873
7593f6873K1553O9531o60r0668n3648j3798J45516Q789r0191K9236j3575L3383
$$ -66873 -45320 24211 23551 -67117 -120765 -134563 10953 19742 -70449 -41213 -54788 -21405
7581b1405J41306n0033j28001l8982k9905l0068R2001L9839r5441p328k8116K5292
$$ -21405 119901 69868 -58133 -97115 -127020 -157088 -65087 -25248 -120689 -128017 -156133 -130841
7569a30841Q4039j0416j27969K201J18281K9502k539n0253k2299K2465N3133K6645
$$ -130841 -46802 -57218 -185187 -182986 -64705 -35203 -37742 -87995 -110294 -87829 -34696 -8051
7557h051m2268J6026J3433o6796J40773K9096r7467l2491k8993m4447Q4163J21376
$$ -8051 -50319 -34293 -20860 -87656 53117 82213 -15254 -47745 -76738 -121185 -37022 84354
7545H4354j28566j23140N5840O8394M8404J1775p0754n5833K5914J04806l4065
$$ 84354 -44212 -167352 -111512 -43118 5286 17061 -53693 -109526 -83612 21194 -12871
7534a2871j6967j7673n3456O6312M8469j1421l7272m7155l2780N7762P0878l420
$$ -12871 -29838 -47511 -100967 -34655 13814 2393 -34879 -82034 -114814 -57052 13826 10406
7522A0406n0361l1749n645J26275P4255p6629n4418m9478L3036J34042l5672n6339
$$ 10406 -39955 -71704 -77349 48926 123181 46552 -7866 -57344 -24308 109734 74062 17723
7510A7723q6515n8089P2382K8567K5203n0786M1023R388Q0415K9522p5174j26946
$$ 17723 -68792 -126881 -54499 -25932 -729 -51515 -10492 -1104 79311 108833 33659 -93287
7498i3287l8979J03052N3266K3204J8404j14238K510J12089m435m7003m7670o4675
$$ -93287 -132266 -29214 24052 47256 65660 -48578 -46068 66021 61586 14583 -33087 -97762
7486i7762J461J57531j3306q1499j5269k142l474Q0079L8921j10205p396L0930
$$ -97762 -96301 61230 47924 -33575 -48844 -50986 -54460 25619 64540 -45665 -53061 -22131
7474b2131J7058J00365n23j91492o2698P9010M5258Q384R3716j11251o5424J31722
$$ -22131 -5073 95292 94769 -96723 -159421 -80411 -35153 -26769 66947 -44304 -109728 21994
7462B1994m952J2986j0759j63462L371J72638J13704j45479K7674k8608j03773
$$ 21994 17042 30028 19269 -144193 -140822 31816 145520 41 27715 -893 -104666
7451a04666J01661N6731l5395n7333O3305k052O3850N1864j54800j19170J75413
$$ -104666 -3005 53726 18331 -39002 24303 22251 86101 137965 -16835 -136005 39408
7440C9408L9620L7746J39872Q0226j7528N2815J19478j4630j5969j16274j17837
$$ 39408 79028 116774 256646 336872 319344 372159 491637 477007 461038 344764 226927
7429B26927k5352P6615o604j73650o3565k0623O7212O6384k3250j08148n9321
$$ 226927 201575 278190 271586 97936 34371 13748 80960 147344 124094 15946 -43375
7418d3375L9368K5775J852K805r5252k6814Q7626J10260P757k1013l5140m6541
$$ -43375 -4007 21768 23620 26425 -68827 -95641 -8015 102245 110002 88989 53849 7308
7406G308j2099J15779n3813j32387O277L5165l9000R3989n3106j42373J18299
$$ 7308 -4791 110988 57175 -75212 -68935 -33770 -72770 21219 -31887 -174260 -55961
7395e5961J15924o2069j8729Q6292j62479m795J75980N2594j32570j3590n4171
$$ -55961 59963 -2106 -20835 65457 -97022 -101817 74163 126757 -5813 -19403 -73574
7384g3574n8320R9879N59k6385R974p526k1249Q6816o579j17236n2132J15408
$$ -73574 -131894 -32015 -31456 -57841 -47867 -55393 -76642 10174 3595 -113641 -165773 -50365
7372e0365j6955M1669N4151j41800p811N9133L0339J773J09424j51968r6435J11684
$$ -50365 -67320 -25651 28500 -113300 -121111 -61978 -31639 -29866 79558 -72410 -168845 -57161
7360e7161K2009l8136j8950K657J0441P6795J7901r2879l1348J6228J04356K2323
$$ -57161 -35152 -73288 -92238 -89581 -79140 -2345 15556 -77323 -108671 -92443 11913 34236
7348C4236l8827r7381O1999Q6058O8186j17665l2545j9856m7380N1457K8742O917
$$ 34236 -4591 -101972 -39973 46085 114271 -3394 -35939 -55795 -103175 -51718 -22976 -16059
7336a6059k9038o9587K1360J9914J2327J4850p3075N5538M6253o4831l3517Q6728
$$ -16059 -45097 -114684 -93324 -73410 -61083 -46233 -119308 -63770 -17517 -82348 -115865 -29137
7324b9137o5857L8759J18324m1187p2529J02565L73J2478R377P261r2209o1222
$$ -29137 -94994 -56235 62089 20902 -51627 50938 51311 63789 73166 80427 -11782 -73004
7312g3004k0798k171n556K9139K6478k3752N7153k4059j6421R3113l5626r2108
$$ -73004 -93802 -95973 -101529 -72390 -45912 -69664 -12511 -36570 -52991 40122 4496 -87612
7300h7612K3964L3703o6227N3119N5403j36993J21683O2459j56857R0630N6228
$$ -87612 -63648 -29945 -96172 -43053 12350 -124643 -2960 59499 -97358 -6728 49500
7289D9500n7164k1936J19452o780p8835n939K3814q310l4340m5484l0938o28P5295
$$ 49500 -7664 -29600 89852 83072 4237 -1702 22112 13802 -20538 -66022 -96960 -97588 -22293
7276b2293P31o6483j2461j05142J19275J01608L2437j10258o8106O8161O5336
$$ -22293 -21562 -88045 -100506 -205648 -86373 15235 47672 -62586 -130692 -62531 2805
7265B805L3015k6081r3425l3849O9321M1715m24J9539k675q0052l5401N4207L4337
$$ 2805 35820 9739 -83686 -117535 -48214 -6499 -6923 12616 9941 -70111 -105512 -51305 -16968
7252a6968m2556j2508n5668J6576R0778O448j0407N0204M345k8766K5909q4180
$$ -16968 -59524 -72032 -127700 -111124 -20346 -13898 -24305 25899 30244 1478 27387 -56793
7240e6793j17026J12254P2488j10871J00816m7756j03320M6141L9174N278n067
$$ -56793 -173819 -61565 10923 -99948 868 -46888 -150208 -104067 -64893 -59615 -64682
7229f4682M2796o5260j8879J26466q5321q4885R1793j4377k8275L2150N9605L6751
$$ -64682 -21886 -87146 -106025 20441 -64880 -149765 -57972 -72349 -100624 -68474 -8869 27882
7217B7882M1089L4140o7430L7585n0548j13002Q5357Q6031j25712o8385J54739
$$ 27882 68971 103111 35681 73266 22718 -90284 -4927 81104 -44608 -112993 41746
7206D1746m3434r1651N6013j1848J2833N6549j736l4635L286J8961m8503m0077
$$ 41746 -1688 -93339 -37326 -49174 -36341 20208 18472 -16163 -12877 6084 -42419 -82496
7194h2496J269J2500N2325P500k9426o3395O3595l0301j298M1924J8185k5146
$$ -82496 -81227 -68727 -16402 -8902 -38328 -101723 -38128 -68429 -69727 -27803 -9618 -34764
7182c4764k6414Q0365Q049L1638k3339q0093m775P7009j9527l9500j9509K6215
$$ -34764 -61178 19187 27236 58874 35535 -44558 -49333 27676 8149 -31351 -50860 -24645
7170b4645L8119j4776N627K8158l0632p1458j0244N9090Q7854o5509l7847l6071
$$ -24645 13474 -1302 4325 32483 1851 -69607 -79851 -20761 67093 1584 -36263 -72334
7158g2334r093r968L2992J00735r0330m2685J0620l981o38O6393j14144J3120
$$ -72334 -81427 -91395 -58403 42332 -47998 -90683 -80063 -84044 -84682 -18289 -132433 -119313
7146a19313R3248L575o8483O5299L4948n6919O90M3194l8696N8067k7461q6984
$$ -119313 -26065 -22490 -90973 -25674 9274 -47645 -46955 -3761 -42457 15610 -11851 -98835
7134i8835R462R2698J1357l0417l5744j3820O672L4319k071l2977j2967k904j5768
$$ -98835 -89373 3325 14682 -15735 -51479 -65299 -58627 -24308 -26379 -59356 -72323 -75227 -90995
7121i0995J00529J1840l6955q999K1624p526j3724l6953k4625P3865l197M2336
$$ -90995 9534 21374 -15581 -24580 -2956 -10482 -24206 -61159 -85784 -11919 -15116 27220
7109B7220L9370r477n6153k84k526q008L1800m6816j15522P4774J6514N9406J4816
$$ 27220 66590 57113 960 676 -1850 -9858 21942 -24874 -140396 -65622 -49108 10298 25114
7096B5114k5015m9886P4006R198J7688J0065J0011p7298P7490k9951l5856n680
$$ 25114 99 -49787 24219 33417 51105 61170 71181 -6117 71373 41422 5566 -114
7084a14m8112Q2670K5512M995j4086o836j0285O29o2835O425j8392o5033M6515
$$ -114 -48226 34444 59956 64951 50865 44029 33744 34373 -28462 -22037 -40429 -105462 -58947
7071e8947R988P0981m375j1544k5017O4499P7633p2200n6699l073J6850K6879
$$ -58947 -48959 22022 17647 6103 -18914 45585 123218 51018 -5681 -8754 8096 34975
7059C4975k4008r6318j3992M701J5693M2070j5348j8653M6080L1139l9750J1663
$$ 34975 10967 -85351 -99343 -94642 -78949 -36879 -52227 -70880 -24800 6339 -33411 -21748
7047b1748M7785l2478J0225J3847k1435k1155K2757K0583k3397l1029N6323l8814
$$ -21748 26037 -6441 3784 17631 -3804 -24959 -2202 18381 -5016 -36045 20278 -18536
7035a8536J8244k7732o5425k5962L1725O7353m1472N2643j9364k1748n1254J4902
$$ -18536 -292 -28024 -93449 -119411 -87686 -20333 -61805 -9162 -28526 -50274 -101528 -86626
7023h6626O7596k6142n0291K6097O4227P7041J4801r2702r2785J149N5221j1677
$$ -86626 -19030 -45172 -95463 -69366 -5139 71902 86703 -5999 -98784 -97635 -42414 -54091
7011e4091K5706M3058l9520N922k1836q7515K9690P0335p657J1496r397j1244
$$ -54091 -28385 14673 -24847 -18925 -40761 -128276 -98586 -28251 -35908 -24412 -33809 -45053
6999d5053k0347J6886N0186N577P2991m1396R380q6308m3230J5118L6831p3990
$$ -45053 -65400 -48514 1672 7249 80240 38844 48224 -38084 -81314 -66196 -29365 -103355
6987a03355K6633k7014k3018O4840Q02J3187j4512R594P240J7370O0111n8148
$$ -103355 -76722 -103736 -126754 -61914 -61112 -47925 -62437 -52843 -45603 -28233 31878 -26270
6975b6270n9038L831J5657N2568J5976j7934l5371L5955j5984k8104p146l9648
$$ -26270 -85308 -81477 -65820 -13252 2724 -15210 -50581 -14626 -30610 -58714 -65860 -105508
6963a05508J01735N0172l5169R140m8895q8508N2981N7054k6001J226M0746p7386
$$ -105508 -3773 46399 11230 20370 -28525 -117033 -64052 -6998 -32999 -31773 8973 -68413
6951f8413J3464Q1702m96m2210l5811J8153p914M1267m0760K5145l3588k8714
$$ -68413 -54949 26753 26257 -15953 -51764 -33611 -41525 -258 -41018 -15873 -49461 -78175
6939g8175J6890O00J7224K6355J0216J1573k332P2674P8377j25676o9796Q020
$$ -78175 -61285 -60685 -43461 -17106 -6890 4683 2351 75025 153402 27726 -42070 -34050
6927c4050L930l4545O7391o677o8316N9589J8899K0542K1029m2579j8386R5026
$$ -34050 -30120 -64665 2726 -3951 -72267 -12678 6221 26763 47792 5213 -13173 81853
6915H1853k3743j20998J488j7556k5812R8215j6456q821p8104Q4377K4112J3577
$$ 81853 58110 -62888 -61400 -78956 -104768 -6553 -23009 -31830 -109934 -25557 -1445 12132
6903A2132N3670N693k9580p3810l1338K365Q5087m205J5705q94r735M0033k9661
$$ 12132 65802 71495 41915 -31895 -63233 -60868 24219 20014 35719 34825 25090 65123 35462
6890C5462k1668l5944O0338l2669k0988J2334o1316n876Q1662L9999j5155k585
$$ 35462 13794 -22150 38188 5519 -15469 -3135 -64451 -70327 11335 51334 36179 33594
6878C3594m2966k7762K690J5380P1646l2356m0156J369k451N8737n7064L2927
$$ 33594 -9372 -37134 -34444 -19064 52582 20226 -19930 -18561 -21012 37725 -19339 13588
6866A3588o4293p6032J04052L6311j12311P9967M0487k5620L1626k6394L299j0433
$$ 13588 -50705 -126737 -22685 13626 -98685 -18718 21769 -3851 27775 1381 4680 -5753
6854e753m5929n3474O2365M4269o7912N2017J6929j4144Q5856M8727j20680j9751
$$ -5753 -51682 -105156 -42791 1478 -66434 -14417 2512 -11632 74224 122951 2271 -17480
6842a7480O9355o2836q6476P8417O1692p9787K3997M4006j9706N1831M5061l1729
$$ -17480 51875 -10961 -97437 -19020 42672 -37115 -13118 30888 11182 63013 108074 76345
6830G6345K2513k2216m7285K6468L5071j9169n7238K3878j0893k6027L0110m8371
$$ 76345 98858 76642 29357 55825 90896 71727 14489 38367 27474 1447 31557 -16814
6818a6814j2671R559n431J0099k2317K2432J5923K2767l8858K5039j2436j7018
$$ -16814 -29485 -19926 -25357 -15258 -37575 -15143 780 23547 -15311 9728 -2708 -19726
6806a9726L7195r685p4315j3452O0469K7314M6855N97m9735n0545L9664k6849
$$ -19726 17469 7784 -66531 -79983 -19514 7800 54655 55252 5517 -45028 -5364 -32213
6794c2213P2785M5332n0100J5664J6772n1619M2599J41021j54096l495M2888K230
$$ -32213 40572 85904 35804 51468 68240 16621 59220 200241 46145 42650 85538 87768
6782H7768M4519K1175j13213j28687N7787J19635m5958n7199Q5514j04303K0581
$$ 87768 132287 153462 40249 -88438 -30651 88984 43026 -14173 71341 -32962 -12381
6771a2381J30028O0l0254n4406k5342M4814l8222Q175k9393q940j732K5342M2158
$$ -12381 117647 117707 87453 33047 7705 52519 14297 22472 -6921 -15861 -17593 7749 49907
6758D9907L3628j6874J8765k4045o2025L508k1908j5747Q880k6007N5612J9767
$$ 49907 83535 66661 85426 61381 -644 2864 -19044 -34791 -25911 -51918 3694 23461
6746B3461m8649j2098P4978N6266J2942k9894j6838l5442m0549P1985l9707j2429
$$ 23461 -25188 -37286 37692 93958 106900 77006 60168 24726 -15823 56162 16455 4026
6734D026L2708p5235O6939L9220k2142o0020L0217l2083o0343L8758J4322J38440
$$ 4026 36734 -38501 28438 67658 45516 -14504 15713 -16370 -76713 -37955 -23633 114807
6722A14807J4978j29576Q639N8465l3179q9623k4351J6649R6637M6161k9747l1886
$$ 114807 129785 209 8848 67313 34134 -55489 -79840 -63191 33446 79607 49860 17974
6710A7974M9464N2055p5983J3796r231j06898M2850M6726n4870Q2931l3444j3741
$$ 17974 67438 119493 43510 57306 48075 -58823 -15973 30753 -24117 58814 25370 11629
6698A1629Q683K3806J2322o2164j8986L6357n9097N8637k484q7049j9161J00027
$$ 11629 20312 44118 56440 -5724 -24710 11647 -47450 11187 8703 -78346 -97507 2520
6686B520m0392L7817J18559p4979k8454M2452j5733j377P425q2693j7652j6343
$$ 2520 -37872 -55 118504 43525 15071 57523 41790 40413 47838 -34855 -52507 -68850
6674f8850M1424N8768n7348l0305J8163K2953j055O2966n3984k9213j9027k8860
$$ -68850 -27426 31342 -26006 -56311 -38148 -15195 -16250 46716 -7268 -36481 -55508 -84368
6662h4368L0413K6786j5712P8361M495l060l3585K6355l6426l9276L7829J5370
$$ -84368 -53955 -27169 -42881 35480 39975 36915 3330 29685 -6741 -46017 -8188 7182
6650G182J0838L2375k6805l7741O2182o1089j2875L9574L1259o6653O023Q8433
$$ 7182 18020 50395 23590 -14151 48031 -13058 -25933 13641 44900 -21753 -15730 72703
6638G2703K5996o5969J24746q6136j60398R4600O306q6462l261J54648n0509o4445
$$ 72703 98699 32730 157476 71340 -89058 5542 11848 -74614 -77875 76773 26264 -38181
6626c8181M4689l6151L7439N3125n3076n2704J04582q9928r744Q8720p7048j27773
$$ -38181 6508 -29643 7796 60921 7845 -44859 59723 -30205 -39949 48771 -28277 -156050
6614a56050R0029R1315r6699Q5775L4174r8654J12570Q6954j32997p7478J69018
$$ -156050 -66021 25294 -71405 14370 48544 -50110 62460 149414 16417 -61061 107957
6603A07957p7818j01963O3835o3272n6685J85945n58m2905J27873q825q5061L3582
$$ 107957 30139 -71824 -7989 -71261 -127946 57999 57441 14536 142409 133584 48523 82105
6591H2105K3097q9652l9703M682j321o865M0720J8143j6428P870k9665n2195N2949
$$ 82105 105202 15550 -24153 -19471 -20792 -27657 13063 31206 14778 22648 -7017 -59212 -6263
6578f263K4113q6069J15123Q3017m1607m2007l7621J1017k1072J04708P4228r5025
$$ -6263 17850 -68219 46904 129921 88314 46307 8686 19703 -1369 103339 177567 82542
6566H2542J9317K1823r3965n369N9035j23979K095J26804r6596j7756J20674q4658
$$ 82542 101859 123682 29717 24348 83383 -40596 -38501 88303 -8293 -26049 94625 9967
6554I967j16753J70139K9878q7774P1178J2268r5585P9773K7581j36510M6627
$$ 9967 -106786 63353 93231 5457 76635 88903 -6682 73091 100672 -35838 10789
6543A0789J29992n5183o686P1953j40894l1164N4612n5755q3351J06393J2482
$$ 10789 140781 85598 78912 150865 9971 -21193 33419 -22336 -105687 706 13188
6532A3188j40667J25927K8530L090P0294r571j61268N7567J51695n7071j6814
$$ 13188 -127479 -1552 26978 30068 100362 90791 -70477 -12910 138785 81714 64900
6521F4900N1933r8801L1270J19427n2281q1578j7937l9593n3384P5230N7979m2106
$$ 64900 116833 18032 49302 168729 116448 34870 16933 -22660 -76044 -814 57165 15059
6509A5059j0952L0691l7891J5427L1680o4442L2656N791p2992L3901N8517J5135
$$ 15059 4107 34798 -3093 12334 44014 -20428 12228 18019 -54973 -21072 37445 52580
6497E2580r1951o4440M6355J9014J0376J232N5934Q0472m8137l303n6639l617
$$ 52580 -39371 -103811 -57456 -38442 -28066 -26834 29100 109572 61435 58132 1493 -2124
6485b124J20668L8396j7957p6011q3403q463Q1520M419l4656P4220k3291l3388
$$ -2124 118544 156940 138983 62972 -20431 -28894 52626 57045 22389 96609 73318 39930
6473C9930J8947J9775j5020M4256K3579j83701L7647P8455p866l3673L8106p1439
$$ 39930 58877 78652 63632 107888 131467 -52234 -14587 63868 56002 22329 60435 -11004
6461a1004J19655J07710j39798k4275R5393o4176r5203J07898n0629p2160J24834
$$ -11004 108651 216361 76563 52288 147681 83505 -11698 96200 45571 -26589 98245
6450I8245m1632p6513J34369J7410j05975P75P6121p4523J2328O0732r8750j0249
$$ 98245 56613 -19900 114469 131879 25904 26679 102800 28277 40605 101337 2587 -7662
6438g662J7070m4653J6315J45536r2136l3980J06058k2079k9304R1193m180m6121
$$ -7662 9408 -35245 -18930 126606 34470 490 106548 84469 55165 146358 142178 96057
6426I6057K2939o0618n6378l782K2507J6452J26638J7160q975o6963m5822K7238
$$ 96057 118996 58378 2000 -1782 20725 37177 163815 180975 172000 105037 59215 86453
6414H6453K3577K3562m9965k758j6868j3870J5706J8266J1008o6459k3332M3991
$$ 86453 110030 133592 83627 80869 64001 50131 65837 84103 95111 28652 5320 49311
6402D9311N2872N711n017k9249M3419L4545m4911l9988m2334r0178J6680K5059
$$ 49311 102183 107894 102877 73628 117047 151592 106681 66693 24359 -65819 -49139 -24080
6390b4080M0978N597J3716J2040R0189k5565l3474J4334o2867O7319k953r1293
$$ -24080 16898 22495 36211 48251 138440 112875 79401 93735 30868 98187 95234 3941
6378C941Q523M3971j38537m124J50809J6498j5496j4667k3784N1612M8760o9476
$$ 3941 12464 56435 -82102 -86226 64583 81081 65585 50918 27134 78746 127506 58030
6366E8030l360L276j20094L8613J29706k376j33670P43L6750J6718Q4404o2860
$$ 58030 54670 57946 -62148 -23535 106171 103795 -29875 -29132 7618 24336 108740 45880
6354D5880m1226K4044L2994n043L9669n0799j04881n420J67379n3604n7383O1424
$$ 45880 4654 28698 61692 56649 96318 45519 -59362 -64782 102597 48993 -8390 53034
6342E3034j7129Q780J1313J0703k6498m1855Q2849L8029o5723J5539j9143p633
$$ 53034 35905 44685 55998 66701 40203 -1652 81197 119226 53503 69042 49899 42266
6330D2266L8686n925j616M2009m1821j0398N6312m9416k8050L481R059o2464M4076
$$ 42266 80952 75027 73411 115420 73599 63201 119513 70097 42047 45528 54587 -7877 36199
6317C6199P1044l7231n9409O5758J5548J5728J0952n7382n2991m792K950P0858
$$ 36199 107243 70012 10603 76361 91909 107637 118589 61207 8216 3424 6374 77232
6305G7232L4900l5257n2926J3083K3847N7183Q1712o1409l388o6768m0918j2283
$$ 77232 112132 76875 23949 37032 60879 118062 199774 138365 134977 68209 27291 15008
6293A5008R5663m0524k9757j5574M2291o7293M2856o416j5232Q6048M5836r781
$$ 15008 110671 70147 40390 24816 67107 -186 42670 36254 21022 107070 152906 143125
6281A43125J2210J0088o0416o6234P144J0392l4555N146n6013k9133O5076P9953
$$ 143125 155335 165423 105007 38773 45917 56309 21754 26900 -29113 -58246 6830 86783
6269H6783N148n9694J6548J4969L2904n0337J7613j5291j6764N2556j659n6150
$$ 86783 91931 32237 48785 63754 96658 46321 63934 48643 31879 84435 82776 26626
6257B6626j7184K1207R3716K7307l3259r4072J5560J2715m9056L0993L0529j16523
$$ 26626 9442 30649 124365 151672 118413 24341 39901 52616 3560 34553 65082 -51441
6245e1441J8658J975n2912M1504J02736l6100J5596M7447k7447J3404k429k3508
$$ -51441 -32783 -30808 -83720 -42216 60520 24420 40016 87463 60016 73420 70991 47483
6233D7483l8549Q336o3333j8795Q8785P463l1305Q4713J6276J6354L1527m0974
$$ 47483 8934 17270 -46063 -64858 23927 31390 85 84798 101074 117428 148955 107981
6221A07981j32414R2286J3331j00152L6089J07106j05733J2468P3698l5792k1316
$$ 107981 -24433 67853 81184 -18968 17121 124227 18494 30962 104660 68868 47552
6210D7552P8342m6651j6819J35145m363o7051m5318r1134M3835O3824k8619j06367
$$ 47552 125894 79243 62424 197569 193206 126155 80837 -10297 33538 97362 68743 -37624
6198c7624K6953O0721k2711K1181M6895k5181l4553J4192N4882l1070n146p7132
$$ -37624 -10671 50050 27339 48520 95415 70234 35681 49873 104755 73685 68539 -8593
6186h593j7384J02347M8265j08792K1144j2241n6039O7537L3067J3893l1228k089
$$ -8593 -25977 76370 124635 15843 36987 24746 -31293 36244 69311 83204 51976 49887
6174D9887j2980j7072p572p597l2654K5971N332J09285K0831P8866J6142j22885
$$ 49887 36907 19835 12263 4666 -27988 -2017 3315 112600 133431 212297 228439 105554
6162A05554Q484p4031l0738O3766q163p7133J26588J4554p6321K0401P581k9244
$$ 105554 114038 40007 9269 73035 64872 -12261 114327 128881 52560 72961 80542 51298
6150E1298N6721O5463l9262n4439m67m2542K8671J31976j32636j33858J20828
$$ 51298 108019 173482 134220 79781 79314 36772 65443 197419 64783 -69075 51753
6139E1753J149l4253P7806J8453j15105L7467Q1881m6530J1533n0432l3141M164
$$ 51753 52902 18649 96455 114908 -197 37270 119151 72621 84154 33722 581 4745
6127D745L8423o1998O6771J3469l0604j9897J05590o143l5557q5768k1861J01212
$$ 4745 43168 -18830 47941 61410 30806 10909 116499 110356 74799 -10969 -32830 68382
6115F8382P7277m5582r5252L8259j9383L6487l996N6088l6518l2298P5093K7498
$$ 68382 145659 100077 4825 43084 23701 60188 56192 112280 75762 43464 118557 146055
6103A46055k7174J2778m8414k7327k0523j671m4347p488L4455Q3438l1811K3319
$$ 146055 118881 131659 83245 55918 35395 33724 -10623 -18111 16344 99782 67971 91290
6091I1290L3284j01422K5085P0430n0076k7449k5827J1888M8902l2331k4565l4775
$$ 91290 124574 23152 48237 118667 68591 41142 15315 27203 76105 43774 19209 -15566
6079a5566O9699o119j0613N2167O0088j14751M249M7212p9015n1637J07210m4740
$$ -15566 54133 48014 37401 89568 149656 34905 39154 86366 7351 -44286 62924 18184
6067A8184k8691N4022j999O0064P1698r1772n6123M8586O1632K0284K4120o7937
$$ 18184 -10507 43515 41516 101580 173278 81506 25383 73969 135601 155885 180005 112068
6055A12068j23341P2839K2583J9628O5873k5715q0970m6598K880N9316J24284
$$ 112068 -11273 61566 84149 103777 169650 143935 62965 16367 19247 78563 202847
6044B02847p4328k0757K3416k0309N3112q1950m6626m4233N8724K0136m0066P5471
$$ 202847 128519 107762 131178 110869 163981 82031 35405 -8828 49896 70032 29966 105437
6032A05437N6076J6073l6059j6602n9205o9937N513k3181N1530J02071q4483l8353
$$ 105437 161513 177586 141527 124925 65720 -4217 1296 -21885 29645 131716 47233 8880
6020H880L9868Q1529K6988L5606l8336m2155j078k0236M249J9744o4583p6455
$$ 8880 48748 130277 157265 192871 154535 112380 111302 91066 95315 115059 50476 -25979
6008b5979O7168M4593K2587P5056p506o3165j7980O7635k4805p9357M2135n9875
$$ -25979 41189 85782 108369 183425 175919 112754 94774 162409 137604 58247 100382 40507
5996D0507L032N3515j6311k397J1889M934O450R0212L916j7194J3506R924j576
$$ 40507 43539 97054 80743 78346 90235 95169 101619 191831 195747 178553 192059 201983 200407
5983B00407n621R024q6496R003n0028j2900J7432p1496l0371M5805P4651P4005
$$ 200407 194786 203810 117314 126317 76289 63389 80821 9325 -21046 24759 99410 173415
5971A73415j5269n4375J2225L7615j34442J51034N9142j11091m1895N6372K9022
$$ 173415 158146 103771 115996 153611 19169 170203 229345 118254 76359 132731 161753
5960A61753L5162O7751j10316j07756J16453k3397Q586J42010m4704r1108R0277
$$ 161753 196915 264666 154350 46594 163047 139650 148236 290246 245542 154434 244711
5949B44711j49j44229J14786M4252j40944O7950J33652r5759K5740l3131m7873
$$ 244711 244562 100333 215119 259371 118427 186377 320029 224270 250010 216879 169006
5938A69006j7876P3233o0751p0478N4914o9364k5527J00962N8688m5318N1086
$$ 169006 151130 224363 163612 93134 148048 78684 53157 154119 212807 167489 218575
5927B18575K3739p7076l5611L2150r3162K8426J01371K9859j9606K1687q2883
$$ 218575 242314 165238 129627 161777 68615 97041 198412 228271 208665 230352 147469
5916A47469L392Q0695K3039p180J3566o207k1953J3073M5334j1257q7464O0129
$$ 147469 150861 231556 254595 247415 260981 254774 232821 245894 291228 279971 192507 252636
5904B52636k9145J4846K911j04790R6823M9853j7123p9069J3303k9757M4582k675
$$ 252636 223491 238337 241248 136458 233281 283134 266011 186942 200245 170488 215070 212395
5892B12395m4308J9885Q109K4502p665l6901Q2782J05220j18875j4867j4165l83
$$ 212395 168087 187972 196081 220583 212918 176017 258799 364019 245144 230277 216112 215729
5880B15729J06176n1167m4141N0466k1122M6153p9544L7156m7266M0461N7782
$$ 215729 321905 270738 226597 277063 255941 302094 222550 259706 212440 252901 310683
5869C10683l4393l7987L1274n8706l2079M2625l4679P241J1283J7963K2390K3765
$$ 310683 276290 238303 269577 210871 178792 221417 186738 193979 205262 223225 245615 269380
5857B69380L6398q1002L3287L4798K3137J14750N5296j19063q8486M9288O9284
$$ 269380 305778 224776 258063 292861 315998 430748 486044 366981 278495 327783 397067
5846C97067n1895O3688K9754k1781Q8166L9224o1573O0285n759k1801l502L1031
$$ 397067 345172 408860 438614 416833 504999 544223 482650 542935 537176 515375 511873 542904
5834E42904j4253k008P6764L5530k269k0123M0188O4614J14765M5234L6016j500
$$ 542904 528651 526643 603407 638937 636668 616545 656733 721347 836112 881346 917362 915862
5822I15862N6434J0483P3817O5464Q8779P7149K27014K75230L15934M98298O70149
$$ 915862 972296 982779 1056596 1122060 1210839 1287988 1515002 1790232 2106166 2604464 3274613
5811C274613J207519J411932J270393J157764Q23682K55400l84822q29741j117706
$$ 3274613 4482132 5894064 7164457 8322221 9145903 9401303 9016481 8186740 7069034
5802G069034j113308r83823q22545p31262o01005m61138l88956k54136j00758
$$ 7069034 5955726 4971903 4149358 3418096 2817091 2355953 1966997 1712861 1612103
5793A612103j75283k04178j20131k6942q1804m5017Q308r6005J4446n206p1299
$$ 1612103 1436820 1232642 1112511 1085569 1003765 958748 967056 871051 885497 880291 808992
5782H08992q855Q2523j07387J823j0924m4782Q3308L6849j30611p0925O3251o0352
$$ 808992 800137 882660 775273 777096 766172 721390 804698 841547 710936 640011 703262 642910
5770F42910p2663L0086J37652k3037O633k3142r2671q9258p6166m287M0024J1211
$$ 642910 570247 600333 737985 714948 721581 698439 605768 516510 440344 436057 476081 487292
5758D87292R871l8176P003l3713O1684r387n5245M5585J6007P5027M4743q5119
$$ 487292 497163 458987 465990 432277 493961 484574 429329 474914 490921 565948 610691 525572
5746E25572j8352K7005m6493K556M3742q6303o3686J30344N3515j0056Q9683m2095
$$ 525572 507220 534225 487732 490288 534030 447727 384041 514385 567900 557844 647527 605432
5734F05432p2520J864l9765o9452p453n5590l8023N2865N7868N8274J6257j0637
$$ 605432 532912 534776 495011 425559 418106 362516 324493 377358 435226 493500 509757 499120
5722D99120r0315P1582R0519q7525l6106k0911N5613k8457J05677p6501j21541
$$ 499120 408805 480387 570906 483381 447275 426364 481977 453520 559197 482696 361155
5711C61155J11357N056K4805P5675r237j70400R373M8568P571O5517l6514r2947
$$ 361155 472512 477568 502373 578048 568811 398411 407784 456352 463923 529440 492926 399979
5699C99979P483L7594q8093l9524O9977m3370O205J35550j1712j57701O3748p9868
$$ 399979 407462 445056 356963 317439 387416 344046 350251 485801 474089 316388 380136 300268
5687C00268l9989R1753L2472j06276P8920J8639K1382J30857K5474n9636n3592
$$ 300268 260279 352032 384504 278228 357148 375787 397169 528026 553500 493864 440272
5676D40272P5623n7158P0988j8823p0768j2991K2042p0440M5180j2682N1234J16551
$$ 440272 515895 458737 529725 510902 440134 427143 449185 378745 423925 411243 462477 579028
5664E79028K7030N2729j1442k7824p3522L4843j1941p4182J7921N9493j02280
$$ 579028 606058 658787 647345 619521 545999 580842 568901 494719 512640 572133 469853
5653D69853j2639K1861K3055O4236J12699o4587k9641r4M208J5128L2774n0403
$$ 469853 457214 479075 502130 566366 679065 614478 584837 584743 588951 604079 636853 586450
5641E86450r705J16573J6806m8644n409m8548M9625J04588n2156k2665L5913j5123
$$ 586450 576745 693318 710124 661480 656071 607523 657148 761736 709580 686915 722828 707705
5629G07705j05083O3704M3777p7626j494k2829r4974J47095J22379p7099l7113
$$ 707705 602622 666326 710103 632477 630983 608154 513180 660275 782654 705555 668442
5618F68442M1484l4810J03343R7093o8258n1994O8552o2269M0445Q6008n6310
$$ 668442 709926 675116 778459 875552 807294 755300 823852 761583 802028 888036 831726
5607H31726r4981Q8387P1929l9358J18249l5104J429J3956o4810J2118l798o0824
$$ 831726 736745 825132 897061 857703 975952 940848 942277 956233 891423 903541 899743 838919
5595H38919n1429J32837J07597k0262j7716J3089N8390J09136R8797k2790N830
$$ 838919 787490 920327 1027924 1007662 989946 1003035 1061425 1170561 1269358 1246568 1252398
5584A252398J8646K9490K4641m4623k2042O821M2539P6683Q4287P5757N7832J8306
$$ 1252398 1271044 1300534 1325175 1280552 1258510 1265331 1307870 1384553 1468840 1544597 1602429 1620735
5572A620735j588k5056K3084O7874m7607r995J38013J22286k3666L9021L9770
$$ 1620735 1619147 1594091 1617175 1685049 1637442 1627447 1765460 1887746 1864080 1903101 1942871
5561A942871J2415J26885J38950p608M3278L5191J39482J98286J35812j5190Q3099
$$ 1942871 1955286 2082171 2221121 2213513 2256791 2291982 2431464 2629750 2765562 2750372 2833471
5550B833471J37238J17465K35807K98454K69072K05698L84639M67364L92984M46058
$$ 2833471 2970709 3088174 3323981 3622435 3891507 4097205 4481844 4949208 5342192 5788250
5540E788250N03016N92855P61218Q93022J186517J450790J685842K062225K430883
$$ 5788250 6291266 6884121 7645339 8538361 9724878 11175668 12861510 14923735 17354618
5531A7354618K696528K686204K505625K089331J560396R70790L47102J08345o1779
$$ 17354618 20051146 22737350 25242975 27332306 28892702 29863492 30210594 30318939 30257160
5522C0257160k2201L23997N01143N51617M34430r931n60609j276989j801880k178250
$$ 30257160 30234959 30558956 31060099 31611716 32046146 32036215 31475606 30198617 28396737 26218487
5512B6218487k449901k506298k391566k138211j881666j696289j442781j141127
$$ 26218487 23768586 21262288 18870722 16732511 14850845 13154556 11711775 10570648
5504A0570648q94755p98548o01211n25465n70347m10930l00909l50971l21149
$$ 10570648 9675893 8877345 8276134 7750669 7180322 6769392 6468483 6117512 5796363
5495E796363k18466k24559k64954j36104k17022k81382k4439j49482k19848n4014
$$ 5796363 5577897 5353338 5088384 4952280 4735258 4453876 4429437 4279955 4060107 4006093
5485D006093n2507r5528q7180p3542k19768q0468L4485n5452j23616M0342o0909
$$ 4006093 3953586 3858058 3770878 3697336 3477568 3397100 3431585 3376133 3252517 3292859 3231950
5474C231950q3109K3274J5053l0919L8292n117j97391Q0450P916q0450r2688l3630
$$ 3231950 3148841 3172115 3187168 3156249 3194541 3189424 2992033 3072483 3080399 2999949 2907261 2873631
5462B873631J1569J2579J38188l4600l5161Q4107Q3607o663K0196l0654j12048
$$ 2873631 2885200 2897779 3035967 3001367 2966206 3050313 3133920 3127257 3147453 3116799 3004751
5451C004751m526M9412o1941m169n7697r1617J10613P7330k9540k5535l9708o7918
$$ 3004751 3000225 3049637 2987696 2983527 2925830 2834213 2944826 3022156 2992616 2967081 2927373 2859455
5439B859455K5585M5471K1857m5817o7128K792Q2911J65701J1849k6034N2524
$$ 2859455 2885040 2930511 2952368 2906551 2839423 2842215 2925126 3090827 3102676 3076642 3129166
5428C129166k9963J36032Q2709M4855j2174j09024R1593J20474K0881j8191K4480
$$ 3129166 3099203 3235235 3317944 3362799 3350625 3241601 3333194 3453668 3474549 3456358 3480838
5417C480838K9042J1677J98068Q5694m3606P3063N1712M7155O4914J34456r3333
$$ 3480838 3509880 3521557 3719625 3805319 3761713 3834776 3886488 3933643 3998557 4133013 4039680
5406D039680o1519J04317J40880L3708J21990n8271p6861J09642J20906J14271
$$ 4039680 3978161 4082478 4223358 4257066 4379056 4320785 4243924 4353566 4474472 4588743
5396D588743K2634o6938q1943J47457R3165M1069K593j8520o1335K53839K88827
$$ 4588743 4611377 4544439 4462496 4609953 4703118 4744187 4746780 4728260 4666925 4920764 5209591
5385E209591L2802K2809O8455N4469K02442K53068J995r2926Q9405J20600J59617
$$ 5209591 5242393 5265202 5333657 5388126 5590568 5843636 5845631 5752705 5842110 5962710 6122327
5374F122327K05344R734j03186J50918J83468J94256Q6327Q0813j7490J27627
$$ 6122327 6327671 6337405 6234219 6385137 6568605 6762861 6849188 6930001 6912511 7040138
5364G040138J86183Q5613K6865r460N726J95817K64310J68540Q1911P9594J58177
$$ 7040138 7226321 7311934 7338799 7329339 7335065 7530882 7795192 7963732 8045643 8125237 8283414
5353H283414K52603K25375J39867N7514R3871K62547K77176K32666J76059J89814
$$ 8283414 8536017 8761392 8901259 8958773 9052644 9315191 9592367 9825033 10001092 10190906
5343A0190906J59232L26685L39587K72829K20256K19859K80031L91288M26865
$$ 10190906 10350138 10676823 11016410 11289239 11509495 11729354 12009385 12400673 12827538
5334A2827538N08001L31488L25641M57422M75807N43741M44039L69142M68155
$$ 12827538 13335539 13667027 13992668 14450090 14925897 15469638 15913677 16282819 16750974
5325A6750974O24790O93772O49333N16047M36658N18324P44644P73713P86305
$$ 16750974 17375764 18069536 18718869 19234916 19671574 20189898 20934542 21708255 22494560
5316B2494560O53595O68060Q92277R63634R83497R04994R72196J038843J147300
$$ 22494560 23148155 23816215 24708492 25672126 26655623 27560617 28532813 29571656 30718956
5307C0718956J340191J438144J276928J472141J716276J843996K106763K306548
$$ 30718956 32059147 33497291 34774219 36246360 37962636 39806632 41913395 44219943
5299D4219943K319439K620968K990608L282232L674588M048594M465084M983746
$$ 44219943 46539382 49160350 52150958 55433190 59107778 63156372 67621456 72605202
5291G2605202N629808O377988P082683P991380Q744942R575992J0667314J1743655
$$ 72605202 78235010 84612998 91695681 99687061 108432003 118007995 128675309 140418964
5283A40418964J2738382J3949322J5272974J6817198J8434864J9784415K0304547
$$ 140418964 153157346 167106668 182379642 199196840 217631704 237416119 257720666
5276B57720666K0009059J8702111J6145700J2473348P843023K479599k982601
$$ 257720666 277729725 296431836 312577536 325050884 332893907 335373506 332390905
5269C32390905p750365j1786713j4930681j7144258j8387454j8980841j8607293
$$ 332390905 324640540 312853827 297923146 280778888 262391434 243410593 224803300
5262B24803300j7657065j6596796j5371553j4068705j2843527j1538478j0241565
$$ 224803300 207146235 190549439 175177886 161109181 148265654 136727176 126485611
5255A26485611r279082q284053p464797o815423o055875n322281m861072m550721
$$ 126485611 117206529 108922476 101457679 94642256 88586381 83264100 78403028 73852307
5247G3852307m134467l760336l390494l048724k936821k894668k652428k330038
$$ 73852307 69717840 65957504 62567010 59518286 56581465 53686797 51034369 48704331
5239D8704331k234351k044192j927520j964136j708120j602758j626320j431442
$$ 48704331 46469980 44425788 42498268 40534132 38826012 37223254 35596934 34165492
5231C4165492j348621j335842j269833j086986r78227r49535r65361j032671q15539
$$ 34165492 32816871 31481029 30211196 29124210 28145983 27196448 26231087 25198416 24382877
5222B4382877o76402o77738o96168p08143p19359o61080m63801n11213n90097
$$ 24382877 23706475 23028737 22332569 21624426 20905067 20243987 19780186 19268973 18678876
5213A8678876n05827n23715m58048k17143l59330l98598m10810m18562l69599
$$ 18678876 18173049 17649334 17191286 16974143 16614813 16216215 15805405 15386843 15017244
5204A5017244k63274l66364m45866l07111m06441k61692k75528k69341l86685
$$ 15017244 14753970 14387606 13941740 13634629 13228188 12966496 12690968 12421627 12034942
5195A2034942l22428l41374k43481j72660k44002m26669k13382j66539k50189
$$ 12034942 11712514 11371140 11127659 10954999 10710997 10284328 10070946 9904407 9654218
5186I654218j95287k75269l97260j82385j13558k51668j94031j37815k53893j71077
$$ 9654218 9458931 9183662 8786402 8604017 8490459 8238791 8044760 7906945 7653052 7481975
5176G481975o9107j65829j57316k03780k72064j98203J3342j78238k37403r7221
$$ 7481975 7412868 7247039 7089723 6885943 6613879 6415676 6429018 6250780 6013377 5916156
5166E916156j42602j65012N5029k1164k65180r9254Q181j47759k2398l9111j91825
$$ 5916156 5773554 5608542 5663571 5642407 5377227 5277973 5286154 5138395 5115997 5076886 4885061
5155D885061p5043p8165j41201l462n6624k68476p8190k9988k8577j2250n748
$$ 4885061 4810018 4731853 4590652 4587190 4530566 4262090 4183900 4153912 4125335 4113085 4107337
5144D107337j91414j80480K9625j28846k28239m8220j30861m2827J00003k8879
$$ 4107337 3915923 3735443 3765068 3636222 3407983 3359763 3228902 3186075 3286078 3257199
5134C257199o0533j08167o8223K0490O0964q4891q9932j69775o0878k1262j8089
$$ 3257199 3196666 3088499 3020276 3040766 3101730 3016839 2926907 2757132 2696254 2674992 2656903
5123B656903m8697j37435n3477j5997P0893J02407j34156j27798P6715p0804j17261
$$ 2656903 2608206 2470771 2417294 2401297 2472190 2574597 2440441 2312643 2389358 2318554 2201293
5112B201293P1688j30284o6207J50225L9142n7697P3950j58205j49494J65396
$$ 2201293 2272981 2142697 2076490 2226715 2265857 2208160 2282110 2123905 1974411 2139807
5102B139807L1601j59445m78q9370k44977P0777J07947j22882j50511l3123j19140
$$ 2139807 2171408 2011963 2011485 1922115 1677138 1747915 1855862 1732980 1582469 1549346 1430206
5091A430206k6074N4160m7936m8248M4020M105J5676m894n6339j25468J1631P5223
$$ 1430206 1404132 1458292 1410356 1362108 1406128 1410233 1425909 1421015 1364676 1239208 1250839 1326062
5079A326062l7681O1873j08803p7131Q4287Q3564m0033j6670j44971j34811Q220
$$ 1326062 1288381 1350254 1241451 1164320 1248607 1332171 1292138 1275468 1130497 995686 1003906
5068A003906J34145l982q7857o0408N3530O7963m1501k2513l4297r43p408K4470
$$ 1003906 1138051 1134069 1046212 985804 1039334 1107297 1065796 1043283 1008986 1008043 1000635 1025105
5056A025105K3236j9858j07419l6774L9274N5329o2341o8573J9868r674P1191
$$ 1025105 1048341 1028483 921064 884290 923564 978893 916552 847979 867847 858173 929364
5045I29364J023l6887k3459J2599m4980j5920R618j11557o6983O9683l5103q3957
$$ 929364 930387 893500 870041 882640 837660 821740 831358 719801 652818 722501 687398 603441
5033F03441N7199M1200m6142j1407J43822m3902Q188O548p4939q708J16904n6985
$$ 603441 660640 701840 655698 644291 788113 744211 752399 758947 684008 675300 792204 735219
5021G35219j27327M8545N2930M7991Q7175l1005p1827J16520R2208r4404L799
$$ 735219 607892 656437 709367 757358 844533 813528 741701 858221 950429 856025 859824
5010H59824o879j000P3580K9901p9502J5212Q1903r2067M2473J5916J7805K7818
$$ 859824 852945 851945 925525 955426 875924 891136 973039 880972 923445 939361 957166 984984
4998I84984k2720P1613l9200m922O7457o6363k3497L6876L8794o4000L707L5468
$$ 984984 962264 1033877 994677 989755 1057212 990849 967352 1004228 1043022 979022 982729 1018197
4986A018197n1137N2090P6762k4158l8601N0972k2962J4890O3720M1269k8362
$$ 1018197 967060 1019150 1095912 1071754 1033153 1084125 1061163 1076053 1139773 1181042 1152680
4975A152680J23642J42730K35646K12489J32841N7322R3478Q3362j30846k08537
$$ 1152680 1276322 1419052 1654698 1867187 2000028 2057350 2150828 2234190 2103344 1894807
4965A894807j47585k12146j62034k6665j30872r1654j512n3549o3949Q6243j06792
$$ 1894807 1747222 1535076 1373042 1346377 1215505 1123851 1122339 1068790 1004841 1091084 984292
4954I84292r9260L3179M9801p5943j6974j4192N1734Q8786j36693q7077N7902
$$ 984292 885032 918211 968012 892069 875095 860903 912637 1001423 864730 777653 835555
4943H35555N3410r8872N051J58262j3814l0590L5721k7518K4605Q943l5379j8757
$$ 835555 888965 790093 795144 953406 939592 909002 944723 917205 941810 950753 915374 896617
4931H96617k9551l6082M8128K5653k7115P0953Q8440k6487J8830l7782j8692k7546
$$ 896617 867066 830984 879112 904765 877650 948603 1037043 1010556 1029386 991604 972912 945366
4919I45366k6240N7739J3162M518q1916R2538R3813L6123q631K1209L7751O9390
$$ 945366 919126 976865 990027 994545 912629 1005167 1098980 1135103 1126472 1147681 1185432 1254822
4907A254822J0190l1235j0292N771j8217j557Q016j8209P0258N5653K5556J27651
$$ 1254822 1265012 1233777 1223485 1229256 1211039 1209482 1217498 1199289 1269547 1325200 1350756 1478407
4895A478407J00199P627L8268J04855R6199J01490J18800N9997J23120K87501
$$ 1478407 1578606 1586233 1624501 1729356 1825555 1927045 2045845 2105842 2228962 2516463
4885B516463L11386L19784M13436M80173O17723Q00655P27337P19546P51399O60381
$$ 2516463 2827849 3147633 3561069 4041242 4658965 5459620 6186957 6906503 7657902 8318283
4875H318283N65514O04516M91359L89679O84684Q22190Q99583R34758P55112M08540
$$ 8318283 8883797 9488313 9979672 10369351 11054035 11876225 12775808 13710566 14465678 14874218
4865A4874218J77168j37186n12341o42996o85325o65574o80277n08113m92330
$$ 14874218 15051386 14914200 14401859 13758863 13073538 12407964 11727687 11219574 10727244
4856A0727244m98061o07414o49665n88091o28423n92527o92146o68652o39355
$$ 10727244 10229183 9621769 8972104 8384013 7755590 7163063 6470917 5802265 5162910
4847E162910m82908l91550l07824k91578k53995k46196j09610J4788R3563j1254
$$ 5162910 4680002 4288452 3980628 3689050 3435055 3188859 3079249 3094037 3187600 3176346
4837C176346J66918K33069M73662Q11777Q65584O81384O83512M33332K45557j72396
$$ 3176346 3343264 3576333 4049995 4861772 5727356 6408740 7092252 7525584 7771141 7598745
4827G598745o95719o91064n86986m15982l65332l41336n07622m19312k85544l36775
$$ 7598745 6903026 6211962 5624976 5208994 4843662 4502326 3994704 3575392 3289848 2953073
4817B953073k16525j89610l05160k41509o5948p4179j31127j7550j25033q0865
$$ 2953073 2736548 2546938 2241778 2000269 1934321 1860142 1729015 1711465 1586432 1505567
4807A505567Q7394P5774p543J26380J05670J41442L23145J97492k9423P4692L4320
$$ 1505567 1592961 1668735 1661192 1787572 1893242 2034684 2357829 2555321 2525898 2600590 2634910
4796B634910j9870r94O9024p0657J58729L82370K31784K23633L42807Q200j91766
$$ 2634910 2615040 2614046 2683070 2612413 2771142 3153512 3385296 3608929 3951736 3959936 3768170
4785C768170l5760k64774l32588r8806k57830k89071O2806M5535j47919N8263
$$ 3768170 3732410 3467636 3135048 3036242 2778412 2489341 2552147 2597682 2449763 2508026
4775B508026n6746k12256p5472j86183k40021k28989p2622j70958j50785j5859
$$ 2508026 2451280 2239024 2163552 1977369 1737348 1508359 1435737 1264779 1113994 1098135
4765A098135n4889k1606j7488L7745o2573p9772n6418m7024l8126o39K1844l4314
$$ 1098135 1043246 1021640 1004152 1041897 979324 899552 843134 796110 757984 757345 779189 744875
4753G44875k2978j1858N1838J21901N985j18899m4546k5762q589j9678Q5141k7525
$$ 744875 721897 710039 761877 883778 889763 770864 726318 700556 691967 672289 757430 729905
4741G29905j99538Q7899O7880j35527M6380M6921p5493R8733Q8257j01333m9719
$$ 729905 530367 618266 686146 550619 596999 643920 568427 667160 755417 654084 604365
4730F04365O2489j28635k1332J80621j28957j37800J34034q7916j02022K41952
$$ 604365 666854 538219 516887 697508 568551 430751 564785 476869 374847 616799
4720F16799j9602q4166J16210Q2654j21602M8260J243k04101P7662J45086j16310
$$ 616799 597197 513031 629241 711895 590293 638553 639796 435695 513357 658443 542133
4709E42133J1429J8961j46329j0071J97107k4691j22742J67023R9301j06927R7449
$$ 542133 553562 572523 426194 416123 613230 588539 465797 632820 732121 625194 722643
4698G22643l5532j85042P1022L7065p7938K1474N6062n1127M0583P3182m8154
$$ 722643 687111 502069 573091 610156 532218 553692 609754 558627 599210 672392 624238
4687F24238m8520M9895M6988n7986j1813L0865j12561J5931J05255L5682k8053
$$ 624238 575718 625613 672601 614615 602802 633667 521106 537037 642292 677974 649921
4676F49921J4884L6343l5804L5682P1730q9596k8048P2907q3572P1004M5650j26500
$$ 649921 664805 701148 665344 701026 772756 683160 655112 728019 644447 715451 761101 634601
4664F34601K6393J47646J1268k2026J03973k2984m2019N1889J22306k3961M2987
$$ 634601 660994 808640 819908 797882 901855 878871 836852 888741 1011047 987086 1030073
4653A030073n1081j22143J21338J35355m9939O439J31749k6875Q0225J88094L3565
$$ 1030073 978992 856849 978187 1113542 1063603 1070042 1201791 1174916 1255141 1443235 1476800
4642A476800j7679O8670P819N8005K22701P9611m158K24053K17849J57166L09335
$$ 1476800 1459121 1527791 1535610 1593615 1816316 1895927 1891769 2115822 2333671 2490837 2800172
4631B800172M85351M49380Q63973J323984J221380J221579J116338N62168J49743
$$ 2800172 3285523 3734903 4598876 5922860 7144240 8365819 9482157 10044325 10194068
4622A0194068k33517p18167r51927q40807p38841o20034k80121j62797j35920
$$ 10194068 9960551 9242384 8290457 7449650 6710809 6090775 5810654 5647857 5511937
4613E511937J05020K90410L82278O88134P25151O40352P59621Q37927P14202P48558
$$ 5511937 5616957 5907367 6289645 6977779 7702930 8343282 9102903 9940830 10655032 11403590
4603A1403590Q60842Q29095J027338J231599J140572R65099Q31827O00907M75710
$$ 11403590 12264432 13093527 14120865 15352464 16493036 17458135 18289962 18890869 19366579
4594A9366579O13013P77602P61841Q06820P29098K98843l6000l43150n85302o84582
$$ 19366579 19979592 20757194 21519035 22325855 23054953 23353796 23317796 22974646 22389344 21704762
4584B1704762m55059m84302m35792n22033p77540r35941j081253j125369j006252
$$ 21704762 21249703 20765401 20329609 19807576 19030036 18094095 17012842 15887473 14881221
4575A4881221q44048q73688r14386q25184q63238q74773q69119r63974q90488
$$ 14881221 14037173 13163485 12249099 11423915 10560677 9685904 8816785 7852811 6962323
4566F962323p61739o39581o35854l93133l68516m10656k09680k40809k30891j74110
$$ 6962323 6200584 5561003 4925149 4532016 4163500 3752844 3543164 3302355 3071464 2897354
4556B897354k18186j34606m4973j2708j95743r5112j23972j67129p6616n7904
$$ 2897354 2679168 2544562 2499589 2486881 2291138 2196026 2072054 1904925 1828309 1770405
4546A770405n7966m5923j02427p5895O6845n0458j55940j0275P4685o7094m6324
$$ 1770405 1712439 1666516 1564089 1488194 1555039 1504581 1348641 1338366 1413051 1345957 1299633
4535A299633l8844q3001o1437m2252o0712l4161Q3053m0165n4638O9344L5507
$$ 1299633 1260789 1177788 1116351 1074099 1013387 979226 1062279 1022114 967476 1036820 1072327
4524A072327q954J5245j18016q9154R8913p1949n2232M3388j5345o4816N0629
$$ 1072327 1063373 1078618 960602 871448 970361 898412 846180 889568 874223 809407 860036
4513H60036n8402l3241J27929j7222j82008P1223N9513j18245J8133l3503j63197
$$ 860036 801634 768393 896322 879100 697092 768315 827828 709583 727716 694213 531016
4502E31016M4634J02838j29744P4378M8217j65730J6083J20354j64004l4643J80850
$$ 531016 575650 678488 548744 623122 671339 505609 521692 642046 478042 443399 624249
4491F24249p3298m5247J33313j41234j92552J00015M2470n9328J50867O6145j15328
$$ 624249 550951 505704 639017 497783 305231 405246 447716 388388 539255 605400 490072
4480D90072J00969J7266j04296M1446k9147j98058j5406J27631k1961l4047J06262
$$ 490072 591041 608307 504011 545457 516310 318252 302846 430477 408516 374469 480731
4469D80731p9316J7107J23581n2343J3202M4167o7292p4602R8038J5134j11143
$$ 480731 401415 418522 542103 489760 502962 547129 479837 405235 503273 518407 407264
4458D07264J9171l4587N726K820M3097N264M3105L0399L4801J8137r0286N169
$$ 407264 426435 391848 397574 400394 443491 448755 491860 522259 557060 575197 484911 490080
4446D90080l1555k8389K970P0917j49997Q7997J16295q3819J1888N5600j23900
$$ 490080 458525 430136 433106 504023 354026 442023 558318 474499 486387 541987 418087
4435D18087k8660J12173k4878K3324R5548j22227p9941J61382k1073j42885J57773
$$ 418087 389427 501600 476722 500046 595594 473367 393426 554808 533735 390850 548623
4424E48623L7644j72644Q4402R9895j07578r076P1142k02017n5831J90047o3519
$$ 548623 586267 413623 498025 597920 490342 481266 552408 350391 294560 484607 421088
4413D21088k6999J34940j17554n3776J48948l0821m4593M2190j08322r3792J74410
$$ 421088 394089 529029 411475 357699 506647 475826 431233 473423 365101 271309 445719
4402D45719j8577j96974O5070N3055j37515Q4016L4123j8576R618K2211P952J3221
$$ 445719 427142 230168 295238 348293 210778 294794 328917 310341 319959 342170 350122 363343
4390C63343N1043j4350r7097M5735L9505o8349n223O663p2814M7733O4926j1766
$$ 363343 414386 400036 302939 348674 388179 319830 314607 321270 248456 296189 361115 349349
4378C49349J4228p4471n8305M7915J11111M8220m6042j14361P9529P964j1120
$$ 349349 363577 289106 230801 278716 389827 438047 392005 277644 357173 365137 354017
4367C54017N7009m0216j17371L3264M6260N7219Q3731j13270j35594M7732J54178
$$ 354017 411026 370810 253439 286703 332963 390182 473913 360643 225049 272781 426959
4356D26959J389j20364j8573j21757J14093J26900N9489J5023k0953p4141N1470
$$ 426959 428348 307984 289411 167654 281747 408647 468136 483159 462206 388065 439535
4345D39535J23454K548j70076k3130j2566N039P9743M0664j51508r9311J56168
$$ 439535 562989 565537 395461 372331 359765 364804 444547 485211 333703 234392 390560
4334C90560R6448M3953Q797j48609k4083R2169o824M6144p2058r7066J4992J30508
$$ 390560 487008 530961 539758 391149 367066 459235 452411 498555 426497 329431 344423 474931
4322D74931J09830m0855m8319L5415O6911P9342K9300o7075o1400k7956M1169
$$ 474931 584761 543906 495587 531002 597913 677255 706555 639480 578080 550124 591293
4311E91293P5198O2745k3956p2745R5599Q0126J8850o3733M7901k2617p8678J14461
$$ 591293 666491 729236 705280 632535 728134 808260 827110 763377 811278 788661 709983 824444
4299H24444P4374j08805n8609K7346j7027J07093R0858j39929K8624O4523K0950
$$ 824444 898818 790013 731404 758750 741723 848816 939674 799745 828369 892892 913842
4288I13842M9676N1012o7052m0917P8547m1540n077L0775J6616m9232M9733J19109
$$ 913842 963518 1014530 947478 906561 985108 943568 938491 969266 985882 936650 986383 1105492
4276A105492j1455k4107J3090j0626Q4227Q6210k6362p4853j00409J23172P8845
$$ 1105492 1094037 1069930 1083020 1072394 1156621 1242831 1216469 1141616 1041207 1164379 1243224
4265A243224k0974m0861k0979l1006N7791J06537r025l8052k4523n173K9547Q8737
$$ 1243224 1222250 1181389 1160410 1129404 1187195 1293732 1284707 1246655 1222132 1216959 1246506 1335243
4253A335243m7285r8194O6098K12R623J05015Q608p9893J38055N6870N3121M0438
$$ 1335243 1287958 1189764 1255862 1256074 1265697 1370712 1379320 1299427 1437482 1494352 1547473 1587911
4241A587911p151j18166O8822J80525m0797K1355k4437n7761J52404K35204O734
$$ 1587911 1580760 1462594 1531416 1711941 1671144 1692499 1668062 1610301 1762705 1997909 2004643
4230B004643J369Q1365j07831P1937K06989L7962J4072R3890O0577J37175K98733
$$ 2004643 2006012 2087377 1979546 2051483 2258472 2296434 2310506 2404396 2464973 2602148 2900881
4219B900881J48580M2863J61050J84796J99211K54439J35298P8182J94650K31603
$$ 2900881 3049461 3092324 3253374 3438170 3637381 3891820 4027118 4105300 4299950 4531553
4209D531553K50616L11314K84214J63781L08446M32568K83849M40989L82398K45849
$$ 4531553 4782169 5093483 5377697 5541478 5849924 6282492 6566341 7007330 7389728 7635577
4199G635577M54433M92133L93800M32613M44905L72547M79692O65144M37688M07692
$$ 7635577 8090010 8582143 8975943 9408556 9853461 10226008 10705700 11370844 11808532 12216224
4189A2216224N13453M38014M95687O32227M98209M69199N49134M39777M77641
$$ 12216224 12729677 13167691 13663378 14295605 14793814 15263013 15812147 16251924 16729565
4180A6729565N84234M16078L46048M51599M37430L83082N43829L15376L06288
$$ 16729565 17313799 17729877 18075925 18527524 18964954 19348036 19891865 20207241 20513529
4171B0513529M40572M43450L66449M47774L96433L22536N43719M04943K74989
$$ 20513529 20954101 21397551 21764000 22211774 22608207 22930743 23474462 23879405 24154394
4162B4154394M33103L81088K80480L67507M26343K98014L84725K79794K01023
$$ 24154394 24587497 24968585 25249065 25616572 26042915 26340929 26725654 27005448 27206471
4153B7206471L97421L39200K02244J24342K04322J06146J38700K26278Q368O4126
$$ 27206471 27603892 27943092 28145336 28269678 28474000 28580146 28718846 28945124 28953492 29017618
4143B9017618Q1729P1497J3384M9049j39418k13432j24267l91451l47786k85573
$$ 29017618 29099347 29170844 29184228 29233277 29093859 28880427 28756160 28364709 28016923 27731350
4133B7731350m20200m65499l95252n12672n44756m47201n79766o47879n28037
$$ 27731350 27311150 26845651 26450399 25937727 25392971 24945770 24366004 23718125 23190088
4124B3190088n27622o72328p14706p23082q42207o92676p18073q04742p49006
$$ 23190088 22662466 21990138 21275432 20552350 19710143 19017467 18299394 17494652 16745646
4115A6745646o88431p17374o49965o52581p00912n94870n38698n65820o65738
$$ 16745646 16057215 15339841 14689876 14037295 13336383 12741513 12202815 11636995 10971257
4106A0971257o22363o36851o05791m25856m39380m97581m44954m85672m32441
$$ 10971257 10348894 9712043 9106252 8680396 8241016 7743435 7298481 6812809 6380368
4097F380368j78016k63773m11350k94494k45683l17716j32774j75582k74228k47872
$$ 6380368 6202352 5938579 5527229 5232735 4987052 4669336 4536562 4360980 4086752 3838880
4087C838880r8854k11279j13012q9574k08979r0534m3210p4437j43111o5998r8497
$$ 3838880 3740026 3528747 3415735 3326161 3117182 3026648 2983438 2909001 2765890 2699892 2601395
4076B601395m4812m5984k9326q8191J4938l4087m3999N079j8398m094p3386M644
$$ 2601395 2556583 2510599 2481273 2393082 2408020 2373933 2329934 2335013 2316615 2312521 2239135 2243779
4064B243779K1837K1623o8965o9510Q165j8808m3577N1107P2453n8042j3929N8715
$$ 2243779 2265616 2287239 2218274 2148764 2156929 2138121 2094544 2145651 2218104 2160062 2146133 2204848
4052B204848o35J24113l1758j39838L9034R310p9372O4272K3684j45149j8967
$$ 2204848 2204213 2328326 2296568 2156730 2195764 2205074 2125702 2189974 2213658 2068509 2049542
4041B049542L5558n4329l7701p559m5666N0096O8503l8763j11453N3608N8316
$$ 2049542 2085100 2030771 1993070 1985511 1939845 1989941 2058444 2019681 1908228 1961836 2020152
4030B020152q5443L5315j2968l8388O1366N117m8435P2608J10312k4847n1759
$$ 2020152 1934709 1970024 1957056 1918668 1980034 1985151 1936716 2009324 2119636 2094789 2043030
4019B043030L9549l3361K9364N6903n4018j09913Q9921P5949l4236J18916q9553
$$ 2043030 2082579 2049218 2078582 2135485 2081467 1971554 2061475 2137424 2103188 2222104 2132551
4008B132551k0386J17927P9149r8332Q0983l7629j14392L2412L6563p1989r0790
$$ 2132551 2112165 2230092 2309241 2210909 2291892 2254263 2139871 2172283 2208846 2136857 2046067
3997B046067P5409M129Q3279N7316j3652k0704P6700r3794m7641R0687k5721j0307
$$ 2046067 2121476 2125605 2208884 2266200 2252548 2231844 2308544 2214750 2167109 2257796 2232075 2221768
3985B221768J3480L4691n1165L7848N0046J6902J05399P484N7836r631q7593q36
$$ 2221768 2235248 2269939 2218774 2256622 2306668 2323570 2428969 2436453 2494289 2484658 2397065 2396229
3973B396229O8954K7483j5468Q1397o5580K9636J28294m2661O5422J69734l2398
$$ 2396229 2465183 2492666 2477198 2558595 2493015 2522651 2650945 2608284 2673706 2843440 2811042
3962B811042j3158J19710J4940j3893M7067k8744n1499J67496L2671o9160J34306
$$ 2811042 2797884 2917594 2932534 2918641 2965708 2936964 2885465 3052961 3085632 3016472 3150778
3951C150778J26105n2145R5097K09666l5786M6713J77484k6184K0464J47439m1292
$$ 3150778 3276883 3224738 3319835 3529501 3493715 3540428 3717912 3691728 3712192 3859631 3818339
3940C818339J06917K83100R9686R9274K17144J04880K59148M28047K39370K59839
$$ 3818339 3925256 4208356 4308042 4407316 4624460 4729340 4988488 5416535 5655905 5915744
3930E915744M41314M41861M41572P17510P55386O17718P76029Q54877Q71551J125549
$$ 5915744 6357058 6798919 7240491 7958001 8713387 9331105 10107134 10962011 11833562 12959111
3920A2959111J390742J446800J733285K130607K267619K523672K733639K664437
$$ 12959111 14349853 15796653 17529938 19660545 21928164 24451836 27185475 29849912
3912B9849912K585950K339977J901154J521689R50665N28067J64611N3735k7188
$$ 29849912 32435862 34775839 36676993 38198682 39149347 39677414 39842025 39895760 39868572
3903C9868572o7404j04254q1333J44504J34926M9144R676k78932o48460r27572
$$ 39868572 39801168 39696914 39615581 39760085 39895011 39944155 39953831 39674899 39026439 38098867
3893C8098867j400887j921063k246144k346428k523364k396922k196781k190496
$$ 38098867 36697980 34776917 32530773 30184345 27660981 25264059 23067278 20876782
3885B0876782j820252j530256j532163j196700r58308r37480q42040n65308o69041
$$ 20876782 19056530 17526274 15994111 14797411 13839103 12901623 12059583 11494275 10825234
3876A0825234n93083l44230l51002m27213k20901k59738l74018j26175j17676
$$ 10825234 10232151 9887921 9536919 9109706 8888805 8629067 8255049 8128874 8011198
3867H011198k26445j40365k6309q5420o9726O576q1911l1258J90365P1365l9506
$$ 8011198 7784753 7644388 7618079 7532659 7462933 7469509 7387598 7356340 7546705 7618070 7578564
3856G578564R6152K22337K55517K32213L12750K45978L42142M44309L17635K86057
$$ 7578564 7674716 7897053 8152570 8384783 8697533 8943511 9285653 9729962 10047597 10333654
3846A0333654K28401J1186j30867n3780J5936k9403r0199o9981k379J10185J84568
$$ 10333654 10562055 10573241 10442374 10388594 10404530 10375127 10284928 10214947 10212568 10322753 10507321
3835A0507321J65047R8459J51243J27465J93124K43200J76008O1952J53568J35382
$$ 10507321 10672368 10770827 10922070 11049535 11242659 11485859 11661867 11723819 11877387 12012769
3825A2012769J37918J51630Q8464M1474K2955J19400J36918M3247l0235j06682
$$ 12012769 12150687 12302317 12390781 12432255 12455210 12574610 12711528 12754775 12724540 12617858
3815A2617858j88098O7842N9587j67123l4953n2268q7544P7186J18849l1063l5708
$$ 12617858 12429760 12497602 12557189 12390066 12355113 12302845 12215301 12292487 12411336 12380273 12344565
3804A2344565O7598J17289K01254L07933K66696K47742L27495M66823N17706O96134
$$ 12344565 12412163 12529452 12730706 13038639 13305335 13553077 13880572 14347395 14865101 15561235
3794A5561235P40478P37120J017792J248915J337475J533820J564270J753738
$$ 15561235 16301713 17038833 18056625 19305540 20643015 22176835 23741105 25494843
3786B5494843K003702K231452K366017K421547K581298K588126K647366K779136
$$ 25494843 27498545 29729997 32096014 34517561 37098859 39686985 42334351 45113487
3778D5113487K850175K608213K582337K785833K775350K748959K692542K623155
$$ 45113487 47963662 50571875 53154212 55940045 58715395 61464354 64156896 66780051
3770F6780051K621655K731813K654317K418234K235894J933803J644940J469984
$$ 66780051 69401706 72133519 74787836 77206070 79441964 81375767 83020707 84490691
3762H4490691J265681Q69253N58121K37017R6990J40898O217k69041k57060k71612
$$ 84490691 85756372 86625625 87183746 87420763 87517753 87658651 87664868 87395827 87138767 86867155
3752H6867155k39468n8989j93730l94085m46869p15010q67461j116402j433968
$$ 86867155 86627687 86568698 86374968 85980883 85534014 84819004 83951543 82835141 81401173
3743H1401173j818146k038938k174458k194804k067300k113759j858384j603597
$$ 81401173 79583027 77544089 75369631 73174827 71107527 68993768 67135384 65531787
3735F5531787j316148j024167o78578o03049o11077k69467j20192M5206L04682
$$ 65531787 64215639 63191472 62512894 61909845 61298768 61029301 60909109 60954315 61258997
3726F1258997N32348O92516R64674J480805J537442J604707J601487J269719R51140
$$ 61258997 61791345 62483861 63448535 64929340 66466782 68071489 69672976 70942695 71893835
3717G1893835O47368K68335j27146l51491m89745n27213m04162l56371l85418
$$ 71893835 72541203 72809538 72682392 72330901 71841156 71313943 70909781 70553410 70167992
3708G0167992l92333n41259p93700j060068j530574k229418k632982l026548l382781
$$ 70167992 69775659 69234400 68440700 67380632 65850058 63620640 60987658 57961110 54578329
3699E4578329l478598l613692l632478l344386l079414k798606k510787k257583
$$ 54578329 51099731 47486039 43853561 40509175 37429761 34631155 32120368 29862785
3691B9862785k078377j809021j523228j379553j322290j281623j088280j052764
$$ 29862785 27784408 25975387 24452159 23072606 21750316 20468693 19380413 18327649
3683A8327649q51827q13269p71470p63469p49528n41542n59752o50432n91625
$$ 18327649 17475822 16662553 15891083 15127614 14378086 13836544 13276792 12626360 12034735
3674A2034735m31276n24613n26816l40449m22562n02689l05995m12771l66194
$$ 12034735 11603459 11078846 10552030 10211581 9789019 9286330 8980335 8567564 8201370
3665H201370k23431m03143m43854k40961k63326k27906j55500j48478k48601j67812
$$ 8201370 7977939 7574796 7130942 6889981 6626655 6398749 6243249 6094771 5846170 5678358
3655E678358j20852j86748j54032o7546j36441j66932k806j72918k11929q4039
$$ 5678358 5557506 5370758 5216726 5149180 5012739 4845807 4843001 4670083 4458154 4374115
3645D374115j44847j26300p4899j23078j28891j4548m6493j42305m6717j4304
$$ 4374115 4229268 4102968 4028069 3904991 3776100 3761552 3715059 3572754 3526037 3511733
3635C511733j05062p7093r6960j59443k245m826j41650l8412K6630r8238j29055
$$ 3511733 3406671 3329578 3232618 3073175 3070930 3066104 2924454 2886042 2912672 2814434 2685379
3624B685379p3333j8053k3676R490p6630n1867p7700q7179P883r7779j44057k1603
$$ 2685379 2612046 2593993 2570317 2579807 2503177 2451310 2373610 2286431 2294314 2196535 2052478 2030875
3612B030875K705J7103J4814o8812q8097P0647p1864r6752j2516J0062j44056
$$ 2030875 2033580 2050683 2065497 1996685 1908588 1979235 1907371 1810619 1798103 1808165 1664109
3601A664109l9445O4292j08591M3851l1299k22656o275K15526j85993j09080J41792
$$ 1664109 1624664 1688956 1580365 1624216 1592917 1370261 1363986 1579512 1393519 1284439 1426231
3590A426231j06909p1072J24086j48446j50717J12026q8666r1373J73161l2403
$$ 1426231 1319322 1248250 1372336 1223890 1073173 1185199 1096533 1005160 1178321 1145918
3580A145918k18060L7984P3817p5635Q9737q533k06733j5967J10215n9400p5296
$$ 1145918 927858 965842 1039659 964024 1053761 1045228 838495 822528 932743 873343 798047
3569G98047P1946q4537j12756J79361O5422j25884Q1028o3373k2872O0531N5908
$$ 798047 869993 785456 672700 852061 917483 791599 872627 809254 786382 846913 902821
3558I02821k24745r0070J17569J9437N4344L5887j53945o1933O8958J7145p303
$$ 902821 678076 588006 705575 725012 779356 815243 661298 599365 668323 685468 678165
3547F78165l3581K2520o5668N489R6873m2067n4856k4614q2478N5988P9495L302
$$ 678165 644584 667104 601436 606925 703798 661731 606875 582261 499783 555771 635266 638568
3535F38568q1997l3789O8435p6778J2958J32460k12603j55018J47942J3268o3016
$$ 638568 556571 522782 591217 514439 527397 659857 447254 292236 440178 453446 390430
3524C90430N3398k7928j23032J69978J26856j39681J8626Q544j33291R0409K07749
$$ 390430 443828 415900 292868 462846 589702 450021 468647 477191 343900 434309 642058
3513F42058j91433q3607R4061l5998K4627J23750j10206j16581P7663M8544k8962
$$ 642058 450625 367018 461079 425081 449708 573458 463252 346671 424334 472878 443916
3502D43916J95701l3637k20103L7897R6739l2011K3631M2576j35628O4338K14368
$$ 443916 639617 605980 385877 423774 520513 488502 512133 554709 419081 483419 697787
3491F97787m8155o7356Q4819l8524l3367J00956M0788q8862L5181l965m433J37571
$$ 697787 649632 582276 667095 628571 595204 696160 736948 648086 683267 679302 674869 812440
3479H12440R4592m6452j24781J21630j3172m2311J32437q3044j15869Q2473O8999
$$ 812440 907032 860580 735799 857429 844257 801946 934383 851339 735470 817943 886942
3468H86942p4579j7214q9101n3291P5438J96241l9833q9505O9789m8918q752J21401
$$ 886942 812363 795149 706048 652757 728195 924436 884603 795098 864887 815969 807217 928618
3456I28618n6314o6376M0888m863j3933O8232N2965j00395P843Q0793J6642j3602
$$ 928618 872304 805928 846816 841953 828020 896252 949217 848822 856665 937458 954100 940498
3444I40498J14066j17106r4562J50457N5187o6016K4420P872m3123O3356O9138
$$ 940498 1054564 937458 842896 993353 1048540 982524 1006944 1014816 971693 1035049 1104187
3433A104187n1289o2489M9467l7918r7649O1790O2j39518J582j3094j9571k6445
$$ 1104187 1052898 990409 1039876 1001958 904309 966099 966161 826643 828225 815131 795560 769115
3421G69115N539r9729k5848O9856J5819R939Q4865l2641o9505K5831J7429o7336
$$ 769115 774654 674925 649077 718933 734752 744691 829556 796915 727410 753241 770670 703334
3409G03334o8484m9198j29525R0931J27229N011j50112L0228L7605n3967P5207
$$ 703334 634850 585652 456127 547058 674287 679298 529186 559414 597019 543052 618259
3398F18259l6793p7535l0151p278j0419K1433m1967j14934Q37N6113Q6172N8157
$$ 618259 581466 503931 473780 466502 456083 477516 435549 320615 321452 377565 463737 521894
3386E21894l4534j47313m8554R776N8791m5802l8885n6959j7889R9413J3605l4163
$$ 521894 487360 340047 291493 301269 360060 314258 275373 218414 200525 299938 313543 279380
3374B79380k667q2256k6359Q5290Q7466m971n6326o2816R06J7464L7721r082l4879
$$ 279380 276713 194457 168098 253388 340854 335883 279557 216741 217647 235111 272832 263750 228871
3361B28871J3346n4867Q1543n5420L2541l8663k7449J8551J26642o0369j37450
$$ 228871 242217 187350 268893 213473 246014 207351 179902 198453 325095 264726 127276
3350A27276j9203J5425J4059P3834k9009o6087P0254J14174l3803M1309J6509
$$ 127276 108073 123498 137557 211391 182382 116295 186549 300723 266920 308229 324738
3339C24738j00236K226R8576m6436p9361K4754l9918p9586Q2584O1549o4698J5900
$$ 324738 224502 226728 325304 278868 199507 224261 184343 104757 187341 248890 184192 200092
3327B00092M6052J7029Q4581M7780j09465k747p708j0952j4156L455r9927p0570
$$ 200092 246144 263173 347754 395534 286069 283322 275614 264662 250506 253961 154034 83464
3315H3464L0803P0208j0449K3339M4250k5160M6633M1561q9683m5516o5554m0145
$$ 83464 114267 184475 174026 197365 241615 216455 263088 304649 214966 169450 103896 63751
3303F3751O2761P2150l4884p5582N6568J26112q51L3923R4708J6966q1897K3058
$$ 63751 126512 198662 163778 88196 144764 270876 270025 303948 398656 415622 333725 356783
3291C56783J1240o1817o550k3368J7648J21979J29728M457Q9356K01741O6326
$$ 356783 368023 306206 299656 276288 293936 415915 545643 550100 639456 841197 907523
3280I07523P0123J79326r4680q9030m0038o3335j62578q5074o2315j95576K4693
$$ 907523 977646 1156972 1062292 973262 933224 869889 707311 622237 559922 364346 389039
3269C89039K1989p9385O8498P9143j38596K3330O5906j05179m3983J08207k7591
$$ 389039 411028 331643 400141 479284 340688 364018 429924 324745 280762 388969 361378
3258C61378J8256K41488J72394k6928J18490R4185M9601J81815m4068k90451n1610
$$ 361378 379634 621122 793516 766588 885078 979263 1028864 1210679 1166611 876160 824550
3247H24550j9692j81846j01953l3463j74094k6209J02420p4376o6326K1322l3140
$$ 824550 804858 623012 521059 487596 313502 287293 389713 315337 249011 270333 237193
3236B37193k6454O8038k7193j32914K037j7510m2780N1315M1970o7303M1780Q7918
$$ 237193 210739 278777 251584 118670 120707 103197 60417 111732 153702 86399 128179 216097
3224B16097L6986l0428N1322m7528k6387M3554o0742J6194o7293p008m8333O1991
$$ 216097 253083 222655 273977 226449 200062 243616 182874 199068 131775 124767 76434 138425
3212A38425M0861J1408J47M0398L1812q443l6977p5765q1544j4174P4161M9779
$$ 138425 179286 190694 190841 231239 263051 254608 217631 141866 60322 46148 120309 170088
3200A70088j6397m0039J6386n9325M4637J38998p2755n1348O0966p1989k341O5444
$$ 170088 153691 113652 130038 70713 115350 254348 181593 130245 191211 119222 116881 182325
3188A82325l4946p5820R5275J9686l9413P4282p1662m6551M5351J21195m2576
$$ 182325 147379 71559 166834 186520 147107 221389 149727 103176 148527 269722 227146
3177B27146k2806o8436l6892K7698N6766n7874l9010M6237k7256P6794P8567j77140
$$ 227146 204340 135904 99012 126710 183476 125602 86592 132829 105573 182367 260934 83794
3165H3794j3060J39097n0871M4478O5441j36315n7662L1822K4131K8944O4851
$$ 83794 70734 209831 158960 203438 268879 132564 74902 106724 130855 159799 224650
3154B24650j59340j21220J97170K1212l5709O4088q1275o6119J79030J1369j00191
$$ 224650 65310 -55910 141260 162472 126763 190851 109576 43457 222487 233856 133665
3143A33665L7034p6204q6143Q8158J01431r7963Q405L9870j4594L3559J13237
$$ 133665 170699 94495 8352 96510 197941 99978 108383 148253 133659 167218 280455
3132B80455p0082l6120K8129r5899K8814J26246p9171r6328J35718k2583K0159
$$ 280455 210373 174253 202382 106483 135297 261543 182372 86044 221762 199179 219338
3121B19338M9951r3678j08097P8569J25331o9911M7571q2903j22828K26197m0589
$$ 219338 269289 175611 67514 146083 271414 201503 249074 166171 43343 269540 228951
3110B28951k04591O3519M5790r4525J09782J37283p4538K8096R152j31327L4506
$$ 228951 24360 87879 133669 39144 148926 286209 211671 239767 248919 117592 152098
3099A52098L2116r9350J4180P4682l5817K2628M5533m8047l5584J15850M5826
$$ 152098 184214 84864 99044 173726 137909 160537 206070 158023 122439 238289 284115
3088B84115j8640l8345j23905k7567R3999q8456O4287P4188q3602r53J40335m4756
$$ 284115 265475 227130 103225 75658 169657 81201 145488 219676 136074 135121 275456 230700
3076B30700k1910L9343l1186l1515J0566l3452K7761L0762q8020j6657J38775
$$ 230700 208790 248133 216947 185432 195998 162546 190307 221069 133049 116392 255167
3065B55167m7697j41243P0624K8785n0757J56344l2293j49154n842r124j9225
$$ 255167 207470 66227 136851 165636 114879 271223 238930 89776 83934 74810 55585
3054E5585J04817M3101j00843l1166R0893j03973L5860J59250k11956l0009J43347
$$ 55585 160402 203503 102660 71494 162387 58414 94274 253524 41568 11559 154906
3043A54906o8123l3845J44294j27541r9033J49605o5391r9584J75054k8226j27867
$$ 154906 86783 52938 197232 69691 -29342 120263 54872 -44712 130342 102116 -25751
3032b5751L9478R6782j30691Q9710P4415j34009L3832N1034n3637m501K1199q0506
$$ -25751 13727 110509 -20182 69528 143943 9934 43766 94800 41163 36662 57861 -22645
3020b2645P5661N1137K8158K2396K912o9776r5019M3193L3161Q9963k3515q2099
$$ -22645 53016 104153 132311 154707 157619 87843 -7176 36017 69178 159141 135626 53527
3008E3527k7710k6686M150M7845k1906n1350N3210L4954k3126R0420o7575n8299
$$ 53527 25817 -869 3281 51126 29220 -22130 31080 66034 42908 133328 65753 7454
2996G454n275J9326q4781J05424L9076p9335K126J01002l1178j7038Q7028j28710
$$ 7454 2179 21505 -63276 42148 81224 1889 4015 105017 73839 56801 143829 15119
2984A5119k765J09409j2096j54601N2071M209q9036R9585R9895j87717K4763J38230
$$ 15119 12354 121763 109667 -44934 7137 11346 -77690 21895 121790 -65927 -41164 97066
2972I7066q176N0679L2090j35214l7132P9459o3025Q378N8191r7776o7794J59365
$$ 97066 88890 139569 171659 36445 -687 78772 15747 24125 82316 -15460 -83254 76111
2960G6111M456J5284n0695l1866m8222N6878L1130k0821j1618j7520N8645n4799
$$ 76111 80567 95851 45156 13290 -34932 21946 53076 32255 20637 3117 61762 6963
2948F963P8530l9970r5419L3949J28116L4531j4053j7395k2401l9166P3156o5379
$$ 6963 85493 45523 -49896 -15947 112169 146700 132647 115252 92851 53685 126841 61462
2936F1462p5956M3099p7911j6952M2715O3329k0150j2212o1712m6941J20334O2560
$$ 61462 -14494 28605 -49306 -66258 -23543 39786 19636 7424 -54288 -101229 19105 81665
2924H1665j50047L1158R0356j8196k7797L1052j41527n2083J80921L9358P810
$$ 81665 -68382 -37224 53132 34936 7139 38191 -103336 -155419 25502 64860 72670
2913G2670j4382l6784l2878N2245K3502p4624R136K4755n1560N9040o603K0052
$$ 72670 58288 21504 -11374 40871 64373 -10251 -1115 23640 -27920 31120 24517 44569
2901D4569k3243L8395J6920M0647j8258k8207j1028r9880L398Q0624l8988m1556
$$ 44569 21326 59721 76641 117288 99030 70823 59795 -40085 -36687 43937 4949 -36607
2889c6607O6904l579j0314N9928j10220L1055J0366n8578j8373L533K0726J6895
$$ -36607 30297 26718 16404 76332 -33888 -2833 7533 -51045 -69418 -65885 -45159 -28264
2877b8264O2215k6711n0807P7606L8354p2192O8350Q4730q3296r9434K1405o4258
$$ -28264 33951 7240 -43567 34039 72393 201 68551 153281 69985 -29449 -8044 -72302
2865g2302N0758P2128m8109n2863L2072m3986k8419J33448j3055k6041O9203n7865
$$ -72302 -21544 50584 2475 -50388 -18316 -62302 -90721 42727 29672 3631 72834 14969
2853A4969m6317J67939p6387j04182O6604o7679Q14R7706L5857j37995j5175R8088
$$ 14969 -31348 136591 60204 -43978 22626 -45053 -44239 53467 89324 -48671 -63846 34242
2841C4242R998Q9882l1173j00010j0269N4759m9762l4023O7916j15331j7407J03304
$$ 34242 44240 134122 102949 2939 -7330 47429 -2333 -36356 31560 -83771 -101178 2126
2829B126M0895k982J7218r7825O62J28352K3281p2663j7006o3079l0868J37798
$$ 2126 43021 40039 57257 -40568 -39906 88446 111727 39064 22058 -41021 -71889 65909
2817F5909O841o9009k4065p9289K5358J28961N4811r4716j9221p021k0639J10996
$$ 65909 72750 3741 -20324 -99613 -74255 54706 109517 14801 -4420 -11441 -32080 78916
2805G8916K3424n9709l5258L7k9520R2164j3877n4824R7288N2746p2334K499j285
$$ 78916 102340 42631 7373 7410 -22110 70054 56177 1353 98641 151387 79053 81552 80267
2792H0267r5335O3857N5255p2894N5614l3978p0239j5288J19218M2351r2279J0152
$$ 80267 -15068 48789 104044 31150 86764 52786 -17453 -32741 86477 128828 36549 46701
2780D6701j46214P4024R6479j4402o9093j7723l0392L3423R2396P760m6564Q253
$$ 46701 -99513 -25489 70990 56588 -12505 -30228 -60620 -27197 65199 72959 26395 34648
2768C4648j0439P2086Q1791j8800j38050M033P5153m4411Q4815o1610j60524J0259
$$ 34648 24209 96295 178086 159286 21236 25269 100422 56011 140826 79216 -81308 -71049
2756g1049M6000L5238O402lk7069M8239J5227k3123m3043n3199m1017J07336J27735
$$ -71049 -25049 10189 16591 16588 -10481 37758 52985 29862 -13181 -66380 -107397 -61 127674
2743A27674n7982q2135J9829l6874m39J51119n951j04184j3078N2220K2204J37798
$$ 127674 69692 -12443 7386 -29488 -29927 121192 115241 11057 -2021 50199 72403 210201
2731B10201r8717k05830j7934Q0088M4087P5269J8173m4274j7990L2657R923r5428
$$ 210201 111484 -94346 -112280 -32192 11895 87164 105337 61063 43073 75730 85653 -9775
2719i775K163m7230N0155K5037n9377J9421k8109J3926M571J31648k2005n8223
$$ -9775 -7612 -54842 -4687 20350 -39027 -19606 -47715 -33789 -29218 102430 80425 22202
2707B2202M7403L2942j07651q357P186o8345l5010J7918k066K2117J23732o8969
$$ 22202 69605 102547 -5104 -13461 -6275 -74620 -109630 -91712 -93778 -71661 52071 -16898
2695a6898L169N7814j7107l0227L2248O3866j00709N7064l372o3604r400L3867
$$ -16898 -13729 44085 26978 -3249 28999 92865 -7844 49220 45848 -17756 -27156 6711
2683F711Q321J909o9644k9551J48872j5144K1815M427n6379l1453l6229K5817
$$ 6711 15032 16941 -52703 -82254 66618 51474 73289 77716 21337 -10116 -46345 -20528
2671b0528N7958J6838n4563j1161M9790k0801r011K8208j5822l246N4163j7755
$$ -20528 37430 54268 -295 -11456 38334 17533 8522 36730 20908 17662 71825 54070
2659E4070p4309M4976L4837p3448k2221Q1292o2244m4814J3620j6401L6731P3121
$$ 54070 -20239 24737 59574 -13874 -36095 45197 -17047 -61861 -48241 -64642 -27911 45210
2647D5210r1422p8566J38258n916l8964P6172q9826q1520P7630L4316J1944N9364
$$ 45210 -46212 -124778 13480 7564 -31400 44772 -45054 -126574 -48944 -14628 -2684 56680
2635E6680j4676n3647O1126L4602p4786o157M4088p2453J3122M6624n7488j4127
$$ 56680 42004 -11643 49483 84085 9299 3142 47230 -25223 -12101 34523 -22965 -37092
2623c7092Q3211j3056J2034P7185l6053j14188K1740m026Q851J4158j43208k7340
$$ -37092 46119 33063 45097 122282 86229 -27959 -6219 -10245 -1394 12764 -130444 -157784
2611a57784J11310M1876k20J8943l444j4176j3735J12833J226o1567O930k4123
$$ -157784 -46474 -4598 -4818 14125 10681 -3495 -17230 95603 96829 35262 42192 18069
2599A8069k5048N718o6274q014N3491m9232R3660J10932j00775k1851O7500n0855
$$ 18069 -6979 -1261 -67535 -75549 -22058 -71290 22370 133302 32527 10676 78176 27321
2587B7321K8720Q2125j9320p5450J5968j7278P3129j16797q5039J5119K6011m9117
$$ 27321 56041 138166 118846 43396 59364 42086 115215 -1582 -86621 -71502 -45491 -94608
2575i4608N3351N8059j5601K4015Q3957k1212o8707L9017o3276n5771L0363K9023
$$ -94608 -41257 16802 1201 25216 109173 87961 19254 58271 -5005 -60776 -30413 -1390
2563a390n3360k98r037k778J7192J566J8780K3440P2091Q022p1125j382k4980
$$ -1390 -54750 -55048 -64085 -66863 -49671 -48105 -29325 -5885 66206 74228 3103 1721 -23259
2550b3259m1541M9839p0990K0729N9291p4794J7362J27942J1969p8243M971n2756
$$ -23259 -64800 -14961 -85951 -65222 -5931 -80725 -63363 64579 76548 -1695 3276 -49480
2538d9480o8479Q7531O8697j13519N9528L5518J8750m0167k3668n3710M2524O2028
$$ -49480 -117959 -30428 38269 -75250 -15722 19796 38546 -1621 -25289 -78999 -36475 25553
2526B5553p1154M8590P621n1422j9560L5916n0244K4047K5314L2652N6143m7288
$$ 25553 -45601 2989 10610 -40812 -60372 -24456 -74700 -50653 -25339 7313 63456 16168
2514A6168o5080N432K7301K0484K6003L7356l2592l6991M962n7398K6410n6374
$$ 16168 -48912 -43480 -16179 4305 30308 67664 35072 -1919 3043 -54355 -27945 -84319
2502h4319J701P778M8500l3613j5336L5609L7161m4488K387p187m2166L3431O5713
$$ -84319 -82618 -74840 -26340 -59953 -75289 -39680 -2519 -47007 -44620 -51807 -93973 -60542 5171
2489E171k7166N102J1854j00289J10156K7375k8809P9885L4557o4101m5709O887
$$ 5171 -21995 -16893 -5039 -105328 4828 32203 3394 83279 117836 53735 8026 14913
2477A4913n01k770k7144m6491m6284J10301K7043L782J7381l3160n565K6954O08
$$ 14913 14412 11642 -15502 -61993 -108277 2024 29067 32849 50230 17070 11505 38459 39067
2464C9067m1659K6952K2394p4331M6504L6284q75l5937J4088R958N4458M5698
$$ 39067 -2592 24360 46754 -27577 18927 55211 54336 18399 32487 42445 96903 142601
2452A42601j31215n1132R31l38M3549O2508m0466o2964M2156Q2865j0812k2205
$$ 142601 11386 -39746 -38815 -39153 4396 66904 26438 -36526 5630 88495 77683 55478
2440E5478k2258q7898N7280M9083Q417m0660o5313K6439O6826J7729j11023o176
$$ 55478 33220 -54678 2602 51685 60102 19442 -45871 -19432 47394 65123 -45900 -52076
2428e2076J4099K7837N9317Q4153r4807l5835p5244L3207J03383j0717j41258
$$ -52076 -37977 -10140 49177 133330 38523 2688 -72556 -39349 64034 53317 -87941
2417h7941K8005J12005O0979J5856n3997q4455R642M649m3663N5310O7542j43526
$$ -87941 -59936 52069 113048 128904 74907 -9548 94 4743 -38920 16390 83932 -59594
2405e9594L0913Q9381p8798J7249l1993r4793P029J41809P9002O574K5589l7343
$$ -59594 -28681 60700 -18098 -849 -32842 -127635 -120606 21203 100205 106779 132368 95025
2393I5025o3026R0801L011j73205J0260M596J5694N5763l2492l3383M9644K6090
$$ 95025 31999 122800 125811 -47394 -37134 -32538 -16844 38919 6427 -26956 22688 48778
2381D8778j3762L8389k5204L0848M8359N0251l2758L7233j6956j37398k8207J52422
$$ 48778 35016 73405 48201 79049 127408 177659 144901 182134 165178 27780 -427 151995
2369A51995k2211j2177J8077j8824O574K0621k009k2378O1518q2907Q156M8583
$$ 151995 129784 117607 135684 116860 123434 144055 142046 119668 181186 98279 106435 155018
2357A55018k0690m5186K9322K4233k5102P8241m9328n0477M7427O7700K2946J7157
$$ 155018 134328 89142 118464 142697 117595 195836 146508 96031 143458 211158 234104 251261
2345B51261p3830q0423R1297L1275j5114L5369j2372m3056R4797J80990J5561
$$ 251261 177431 97008 188305 219580 204466 239835 227463 184407 279204 460194 475755
2334D75755J2045L2853O5778L8815J02184J03308l5754J34591P3309K25691M30908
$$ 475755 487800 520653 586431 625246 727430 830738 794984 929575 1002884 1228575 1659483
2323A659483M91274P37656Q40810P98594O55428M93184J98773k52278n50206o54158
$$ 1659483 2150757 2888413 3729223 4527817 5183245 5676429 5875202 5622924 5072718 4418560
2313D418560o74982o00163n34529n40027l65174k03534j95621j45815j59599j59416
$$ 4418560 3743578 3143415 2608886 2068859 1703685 1500151 1304530 1158715 999116 839700
2303H39700r4102O7136N424j08257j72065j01646M7165N3363m2446j23699n1737
$$ 839700 745598 812734 818158 709901 537836 436190 483355 536718 494272 370573 318836
2292C18836k1757N2453P7463q1762p7185J4145k2942q054P2087p8489r8256L7569
$$ 318836 297079 349532 426995 345233 268048 282193 259251 251197 323284 244795 146539 184108
2280A84108N7787m017k4485r5699m398M6331j9007j5975Q7490n4188o2872M5139
$$ 184108 241895 237878 213393 117694 113296 159627 140620 124645 212135 157947 95075 140214
2268A40214K3837l5462j8326N4540n5825P6572k5839j28477M4791K9147j4118
$$ 140214 164051 128589 110263 164803 108978 185550 159711 31234 76025 105172 91054
2257I1054K725J05239j14084n2769J15034p5298n4400L9432N1772k2785M1826
$$ 91054 93779 199018 84934 32165 147199 71901 17501 56933 108705 85920 127746
2246A27746q6145m1433l235k6285k1464J03066J9764p9047M8699N9039j51124
$$ 127746 41601 168 -3067 -29352 -50816 52250 72014 -7033 41666 100705 -50419
2235e0419J5625J00807o5212K6937N155j3086n410N0278Q695l5974K3175K949
$$ -50419 -34794 66013 801 27738 32893 19807 14397 64675 73370 37396 60571 63520
2223F3520L1025m425K1783n9050m8002M093j8348K3415J5779J4362j08067L575
$$ 63520 94545 90120 111903 52853 4851 8944 -9404 14011 29790 44152 -63915 -60340
2211f0340Q8865O712m9905j0519L5252m6469J17325k5533j14128O1084O462n2994
$$ -60340 28525 35237 -14668 -25187 10065 -36404 80921 55388 -58740 2344 8806 -44188
2199d4188R291R1126j09845p2510N4960n9163M4012Q4995K062o9749P2704j4852
$$ -44188 -34897 56229 -53616 -126126 -71166 -130329 -86317 -1322 740 -69009 3695 -11157
2187a1157o0506M8407n5709p6687J06231J10154j08502L2515j64n0681L1665N5375
$$ -11157 -71663 -23256 -78965 -155652 -49421 60733 -47769 -15254 -15418 -66099 -34434 20941
2175B0941n9257n414K9589k8841J7509O1953q3430o5696J01347K1667q9551O7713
$$ 20941 -38316 -43730 -14141 -42982 -25473 36480 -46950 -112646 -11299 10368 -79183 -11470
2163a1470L6651m4185R20n386l9059k2325L9730o0067m0320M7513L4866n6800
$$ -11470 25181 -19004 -18084 -23470 -62529 -84854 -45124 -105191 -145511 -97998 -63132 -119932
2151a19932J9332J8072k0838Q7145l719l5632O972N5362J1559l5058j2942L9784
$$ -119932 -100600 -82528 -103366 -16221 -19940 -55572 -48600 6762 18321 -16737 -29679 10105
2139A0105k2789L8564j4656m8409M607r760P805j1999L3049l4579K3431m4201
$$ 10105 -12684 25880 11224 -37185 -32578 -42338 -34533 -46532 -13483 -48062 -24631 -68832
2127f8832J2123K6668M0107k8275p2935L00j4126j6737Q2340N1213l6421K7535
$$ -68832 -56709 -30041 10066 -18209 -91144 -90844 -104970 -121707 -39367 11846 -24575 2960
2115B960R188n3294r334j5986J5605M3877M523q0794n744R7109l2368k8353O4790
$$ 2960 12148 -41146 -50480 -66466 -50861 -6984 -2461 -83255 -88999 8110 -24258 -52611 12179
2102A2179m240m9402L8387J4821o2938J8615N474k9399O9334j9388j0285m2949
$$ 12179 7939 -41463 -3076 11745 -51193 -32578 -27104 -56503 12831 -6557 -16842 -59791
2090e9791L4154R06K284k3576R725K6934j2192L433l8429J2536l4085k6194J4978
$$ -59791 -25637 -24731 -22447 -46023 -36298 -9364 -21556 -18123 -56552 -44016 -78101 -104295 -89317
2077h9317N6350k4319l6711J3983M4889p36K9865K3403m8080K0091k2097k6125
$$ -89317 -32967 -57286 -93997 -80014 -35125 -35861 -5996 17407 -30673 -10582 -32679 -58804
$$ [...]
##END NTUPLES=NMR SPECTRUM
##END=
