##TITLE=1H_EC-3384(6)f
 200.13Hz, CDCl3.
 8 sc
5.8.2026
##JCAMPDX= 6.0         $$ Bruker NMR JCAMP-DX V2.0
##DATA TYPE= NMR SPECTRUM
##DATA CLASS= NTUPLES
##ORIGIN= UXNMR, Bruker Analytische Messtechnik GmbH
##OWNER= pz
$$ XWIN-NMR		Version 3.5
$$ Wed Aug  5 12:36:12 2026 Russian Standard Time (UT+4h)  she@DPX200
##.OBSERVE FREQUENCY= 200.1313
##.OBSERVE NUCLEUS= ^1H
##.ACQUISITION MODE= SIMULTANEOUS
##.ACQUISITION SCHEME= undefined
##.AVERAGES= 8
##.DIGITISER RES= 18
##SPECTROMETER/DATA SYSTEM= spect
##.PULSE SEQUENCE= zg30
##.SOLVENT NAME= CDCl3
##.SHIFT REFERENCE= (INTERNAL, CDCl3, 0, 15.6775)
##AUDIT TRAIL= $$ (NUMBER, WHEN, WHO, WHERE, WHAT)
$$ ##TITLE= Audit trail, XWIN-NMR		Version 3.5
$$ ##JCAMPDX= 5.01
$$ ##ORIGIN= Bruker BioSpin GmbH
$$ ##OWNER= she
$$ F:/spectra/data/she/nmr/H-C/1/pdata/1/auditp.txt
$$ ##AUDIT TRAIL=  $$ (NUMBER, WHEN, WHO, WHERE, WHAT)
(   1,<2026-08-05 12:34:24.53 +0400>,<she>,<DPX200>,
      <created by zg, POWCHK disabled, PULCHK disabled
       configuration hash MD5:
       00 E9 B6 7A A2 85 ED C7 34 08 36 98 17 FE 4E 26
       data hash MD5: 16K
       42 56 8E 1D DB 10 7F 85 81 27 81 C3 72 53 BF 6D>)
(   2,<2026-08-05 12:34:27.79 +0400>,<she>,<DPX200>,
      <Start of raw data processing
       efp BC_mod = 2 LB = 0.25 FT_mod = 6 PKNL = 1 PHC0 = -4219.616 PHC1 = 12.5923 SI = 16K 
       data hash MD5: 16K
       D0 06 07 8A 90 C6 F1 C9 2E D9 0F F6 A7 B2 BE 77>)
(   3,<2026-08-05 12:35:02.32 +0400>,<she>,<DPX200>,
      <pk PHC0 = -159.0041 PHC1 = 0 
       data hash MD5: 16K
       28 37 A7 1C E6 E4 D1 34 55 5E E2 64 17 02 FC 57>)
(   4,<2026-08-05 12:35:06.54 +0400>,<she>,<DPX200>,
      <abs ABSG = 5 
       data hash MD5: 16K
       B0 EA 26 F4 2B 84 31 E8 67 F9 44 9A 58 DD 8F FD>)
$$ ##END=
$$ 
$$ hash MD5
$$ 21 1C 65 23 2C CD AB F8 B9 A4 A4 1E 63 AD FC 67
##$RELAX= 
##$RELAX= 
##$RELAX= 
##$RELAX= 
##$RELAX= 
##$RELAX= 
$$ Bruker specific parameters
$$ --------------------------
##$DU= <F:/spectra>
##$EXPNO= 1
##$NAME= <H-C>
##$PROCNO= 1
##$TYPE= <nmr>
##$USER= <she>
##$AMP= (0..31)
100 100 100 100 100 100 100 100 100 100 100 100 100 100 100 100 100 100 
100 100 100 100 100 100 100 100 100 100 100 100 100 100 
##$AQSEQ= 0
##$AQ_mod= 1
##$AUNM= <au_zg>
##$AUTOPOS= <>
##$BF1= 200.13
##$BF2= 200.13
##$BF3= 200.13
##$BF4= 200.13
##$BF5= 200.13
##$BF6= 200.13
##$BF7= 200.13
##$BF8= 200.13
##$BYTORDA= 1
##$CFDGTYP= 0
##$CFRGTYP= 5
##$CHEMSTR= <none>
##$CNST= (0..31)
1 1 145 1 1 1 1 1 1 1 1 1 1 1 1 1 1 1 1 1 1 1 1 1 1 1 1 1 1 1 1 1 
##$CPDPRG= <>
##$CPDPRG1= <>
##$CPDPRG2= <>
##$CPDPRG3= <>
##$CPDPRG4= <mlev>
##$CPDPRG5= <mlev>
##$CPDPRG6= <mlev>
##$CPDPRG7= <mlev>
##$CPDPRG8= <mlev>
##$CPDPRGB= <>
##$CPDPRGT= <>
##$D= (0..31)
0 0.7 0 0 0 0 0 0 0 0 0 0.03 0 0 0 0 0 0 0 0 0 0 0 0 0 0 0 0 0 0 0 0 
##$DATE= 1785918863
##$DBL= (0..7)
120 120 120 120 120 120 120 120 
##$DBP= (0..7)
150 150 150 150 150 150 150 150 
##$DBP07= 0
##$DBPNAM0= <>
##$DBPNAM1= <>
##$DBPNAM2= <>
##$DBPNAM3= <>
##$DBPNAM4= <>
##$DBPNAM5= <>
$$ [...]
##$SUBNAM3= <"">
##$SUBNAM4= <"">
##$SUBNAM5= <"">
##$SUBNAM6= <"">
##$SUBNAM7= <"">
##$SUBNAM8= <"">
##$SUBNAM9= <"">
##$SW= 18.0517328524113
##$SWIBOX= (0..15)
0 0 2 0 0 0 0 0 0 0 0 0 0 0 0 0 
##$SW_h= 3612.71676300578
##$TD= 16384
##$TD0= 1
##$TE= 0
##$TE2= 300
##$TE3= 300
##$TEG= 300
##$TL= (0..7)
0 120 120 120 120 120 120 120 
##$TP= (0..7)
150 150 150 150 150 150 150 150 
##$TP07= 0
##$TPNAME0= <>
##$TPNAME1= <>
##$TPNAME2= <>
##$TPNAME3= <>
##$TPNAME4= <>
##$TPNAME5= <>
##$TPNAME6= <>
##$TPNAME7= <>
##$TPOAL= (0..7)
0.5 0.5 0.5 0.5 0.5 0.5 0.5 0.5 
##$TPOFFS= (0..7)
0 0 0 0 0 0 0 0 
##$TUNHIN= 0
##$TUNHOUT= 0
##$TUNXOUT= 0
##$USERA1= <user>
##$USERA2= <user>
##$USERA3= <user>
##$USERA4= <user>
##$USERA5= <user>
##$V9= 5
##$VALIST= <valist>
##$VCLIST= <CCCCCCCCCCCCCCC>
##$VD= 0
##$VDLIST= <DDDDDDDDDDDDDDD>
##$VPLIST= <PPPPPPPPPPPPPPP>
##$VTLIST= <TTTTTTTTTTTTTTT>
##$WBST= 1024
##$WBSW= 4
##$XGAIN= (0..3)
0 0 0 0 
##$XL= 0
##$YL= 0
##$YMAX_a= 1035281
##$YMIN_a= -921515
##$ZGOPTNS= <>
##$ZL1= 120
##$ZL2= 120
##$ZL3= 120
##$ZL4= 120
##$ABSF1= 15.51
##$ABSF2= -2.541849
##$ABSG= 5
##$ABSL= 3
##$ALPHA= 0
##$AQORDER= 0
##$ASSFAC= 0
##$ASSFACI= 0
##$ASSFACX= 0
##$ASSWID= 0
##$AUNMP= <proc_1d>
##$AZFE= 0.1
##$AZFW= 0.1
##$BCFW= 0
##$BC_mod= 2
##$BYTORDP= 0
##$COROFFS= 0
##$CY= -3
##$DATMOD= 1
##$DC= 0
##$DFILT= <>
##$DTYPP= 0
##$F1P= 0
##$F2P= 0
##$FCOR= 1
##$FTSIZE= 16384
##$FT_mod= 6
##$GAMMA= 0
##$GB= 0
##$INTBC= 1
##$INTSCL= 3.241238e-09
##$ISEN= 128
##$LB= 0.25
##$LEV0= 0
##$LPBIN= 0
##$MAXI= 10000
##$MC2= 0
##$MEAN= 0
##$ME_mod= 0
##$MI= 1.114404
##$NCOEF= 0
##$NC_proc= -5
##$NLEV= 6
##$NOISF1= 3.799351
##$NOISF2= 2.8
##$NSP= 0
##$NTH_PI= 0
##$NZP= 0
##$OFFSET= 15.67748
##$PC= 1
##$PHC0= -4378.62
##$PHC1= 12.5923
##$PH_mod= 1
##$PKNL= yes
##$PPARMOD= 0
##$PSCAL= 0
##$PSIGN= 0
##$REVERSE= no
##$SF= 200.129968824307
##$SI= 16384
##$SIGF1= 3
##$SIGF2= 2
##$SINO= 0.751879
##$SIOLD= 32768
##$SREGLST= <19F.Aceton>
##$SSB= 0
##$STSI= 16384
##$STSR= 0
##$SW_p= 3612.71676300578
##$SYMM= 0
##$S_DEV= 0
##$TDeff= 16384
##$TDoff= 0
##$TI= <>
##$TILT= no
##$TM1= 0
##$TM2= 0
##$TOPLEV= 0
##$USERP1= <user>
##$USERP2= <user>
##$USERP3= <user>
##$USERP4= <user>
##$USERP5= <user>
##$WDW= 1
##$XDIM= 16384
##$YMAX_p= 437227365
##$YMIN_p= -85158
$$ End of Bruker specific parameters
$$ ---------------------------------
##NTUPLES= NMR SPECTRUM
##VAR_NAME=  FREQUENCY,     SPECTRUM/REAL,   SPECTRUM/IMAG
##SYMBOL=    X,             R,               I
##VAR_TYPE=  INDEPENDENT,   DEPENDENT,       DEPENDENT
##VAR_FORM=  AFFN,          ASDF,            ASDF
##VAR_DIM=   16384,         16384,           16384
##UNITS=     HZ,            ARBITRARY UNITS, ARBITRARY UNITS
##FACTOR=    0.220516191357247, 1,           1
##FIRST=     3137.53353240192, 0,            0
##LAST=      -475.183230603857, 0,           0
##MIN=       -475.183230603857, -85158,      0
##MAX=       3137.53353240192, 437227365,    0
$$ Real data points
##PAGE= N=1
##DATA TABLE= (X++(R..R)), XYDATA
$$ [...]
7036c28O099k2902K7528L522j5853Q126M488k0986K641O457R891p987j1899k597
7022a3800M017J152r619J34J4362J6411j6233p247J3298k24j4588L490j4049J3321
7008i575l864R98p620k842l285J368K2246N625Q678K904k524j3811k46j0567K3310
6993A0795n232k170J3164j5887q52j3103R782O620q392J4214j1210j8248J2222
6980h297J6501m022J756k5935J1229K419J5588P108o569m059j1911O044m089M302
6966F5J682m334m547p482J9397q807j5186Q535Q928K273k3582K681J5935o742
6952a1184j0314J1631L680j6091r980J5198q798L383j1145Q999P475o961O453
6939a7654J6090j4011p876K352l796j6553J5297j0817J99O579J1383m165J4950
$$ y = [-328, 5771, -17131, 10397, 13919, -1934, 6192, 10680, -10306, -7665, -1208, 8683, 696, -11203, -13800, -9783, -8631, -18250, -18116, -3754, 12657, -3576, -10823, 2475, 2251, -12337, -8847, -22896, -9575, -13439, -12441, -20061, -22903, -26188, -24820, -2574, 3051, 11729, 14633, 12109, -1702, -1948, -12515, 10795, 5563, 3393, 16557, 670, -182, -13285, -3503, 3117, -5275, 8939, -2271, -20519, -8297, 8204, 4182, 5938, -19997, -8768, -6349, 9239, 16347, 9778, 5719, -6192, -148, -4237, 65, 1747, -2587, -7134, -14616, 4781, -4026, -19212, -10677, -1749, 524, -23058, -20377, -4442, -11184, -21498, -9867, -6187, -22278, -32258, -17060, -25858, -22475, -33620, -24621, -17146, -24107, -17654, -1564, -15575, -23451, -21099, -24895, -41448, -26151, -36968, -36769, -30190, -18807, -22972, -8022]
6926h022Q734k2159L127M961L346M364j3812r61K1985q876j865m245J3582j9313
6912a9154J1513J2701k2192P155K760k0871O473M294K540l517j453J9229o784
6899g306j5801J0167k5978k964R845J3895J3834J0454k0812N759l516m045j6615
6886c3083J389J3960j1909m228j856J0151O01l7n944O476L975N219O231J980J745
6871e330j053p949N594j1412k618p36R872P278M798n178j8274k333r22J1696Q058
6856h509l836R856j606j8351n50O487m485p847J6748l040r655O397r954K523n601
6841c1423J2057n853J4395j1622R203L930Q239O694j1194m588L073n288j2228
6828b4605M0574L819j5859q979P135j8258N067Q807O024K89k0923o15q263r445
$$ y = [-8022, 712, -21447, -18320, -13359, -10013, -5649, -19461, -20422, 1563, -7313, -9178, -13423, 159, -19154, -7641, 5060, -17132, -9977, -7217, -28088, -21615, -17321, -14781, -18298, -19751, -522, -7306, -23107, -12940, -38918, -41882, -32037, -18142, -4308, 6146, -14666, -8907, -12423, -16468, -33083, -31694, -17734, -29643, -33871, -35727, -25576, -24975, -25012, -30956, -24480, -20505, -15286, -9055, -7075, -5330, -6383, -14332, -8738, -20150, -22768, -23504, -13632, -6354, -1556, -6734, -25008, -27341, -28263, -16567, -8509, -12345, -2489, -4095, -22446, -22996, -16509, -20994, -28841, -12093, -15133, -24788, -18391, -28345, -25822, -31423, -19366, -25219, -10824, -22446, -13243, -9313, -1074, 5620, -5574, -10162, -7089, -12377, -24605, 15969, 19788, 3929, -5050, 2085, -16173, -11106, -2299, 3725, 4014, -16909, -17524, -25787, -35232]
6814c5232J6580J1061M918p640k831O479r415n226L10J8744K485m648L08p226
6800a1333m301n906O022N564O525j0655m424j9059P913N720L65N524O76M762J301
6785a1306L54J0777j185j7240n60J2393M535J0681j70j6881j1396N590J1267K7518
6771B4377j6409j5656n97p083J0039k654N008L834J1454j0644N001J308j7409
6758i431R59m913j5983J2447J030J6789j6849j0512K3460j655J847m079j3546
6745b0436l533O13k033j0956K6483n663K766j389N986j1564m106Q017j1216K135
6731b4896l689N901j4860n767J3536R684k610K335M96p537o34Q995j7638M673
6717c2011R427K0862k545j3970J2097m949K421m999o648m751J6163j1898j859
$$ y = [-35232, -18652, -7591, -2673, -10313, -13144, -6665, -16080, -21306, -20996, -2252, 233, -4415, -4107, -11333, -15634, -21540, -15518, -9954, -3429, -14084, -18508, -37567, -29654, -23934, -23569, -18045, -17369, -12607, -11306, -10952, -175, -1360, -18600, -19160, -6767, -2232, 8449, 8279, -8602, -19998, -14408, -3141, 24377, 7968, -7688, -8285, -15368, -5329, -7983, -2975, 859, 12313, 1669, 6670, 7978, -9431, -8472, -13385, -29368, -16921, -15891, 898, -15951, -26463, -3003, -4658, -2811, -6890, -20436, -23969, -23356, -25389, -36345, -9862, -15525, -12759, -14148, -8162, -19726, -23832, -15815, -27031, -24896, -28585, -22684, -37544, -43311, -29775, -20091, -22701, -20366, -19870, -27407, -28041, -19046, -36684, -32011, -22584, -1722, -4267, -18237, -6140, -11089, -8668, -13667, -20315, -25066, -8903, -20801, -22660]
6704b2660J6515k4137L759m531n288L486n913L785J6987J0325j2504j0368Q791
6691b1753l141n447K8442K1831o451j4837j224q017K299j5027j2142K8826j3545
6678b0186p130J85J5951N398o174L015l985N62L179j548j1076M277O870J3015
6664B353j0769r330N712q09M455l009j123Q29l302J1895j2050m317J6661P396
6650D592o697n63Q927j0695r293j5714R545K795q512N744M442K0355M420j6093
6636f747K115Q622j202o208r517k2184K4460M11K969O139o635L262o704Q265k972
6621e926J0950k2616p544N064j1444p47L422M349O857K5534O161j2369n648k1580
6607b5537o038N155l932L964p40J127M696J1108o642L936o656j1434J4894M012
$$ y = [-22660, -6145, -30282, -26523, -31054, -36342, -32856, -38769, -34984, -17997, -7672, -20176, -30544, -21753, -24894, -30341, -1899, 19932, 13481, -1356, -2580, -10597, -8298, -23325, -35467, -6641, -20186, -27316, -27131, -11180, -5782, -11956, -8941, -12926, -12364, -9185, -10733, -21809, -17532, -10662, 2353, -8416, -17746, -12034, -12843, -8388, -11397, -12520, -11691, -14993, -3098, -15148, -19465, -2804, 4592, -2105, -2668, 6259, -4436, -13729, -29443, -19898, -17103, -25615, -19871, -15429, 4926, 9346, -6747, -4632, 3990, 2788, -3420, -12937, -35121, -10661, -10250, -7281, -1142, -7777, -4515, -11219, -2954, -5926, 5024, -17592, -25136, -20072, -31516, -32263, -28841, -24492, -17635, 7899, 14060, 1691, -3957, -25537, -31575, -26420, -30352, -26388, -27128, -26001, -21305, -10197, -16839, -12903, -19559, -30993, -16099, -12087]
6593a2087m263K4886j3789r464m262k529P7l984j2582J143J4693Q263K895J3561
6579B558k513j6041J1098o139p487N227J968q14N677R06M15l689P062K865r665
6564h572r703o418k974J1534K343m909N997J0576Q412L806j6339p655l30J5490
6550A258k6366j026L443J340j1307j3566k338O51K4655M574M1M097p770N117p852
6535b5049P192J7019L129m006n788j3074N754K418J5328L813q933q466q865N989
6521a3539j7308k438L497p044J2241K4963j5346K977n406k334K742K115j299J3201
6507b978j5196p327J2418m556j0564r953K5402O834j9357J227p736K107J5007
6494a4672l293n959p564m530J4168n851O751J7125j0422R67r938j0589K5892J2712
$$ y = [-12087, -16350, 8536, -5253, -14717, -18979, -21508, -21431, -25415, -37997, -36854, -22161, -13898, -11003, 2558, 45, -15996, -4898, -11037, -18524, -13297, -11329, -12143, -6466, -5560, -5145, -8834, -1772, 1093, -8572, -18275, -24693, -27667, -16133, -13790, -18699, -12702, -2126, 6286, 10092, -6247, -13902, -14232, 1258, -25108, -26134, -22691, -21351, -32658, -46224, -48562, -47911, -23256, -18682, -18641, -14544, -22314, -17197, -25049, -17857, -838, 2291, -1715, -7503, -20577, -14823, -12405, 2923, 6736, -2197, -10663, -19528, -13539, -30847, -33285, -29788, -36832, -24591, 372, -14974, -11997, -17403, -19737, -16995, -14880, -16179, -2978, -18174, -25501, -13083, -17639, -28203, -38156, -12754, -5920, -25277, -24050, -31786, -29679, -14672, -17965, -23924, -31488, -36018, -21850, -27701, -20950, -3825, -14247, -13280, -23218, -33807, -7915, 4797]
6480D797k1785j2825j841m11j016J6086O060P239p107J134Q208J928j1989j5936
6466b7458L869O43Q75m347k1048M091J4699J0059M22j487m418r898J2435P640
6452a3923m627N94n452r46R486j216L090M601o31k977j1135R066j208r219J2189
6437a2308j5073j1661m860J9124L994k4J192p831O726R752q77K862m568K804J8582
6422G834j3179o886J4734l305j8907j3734l46J9041l078p467K0603j2427K174
6409a4943q669N584k911j3881r061R00J3434q925Q060N77o920J2487n884J532
6395b8620N291Q694L929n32L177P68j9608M106O599l18j0294m149J7531Q601q010
6380a2835k3813J1424n006n666K0639J0939l875n71N318j0725l4446J3292J1465
$$ y = [4797, -16988, -29813, -31654, -32065, -33081, -16995, -10935, -3696, -10803, -9669, -1461, 467, -11522, -27458, -23589, -22946, -22071, -26418, -47466, -43375, -28676, -18617, -18195, -19682, -24100, -33998, -21563, -13923, -18550, -17956, -23408, -24354, -14868, -16084, -12994, -8393, -9024, -12001, -23136, -14070, -15278, -24497, -12308, -27381, -39042, -43902, -24778, -20784, -20808, -19616, -27447, -20721, -10969, -11846, -8984, -13552, -10748, 7834, -5345, -12231, 2503, -802, -19709, -33443, -33789, -14748, -17826, -25293, -4690, -17117, -14943, -23612, -18028, -20939, -34820, -43881, -42981, -29547, -38472, -30412, -29835, -36755, -24268, -30152, -28620, -23329, -14635, -10706, -11238, -8061, -7293, -26901, -22795, -16196, -16514, -26808, -30957, -13426, -4825, -12835, -36648, -25224, -30230, -35896, -15257, -4318, -8193, -8764, -3446, -14171, -48617, -35325, -23860]
6367b3860o371j94N928k118K527K2465k0695j65m24j4368N107O654K4339j5982
6353a7157J832Q071J162N856Q028j0787k173j5335j599J2008P464p882K30J2113
6339A831j6506J100k626M352j6527R03J4750l275o22l276J1770k566J2173j3383
6325a1902M957j2835R86q74M542j3501j446K3576k8371p890J2607J977P076J7625
6311c473m589P47j5365l050K9668r262n182n382P800Q801o101k9447j3547L1525
6297a6857l610L447j2665j1844N258R465O522J372j363p643L951Q715k452n95
6283a8299j3071J4423j764j113L209k329q907j1858J0627p597j8405J3033N685
6270c6366J7663R919J53K559Q248m216k661k583j5043j765J2903j490R702Q768
$$ y = [-23860, -30231, -30425, -24497, -26615, -24088, -1623, -22318, -22483, -22907, -37275, -32168, -25514, -1175, -17157, -15325, -7254, -6092, -236, 7792, -2995, -5168, -20503, -22102, -10094, -2630, -10512, -10282, 1831, -14675, -13575, -16201, -11849, -28376, -27473, -12723, -15998, -16620, -19896, -8126, -10692, 1481, -11902, -6945, -19780, -18794, -19668, -15126, -28627, -30073, -6497, -34868, -42758, -30151, -28174, -21098, -3473, -8062, -7315, -22680, -25730, 3938, -5324, -10506, -15888, -8088, 713, -5388, -34835, -48382, -16857, -20467, -17020, -29685, -41529, -36271, -26806, -20284, -18912, -20275, -27918, -23967, -15252, -17704, -18299, -31370, -16947, -18711, -19824, -16615, -18944, -27851, -39709, -29082, -36679, -55084, -42051, -36366, -18703, -8784, -8631, -6072, 2176, -2040, -4701, -7284, -22327, -24092, -11189, -12679, -2977, 5791]
6256E791Q332k482j1139j3999j0529p957J3018L106p517n242n176O253J7567o098
6242a6072o36n97J35K6766Q520j0743j9778k183p720m812j495m405J6599J4888
6228a533j0209J3037m071m245j9243j5139l186J2893L494K957j833Q027O18q7
6214a8520r778J4109J8387k093m085q034r767R448j382q255Q49O88K584J2337
6200c512L170j7979p094J250N183j5993J0005J6141K086Q205K888j1970o641K845
6186a1416o658n292O946j0309R252J347R263L748j0998M835q55n099K625Q288
6172d323r7j8050k506Q955J3820J1873K452q209k9463K898R473n24l056J082O344
6157i331q4j457O706O668l132K995l222p644q575L600r496N775J3395J3143j3752
$$ y = [5791, 14123, 11641, 502, -13497, -24026, -31983, -18965, -15859, -23376, -28618, -33794, -27541, -9974, -16072, -16708, -17305, -17170, 9596, 18116, 7373, -12405, -14588, -22308, -27120, -28615, -33020, -16421, -1533, -11742, 1295, -2776, -7021, -26264, -41403, -44589, -31696, -28202, -25245, -27078, -19051, -18433, -18520, -28298, -14189, 4198, 2105, -1980, -10014, -19781, -10333, -11715, -19970, -19121, -18433, -15849, -3512, -342, -18321, -25415, -24165, -18982, -34975, -24970, -8829, -6743, 1462, 4350, -7620, -14261, -11416, -18074, -23366, -16420, -26729, -17477, -16130, -6867, -3119, -14117, -9282, -10137, -15236, -12611, -4323, -4420, -22470, -24976, -16021, -2201, 9672, 12124, 3915, -25548, -22650, -13177, -13701, -16757, -15675, -9331, -9415, -10872, -4166, 2502, -630, 2365, -857, -8501, -17076, -13476, -22972, -17197, -3802, 9341, -4411]
6142d411K090J697q276J8791J5349l000r00O634o237J660j1163k5431r623J470
6128b1350N415N420J9302J2465q311q809P337J459o983J2160q907N679j283j4958
6114a364n987N611l593j0992Q117l438j5751O390J2803L392j6005N609M18m756
6100a9546n221J1947p109n00J2143m054k023k810N069P970m522n760q153J1736
6086a0833M209K020j0072r511K4209l931p108r492P817K2518j4710n561J1331
6073H86o523j157M210r63j558K256k1703R171J4715q874l152l610j468O592J670
6058i508k547j3393n93l721J4951P755j9041M984j2014r009M113K5787L830J1859
6044C453o855j6800r927M694M870R257J1680l061L310Q042K752k0072J0025j603
$$ y = [-4411, -2321, -624, -8900, 9891, 25240, 22240, 21340, 27974, 21737, 23397, 12234, -13197, -22820, -21350, -15935, -10515, 8787, 21252, 12941, 4132, 11469, 12928, 5945, 18105, 9198, 14877, 13594, -1364, -7351, -1740, -5333, -16325, -8208, -11646, -27397, -21007, -8204, -4812, -20817, -15208, -14790, -19546, -24767, -12820, -19929, -20429, -8286, -12340, -14363, -17173, -12104, -4134, -8656, -14416, -22569, -10833, -6624, -4604, -14676, -24187, 22, -3909, -11017, -20509, -12692, 9826, -4884, -10445, 886, -5637, -6794, -2584, -3547, -5105, -2849, -24552, -15381, -666, -9540, -12692, -16302, -17770, -11178, -9508, -12055, -25448, -26041, -29762, -14811, -7056, -26097, -21113, -33127, -42136, -38023, -12236, -8406, 3453, -3402, -20202, -30129, -25435, -20565, -11308, 372, -2689, 621, 8663, 11415, -8657, 1368, -235]
6030b35j039j7316P54m423p814P746l78P893M955L772j0693j0088O690J5647P673
6015C144j1055K483p366J0388P157j1058l0008r40K7254M500m49l69J3249J076
6001H006n530n786j9063m80J6285Q513m48R661j0267q408j7064K777J995Q396
5987a1413J0046r013o578j0633K2155J7648j7100j3036M147k595L473R792o674
5974i781o210Q861J651J1575N472p593N913q693j605l731m269J5264m253L719
5960F320o745J4418K412J671j0089L19J1970j922l472l394J0174K748R52r62j1471
5945A2929r097J1522M575n670K361j903K861n94o574q742j1128j663P724J142
5931b257O087L2Q214j4966L672M462j2496K432J5768q474r825M609J1828J1518
$$ y = [-235, -1274, -18590, -17836, -22259, -30073, -22327, -22705, -14812, -9857, -6085, -16778, -26866, -20176, -4529, 3144, -7911, -5428, -12794, -2406, 4751, -6307, -36315, -37255, -10001, -5501, -5950, -6319, 6930, 8006, 2476, -3310, -22373, -22853, -6568, 1945, 1497, 11158, 891, -7517, -24581, -21804, -19809, -11413, -1367, -10380, -16958, -27591, -5436, 12212, -4888, -17924, -13777, -16372, -12899, -3107, -9781, -15991, -7130, -5479, 6096, 11568, 3975, 9888, 1195, -410, -4141, -8410, 6854, 2601, 6320, -425, 13993, 16405, 18076, 7987, 8306, 20276, 18354, 14882, 11488, 21662, 24410, 25362, 24400, 12929, 3832, 15354, 19929, 14259, 16620, 14717, 17578, 16984, 10410, 1668, -9460, -11123, -3399, -2257, 3830, 3862, 12076, -2890, 782, 5244, -7252, -4820, 10948, 2474, -7351, -2742, 9086, 20604]
5917B0604k4072J9558n376j6323L1841j617j8186K146J0216P777j7376p527M883
5904F548O261J5649M741j2899m750r125j3330K2517K171j0293J544m512n716M662
5890C468J0648j3332j6846Q618P704N09L85J2458Q651j1767p347N293j2104q369
5876a2031K406J0987K395K296K246o327K845l550J1376o88j270j5287P155p903
5862e350R957J0186l918q832P907K0726N125k8861m149J6287l247n102p205J6408
5848A9932J9773r518m755J632K044L815l089p821M693N065K596J6347k7667P962
5834C1009K96P365J314m779J0800M857j421N046j791K648J6492M326K3084K8146
5820A27392L284O96k612J757q699J1933K5664J6100K539M065J8470K3786J3004
$$ y = [20604, -3468, 16090, 10714, -5609, 26232, 24615, 6429, 8575, 18791, 26568, 9192, 1665, 6548, 12809, 28458, 33199, 20300, 15550, 6425, -6905, 15612, 17783, 7490, 9034, 4522, -1194, 3468, 14116, 784, -16062, -7444, 260, 769, 1154, 13612, 22263, 10496, 3149, 8442, -3662, -12031, -9625, 1362, 3757, 6053, 8299, 1972, 4817, 1267, 12643, 11955, 10685, -4602, 2553, -5350, 4607, 14793, 10875, 2043, 9950, 30676, 35801, 6940, 2791, 19078, 15831, 10729, 3524, 19932, 39705, 30187, 25432, 27064, 29108, 32923, 29834, 22013, 26706, 31771, 34367, 50714, 23047, 31009, 31305, 38670, 39984, 35205, 46005, 50862, 49441, 54487, 52696, 55344, 71836, 76162, 99246, 127392, 130676, 131372, 128760, 130517, 121818, 133751, 159415, 175515, 178054, 182119, 200589, 224375, 237379]
5807B37379J496J6740K488J7353M446j0359k503M984O732j1323k4435m747j5578
5794B22673J815J1437l651j0514j0177O38j6398j3582P040j5253j2178m208l0407
5781A27235k0666O234r635j751q547r80R463r86j3135O27Q820J883j7222N153
5767H6493o843J3217l795K458J6r082J0429j3714J2483p497O322R739Q257j5761
5753I2722j5004Q139J0934m658J1048j1209j5091M781l16j1685M606N485J4952
5740I4704j1576M613m694o288J0597j7636l121J4332p259o30J619J9397J2787
5727A06845k618j0491j0123L674J333O959j1785m261R801p317K548K541k1882
5714F5224J0421L220N281j1791n434p621R504J9655M590N745p448j2616K294J4822
$$ y = [237379, 238875, 255615, 258103, 275456, 279902, 269543, 267040, 272024, 278756, 267433, 242998, 238251, 222673, 224488, 235925, 232274, 221760, 211583, 212221, 195823, 182241, 189281, 174028, 161850, 157642, 127235, 106569, 112803, 103168, 101417, 92870, 91890, 101353, 100367, 87232, 87859, 96679, 98562, 81340, 86493, 79650, 92867, 89072, 91530, 91546, 82464, 92893, 79179, 91662, 84165, 90487, 100226, 108483, 92722, 77718, 85857, 96791, 92133, 103181, 91972, 76881, 81662, 81346, 69661, 74267, 79752, 94704, 83128, 87741, 83047, 76759, 87356, 69720, 66599, 80931, 73672, 73042, 74661, 94058, 106845, 104227, 93736, 83613, 87287, 88620, 95579, 83794, 79533, 89334, 82017, 84565, 87106, 65224, 75645, 78865, 84146, 72355, 66921, 59300, 68804, 88459, 93049, 98794, 91346, 78730, 81024, 95846]
5700I5846N988j2727k0385J3865j061O491J4806J8680j5517l842N847j281L576
5687A10286j598O179l404L68O2J8541M976j103L591N995K680J3361O570k0567
5673A45937Q37K031R925J871J5597K5658j2459L847J2434o761J398K878l941J7046
5659B16298k0380k596J466K7240Q427j146k565K742M596p505L665j2846K852R383
5645B29631n548J276J2959J2474j2638m705R054J0085O64J020J5671l223J4207
5632B80927o968M29R185n325J1702J2302J693P070L765j6666O566J0399J3110
5619C28189j151J766R852J4866R301q526J3040K2250O324r779J8687m486k1456
5606C78877K833o971J3878J4324l516O166J4536K1681J0634R614l294j1173K172
$$ y = [95846, 101834, 89107, 68722, 82587, 81526, 88017, 102823, 121503, 105986, 102144, 107991, 106710, 110286, 108688, 114867, 111463, 111831, 111893, 130434, 135410, 134307, 137898, 143893, 146573, 159934, 166504, 145937, 146774, 148805, 158730, 160601, 176198, 201856, 189397, 193244, 205678, 198917, 200315, 203193, 199252, 216298, 195918, 193322, 194788, 222028, 230455, 229309, 226744, 229486, 234082, 226577, 230242, 217396, 220248, 229631, 224083, 225359, 238318, 250792, 238154, 233449, 242503, 252588, 253252, 254272, 269943, 266720, 280927, 273959, 274388, 283573, 278248, 289950, 302252, 303945, 311015, 314780, 298114, 304680, 315079, 328189, 327038, 328804, 338656, 353522, 362823, 354297, 367337, 389587, 395911, 386132, 404819, 400333, 378877, 381710, 374739, 388617, 402941, 399425, 405591, 420127, 441808, 452442, 462056, 458762, 447589, 449761]
5593D49761N711N448J6371J0554n395N475K77J2213k79Q977M654J3878L5817p573
5579E55889N877k372J9867J9728J3371K120J0587N365K6427J9831L0511j3109
5567F94092m527L3352P107J3766K5335K4422j0259J438L5623K5776R352L0427
5555H85904J613j845K4935K6660J9682L2351M008J4082M9671K6680K4941K4656
5543A133338J6624L8972M4304M8145N4574O1049N3106O0915O3454N0717Q7467
5532A712665R4164R8984R7751J23747J46825J55342J87002J78765K11073K36337
5522C242655K48923K63899L01490L17261L27000L87769M40007N04536N64933O41122
5512G239595P56457R09744J092990J336820J680538K114917K474782K687007K677846
$$ y = [449761, 455472, 460920, 477291, 487845, 482450, 487925, 488202, 500415, 500136, 509113, 513767, 527645, 563462, 555889, 561766, 559394, 579261, 598989, 612360, 614480, 625067, 630432, 656859, 676690, 707201, 694092, 689565, 722917, 730024, 743790, 769125, 793547, 783288, 784726, 820349, 846125, 855477, 885904, 887517, 885672, 910607, 937267, 956949, 989300, 993308, 1007390, 1057061, 1083741, 1108682, 1133338, 1149962, 1188934, 1233238, 1281383, 1335957, 1397006, 1450112, 1511027, 1574481, 1625198, 1712665, 1806829, 1905813, 2003564, 2127311, 2274136, 2429478, 2616480, 2795245, 3006318, 3242655, 3491578, 3755477, 4056967, 4374228, 4701228, 5088997, 5529004, 6033540, 6598473, 7239595, 7996052, 8905796, 9998786, 11335606, 13016144, 15131061, 17605843, 20292850, 22970696]
5503B2970696K231103J381334P41544N64705P61124J351621K062746K645650K953561
5494C7664084K870795K370831J634978Q28965L32147L98144O36277N32665J03857
5485D7372743o77389j457672j804179j894148j735622j389052j015796q21761
5477C6577124q59876j331610k013574k623271l016235k941795k724878k499188
5469A8566697k283200k012862j787617j582895j389506j208913r85368q41957
5461F474379p01514o01686n39238m81213m14901l54459l08706k58575k27267j89034
5451B397786j61126j35650j22929j02304j01933p8010j00514p6605n9418n5021
5441A404276n3559n5530o3527m8760l7517m3730k5084m6032l7987l4094l7326
$$ y = [22970696, 25201799, 26583133, 27324677, 27889382, 28650506, 30002127, 32064873, 34710523, 37664084, 40534879, 42905710, 44540688, 45369653, 45701800, 46099944, 46736221, 47268886, 47372743, 46695354, 45237682, 43433503, 41539355, 39803733, 38414681, 37398885, 36577124, 35717248, 34385638, 32372064, 29748793, 26732558, 23790763, 21065885, 18566697, 16283497, 14270635, 12483018, 10900123, 9510617, 8301704, 7316336, 6474379, 5772865, 5171179, 4631941, 4150728, 3735827, 3381368, 3072662, 2814087, 2586820, 2397786, 2236660, 2101010, 1978081, 1875777, 1773844, 1695834, 1595320, 1518715, 1459297, 1404276, 1350717, 1295187, 1231660, 1182900, 1145383, 1101653, 1076569, 1030537, 992550, 958456, 921130]
5430I21130k0292l9151l9816j8239k1642k4527j1761j3331l2417k9215k1399k8180
5418F21160k0117n040j9431k158o901n578k5229j2627j7011L147j3664k8810O023
5405D73764j8858M003q161l6760q836n740Q682j4262k137j5180l96L926j2037
5392C68008l0003o538o857j3245Q288j7860k4514M628N594J636r749q743P422
5379B78067j1624n328j5128J179m751j0367L411P050q990m508j2771J313p57m632
5365B12164K084J149J7393j9417j2758p27m956k220o910j550j2483r975M933O90
5351A67417K45L337P508j594m852O929m108M243o022l859j657K259r66O955P014
5336A82849Q506q077M074K517j3075P815j563K939J138Q1l95J8282J8340p156
$$ y = [921130, 900838, 861687, 821871, 803632, 781990, 757463, 745702, 732371, 699954, 670739, 649340, 621160, 601043, 596003, 576572, 574414, 567513, 561935, 536706, 524079, 507068, 510215, 496551, 467741, 473764, 454906, 458909, 450748, 413988, 405152, 399412, 408094, 393832, 391695, 376515, 376119, 380045, 368008, 338005, 331467, 324610, 311365, 319653, 301793, 277279, 281907, 287501, 289137, 279388, 270645, 278067, 266443, 261115, 245987, 247166, 242415, 232048, 235459, 242509, 233519, 229011, 216240, 217553, 216796, 212164, 214248, 215397, 232790, 213373, 200615, 199888, 194932, 192712, 185802, 184252, 171769, 161794, 166727, 167417, 167662, 170999, 178507, 176913, 172061, 178990, 174882, 179125, 173103, 169244, 167587, 169846, 168880, 175835, 182849, 191355, 183278, 187352, 189869, 176794, 184609, 183046, 185985, 187123, 187204, 186809, 205091, 223431, 216275]
5322B16275k182o455N877J4840l442n290J358l860l318J1794j3719P140M324J929
5308B25271J2732r21l24J1612N948j6498J442O153k648K4910N919Q021P677J4696
5294C03990J5173J1992K1335J0226K0225K9372K6407L3638L0533K2312K0536K4986
5282E70725O2284M6835M9819L8088N2543N9345O5549Q5198R7297R4982J41377
5271A364042J33517J47752J79515K74495L68010M68132N14776M76593L73825J10682
5261D411339j6790j4709N4347J96748L34578M21725M91966N22756M95384M01194
5251G298538K09555K9646K9605R7124O2654k7660j72342l03828l36664l10554
5241F576074k87110k57710j66790q9878k8224q3043k14245m03798n25207n31951
$$ y = [216275, 214093, 207638, 213515, 228355, 224913, 219623, 220981, 217121, 213803, 225597, 211878, 219018, 223342, 225271, 238003, 237082, 236758, 248370, 254318, 237820, 239262, 245415, 242767, 267677, 273596, 281617, 289294, 303990, 319163, 331155, 352490, 362716, 382941, 412313, 438720, 472358, 502891, 525203, 545739, 570725, 633009, 679844, 729663, 767751, 820294, 879639, 945188, 1030386, 1127683, 1222665, 1364042, 1497559, 1645311, 1824826, 2099321, 2467331, 2935463, 3450239, 3926832, 4300657, 4411339, 4394549, 4379840, 4434187, 4630935, 4965513, 5387238, 5879204, 6401960, 6897344, 7298538, 7508093, 7537739, 7567344, 7664468, 7727122, 7699462, 7527120, 7223292, 6886628, 6576074, 6288964, 6031254, 5864464, 5774586, 5746362, 5663319, 5449074, 5045276, 4520069, 3988118]
5231C988118m90208m13226l67826l31342k90755k78347k33692j93616j67519j39926
5221A081661j05867j06585r7092p6528o9915o3013n1313l9698l3790j9918j4491
5210D03451l2639k7512p810p371k5965k1962r274r95j4260r9o657n453r354k1591
5196B12509m788N183L184j9014J043m47K5806J1925J5339j804n654j0294M982
5183B37970J2511R678J4001q568m114K3492j337q20J4082K10L18K0116L463M15
5169C21417m585M250l413j9770j4849j3785R87p918k1308j0859j8537m251j1513
5156A95866j1822N396k0769j3690q432l468j7206k5361j6327O524n054r122j1477
5143F5058J0529J487j0309l50k154m386j1373j1507P789P081r518k1591J555K0676
$$ y = [3988118, 3497910, 3084684, 2716858, 2385516, 2094761, 1816414, 1582722, 1389106, 1221587, 1081661, 975794, 869209, 772117, 695589, 625674, 562661, 511348, 471650, 437860, 417942, 403451, 370812, 343300, 335490, 328119, 302154, 280192, 270918, 269923, 255663, 255564, 248907, 243454, 234100, 212509, 207721, 212904, 216088, 197074, 198117, 197670, 223476, 235401, 250740, 248936, 243282, 232988, 237970, 250481, 260159, 274160, 265592, 261478, 284970, 283633, 282813, 296895, 297105, 297423, 317539, 321002, 321417, 316832, 321082, 317669, 297899, 283050, 269265, 270252, 262334, 241026, 230167, 211630, 207379, 195866, 184044, 189440, 168671, 154981, 146549, 143081, 125875, 100514, 84187, 90711, 85657, 76535, 65058, 75587, 77074, 66765, 66415, 64261, 59875, 48502, 36995, 44784, 51865, 42347, 20756, 22311, 42987]
5129D2987n201N357j390j7956j304K0980j5558j0526J3301P582Q75j6131q992
5116A4024K587N036j761R805j6260q929J7400J2104j2433o388j4027R010O587
5103A6755j6960R711p886r380Q480O199q090m616J6829O888N31n855k4249j6914
5089b8557K8131J3994j2789p423q80r468j0637J0431J2324P885N459L310K419
5076A4199r602N909j004j632q275M845j4830p782K0974j3245j1789J1393L475
5063g364J239m117J1019p498j2806M705j18R819M416J0421l4215n49M337J9843
5049h68P074j4386Q436o74L622l82j749J3207j929J2544j0311j6120k734J8045
5035A3775J22j2408q00J9995j4089j7172N48j0464n538K9522M931k2919N791o03
$$ y = [42987, 37786, 43143, 41753, 23797, 22493, 43473, 27915, 17389, 30690, 38272, 39147, 23016, 14024, 16611, 21647, 19886, 29691, 13431, 4502, 21902, 34006, 21573, 15185, 1158, 10168, 16755, -205, 9506, 1620, -7760, 720, 6919, -1171, -5787, 11042, 17930, 18461, 12606, -11643, -28557, -426, 13568, 779, -6644, -7524, -16992, -27629, -17198, -4874, 3011, 8470, 11780, 14199, 4597, 10506, 9502, 7870, -405, 4440, -10390, -18172, 2802, -10443, -22232, -10839, -7364, -6125, -10242, 777, -6721, -19527, -14822, -14940, -5121, -705, 9716, -24499, -25048, -20711, -868, 6206, -8180, 256, -418, 3204, 2822, 1073, 14280, 12351, 24895, 14584, -1536, -4270, 13775, 13897, 1489, 689, 20684, 6595, -10577, -10029, -20493, -26031, 3491, 8422, -14497, -8706, -9309]
5021i309J0612l237Q238J358n473K683M929k949o694L585R550p165K91j863n536
5006i80l083m084P658o13K0294k010j0341k353k1545O797J7148M824k530Q34j4203
4991d187O350o945J1933J1413j9673J0157j1387O377j260P401p368m330o752P123
4977a148J2457L329K801j1582J2329j8648N873r346L308l68M879j4618N704n952
4963a0982J0411O982m091P33q406J0267o611Q319j1940J1688j164n968J8499J3369
4949C1106l707m934L483j3146p804R971L156J545j1185K0818N228J2348L463l271
4935D7071j7620J2538o722P706J4367m048J703j4058Q4m046j4842m431J9673o023
4921C1352m086m637N314r880J1627l940J98J704j8250k9682J9554K4723n230j3915
$$ y = [-9309, 1303, -1934, 6304, 7662, 2189, 4872, 9801, 6852, 158, 3743, 13293, 6128, 6419, 4556, -980, -4063, -8147, -489, -1102, 19192, 17182, 6841, 4488, -17057, -10260, 6888, 11712, 9182, 10016, -4187, 2163, -4782, 7151, 18564, -1109, 9048, -2339, 4038, 2778, 10179, 2811, -1519, -8271, -1148, 11309, 14638, 17439, 5857, 18186, -462, 5411, -3935, -627, -995, 3884, -10734, -5030, -10982, -571, 6411, 2320, 3053, -5353, 4914, -1697, 6622, -5318, 6370, 5206, -762, 17737, 31106, 27399, 22465, 25948, 12802, 4998, 14969, 18125, 19670, 8485, 29303, 34531, 46879, 50342, 47071, 29451, 41989, 35267, 42973, 57340, 53292, 54995, 40937, 41021, 36975, 22133, 17702, 37375, 31352, 27266, 22629, 27943, 18063, 29690, 25750, 25948, 27652, 9402, -20280, -726, 23997, 18767, 4852]
4907D852l135K994l223j3200P611J6756J7162m115N637m756p659J242l644J1645
4893B8167o023j7663R047j0528j725N925m774O562j3452m062Q451K4450K080J1970
4879C8425Q371j3833j1325N598o547j673p466R449O116m273j1899j5895R440j577
4865B911J8743K2493m209p926k601l284p569n525j6587n148K2336l657p280J2877
4851A5574j1319K0175J0568k60N983r315j5532q267j020q434n040n65J0888J5872
4837A9308R872M494r908p79n251j748O34J495J5332P612j864k5023P49R723j2124
4822A2522O539N971p648L989J4452k957j6862K818k374J8977j0641k2119L509
4809F176R880n224l497J3274o044J583r301J5696l285J0524n883j5499M721J8182
$$ y = [4852, 1717, 4711, 1488, -11712, -4101, 12655, 29817, 25702, 31339, 26583, 18924, 20166, 16522, 28167, 22144, 4481, 13528, 3000, 1275, 7200, 2426, 8988, -4464, -8526, -75, 24375, 26455, 38425, 46796, 32963, 21638, 27236, 20689, 19016, 11550, 20999, 27115, 22842, 10943, -4952, 4488, 2911, 21654, 44147, 39938, 32012, 29411, 26127, 18558, 13033, -3554, -8702, 13634, 9977, 2697, 15574, 4255, 24430, 34998, 34738, 40721, 31406, 15874, 7607, 6587, -1847, -6887, -7452, 3436, 19308, 29180, 33674, 23766, 22987, 17736, 15988, 16622, 18117, 33449, 41061, 39197, 14174, 14923, 24646, 12522, 19061, 25032, 17384, 21373, 35825, 32868, 16006, 18824, 16450, 35427, 24786, 2667, 6176, 16056, 10832, 7335, 20609, 14565, 16148, 6847, 22543, 19258, 29782, 23899, 8400, 13121, 31303]
4795C1303l0263K60J7506M945J5850p081O42r935N578k075k5168J8905J6500q010
4781B8957q671N867J4562p655J5984K952k4058m517o592J9051N066q02p289p555
4767B5300p99j3449O918j6382J7786L178K747p051J7269o941N416r51m891L884
4753C2034p639P168l549j423J8289P61j6269j544J5184m770O186J051q4J0804
4739E6199k1495K617J2855J131P616J341l589n984N534K6186J4334p429K065M540
4725I5921J7234L144K674L3120N34J2304o521o266J6232l701j2014K837N818Q812
4711A70128J1678K675j0276K2892O718j4308k610l964k936k892J416M04p32J4494
4697A92687n812k2689k1979k011Q656O617j0263j4110Q028k0290r812L793k242
$$ y = [31303, 1040, 1300, 18806, 23751, 39601, 32520, 33162, 23227, 28805, 26730, 1562, 20467, 36967, 28957, 20286, 26153, 40715, 33060, 49044, 51996, 27938, 23421, 16829, 35880, 40946, 40144, 32855, 25300, 24501, 11052, 17970, 1588, 19374, 22552, 25299, 18248, 35517, 28576, 33992, 33041, 28150, 32034, 24395, 31563, 28014, 26591, 44880, 45641, 29372, 27828, 43012, 38242, 44428, 45479, 45395, 56199, 34704, 37321, 50176, 51307, 58923, 60264, 56675, 50691, 56225, 82411, 96745, 89316, 91381, 95921, 113155, 116299, 118973, 152093, 152627, 164931, 158410, 152144, 168376, 164675, 152661, 155498, 161316, 170128, 181806, 184481, 174205, 197097, 203815, 189507, 186897, 182933, 179997, 177105, 178521, 178925, 178193, 192687, 186875, 164186, 142207, 140196, 148852, 155469, 145206, 131096, 139124, 118834, 109022, 112815, 110573]
4684A10573j1957J939j0266r120j5188J3777P091l646J002J3257m53q848M662
4671I2823j4597k066N420j6845J7091N659o486M085L169K55j2301k88o312J1248
4657H0855L876j3200J3044K825k955n082P843J008m514J801k117M109j4665J6982
4643H9810j900o110k2828K947R255J6577n431N015L149J3179r178j76o107m975
4629H3227o800O537J8982r12p480p913J573J7758j76j9550N029p972J663j3285
4615G0681J681J5389o591r10N424r366M90J5522r46j6819k142M180J2668n45J4180
4600A02896j38j7317L662K3986j3646j8156J6446Q002j3832j340k00j2750J1607
4587H9220N06N153Q245L120k830q243R384j203j1163k767L679K1964j0140o404
$$ y = [110573, 98616, 100555, 90289, 81169, 65981, 79758, 86849, 83203, 84205, 97462, 97009, 88161, 92823, 78226, 76160, 81580, 64735, 81826, 87485, 80999, 85084, 88253, 88508, 76207, 75919, 69607, 80855, 84731, 71531, 84575, 87400, 84445, 79363, 87206, 88214, 83700, 85501, 83384, 87493, 72828, 89810, 87910, 81800, 58972, 61919, 71174, 87751, 82320, 87335, 90484, 103663, 94485, 94309, 88202, 83227, 76427, 82964, 101946, 101034, 93554, 85641, 87214, 104972, 104796, 85246, 90275, 82303, 83966, 70681, 72362, 87751, 81160, 80250, 85674, 76308, 76798, 92320, 91374, 74555, 72413, 76593, 89261, 88716, 102896, 102758, 85441, 89103, 113089, 99443, 81287, 97733, 105735, 91903, 90563, 90363, 77613, 89220, 89726, 94879, 103124, 106244, 103414, 95171, 104555, 103352, 92189, 89422, 93101, 115065, 104925, 98521]
4573I8521J255j551j01j2821L478K349p38J5687J5282p823m414N3J0944j354J1882
4558A30649j8948J1466J372j3766m682J7220K157R79j3455j0202J3741J2134M044
4545A32709J999j240J786J2552o192k3869k1317O543l916J2094N263n874P381
4532A17919P29O08J1635q90Q194n91K923j3957R606K912j2472P7R826P485p798
4517A36206M462K330l612j6832R799J457O259j3640j5069K064K1544J5192r543
4504A40617j0664o778J2261r18k882J1926Q324m675P565o009J656j2221k3047
4491A15155J1013L4359J6863j5542q052Q416N038p618o845J2280R600n667p745
4478A61255l887L068K0446j4323k229J8990N873j161l578j1795J8573j104j2505
$$ y = [98521, 99776, 98225, 98124, 85303, 88781, 91130, 90392, 106079, 121361, 113538, 109124, 109177, 120121, 118767, 130649, 111701, 123167, 124539, 110773, 106091, 123311, 125468, 126447, 112992, 102790, 116531, 128665, 132709, 134708, 133468, 135254, 147806, 141614, 117745, 96428, 102971, 99055, 111149, 116412, 110538, 117919, 118648, 119256, 130891, 130001, 138195, 137604, 140527, 126570, 136176, 139088, 126616, 126693, 136519, 144004, 136206, 140668, 142998, 139386, 122554, 132353, 133810, 140069, 126429, 111360, 113424, 134968, 150160, 140617, 129953, 123175, 135436, 134518, 131636, 143562, 151886, 147211, 154776, 148767, 150423, 138202, 115155, 126168, 160527, 177390, 161848, 153796, 162212, 167250, 159632, 152787, 165067, 174667, 169000, 161255, 157368, 160436, 180882, 166559, 164330, 183320, 189193, 188032, 184454, 172659, 191232, 190128, 177623]
4465A77623l883l920l020J9675l28R639J3507k1319Q334J4748o994r192K484o303
4451A91051P444q169r078L800N570K7925j1741o099J6088n638O442n551K1276
4438B33320J7728k321j7554n797O441j117N269j572o924J8922R523o915M473L475
4424B56951J0373R32J0861O67j8615l959J0405n067j2451j0115J2529J3364n679
4411B60196k369Q441O913j2565J5934J0259k969p131Q99O994N311j361l668j1040
4397B73844J8275J6055J6071M884q351K801K663J0574L233m437J3697J602k673
4384C48238Q159K1475R021j4144Q485K608N225l64q461J4498J2509R447Q104J0375
4370D35175Q042M286R957J5863K1789k341J0601J8712P3J3809L4060J2212J5349
$$ y = [177623, 173740, 169820, 166800, 186475, 186147, 195786, 209293, 187974, 196308, 211056, 204062, 194870, 197354, 191051, 198495, 190326, 181248, 185048, 190618, 218543, 206802, 200703, 216791, 211153, 217595, 212044, 233320, 251048, 248727, 231173, 225376, 231817, 230700, 235969, 234397, 227473, 246395, 255918, 249003, 253476, 256951, 267324, 268256, 279117, 279784, 261169, 257210, 267615, 262548, 250097, 239982, 252511, 265875, 260196, 257827, 266268, 273181, 260616, 276550, 286809, 283840, 276709, 277608, 284602, 289913, 288552, 284884, 273844, 292119, 308174, 324245, 329129, 320778, 323579, 326242, 336816, 340049, 335612, 349309, 350911, 348238, 356397, 377872, 386893, 372749, 381234, 383842, 389067, 388703, 380242, 394740, 407249, 416696, 424800, 435175, 443217, 447503, 457460, 473323, 495112, 492771, 503372, 522084, 522157, 535966, 570026, 582238, 597587]
4357E97587J1888K3829J9904q577r58J4892J8076J0782J7799L8798K3481K1189
4345G88690J224J6966K1909L1329K6741K2104J8707K3241J4664L226J8887K8991
4333A016679L4664J4760L6627K2599J3273P916K9894L0712J5235j824K3849J0096
4321A254480J9263J287J7294J1333k322J0670R311J1138P351L366k9042J2146
4309A326275J157M624k2744j0912r630r38J4207j0078j7597j7293j0538j6714
4297A229819j5727l026m341j6257j3248k7466j4477j0990r637j7048n696j4287
4285A077619j4844n888r148j4647j058J419j0580J5735j3658k8812P652r367M877
4272I99300J875J1244K3499p175M708J0128L762P579J275j579R820l87K240K624
$$ y = [597587, 609475, 633304, 653208, 644631, 643673, 658565, 676641, 687423, 705222, 744020, 767501, 788690, 789914, 806880, 828789, 860118, 886859, 908963, 927670, 950911, 965575, 968801, 987688, 1016679, 1051343, 1066103, 1102730, 1125329, 1138602, 1146518, 1176412, 1207124, 1222359, 1220535, 1244384, 1254480, 1273743, 1275030, 1292324, 1303657, 1301335, 1312005, 1321316, 1332454, 1339805, 1343171, 1314129, 1326275, 1327432, 1332056, 1309312, 1298400, 1288770, 1287832, 1302039, 1291961, 1274364, 1257071, 1246533, 1229819, 1214092, 1211066, 1206725, 1190468, 1177220, 1149754, 1135277, 1124287, 1114650, 1097602, 1091906, 1077619, 1062775, 1056887, 1047739, 1033092, 1032034, 1033453, 1022873, 1038608, 1024950, 996138, 1003790, 994423, 999300, 1001175, 1012419, 1035918, 1028743, 1033451, 1043579, 1047341, 1054920, 1056195, 1054616, 1064436, 1064049, 1066289, 1068913]
4258A068913J7595p819P804J23M905J3622J4925K3128r72j1537j279l362J3542
4245A139588r529j7309K0950K582R749J5906P703K0195K6495P032J2194K4977
4233A260533J3680N179Q067K3665J7644K5400J9440K4854M5518L4540O4370O8011
4221A610901O3838R8175J14724R5249O9370J4678j5137k7184j1795L5125N5544
4210B103488N8949M8583N5314M2356L1876L6306N0131Q1340P8108L7001L238k9560
4198B597130n4943k5829j0415J2989J3881K0872L4478M0307N5098O6714O8492
4187B818774Q2180Q1139R4076J06218J24624J35046J33496J75687J99485K10014
4177D160739K45375L04566L33151M26647N06901N71824O41048P23717P82880P70554
$$ y = [1068913, 1086508, 1078689, 1086493, 1086616, 1091521, 1105143, 1120068, 1143196, 1142224, 1130687, 1129408, 1126046, 1139588, 1130059, 1112750, 1133700, 1136282, 1146031, 1161937, 1169640, 1189835, 1216330, 1223362, 1235556, 1260533, 1274213, 1279392, 1287459, 1311124, 1328768, 1354168, 1373608, 1398462, 1443980, 1478520, 1542890, 1610901, 1674739, 1772914, 1887638, 1982887, 2052257, 2066935, 2051798, 2024614, 2012819, 2047944, 2103488, 2162437, 2211020, 2266334, 2308690, 2340566, 2376872, 2427003, 2508343, 2586451, 2623452, 2626690, 2597130, 2542187, 2516358, 2505943, 2518932, 2532813, 2553685, 2588163, 2628470, 2683568, 2750282, 2818774, 2900954, 2982093, 3076169, 3182387, 3307011, 3442057, 3575553, 3751240, 3950725, 4160739, 4406114, 4710680, 5043831, 5470478, 5977379, 6549203, 7190251, 7913968, 8696848, 9467402]
4167I467402O91519N95749N87242O37454Q42215J098257J325625J476367J465716
4158A8187546J251070R39299N98546M20346M96751N83640P38992P90714P06373
4149B4713277O12436L95586J15941j05366j24675p3089l8185j93372n14285q02174
4139B3986094j069454j105466j042666r68800q68107p22002o72124p45840r07817
4130A5883818j107921j096185j020813r66071q57370p45664o46762n13006m41530
4121H488496m12078m00413l58090l13985k48898j77128j54193j25838p2669n6045
4111F169159n151K2017K9657P9528P7088R5437J24811J40786J46158J63784J89786
4100G233060J99212K27356K46867K65463K87910L11806L48916L57104L74473M17738
$$ y = [9467402, 10158921, 10754670, 11341912, 11979366, 12821581, 13919838, 15245463, 16721830, 18187546, 19438616, 20377915, 20976461, 21396807, 21893558, 22477198, 23216190, 24006904, 24713277, 25325713, 25721299, 25837240, 25731874, 25607199, 25534110, 25495925, 25302553, 24788268, 23986094, 22916640, 21811174, 20768508, 19799708, 18931601, 18209599, 17537475, 16791635, 15883818, 14775897, 13679712, 12658899, 11692828, 10835458, 10089794, 9443032, 8930026, 8488496, 8076418, 7676005, 7317915, 7003930, 6755032, 6577904, 6423711, 6297873, 6225204, 6169159, 6164008, 6186025, 6215682, 6295210, 6372298, 6467735, 6592546, 6733332, 6879490, 7043274, 7233060, 7432272, 7659628, 7906495, 8171958, 8459868, 8771674, 9120590, 9477694, 9852167, 10269905]
4090A0269905M59834M72966M79309N36618N78813N86313O46456O81150P36880
4081A5448244P66419Q33845Q70975R12912R86662J007245J063487J112920J161636
4072B4164345J204253J243746J288939J374201J433141J490103J590403J645628
4064C5434759J743089J823092J879110J931043K002042K064058K123804K175282
4056E1176279K206126K250244K329255K401955K509559K568141K640071K748004
4048G0829634K805892K872767K924085K935333K943945K947635K897558K872317
4040I4029166K822266K775235K742529K748491K703052K676432K641584K615604
4032A15754359K581280K513607K380919K208874K036112J804389J529476J259522
$$ y = [10269905, 10729739, 11202705, 11682014, 12218632, 12797445, 13383758, 14030214, 14711364, 15448244, 16214663, 17048508, 17919483, 18832395, 19819057, 20826302, 21889789, 23002709, 24164345, 25368598, 26612344, 27901283, 29275484, 30708625, 32198728, 33789131, 35434759, 37177848, 39000940, 40880050, 42811093, 44813135, 46877193, 49000997, 51176279, 53382405, 55632649, 57961904, 60363859, 62873418, 65441559, 68081630, 70829634, 73635526, 76508293, 79432378, 82367711, 85311656, 88259291, 91156849, 94029166, 96851432, 99626667, 102369196, 105117687, 107820739, 110497171, 113138755, 115754359, 118335639, 120849246, 123230165, 125439039, 127475151, 129279540, 130809016, 132068538]
4024A32068538J041698Q44688O54833M59193L38669K02924J6596j64555l50024
4015A35112560n76695q28166j101818j396255j693065j981346k262823k488100
4007A22784292k639812k778718k853010k903222k974618l051515l118902l219254
3999I9245241l300922l407277l524806l583460l661275l678860l705353l683389
3991G0699899l621990l530116l393692l274645l156351l053248k950429k839496
3983D4879932k736338k654402k577294k464068k348918k250178k129843j995715
3975B5723176j856120j732203j588787j480480j372394j249979j119462j062818
3967A4260933r63595q59692q08745p59379o65737o07605n76252m87529m30940
$$ y = [132068538, 133110236, 133954924, 134609757, 135068950, 135407619, 135610543, 135627139, 135462584, 135112560, 134535865, 133707699, 132605881, 131209626, 129516561, 127535215, 125272392, 122784292, 120144480, 117365762, 114512752, 111609530, 108634912, 105583397, 102464495, 99245241, 95944319, 92537042, 89012236, 85428776, 81767501, 78088641, 74383288, 70699899, 67077909, 63547793, 60154101, 56879456, 53723105, 50669857, 47719428, 44879932, 42143594, 39489192, 36911898, 34447830, 32098912, 29848734, 27718891, 25723176, 23867056, 22134853, 20546066, 19065586, 17693192, 16443213, 15323751, 14260933, 13297338, 12437646, 11628901, 10869522, 10203785, 9596180, 9019928, 8532399, 8101459]
3958H101459l90462l39735l24670k68328k19357k07798j67177j53173j26522j19631
3948E784606j00695p6133o6120q7061o9928l5711k7005m4322l5608j1565J402
3937E231860J512k1048O346J02l145j714k2687q168l0400j2166q56l5309j9576
3924E084751j7775k4173j1429K670l9062l1544l1965k2530k0569k8921k9686j8829
3912D810938m0548m3864l2854k1075k7302l4520j2289l654Q120j5992L462K1287
3900D611709L1972K6932N0450N2494N0974M6527N3330N5329N9107M3297Q7725
3889E169846N6100N9858O3142Q3890P2768O4294Q2474Q2767P6087O8945Q3764
3878E963935O2891N6510L8972L1392K9124J7453K8251L1366J5593K7488O0619
$$ y = [8101459, 7710997, 7371262, 7046592, 6778264, 6558907, 6351109, 6183932, 6030759, 5904237, 5784606, 5683911, 5607778, 5541658, 5454597, 5384669, 5348958, 5321953, 5277631, 5242023, 5230458, 5231860, 5233372, 5212324, 5218670, 5218772, 5215627, 5213913, 5191226, 5183058, 5152658, 5140492, 5139636, 5104327, 5084751, 5066976, 5042803, 5031374, 5034044, 4994982, 4963438, 4931473, 4908943, 4888374, 4859453, 4829767, 4810938, 4770390, 4726526, 4693672, 4672597, 4645295, 4610775, 4598486, 4594832, 4602952, 4586960, 4590422, 4611709, 4643681, 4670613, 4721063, 4773557, 4824531, 4871058, 4924388, 4979717, 5038824, 5082121, 5169846, 5225946, 5285804, 5348946, 5432836, 5505604, 5569898, 5652372, 5735139, 5811226, 5880171, 5963935, 6026826, 6083336, 6122308, 6153700, 6182824, 6200277, 6228528, 6259894, 6275487, 6302975, 6363594]
3867F363594N1057N6892P2195P6088J07333J15488J41407J55832J75137K17652
3857G532675K39605K67828L25574L65194M05928M77490N54279O29196P20350Q14985
3847A2333104R55852J119871J306218J542832J808974K104949K430906K654836
3839B6257542K791032K791566K674795K472929K289583K125338K033605K052631
3831D5489021K141159K198217K259072K358320K445147K514053K510975K405947
3823F4321911K140482J658682J002026K27118m70487j071565j510399j749437
3815F4548331j830118j884978j882466j872926j867607j852579j897363j941203
3807D9519091k047941k204238k443635k659001k831189k929127k950602k834732
$$ y = [6363594, 6414651, 6471543, 6543738, 6619826, 6727159, 6842647, 6984054, 7139886, 7315023, 7532675, 7772280, 8040108, 8365682, 8730876, 9136804, 9614294, 10168573, 10797769, 11518119, 12333104, 13288956, 14408827, 15715045, 17257877, 19066851, 21171800, 23602706, 26257542, 29048574, 31840140, 34514935, 36987864, 39277447, 41402785, 43436390, 45489021, 47630180, 49828397, 52087469, 54445789, 56890936, 59404989, 61915964, 64321911, 66462393, 68121075, 69123101, 69350219, 68879732, 67808167, 66297768, 64548331, 62718213, 60833235, 58950769, 57077843, 55210236, 53357657, 51460294, 49519091, 47471150, 45266912, 42823277, 40164276, 37333087, 34403960, 31453358, 28618626]
3799B8618626k645366k422827k167507j940050j702972j477064j281457j112073
3791A3869310r75877q26337p10151n91653n05112m36002l55095k90857k30113
3782H948113j95889j68380j27526r0647o6621m8931k3690J63J0224J9381J1587
3771H267784K2528L8136L1485M1157M5291N4544O0382O7081O1242O7528Q3979
3760H841137Q2048Q7813R6539J02669J07533J07205J10593J20381J25117J27990
3750I909025J29003J43586J51137J79741J75873J95111K20495K22813K44967K63346
3740A1835097K61072L06703L20587L51684L67113L66255M19891M58187M96416
3731A5183005N29114N83940O33989O91954P68208Q25094Q53424Q95613R21650
$$ y = [28618626, 25973260, 23550433, 21382926, 19442876, 17739904, 16262840, 14981383, 13869310, 12893433, 12067096, 11356945, 10765292, 10260180, 9824178, 9469083, 9178226, 8948113, 8752224, 8583844, 8456318, 8365671, 8299050, 8250119, 8226429, 8226592, 8236816, 8256197, 8267784, 8290312, 8328448, 8359933, 8401090, 8446381, 8500925, 8561307, 8628388, 8689630, 8757158, 8841137, 8923185, 9010998, 9107537, 9210206, 9317739, 9424944, 9535537, 9655918, 9781035, 9909025, 10038028, 10181614, 10332751, 10512492, 10688365, 10883476, 11103971, 11326784, 11571751, 11835097, 12096169, 12402872, 12723459, 13075143, 13442256, 13808511, 14228402, 14686589, 15183005, 15712119, 16296059, 16930048, 17622002, 18390210, 19215304, 20068728, 20964341, 21885991]
3722B1885991R64004R55051R81475J001807R88006J011434J050295J093161J137472
3713C1068696J176057J216009J220092J208218J197119J157257J057590R74135
3705D0275173Q59454P35091O57612N82688N06804M88038M37858M08844M24363
3696D5375925L94201L83059L36675K86856K30107J95630J54015R8929J00244J45850
3686D7701491K05206L09426M62877O42599Q65124J123284J387381J700019K044460
3677E6441867K413145K796440L110541L394725L719645M041233M357057M704607
3669H4979260N055538N388698N714769O026050O327595O660221P013240P379456
3661A34544827P737657Q037399Q272763Q447493Q506836Q490039Q359290Q188698
$$ y = [21885991, 22849995, 23805046, 24786521, 25788328, 26776334, 27787768, 28838063, 29931224, 31068696, 32244753, 33460762, 34680854, 35889072, 37086191, 38243448, 39301038, 40275173, 41134627, 41869718, 42527330, 43110018, 43616822, 44104860, 44542718, 44951562, 45375925, 45770126, 46153185, 46489860, 46776716, 47006823, 47202453, 47356468, 47455397, 47555641, 47701491, 47906697, 48216123, 48679000, 49321599, 50186723, 51310007, 52697388, 54397407, 56441867, 58855012, 61651452, 64761993, 68156718, 71876363, 75917596, 80274653, 84979260, 90034798, 95423496, 101138265, 107164315, 113491910, 120152131, 127165371, 134544827, 142282484, 150319883, 158592646, 167040139, 175546975, 184037014, 192396304, 200585002]
3653B00585002Q006713P847308P707780P499534P278676O996712O749964O461268
3645B59132957O204337N915794N594416N197462M758816M259441L787230L403311
3637B98253764K988653K510902J968554J475451J028868O35751K07730k53780
3629C08815893p09000j126825j516956j801104k004222k185745k305949k339265
3621B94826827k287917k057636j591745q30317J22196J182270K318381L515608
3613B95197667M826788O039421O946866P352313P211740O613058N809608N061455
3605C45058916M626419M613817N056677N952040O966318P968816Q844626R587168
3597C98674797J0026854R831718Q656562O409236L485101J43097l192068o070318
$$ y = [200585002, 208591715, 216439023, 224146803, 231646337, 238925013, 245921725, 252671689, 259132957, 265337294, 271253088, 276847504, 282044966, 286803782, 291063223, 294850453, 298253764, 301242417, 303753319, 305721873, 307197324, 308226192, 308861943, 309069673, 308815893, 308106893, 306980068, 305463112, 303662008, 301657786, 299472041, 297166092, 294826827, 292538910, 290481274, 288889529, 288059212, 288181408, 289363678, 291682059, 295197667, 300024455, 306063876, 313010742, 320363055, 327574795, 334187853, 339997461, 345058916, 349685335, 354299152, 359355829, 365307869, 372274187, 380243003, 389087629, 398674797, 408701651, 418533369, 427189931, 433599167, 437084268, 437227365, 434035297, 427964979]
3589D27964979q393167j0133553j1228594j1753053j1699355j1469199j1168973
3582C52119085j0931163j0878004j1179518j1900226j2949378j4253564j5487789
3575B64539443j6570051j7196207j7442691j7305445j6617197j5602224j4279660
3568A49525968j2863272j1481767j0172132q974977p837841o860568o004937n272187
3560H0058287m658649m152213l734258l443421l241874l041815k865287k666370
3552E2254400k480586k353959k208804k081002j964096j852897j750961j653434
3544C5908661j532661j484090j427693j413599j421968j359925j306753j238064
3536B4723908j187951j109875j041466r93228r31229q52177p88588p31675o55209
$$ y = [427964979, 419571812, 409438259, 398209665, 386456612, 374757257, 363288058, 352119085, 341187922, 330309918, 319130400, 307230174, 294280796, 280027232, 264539443, 247969392, 230773185, 213330494, 196025049, 179407852, 163805628, 149525968, 136662696, 125180929, 115008797, 106033820, 98195979, 91335411, 85330474, 80058287, 75399638, 71247425, 67513167, 64069746, 60827872, 57786057, 54920770, 52254400, 49773814, 47419855, 45211051, 43130049, 41165953, 39313056, 37562095, 35908661, 34376000, 32891910, 31464217, 30050618, 28628650, 27268725, 25961972, 24723908, 23535957, 22426082, 21384616, 20391388, 19460159, 18607982, 17819394, 17087719, 16432510]
3527A6432510o50220n83344n29668n07462m67971m45798m08722l91810l80656
3518A2066859l29541l15814l05202k92761k76071k44738k43405k55224k22282
3509I581821k12569k25629j99212j92465j90290j66829j73707j62400j66072j56907
3499G735741j43280j46421j38737j33482j18835j23766j17030j29569j03471j08265
3489F472885j14754j14084j10815r1277j12573q0516p3588r7797p4681p8895r3233
3478E430672o6174q8943p2784o1642o7304l2160o6769o9909m5505m1935m8854
3467D768693l7021m2281l7774l3755l2822j7281r227r092k7307o018m820O526
3455D517821Q215K7528J6503Q513L2378O850J7674L9400J6927L0395M9830N3265
$$ y = [16432510, 15782290, 15198946, 14669278, 14161816, 13693845, 13248047, 12839325, 12447515, 12066859, 11737318, 11421504, 11116302, 10823541, 10547470, 10302732, 10059327, 9804103, 9581821, 9369252, 9143623, 8944411, 8751946, 8561656, 8394827, 8221120, 8058720, 7892648, 7735741, 7592461, 7446040, 7307303, 7173821, 7054986, 6931220, 6814190, 6684621, 6581150, 6472885, 6358131, 6244047, 6133232, 6041955, 5929382, 5848866, 5775278, 5677481, 5602800, 5523905, 5430672, 5364498, 5275555, 5202771, 5141129, 5073825, 5041665, 4974896, 4904987, 4859482, 4817547, 4768693, 4731672, 4689391, 4651617, 4617862, 4585040, 4567759, 4558532, 4549440, 4522133, 4516115, 4511295, 4517821, 4526036, 4553564, 4570067, 4578580, 4610958, 4617808, 4635482, 4674882, 4691809, 4722204, 4772034, 4825299]
3443D825299N3121N4788N8232N8517N3550M4472P9921M4490O1132R0233P7480
3432E501235O6978J01390R9224R7317J27331J42445J19906J21270J27344J10749
3422F615189J30807J53626J48955J61607J62463J82593J70368J90571J76424J99700
3412H292303K02175K16495K40662K48590K49942K76320L01892L06086L21461L33270
3402A0989196L44395L74947L73108L85690M18558M26756M19484M07116L95857
3393A4535107L99498M20124L92323M29161M41428M38476M25957M25652M17458
3384A8325184M21128M23154M62358M68579M87176M96911M80216M88951N48021
3375B2601678O10018O98507P52676Q10081Q15389P77736P81866Q59990R56097
$$ y = [4825299, 4878420, 4933208, 4991440, 5049957, 5103507, 5147979, 5227900, 5272390, 5333522, 5423755, 5501235, 5568213, 5669603, 5768827, 5866144, 5993475, 6135920, 6255826, 6377096, 6504440, 6615189, 6745996, 6899622, 7048577, 7210184, 7372647, 7555240, 7725608, 7916179, 8092603, 8292303, 8494478, 8710973, 8951635, 9200225, 9450167, 9726487, 10028379, 10334465, 10655926, 10989196, 11333591, 11708538, 12081646, 12467336, 12885894, 13312650, 13732134, 14139250, 14535107, 14934605, 15354729, 15747052, 16176213, 16617641, 17056117, 17482074, 17907726, 18325184, 18746312, 19169466, 19631824, 20100403, 20587579, 21084490, 21564706, 22053657, 22601678, 23211696, 23910203, 24662879, 25472960, 26288349, 27066085, 27847951, 28707941, 29664038]
3366B9664038J037378J115704J169545J186377J211352J218648J259923J290134
3358C9153099J286940J290233J294085J315205J315090J318528J380798J486057
3350D9840035J594773J701412J814118J916549J994492K024985K019394J982508
3342F4888266J989658K074834K202172K376923K523033K718071K989170L332546
3334H5094673L749526M248115M806179N366406N895088O330496O654393O864452
3326A29009328P037003P083479O924676O476048N763488M961016M242253L695547
3318A75192838L266125L031101K957334K903631K747143K387243J831870J111693
3310A95428978K85286n49414j566897k741199l967394n114789o160234p014082
$$ y = [29664038, 30701416, 31817120, 32986665, 34173042, 35384394, 36603042, 37862965, 39153099, 40440039, 41730272, 43024357, 44339562, 45654652, 46973180, 48353978, 49840035, 51434808, 53136220, 54950338, 56866887, 58861379, 60886364, 62905758, 64888266, 66877924, 68952758, 71154930, 73531853, 76054886, 78772957, 81762127, 85094673, 88844199, 93092314, 97898493, 103264899, 109159987, 115490483, 122144876, 129009328, 136046331, 143129810, 150054486, 156530534, 162294022, 167255038, 171497291, 175192838, 178458963, 181490064, 184447398, 187351029, 190098172, 192485415, 194317285, 195428978, 195714264, 195164850, 193597953, 190856754, 186889360, 181774571, 175614337, 168600255]
3302A68600255p589895p814853p713603p448534p145459o867865o614032o361932
3294A11044082o055533n785643n476987n148511m861800m582010m337597m098993
3286G0697008l862057l616778l354674l144201k945409k730000k529939k319041
3278D6194909k152422j954621j771425j602374j394840j245198j118518j016821
3270C3938690q90189q32541p43907o63378n87825n29348m75978m06285l52490
3261B8456749k77158k06107j31170q8548l5482L9359P8074J32410J68628J74696
3251B8311451K46260K81882L34953L81735M41155N21692N54143O06610O86884
3242C2366765P31793Q25593Q85234R30604R80070J050066J111697J176972J239477
$$ y = [168600255, 161010360, 153195507, 145481904, 138033370, 130887911, 124020046, 117406014, 111044082, 104988549, 99202906, 93725919, 88577408, 83715608, 79133598, 74796001, 70697008, 66834951, 63218173, 59863499, 56719298, 53773889, 51043889, 48513950, 46194909, 44042487, 42087866, 40316441, 38714067, 37319227, 36074029, 34955511, 33938690, 33048501, 32215960, 31472053, 30808675, 30220850, 29691502, 29215524, 28809239, 28456749, 28179591, 27973484, 27842314, 27753766, 27718284, 27757643, 27835717, 27968127, 28136755, 28311451, 28557711, 28839593, 29174546, 29556281, 29997436, 30519128, 31073271, 31679881, 32366765, 33098558, 33924151, 34809385, 35739989, 36720059, 37770125, 38881822, 40058794, 41298271]
3233D1298271J326883J364470J421499J493149J556270J614335J674584J698048
3225E3447509J726090J753974J754537J747968J680548J644413J560551J485675
3217F6801265J410824J299399J153764J015710Q57316O97392M95478L00576R7821
3208G4129545r1906k89713n08839p25220r07520j105208j274358j414205j562722
3199F6249854j693733j776154j855763j923390j955915k003656j979622j939183
3191E1122438j963327j920150j875706j845280j762883j726698j642873j550866
3183C6834655j505358j434016j350064j298054j246795j195191j122961j073471
3175B6608745j004833r48648q97952q57584q22400p83254p68658o94376o70387
$$ y = [41298271, 42625154, 43989624, 45411123, 46904272, 48460542, 50074877, 51749461, 53447509, 55173599, 56927573, 58682110, 60430078, 62110626, 63755039, 65315590, 66801265, 68212089, 69511488, 70665252, 71680962, 72538278, 73235670, 73731148, 74031724, 74129545, 74037639, 73747926, 73239087, 72513867, 71606347, 70501139, 69226781, 67812576, 66249854, 64556121, 62779967, 60924204, 59000814, 57044899, 55041243, 53061621, 51122438, 49159111, 47238961, 45363255, 43517975, 41755092, 40028394, 38385521, 36834655, 35329297, 33895281, 32545217, 31247163, 30000368, 28805177, 27682216, 26608745, 25603912, 24655264, 23757312, 22899728, 22077328, 21294074, 20525416, 19831040, 19160653]
3166A9160653o49936n87377n85756n39835n26683m90099m60745m52143m22086
3157A4445993m05336m11827l79193l58033l33857l32800l14140k95679l00035
3148A1315093k72300k77698k66272k68634k18835k02222k14879k16261j95076
3139I182916j89094j95653j84376j76353j48921j59088j62896j51532j39043j23751
3129G552209j35092j35104j10695j07728j03718j09125r7552j08113r8514p8549
3119F468019r0840p3058q2400p9049p5214o4582p8369o9399p1377n4968n0472
3108E678291p2336m1295m0245q9001o9192l8184l8334n4007m4430k8404l1950
3097E130913n0224m1166j8533l4536m9565j6977l4235k2362k9458k8671k1458
$$ y = [19160653, 18510717, 17923340, 17337584, 16797749, 16271066, 15780967, 15320222, 14868079, 14445993, 14040657, 13628830, 13249637, 12891604, 12557747, 12224947, 11910807, 11615128, 11315093, 11042793, 10765095, 10498823, 10230189, 10011354, 9809132, 9594253, 9377992, 9182916, 8993822, 8798169, 8613793, 8437440, 8288519, 8129431, 7966535, 7815003, 7675960, 7552209, 7417117, 7282013, 7171318, 7063590, 6959872, 6850747, 6753195, 6645082, 6546568, 6468019, 6377179, 6304121, 6221721, 6142672, 6067458, 6002876, 5924507, 5855108, 5783731, 5728763, 5678291, 5605955, 5564660, 5524415, 5435414, 5366222, 5328038, 5289704, 5235697, 5191267, 5162863, 5130913, 5080689, 5039523, 5020990, 4986454, 4936889, 4919912, 4885677, 4863315, 4833857, 4805186, 4783728]
3086D783728p493M371j3745j6659N988J2643r19p003q153M206j0880K2151J6365
3073D784600K1265K7126K1770K9608M9480K2512M3399M3983K7019N8244P3991
3062E202997O1858M0027M8805M2949O6800P4575O2193O9573R5307J01233R1421
3051E957738P4223J17902J15496J06436J19136J08908R4968Q5306J08237J16701
3041G005051J09118J36873J43539J74683J64149J71706K08414K11125K20370K32268
3031H777296K35185K55816K85251L17425L65299L64573M01441M44729M95194N11875
3021A2454084N59113O23344O91787P45437Q12761R10699R91673J070012J171518
3012B0030428J309488J517056J701168J924406K115284K260221K421032K600809
$$ y = [4783728, 4776235, 4780606, 4766861, 4750202, 4756190, 4768833, 4767914, 4760911, 4752758, 4756964, 4746084, 4768235, 4784600, 4805865, 4832991, 4854761, 4884369, 4933849, 4956361, 4999760, 5043743, 5070762, 5129006, 5202997, 5264855, 5304882, 5353687, 5396636, 5463436, 5538011, 5600204, 5669777, 5765084, 5866317, 5957738, 6031961, 6149863, 6265359, 6371795, 6490931, 6599839, 6694807, 6780113, 6888350, 7005051, 7114169, 7251042, 7394581, 7569264, 7733413, 7905119, 8113533, 8324658, 8545028, 8777296, 9012481, 9268297, 9553548, 9870973, 10236272, 10600845, 11002286, 11447015, 11942209, 12454084, 13013197, 13636541, 14328328, 15073765, 15886526, 16797225, 17788898, 18858910, 20030428, 21339916, 22856972, 24558140, 26482546, 28597830, 30858051, 33279083, 35879892]
3004C5879892K758896K752459K657085K448615K194416K076655K113792K249014
2996E5130824K399050K494929K453786K371354K266771K172008K095841J961667
2988G3346230J858566J682614J398227J121569Q54576P77067Q17355R94166J332143
2979H4182513J924098K785358M146167N596714O530143O484112M769899J309930
2971A17728934j519664j918006j059858L76613J300301J160569N68348r552k1870
2962A16605815L91735R88313J723228J988641M97892j927564m754307o841606
2954A08672147o917403o453225n866636n184917m446490l758860l132096k488010
2946G0424510j808360j264600r36375q79282j020371j241264j360351j318249
$$ y = [35879892, 38638788, 41391247, 44048332, 46496947, 48691363, 50768018, 52881810, 55130824, 57529874, 60024803, 62478589, 64849943, 67116714, 69288722, 71384563, 73346230, 75204796, 76887410, 78285637, 79407206, 80261782, 81038849, 81856204, 82850370, 84182513, 86106611, 88891969, 93038136, 98634850, 105164993, 111649105, 116419004, 117728934, 116209270, 114291264, 113231406, 113608019, 114908320, 116068889, 116637237, 116627685, 116605815, 116997550, 117985863, 119709091, 121697732, 122195624, 120268060, 115513753, 108672147, 101754744, 95301519, 89434883, 84249966, 79803476, 76044616, 72912520, 70424510, 68616150, 67351550, 66415175, 65535893, 64515522, 63274258, 61913907, 60595658]
2938F0595658j198003j013757q59564q32258q63248q64004q15584p55704p80805
2929E2612731q91019j110431j528939k005514k423534k688576k786427k754743
2921C6423548k669051k533254k409051k229316k055467j853825j673875j503055
2913A9496654j371622j285775j158763j073901r76598r00028q06568p27928o58619
2904A0536852n96102n55832n06526m75187m24293l75551l49098l22670k80405
2895F651188k62480k43629k35156k22738k03326j96679j82704j75107j59506j60506
2885D609357j39692j48708j42237j15186j03151j21303j02207j04816r1526q8042
2875C452489r6018r3660r5862p2794q2832p0386p8218o9447p2880o7270o3871
$$ y = [60595658, 59397655, 58383898, 57524334, 56692076, 55828828, 54964824, 54149240, 53393536, 52612731, 51721712, 50611281, 49082342, 47076828, 44653294, 41964718, 39178291, 36423548, 33754497, 31221243, 28812192, 26582876, 24527409, 22673584, 20999709, 19496654, 18125032, 16839257, 15680494, 14606593, 13629995, 12729967, 11923399, 11195471, 10536852, 9940750, 9384918, 8878392, 8403205, 7978912, 7603361, 7254263, 6931593, 6651188, 6388708, 6145079, 5909923, 5687185, 5483859, 5287180, 5104476, 4929369, 4769863, 4609357, 4469665, 4320957, 4178720, 4063534, 3960383, 3839080, 3736873, 3632057, 3540531, 3452489, 3356471, 3262811, 3166949, 3094155, 3011323, 2940937, 2862719, 2793272, 2720392, 2653122, 2589251]
2864B589251n2476n1516n5761m1451o4517o4106o7264l8130m2404m6177l5556
2853B029893n3262n8389m1613l0075l6376k7949l4758m8639l1785l4989l6475
2842A595583n1100m6968l4572n820k0251m3782n1086k5924k1196m4474k6834k2893
2830A200683j6779j5927l4090j5635j6198l4057k5376j3962l815k1472j4485j1589
2818I77298k3832l2906k0325j8208j9566k1912n935j3248k1465k1562n358J1043
2806G84024j4737k5757j7005q722k0825O38r350k0548k73k3799j3743J0893j069
2793F39727p602k4817j0647m308n852Q15m408n247j7677q968q720o474M14n865
2779E30371o551o43j3237J131K94N109K697K132J40m46m632K854J2485r13k3119
$$ y = [2589251, 2536775, 2485259, 2429498, 2388047, 2323530, 2259424, 2192160, 2154030, 2111626, 2065449, 2029893, 1976631, 1918242, 1876629, 1846554, 1810178, 1782229, 1747471, 1698832, 1667047, 1632058, 1595583, 1544483, 1497515, 1462943, 1457123, 1436872, 1393090, 1342004, 1316080, 1294884, 1250410, 1223576, 1200683, 1183904, 1167977, 1133887, 1118252, 1102054, 1067997, 1042621, 1028659, 1024844, 1003372, 988887, 977298, 953466, 920560, 900235, 882027, 862461, 840549, 834614, 821366, 799901, 778339, 772981, 784024, 769287, 743530, 726525, 717803, 696978, 697616, 688266, 667718, 667445, 643646, 629903, 640796, 639727, 632125, 607308, 596661, 592353, 586501, 587316, 582908, 577661, 559984, 551016, 542296, 535822, 536236, 530371, 523820, 523177, 509940, 511071, 511365, 516474, 519171, 521303, 521443, 520997, 516365, 519219, 531704, 530791, 507672]
2764E07672j0430R866k819p11j7851r877p065J6261J1698J775r660P16r148N339
2750D85766j6203r892l894q270n92L236j3714k4045K5982j904r967J8138n988
2737D38653q581r401N381k111j3987K581l78m143M911J9025R244R723J3694J981
2723D66592o071J5802K7555J4612K0151O068o912m675J4416J2053J3643Q804J486
2710E83524J3798J3053L815q77K620J5467M045o717J7611r771Q6J2102M178J52
2696F53086J2505L059R572M2519K7482K4652L8323L1519r194k9968J26j0462N116
2683G98335J0452l56J2309N782p267R664J0459k708J1519l703j6689l9429l7658
2670G50710m9130m5172k8793l8954j1345m7796k4682j4194Q647P982J0378m068
$$ y = [507672, 497242, 507108, 504289, 503578, 485727, 475850, 468785, 485046, 496744, 498519, 488859, 489575, 480427, 485766, 469563, 459671, 455777, 447507, 446915, 450151, 436437, 412392, 438374, 436470, 426503, 444641, 438653, 430072, 420671, 426052, 423941, 409954, 412535, 412157, 408014, 412925, 431950, 441194, 450917, 464611, 466592, 460521, 476323, 503878, 518490, 538641, 544709, 537797, 533122, 547538, 559591, 573234, 582038, 583524, 597322, 610375, 614190, 613313, 615933, 631400, 635445, 628728, 646339, 636568, 636654, 648756, 652934, 653086, 665591, 668650, 678222, 720741, 748223, 772875, 811198, 842717, 833523, 803555, 803681, 793219, 798335, 808787, 808431, 820740, 826522, 819255, 828919, 839378, 836670, 848189, 844486, 827797, 788368, 750710, 701580, 656408, 627615, 588661, 577316, 529520, 504838, 490644, 499291, 507273, 517651, 513583]
2658E13583j5297k218q775M149l087k3311n336m574M058N748q650K070p433m978
2644D45949j1910k1566K4N70j9185k5221j6500k1362j7098k3711j7057k4513j5100
2631B33320l159p072J1706j2109k3150P019j1883o641m637J6072m11q10j4076
2618A84169j0114o92p362L403j947n622j7010j2370n582N371J3853J522m699Q547
2604A51467r653j3349M051O331l852l729j5367N924K116j0524J550J9279j3781
2591A20463J723J798j929l478k220n169J7809p368q00j360L474r520L639l33L309
2576A20038M394m500o682o98j3155j0590j3777J3402j0849J5085N480n724q013
2563H4411j932N320p710Q099K05K511j0155p675j0464K0739o976j0065l768K827
$$ y = [513583, 498286, 496068, 487293, 491442, 488355, 465044, 459708, 455134, 459192, 464940, 456290, 458360, 450927, 445949, 434039, 412473, 412497, 413067, 393882, 368661, 352161, 330799, 313701, 289990, 272933, 248420, 233320, 230161, 223089, 234795, 222686, 199536, 206555, 194672, 188031, 183394, 199466, 199055, 198245, 184169, 174055, 173363, 166001, 169404, 167457, 161835, 144825, 132455, 126873, 132244, 146097, 147619, 142920, 151467, 141814, 128465, 132516, 138847, 134995, 131266, 115899, 121823, 123939, 113415, 114965, 134244, 120463, 122186, 123984, 122055, 118577, 116357, 111188, 128997, 121629, 120829, 119469, 122943, 113423, 117062, 116729, 120038, 124432, 119932, 113250, 112552, 99397, 88807, 75030, 88432, 77583, 92668, 98148, 92424, 84411, 82479, 87799, 80089, 88188, 88393, 90904, 80749, 73074, 62610, 83349, 76373, 66308, 62540, 65367]
2549F5367r56l510J0351K144q274m20j703O791J420P276j1306J558K462o34j1315
2534E9251J1426J1167J336k798r511J3685k1530r151N167j509K368L114o248J8513
2520G5280j8323k0993J2610K4149k152j029K3268k1835j5205j511R521L887L106
2507G0773j1928k0333o851J9502P28m145J5516j9016Q310K87r094P536j127O975
2493E7133j3391q749q71O545l866J1958M201%j1118k388J3513K13M26K002r597
2478D6011j3298j8666J431K7571K504j1734l574l38P365j994n189P954O655o416
2464C8282J2343m487K336Q8K547k519j8370p649O530j56m836K15m078j1121K0688
2449B9813o570k089Q67P986m469M224J4744K345J4069m719j0399j6560M138m393
$$ y = [65367, 64411, 60901, 71252, 73396, 65122, 64702, 62999, 69790, 71210, 78486, 67180, 68738, 71200, 70566, 59251, 70677, 81844, 83180, 80382, 70871, 84556, 63026, 53875, 59042, 57533, 59901, 63015, 56767, 75280, 56957, 35964, 48574, 72723, 70571, 69542, 92810, 70975, 55770, 54259, 63780, 67667, 70773, 58845, 38512, 31661, 51163, 51891, 47746, 63262, 44246, 52556, 52843, 43749, 51285, 50158, 57133, 43742, 34993, 34122, 40667, 36801, 48759, 52960, 52960, 41842, 39454, 52967, 53180, 53606, 55608, 46011, 32713, 14047, 15478, 43049, 45553, 33819, 30245, 29907, 37272, 35278, 30089, 38043, 44698, 38282, 50625, 46138, 48474, 48562, 51109, 48590, 30220, 22571, 29101, 28945, 24109, 24324, 20246, 9125, 29813, 23243, 21154, 22021, 30007, 25538, 29762, 44506, 46851, 60920, 56201, 45802, 29242, 33380, 28987]
2435B8987O15k327J2728k2556M930k933q683K3590Q910q28j4020M739l959m443
2421B4750L240J1138q314l741K925j2197K382N656Q108m006r702j7746R276l304
2407H465m469M933k415j0033j3668M438Q499J034o646n43L98o45J2081l251k5511
2392b7333J5382K121N024J5505j4135M295N525j9200j0409K671J6175K899K078
2379E98m998p410J9228R396O588l139k0679r348j7646N418J5766p735m197j5841
2365c3999J0498M069r971n023J6941j924p528P365o213p118l397J1047K5439n664
2351e478j3823p566K3880j0047M124J0926j67k014Q611o805j5098j3995J6182
2338a1270J1666r011J7664q410k7438J440J8771J8533r682k6768k557J4270j339
$$ y = [28987, 29602, 27275, 40003, 17447, 22377, 19444, 10761, 34351, 43261, 42433, 28413, 33152, 29193, 24750, 27990, 39128, 30814, 27073, 29998, 17801, 20183, 25839, 33947, 29941, 20239, 2493, 11769, 8465, 3996, 8929, 6514, -3519, -17187, -12749, -4250, -3216, -9862, -10405, -10007, -10652, 1429, -1822, -27333, -11951, -9830, -4806, 10699, -3436, 859, 6384, -12816, -23225, -20554, -4379, -1480, 598, -4400, -11810, 7418, 16814, 23402, 20263, -416, -9764, -27410, -21992, -6226, -13961, -18158, -33999, -23501, -19432, -29403, -34426, -17485, -19409, -26937, -19572, -25785, -32903, -36300, -25253, 186, -5478, -19301, -26867, -2987, -13034, -8910, 2016, 1849, -165, 8446, 1641, -13457, -27452, -11270, 396, -8615, 9049, 639, -26799, -25359, -6588, 11945, 2263, -24505, -27062, -12792, -14131]
2325a4131l2112J485J3040K856j0269J1341K0684j000j0890L324p542k4045K887
2312d4372L178J3323q833o472J4936N857r187N307N186M167J024r258k131K844
2298b4431P917N093K088j4418m589J3430j1277k050J0020M69J1862j1627M306
2285a3207k2361J1221O085J7145n325L716J5985l09j0421j4483j925n77j5150
2272b9606Q762J440R351M064o816P778J6598p878k1282K0630j4170j0107K586
2259a8650k714K0586J1564q987l908N349Q399N271k169j2689L800M011q987Q86
2245A762N686P607J261j4443K95m588P711J2803p600j2694J2417j0183K392J0147
2231A2573J263J4040P277k419j8604j570n011R530K393J5757O318m884j6392l089
$$ y = [-14131, -46243, -44758, -31718, -28862, -39131, -27790, -7106, -8106, -18996, -15672, -23214, -47259, -44372, -41194, -27871, -36704, -43176, -28240, -22383, -31570, -26263, -21077, -16910, -15886, -25144, -27275, -24431, -16514, -11421, -9333, -23751, -28340, -14910, -26187, -28237, -18217, -17748, -5886, -17513, -13207, -35568, -24347, -18262, -1117, -6442, -2726, 13259, 12950, 2529, -11954, -13879, -14456, -29606, -20844, -19404, -10053, -5989, -12805, -5027, 11571, 3693, -17589, 3041, -11129, -21236, -18650, -21364, -778, 10786, 1799, -2109, 3240, 11639, 16910, 14741, 2052, 5852, 9863, 876, 1762, 7448, 15055, 16316, 1873, 2168, -2420, 5291, 18094, 10494, -2200, 10217, 34, 2426, 12573, 13836, 27876, 35153, 32734, 14130, 12560, 7549, 17079, 19472, 35229, 41547, 36663, 20271, 17182]
2217A7182q733J764R422n721l977J9088Q77K518K901n245J6462l454J0782J5470
2203F9336J2289K629P637J0667p742J0529K0919R009J0440K0401L5632R959K0888
2190B32593L3548L6504N9549M0674L0725M7344K4430M7133M5100O9515N9463Q8588
2178H15166J24568J36683J85672L18966M80584N83792O11896M76457l0270l64260
2168C339254k48316j08738J20466K27754J44176N2244m0781k6613L5522J09742
2158C604710J97861L15327J42956j14459l98738o13687m61335l60376l05725k68100
2148A738434k21491k17707j90791j67337j17382j02351n6375o2971o8134o4015
2138D69880q2253m9304l8034k9807l6459k2636j9512j1793q508k3008j5919j0883
$$ y = [17182, 8449, 10213, 19635, 13914, 9937, 29025, 29902, 32420, 35321, 30076, 46538, 43084, 53866, 69336, 81625, 84254, 91891, 102558, 94816, 105345, 126264, 135273, 145713, 166114, 201746, 211705, 232593, 266141, 302645, 362194, 402868, 433593, 480937, 505367, 552500, 597600, 667115, 726578, 815166, 939734, 1076417, 1262089, 1581055, 2061639, 2645431, 3257327, 3733784, 3703514, 3339254, 3090938, 2982200, 3102666, 3330420, 3474596, 3526840, 3486059, 3459446, 3494968, 3604710, 3802571, 4117898, 4260854, 4146395, 3747657, 3133970, 2672635, 2312259, 2006534, 1738434, 1516943, 1299236, 1108445, 941108, 823726, 721375, 665000, 602029, 533895, 469880, 387627, 338323, 300289, 270482, 234023, 211387, 191875, 180082, 171574, 148566, 132647, 121764]
2126A21764N472j6670q317K397N525n934k0121o62r456O062N526n986k9850q602
2112D1148j68R34j2447O757J1220j784l038l861j3920J221o963j2027J8467J751
2098B7290k0746R042L04n646j1865J911J4068j924J0551m007k834P585k4547r426
2084a0244j987n202K130J0546J2728l798p345j9j2008l009j1949J0646m507Q3
2070b3935J837j0713N450j5535K0126p035o924J1554K799o830O893q843o175L943
2056c3388Q273K320N532l529j5598J5230p645j2468L435r914J4182J2851j4312
2043c5031m072L237m008p60l74Q014k839j0673L403J9980O800j5609q118j3577
2029e3627J0628J5243m724j4392k336M439P277o432k309J7413j5319N467r060
$$ y = [121764, 127236, 110566, 102249, 104646, 110171, 104237, 84116, 83454, 73998, 80060, 85586, 79600, 49750, 41148, 40980, 41914, 29467, 36224, 47444, 45660, 42622, 38761, 24841, 26062, 19099, 7072, 25539, 27290, 6544, 15586, 15890, 10244, -1621, 290, 14358, 12434, 22985, 18978, 16144, 23729, -818, -10244, -12231, -17433, -15303, -4757, 7971, 4173, -3172, -3191, -15199, -18208, -30157, -19511, -24018, -23935, -22098, -32811, -27361, -42896, -22770, -29805, -36729, -25175, -22376, -29206, -22313, -31156, -37331, -33388, -25115, -22795, -17263, -20792, -36390, -21160, -28805, -41273, -37838, -47752, -33570, -20719, -35031, -39103, -35866, -39874, -40634, -41008, -32994, -35833, -46506, -43103, -23123, -16323, -31932, -40050, -53627, -42999, -27756, -32480, -46872, -49208, -44769, -37492, -43924, -46233, -28820, -44139, -38672, -47732]
2016d7732J5018p302o968j878J7548j041k1805m344J6791j0872N47K235J289J448
2002d7066r119J0486k887K994N647N517o108k7556J672J4973N226M974m358j03
1988d5708o563K327J699o428j0032J5060n487p875j886J215m599J1599N246j5029
1974f6461q412Q755n318J3643L79j7043J2841O584j3515K969o09p415N42J9925
1960e3135Q425l70R892j9021j1622J9820J0214J2849J9457k3844l6494j037J4978
1947d9888O308r730M501P329j7314o041L258R185q135L818Q910j364p865P756
1933d9272j798o336J9716J868l4825j147J3214n180J6100M23O37q381J4871J4157
1919b5953k3153o462o587J3020o891J563O253k0027O205Q192K055R551l098q536
$$ y = [-47732, -32714, -40016, -46984, -48862, -31314, -32355, -54160, -58504, -41713, -52585, -52038, -49803, -48514, -47066, -56185, -45699, -48586, -45592, -39945, -34428, -40536, -68092, -66420, -51447, -46221, -41247, -45605, -45708, -52271, -49944, -48245, -54673, -64705, -49645, -55132, -63007, -64893, -63678, -68277, -56678, -51432, -66461, -74873, -66118, -71436, -57793, -57414, -74457, -61616, -55032, -68547, -65578, -66187, -73602, -73060, -53135, -44710, -45080, -35188, -54209, -65831, -46011, -35797, -22948, -3491, -27335, -63829, -64866, -49888, -43580, -53310, -48809, -41480, -58794, -64835, -61577, -52392, -60527, -56709, -47799, -49163, -57028, -49272, -51070, -57406, -37690, -35822, -70647, -71794, -58580, -63760, -47660, -47237, -46600, -54981, -40110, -25953, -49106, -55568, -62155, -49135, -56026, -54463, -48210, -68237, -62032, -53840, -51785, -42234, -45332, -53868]
1905e3868L793L7M699O041Q396j0227L737K92J8963j9681O449p971o841P433J0547
1890b8201M484k1734O808J2269J4461R06j0600j2792N360O080j8766q160l288
1877e3173k741r427M864K3806q269J574r788k2058J5612j482k270M165J0929R008
1863c9250k831j1837q107q713J3549Q325k585O205l717j8763K466J5806P363N212
1849c6877o380j6411k2725J6783L26m827J0242N263k825J1002N998k420k1130
1836f3981N771p325L948J0700o968j5737P376J7431j929J473k135j3420L478R384
1822e1934N852j43O686m000K963l659r58r764J4592n276n260k099j9350J0466
1808f1884J4412M557J2936M04j4043q682k6506R958J3988L877P915j5932M708
$$ y = [-53868, -50075, -50038, -45339, -39298, -30902, -41129, -37392, -37100, -18137, -37818, -31369, -39340, -46181, -38748, -28201, -23717, -45451, -38643, -26374, -11913, -11007, -21607, -34399, -29039, -22959, -41725, -49885, -53173, -55914, -65341, -60477, -36671, -44940, -43366, -53154, -75212, -59600, -61082, -63352, -59187, -48258, -39250, -42081, -53918, -62025, -70738, -57189, -48864, -51449, -45244, -48961, -67724, -65258, -49452, -42089, -36877, -43257, -59668, -82393, -65610, -65284, -70111, -59869, -54606, -57431, -46429, -40431, -42851, -63981, -58210, -65535, -61587, -50887, -57855, -73592, -66216, -48785, -50714, -49241, -51376, -64796, -61318, -51934, -46082, -46225, -39539, -43539, -40576, -44235, -45193, -54957, -40365, -45641, -50901, -53000, -72350, -61884, -47472, -42915, -29979, -29575, -43618, -52300, -78806, -68848, -54860, -50983, -43068, -59000, -54292]
1795e4292k447j085m52J491M166j3760q76J2378j1487r148l423L786R944q217
1781g3422j36j012J2200R13J0416m445j2609J6340J1992j1553j5802J7363l844
1768e3599J928J4728j7355M688R57j6981l974J8761M107Q332q768n70o114m543
1754e8403j796J1716N848p151j455J0643j4761r447J8719Q579P387j2955m804
1741d7880r807k388j5787n847Q988Q884J4612P156J613p433j4079r473N285J8
1727f6138R536q277J009O971Q978M762Q067r938j5389O792p39P369M5r599m148
1712f0699M515J590o116p75Q879J086q065O488j6215O055J2849J4984L382n181
1698c7223l777k6500m790r56J8326n856J7849M528j1709K569J2307J0650q192
$$ y = [-54292, -56739, -57824, -58276, -56785, -52619, -66379, -67255, -54877, -66364, -75512, -78935, -75149, -65205, -73422, -73558, -74570, -62370, -61457, -51041, -55486, -68095, -51755, -39763, -51316, -67118, -49755, -53599, -51671, -36943, -54298, -49610, -48653, -65634, -69608, -50847, -46740, -38408, -47176, -47746, -53860, -58403, -60199, -48483, -42635, -49786, -51241, -40598, -55359, -64806, -46087, -37508, -30121, -43076, -47880, -57687, -60075, -75862, -81709, -72721, -63837, -49225, -42069, -40456, -47889, -61968, -71441, -66156, -66138, -56602, -64879, -63870, -56899, -47921, -43159, -35092, -45030, -60419, -53627, -54366, -46997, -46952, -56551, -60699, -56184, -54594, -60710, -61485, -52606, -51520, -59585, -53097, -69312, -63257, -50408, -35424, -32042, -37223, -41000, -67500, -72290, -73246, -54920, -60776, -42927, -38399, -50108, -47539, -35232, -24582, -32774]
1685c2774j3460j1584L300k523K894k574o546p521J1720Q43M312R341j715l869
1671e0156K811L476q59n959o299K298M307j8823m404P583m203J2688J5202J523
1657d0815j3067R46j1885K783J8863N04m627K942N897K636l729j983O11o60Q16
1642d0768r232P602q963J1320j3187p212j406Q381R223o037p093O736N31j2328
1628f2433n198L134J092q363J182M750J4135M356J107N88N47j619O66j4181L387
1613e6850q163k631r579O421j1303J0256Q234J2932o191Q011m670l65l639N116
1599e2421R56p838L833j1124j4601J2641j737J1807R991j3267R482n022K941J5216
1585c9143j952j9609J1714J1826J027j0284M482o47Q451K44j1757n094K179n948
$$ y = [-32774, -46234, -57818, -54518, -57041, -54147, -56721, -63267, -70788, -59068, -58225, -53913, -44572, -46287, -50156, -47345, -43869, -44728, -50687, -56986, -54688, -50381, -69204, -73608, -66025, -70228, -57540, -42338, -40815, -53882, -52936, -64821, -62038, -43175, -42671, -47298, -44356, -38459, -35823, -39552, -41535, -40924, -41584, -40768, -50000, -42398, -51361, -40041, -53228, -60440, -61846, -53465, -44242, -50279, -57372, -50636, -50105, -62433, -67631, -64497, -63405, -71768, -70586, -65836, -51701, -47345, -46238, -45650, -45103, -46722, -46056, -60237, -56850, -65013, -67644, -77223, -70802, -82105, -71849, -63615, -50683, -56874, -48863, -53533, -53898, -57537, -52421, -51465, -59303, -55470, -66594, -81195, -68554, -70291, -58484, -48493, -61760, -52278, -57300, -54359, -39143, -41095, -60704, -48990, -37164, -36137, -46421, -41939, -42586, -34135, -33891, -45648, -50742, -48563, -54511]
1571e4511L189M988P644N626Q502j6372n757j52k059J617n310O497m407O134j3528
1556e7899O066o171q39P728r315j1214K6847J0761j5518k224j2586j540K4677
1543d1227m390j0198k31K522m96K291Q193j0631J0178L814q687r72J1895j9413
1529e7352K958J0087K1491q898j3666j6307j946p141l268P384J0414J7698j3797
1516e2343l0919Q934J0620J1607J0359n119P7p017j789J4322o905K699K506N007
1502c7961p407m709O859l747p301n614j461n171J1337R931j5186j7933J0751J6969
1488e0643j5383P444R814L362M906P783r267j1051n629J133K7484j4308J704k675
1474d5326L703p213M643o382N338n214j5218O122J2101K234L8J4080q863p090
$$ y = [-54511, -51322, -46334, -38690, -33064, -24562, -40934, -46691, -46843, -48902, -47285, -52595, -46098, -50505, -44371, -57899, -51833, -58004, -58843, -51115, -60430, -71644, -44797, -34036, -49554, -51778, -64364, -65904, -41227, -45617, -55815, -56046, -53524, -54020, -51729, -43536, -54167, -43989, -40175, -48862, -49834, -37939, -57352, -54394, -44307, -22816, -31714, -45380, -61687, -63633, -70774, -74042, -66658, -56244, -38546, -52343, -83262, -74328, -63708, -52101, -41742, -46861, -46784, -53801, -55590, -41268, -48173, -45474, -42968, -37961, -45368, -50077, -43218, -46965, -54266, -59880, -61341, -66512, -55175, -45244, -60430, -78363, -67612, -50643, -66026, -58582, -48768, -45406, -40500, -32717, -41984, -53035, -58664, -57531, -30047, -44355, -42651, -45326, -41623, -48836, -44193, -50575, -45237, -50451, -65669, -59547, -47446, -45212, -45174, -31094, -39957, -47047]
1460d7047K2360q106j1638J0743p351r751K0922k124k4449j58K5068M1j0353j4763
1446e6606Q334L763j3189R15J0375J2724j7170R443O571K3632N797j9334j9053
1433d3798J217J3128o486r270o349Q140l588m811k590L730J3899P25J194J6731
1419a8128j6509j7662Q478K2768r344j4122k548l434K894m932J76K1969p130N500
1405c2024M364j377r101m350P170j2148r238o58M003L799k352K641K4118O427
1391a8726o120j6072L055N65k0344R784R351K628j1157n058N967J4342o840n281
1377d3906J7214k8338J421J2632Q004o352n403j2331J2462j296J5229l408r08
1364c4980J3479k4491n579N648m430R425K947j745J3101j6685j4477p71O245K268
$$ y = [-47047, -24687, -32793, -44431, -33688, -41039, -50790, -29868, -31992, -56441, -56599, -31531, -31490, -41843, -56606, -48272, -44509, -57698, -56783, -46408, -33684, -50854, -41411, -34840, -11208, -5411, -24745, -43798, -42581, -29453, -35939, -45209, -51558, -43418, -47006, -51817, -54407, -50677, -36778, -36053, -34859, -18128, -34637, -52299, -43821, -21053, -30397, -44519, -47067, -50501, -47607, -52539, -52363, -30394, -37524, -32024, -27660, -29037, -38138, -42488, -35318, -47466, -56704, -57362, -53359, -49560, -51912, -49271, -25153, -18726, -24846, -40918, -37863, -37298, -57642, -47858, -38507, -35879, -47036, -52094, -46127, -31785, -38625, -43906, -26692, -55030, -53609, -40977, -32973, -39325, -44728, -57059, -44597, -45893, -30664, -34072, -34980, -21501, -45992, -51571, -45923, -50353, -40928, -37981, -39726, -26625, -43310, -57787, -58558, -52313, -50045]
1350e0045J1442j873o113J2322q031L00m233J6866O187k269o02r452j6420m401
1336e6322P303j706J8253J9417R84q799q768n429J1861k534j583p768r439O639
1322c7891j945K140l027j835J8979p002J0684Q063j8831j3748J3231J2059m023
1309b3146j4155J769n244O587L632j9122J7183K228P889j0009O940L617j5470
1296c7301M186j4971j0678J0656P811N969p989o335K0309O434k883L969M889O380
1282i554j8973n589Q06M982n92q94j0569k3832M676L2945R2M490k0711o133J6709
1267c2147J2012J2494l4155L634Q368L659N250j2807q149p738J18J4667k489Q757
1253b8526k085K871P743O854j4294j2352j1327J9085J5861L022m565k73j222J611
$$ y = [-50045, -38603, -40476, -46589, -34267, -42298, -41998, -46231, -29365, -23178, -25447, -26049, -35501, -51921, -56322, -49019, -50725, -32472, -13055, -12071, -20870, -29638, -35067, -23206, -25740, -27323, -35091, -44530, -37891, -39836, -37696, -40723, -42558, -23579, -30581, -19897, -11834, -30665, -44413, -31182, -19123, -23146, -37301, -35532, -40776, -34189, -30557, -49679, -32496, -30268, -22379, -32388, -25448, -21831, -37301, -33115, -48086, -58764, -48108, -40297, -34328, -42317, -48652, -28343, -21909, -24792, -20823, -15934, -9554, -28527, -34116, -33310, -28328, -28920, -29814, -40383, -64215, -59539, -26594, -26502, -22012, -42723, -48856, -32147, -20135, -7641, -41796, -38162, -29794, -26135, -20885, -33692, -41841, -49579, -49461, -34794, -37283, -28526, -30611, -27740, -19997, -13143, -27437, -39789, -51116, -32031, -16170, -13148, -17713, -17986, -19208, -17597]
1239a7597N794J67j0425J652J872j8304j5320J3927K584L244Q195n686j5543o496
1225e1936J2354O202r849K509r920J2853O426K296r212n326R200j3987l32J07
1211d8615K3242L472n291p857j262j7235P90K565l9J1713n845J2089Q627L925
1197a9721j7646q431J7497R730J92Q995m170r733J0376j19N02j2997J604J28K112
1182b1681L797j3928r990K5508p05j5271O176O082k808N909o069j808j0816Q3
1168c5521N927J2917m104k271K498J4812j7382N960o590j5646J1971J7018o075
1155a6486O36l950j4368j716J539J3006j11j0240l339K2618L82j0849Q089L179
1141a1610n994R72k0259M860K2447j2660j3904K4462J0589l492k679j9293P720
$$ y = [-17597, -11803, -11636, -22061, -20409, -18537, -36841, -52161, -38234, -35650, -32406, -24211, -29897, -45440, -51936, -39582, -33380, -43229, -40720, -50640, -37787, -31361, -29065, -38277, -43603, -34403, -48390, -48722, -48615, -25373, -21901, -27192, -35049, -36311, -53546, -52756, -50191, -50230, -38517, -44362, -32273, -23646, -19721, -37367, -45798, -28301, -18571, -18379, -9384, -13554, -23287, -12911, -13030, -12528, -25525, -23921, -23793, -21681, -17884, -31812, -41802, -16294, -16999, -32270, -26094, -20012, -22820, -16911, -22980, -24788, -35604, -35521, -29594, -16677, -20781, -23052, -20554, -5742, -23124, -17164, -23754, -39400, -27429, -10411, -16486, -15850, -19800, -34168, -35884, -34345, -21339, -21450, -31690, -35029, -12411, -12029, -22878, -14789, -11610, -17604, -16632, -36891, -32031, -9584, -22244, -36148, -11686, -1097, -4589, -7268, -26561, -18841]
1128a8841J0848P267j4412q394M575j6917J59k570O185J2800M081j8022j427P270
1114b7398M92J5539N974j3513r436P00K2012o623k3899Q099J8636p520q205p676
1100c2818J1231L338k964l866P908J369n04n377o114N322L575j0250P372j8014
1086c9792l73J8901m704k3976O811J9116q939P476Q056K736j1012M859P014J6992
1072C165O16j2009k875J2723q93j2139q773r703O323P712J1192m894n759j5816
1058c1130j3335J5509J0646K748o454o817k581K5270j4220J640R204j9763Q1r10
1044c0112J8020M826p814j6642N653K156O431J0664q984j053N292O218m99l98
1030f242k197j9899Q204k0825L235K0945M559r016J4102J1858L915j64k3953j8329
$$ y = [-18841, -7993, -726, -15138, -23532, -18957, -35874, -35715, -38285, -32100, -19300, -15219, -33241, -34668, -27398, -26906, -11367, -5393, -18906, -28342, -27642, -5630, -12253, -36152, -28053, -9417, -16937, -25142, -32818, -21587, -18249, -21213, -25079, -17171, -15802, -16306, -21683, -27797, -22475, -18900, -29150, -21778, -39792, -40165, -21264, -25968, -49944, -43133, -24017, -32956, -25480, -17424, -14688, -25700, -20841, -13827, 3165, 3781, -8228, -11103, 1620, 727, -11412, -20185, -29888, -23565, -15853, -4661, -9555, -15314, -31130, -44465, -28956, -18310, -15562, -22016, -28833, -31414, -6144, -20364, -18724, -9520, -29283, -29202, -30112, -12092, -7266, -15080, -31722, -26069, -23913, -17482, -6818, -15802, -16855, -11563, -5345, -5844, -6242, -8439, -28338, -20134, -40959, -37724, -16779, -12220, -21236, -7134, 4724, 8639, 8475, -15478, -33807]
1016c3807J5559R583r669O045O342r72n706j92j4472K0357q135Q882n877j1969
1002b4031N106R770K336k54j360p922j5294Q536J3283J0652j5992O688K2093j4004
988c93j0093m569j557L804L965k455M688L388p185m473l659p480q563K195J0579
973b1808j631j717o727j4650l533K3079m076K126J0175n684J032J1871M493j4857
959b1907O471m469j6075p040K2391J2548m939j5063j77M772J2125o701N348N489
945g227K814N222j1165n149L294J079k29J4223k667n902O118o53R413j7838p070
930a5737j895R80Q706M423J7665r027j713o028p005n151K332j2232J2469j974
916a4187n23J0857o55J1534m277j5294m309J903J5271k7691M858J7223J0880j1643
$$ y = [-33807, -18248, -8665, -18334, -12289, -5947, -6919, -12625, -12817, -27289, -6932, -15067, -6185, -12062, -24031, -18925, -9155, -6819, -7073, -8433, -16355, -31649, -23113, -9830, 822, -15170, -8482, 13611, -393, -10486, -15055, -16612, -12808, -8843, -11298, -6610, -3222, -10407, -14880, -18539, -26019, -34582, -32387, -21808, -23439, -25156, -31883, -46533, -50066, -26987, -31063, -28937, -18762, -24446, -23414, -11543, -7050, -21907, -15436, -19905, -35980, -43020, -20629, -8081, -13020, -28083, -28260, -23488, -11363, -18064, -12716, -7227, -4413, 809, -10356, -15505, -12211, -11132, -11361, 2862, 195, -5707, 411, -242, 9171, -8667, -15737, -17632, -16652, -7946, -3523, 14142, 5115, 3402, -2626, -9631, -14782, -12450, -24682, -12213, -14187, -14710, -3853, -4508, 7026, 2749, -12545, -16854, -14951, 320, -27371, -22513, -5290, 5590, -6053]
902f053j3678J0834Q571O815m372N49r452K652k535j7359J7526Q635j0452k729
888a1048j801N723O227R728j6735l47K402m869k992p263Q852R731N526J909L874
873H917l878k7400L766Q573J254M792j3285q371J1006J4824k402p213O322P35
859b360q918o651J1991K685l872M559J0435J397k0086l377O538n798K714O80k720
844a2783R852N39M417m605R12j6986M840J5806J3375J511p762j2576j58K554p664
829h728n430k653J8581L67j9556J1473L575J150o662J84J5339m713N430r896o686
814h225o484R452R055J009M026m364K39j3044O360J0563j4799J5763p791J7561
800A9321p697j7951j3280O914J7911k245j0525j1741O854J1056k230O657J3131
$$ y = [-6053, -19731, -8897, -326, 6489, 2117, 2666, -6786, -4134, -6669, -24028, -6502, 2133, -8319, -11048, -12849, -7126, -899, 8829, -7906, -8253, -5851, -10720, -13712, -20975, -12123, -2392, 3134, 5043, 8917, 5039, -22361, -18595, -10022, -8768, -3976, -17261, -25632, -14626, 198, -2204, -9417, -3095, -2360, -11278, -17929, -5938, -3253, -7125, -2566, 7869, 9266, -10820, -14197, -7659, -13457, -10743, -10063, -12783, -2931, -2392, 2025, -2580, -1668, -18654, -13814, 1992, 15367, 16878, 9116, -3460, -3618, -1064, -8728, -14158, -16811, 1770, 2137, -17419, -5946, -2371, -1221, -7883, -7699, 7640, 2927, 8357, -1539, -8225, -14709, -5257, 3798, 4807, 8833, 4469, 4708, -8336, -1976, 8587, -6212, 9551, 1760, 19321, 11624, -6327, -19607, -12693, 5218, 2973, -7552, -19293, -12439, -1383, -3613, 3044, 16175]
787A6175j0302J128o407m082k142J626R336P550j5876J794P336m004n69J4561
773A6124m233j2598N497N050j1792O318J587J751J944q572M045J2448r845k725
759D999o207r502K039n14J9363m213p646O821l050J70J1187p561k963M310q471
744a238O662J9122k527k1654K908M831j4985q74R92J183O034L137J5530k126o171
729A0824O137M032j9944k650j1401O611J415r677o6K354P123J718J8100p523Q354
714A5407o932j094j0790N170o409J3485J118K917p916j5943J2344k580K788J5754
700A7319j9528N248J4937j783J0849R143r225j351q05N673K819p566K285k0222
686G793q322l962N118J1134k92o84j91M328m920J1288j2710L127O331m881k257
$$ y = [16175, 5873, 7001, 594, -3488, -5630, -4004, 5332, 12882, -2994, -1200, 6136, 2132, 1563, 16124, 11891, -707, 4790, 9840, -1952, 4366, 5953, 7704, 9648, 1076, 5121, 17569, 7724, 4999, -1208, -10710, -8671, -9185, 10178, 5965, -1681, 5140, 2090, 2260, 13447, 5886, 2923, 7233, -1238, 5424, 24546, 22019, 365, 3273, 8104, -6881, -7755, -6763, -5580, 454, 3591, 19121, 16995, 10824, 16961, 20993, 1049, -1601, -13002, -6391, -4976, -14653, -14719, -12365, -5242, -3524, 14576, 7053, 15407, 8475, 7381, -3409, 1761, -4648, 8837, 9955, 12872, 4956, -10987, 1357, -1223, 1565, 17319, -2209, 3039, 17976, 16193, 27042, 36185, 26960, 25609, 24804, 30477, 33296, 25730, 28015, 7793, -529, -4491, 627, 11761, 11469, 10785, 10594, 14922, 10002, 21290, 8580, 11707, 18038, 13157, 10900]
671A0900J9883j096k0056l283n327J2371K721l25L312j7016j3510P137J8129N657
657A9497L607M37m666P367j1527o060j9472P86L402l70p674K7651m022l716r659
642d419P334J9945R23k808J2013j2396l544q001K187l803r065L2249n029p149
628A8437k943q752Q768o644l882N990J1043l774q963l215J0046O974k3182M868
614D771K1812j3448P120n164j500J9929j345L69j3850o077K1178j1910o805Q558
600B3638R344j3722P036R97P963m790l859j890m767K994o715K726p196K991J033
585A5783M886n601L895n21J0251j312j1382J495k974Q22M264L819R961n186R383
570C7583k0353J6536j468k1186J2052J174R514m654j8580k996J2114J0547o389
$$ y = [10900, 30783, 29687, 9631, 6348, 1021, 13392, 16113, 15788, 19100, 2084, -11426, -4289, 13840, 19497, 23104, 23541, 18875, 26242, 14715, 8655, -10817, -10031, -6629, -6999, -14673, 12978, 8956, 5240, -4419, 2915, 22860, 23783, 20975, 32988, 20592, 17048, 9047, 11234, 7431, -1634, 30615, 25586, 18437, 15494, 6742, 15510, 8866, 4984, 10974, 22017, 18243, 9280, 6065, 16111, 23085, -97, 4771, 26583, 13135, 20255, 15091, 13591, 33520, 32175, 32544, 18694, 12617, 33795, 21885, 15080, 23638, 32982, 19260, 26296, 27293, 35256, 30466, 26607, 24717, 19950, 22944, 16229, 18955, 11759, 14750, 15783, 20669, 15068, 18963, 18442, 28693, 27381, 15999, 17494, 14520, 15342, 19606, 23425, 33386, 28200, 37583, 17230, 33766, 32298, 11112, 23164, 24338, 33852, 29198, 10618, 7622, 19736, 30283, 23894]
557B3894J5774o884J685j6710N445r570r538K9403m502j8414o218K353q907J6191
543A4002P403O113J2866p880n291j1560J0205Q41n413K308j0239l030L554J4145
529B8024k432n043l027m326Q380P920p403K121O130q455r237L896N398L904K345
514B8195j0983L387J6408j3277q625N418J72P322p848q015p604O307N687K8038
500D4582j4496j7914p753N638P309O176N495L154J4884q331O738l1194R621M538
486B8447K56k044k848p374k364J4638K226P381n574P50j318o656K104J9940Q43
471D8407M540j5941j5354J3332J8730j7674r840J8786K951n360o93Q393r13L616
457E2980j2130n937n431q264L204J0827L087J6768j2602k122K848k721k655j5507
$$ y = [23894, 39668, 32784, 34469, 17759, 23204, 13634, 4096, 33499, 28997, 10583, 4365, 6718, -2189, 14002, 21405, 27518, 40384, 32504, 27213, 15653, 25858, 26699, 21286, 23594, 13355, 10325, 13879, 28024, 25592, 20549, 17522, 13196, 21576, 29496, 22093, 24214, 30344, 21889, 12652, 16548, 21946, 25850, 28195, 17212, 20599, 37007, 23730, 15105, 20523, 20695, 28017, 20169, 12154, 4550, 10857, 16544, 44582, 30086, 12172, 4419, 10057, 17366, 23542, 29037, 32191, 47075, 38744, 45482, 14288, 23909, 28447, 28703, 26659, 23811, 16437, 14073, 28711, 30937, 38318, 32744, 33494, 32176, 25520, 27624, 47564, 48407, 52947, 37006, 21652, 34984, 53714, 36040, 26200, 44986, 47937, 42577, 41884, 50277, 49364, 52980, 40850, 34913, 29482, 21218, 24422, 35249, 38336, 55104, 42502, 40380, 43228, 40507, 37852, 22345]
443B2345J2490J9126J1706j6039j4882n166K411L312m748p460J2475K337l333
430C4574Q169j0526r662o678P888J8632m331q178j3635M558J1903K290O23j0256
416B5371M49q70N129j611R747n523m748l838J2524n390k1028L309o756J5150M929
401B6844K194R026L103n602j2741K6759j0019p52n547P337M721m752k522q565
387B9484n816J2624O312J7048p608K107L401n477O381p0j875k846q938M425J7704
372F6856j2148R88r098k150j6264J472J2475J7590j1306m386j039o299k270P812
358D2233K3370r025j3383N986j5996k3276Q011J4781j5930J7956l550o817K8544
345E2904j569n025j5769O378J318l031J44K626O486O593j1917j9005J4893n560
$$ y = [22345, 34835, 53961, 65667, 49628, 34746, 29580, 31991, 35303, 30555, 23095, 35570, 37907, 34574, 42743, 32217, 22555, 15877, 23765, 42397, 38066, 29888, 16253, 20811, 32714, 35004, 35627, 25371, 25820, 24950, 30079, 28468, 38215, 32692, 27944, 24106, 36630, 31240, 10212, 13521, 6765, 21915, 26844, 29038, 38064, 41167, 35565, 22824, 49583, 39564, 38812, 33265, 40602, 45323, 40571, 38049, 29484, 23668, 36292, 42604, 59652, 52044, 54151, 57552, 52075, 58456, 58386, 56511, 53665, 44727, 49152, 66856, 54708, 55696, 46598, 44448, 28184, 29656, 42131, 59721, 48415, 44029, 42990, 36691, 34421, 42233, 65603, 56578, 43195, 49181, 33185, 9909, 17920, 32701, 16771, 34727, 31177, 24360, 52904, 51335, 46310, 30541, 36919, 38237, 35206, 35350, 37976, 44462, 51055, 39138, 20133, 35026, 29466]
331B9466O179M979j2663j2748J4633J0874j975j2186R395J1893j1122J5399o962
318D5162J754n154Q303j1093k1384J3677j2752J698k63K3630l207j7361k06J613
304B4417M932J4653m645k515m239P260j3710J5563J8462l534n488j0853j4786
291B5517N975P008L17J2444j3160m231q753J0170J2840Q42R575j2626m187J5177
277E6908J749j4889l32m007m886p263J1217R586o720k98r578J8476J1064q470
263E2557j2294o227J7K783N19J6450n761j0000J428J668q964j841q174K07l329
248A9039R926L336J4137P446r59j6797m06k180K224J9319p694J007n172p092p562
233B8572n17J4236J1318r079M645J3312K561o213j1077j2837k406M270l046R377
$$ y = [29466, 35645, 40624, 27961, 15213, 29846, 40720, 38745, 26559, 35954, 47847, 36725, 52124, 45162, 46916, 41762, 50065, 38972, 17588, 31265, 18513, 20211, 19948, 43578, 40371, 23010, 22804, 24417, 29349, 44002, 39357, 36842, 32603, 39863, 26153, 41716, 60178, 56644, 51156, 40303, 25517, 31492, 38500, 38817, 51261, 38101, 33870, 25117, 35287, 48127, 48969, 58544, 45918, 41731, 56908, 58657, 43768, 43436, 39429, 34543, 27280, 38497, 48083, 41363, 41065, 31487, 49963, 61027, 52557, 40263, 34036, 34053, 36836, 37355, 53805, 48044, 38044, 39472, 41140, 32176, 30335, 22161, 22368, 19039, 28965, 32301, 46438, 53884, 52925, 36128, 35722, 33542, 35766, 55085, 47391, 48398, 43226, 36134, 28572, 28055, 42291, 53609, 44530, 49175, 62487, 65048, 58835, 47758, 34921, 32515, 36785, 33739, 43116]
219D3116J3985m30j0763J1124M040k325k659l866J4290j6279l453j3284r973K5539
205D9062L950O649j0360r748N637J191L028N692m454j9274p513j50J6186O623
191D6519m492M51L892P525k2390L708N407j1203J227J5561m834J090n51J4758
177E6668r64p422j1549m714R611n667j2851l138Q165K639J9267p852j4928j2945
163A4320J8127J2628o252m264J3527J7138j4862J4358n679R269n781k5384Q321
150D5466j027P469J882j3958K094J869j907J6116n006j5623n554J2393m480L054
136D2788O38P55p145J6925J2975k2164o313O731N665p58N173j0310j5609O652
122C6003M430n132m72n747M635l39J1032O858j0968p316m343J2826M181j476J0008
$$ y = [43116, 57101, 56671, 45908, 57032, 61072, 58747, 56088, 52222, 66512, 50233, 46780, 33496, 23523, 49062, 53012, 59661, 49301, 39553, 45190, 46381, 49409, 55101, 50647, 31373, 23860, 23710, 39896, 46519, 42027, 42478, 46370, 53895, 31505, 35213, 40620, 29417, 30644, 46205, 41371, 42461, 41910, 56668, 55704, 48282, 36733, 32019, 41630, 35963, 23112, 19974, 28139, 30778, 50045, 42193, 27265, 14320, 32447, 45075, 38823, 34559, 48086, 65224, 50362, 64720, 59041, 68310, 62529, 37145, 45466, 44439, 51908, 53790, 39832, 41926, 43795, 41888, 58004, 52998, 37375, 31821, 44214, 39734, 42788, 43426, 44181, 37036, 53961, 66936, 44772, 38459, 45190, 50855, 50097, 55270, 44960, 29351, 36003, 40433, 35301, 34829, 29082, 33717, 33378, 44410, 51268, 40300, 32984, 28641, 41467, 45648, 44172, 54180]
107E4180j3087j961J1533j0247K382L744J6147m018p4r751j896K069J1211P84
$$ y = [54180, 41093, 39132, 50665, 40418, 42800, 46544, 62691, 58673, 58599, 48848, 46952, 49021, 60232, 61016]
$$ [...]
##END NTUPLES=NMR SPECTRUM
##END=
