##TITLE=1H_EC-3384(6)-15
 200.13Hz, CDCl3.
 8 sc
 12.8.2026
##JCAMPDX= 6.0         $$ Bruker NMR JCAMP-DX V2.0
##DATA TYPE= NMR SPECTRUM
##DATA CLASS= NTUPLES
##ORIGIN= UXNMR, Bruker Analytische Messtechnik GmbH
##OWNER= pz
$$ XWIN-NMR		Version 3.5
$$ Tue Aug 11 12:20:37 2026 Russian Standard Time (UT+4h)  she@DPX200
##.OBSERVE FREQUENCY= 200.1313
##.OBSERVE NUCLEUS= ^1H
##.ACQUISITION MODE= SIMULTANEOUS
##.ACQUISITION SCHEME= undefined
##.AVERAGES= 8
##.DIGITISER RES= 18
##SPECTROMETER/DATA SYSTEM= spect
##.PULSE SEQUENCE= zg30
##.SOLVENT NAME= CDCl3
##.SHIFT REFERENCE= (INTERNAL, CDCl3, 0, 15.5067)
##AUDIT TRAIL= $$ (NUMBER, WHEN, WHO, WHERE, WHAT)
$$ ##TITLE= Audit trail, XWIN-NMR		Version 3.5
$$ ##JCAMPDX= 5.01
$$ ##ORIGIN= Bruker BioSpin GmbH
$$ ##OWNER= she
$$ F:/spectra/data/she/nmr/H-C/1/pdata/1/auditp.txt
$$ ##AUDIT TRAIL=  $$ (NUMBER, WHEN, WHO, WHERE, WHAT)
(   1,<2026-08-11 12:19:04.28 +0400>,<she>,<DPX200>,
      <created by zg, POWCHK disabled, PULCHK disabled
       configuration hash MD5:
       00 E9 B6 7A A2 85 ED C7 34 08 36 98 17 FE 4E 26
       data hash MD5: 16K
       B6 4D D1 0C 42 24 89 6E 0D C9 E7 28 BC 1E 6F 0A>)
(   2,<2026-08-11 12:19:06.53 +0400>,<she>,<DPX200>,
      <Start of raw data processing
       efp BC_mod = 2 LB = 0.25 FT_mod = 6 PKNL = 1 PHC0 = -4218.537 PHC1 = 7.792301 SI = 16K 
       data hash MD5: 16K
       D6 29 04 11 14 FB D7 53 6E C6 F9 8A 28 AA 26 F3>)
(   3,<2026-08-11 12:19:29.81 +0400>,<she>,<DPX200>,
      <pk PHC0 = 1.26505 PHC1 = 2.2 
       data hash MD5: 16K
       2C 91 F0 1A 84 A6 9F 0C 30 82 75 60 8D 46 31 DF>)
(   4,<2026-08-11 12:19:40.84 +0400>,<she>,<DPX200>,
      <abs ABSG = 5 
       data hash MD5: 16K
       51 EF E7 9D 69 B0 48 B4 F7 CE F2 4A 13 F5 A3 40>)
$$ ##END=
$$ 
$$ hash MD5
$$ D1 A1 F1 4D B9 F2 52 ED CF 25 E1 74 D5 07 AF 9F
##$RELAX= 
##$RELAX= 
##$RELAX= 
##$RELAX= 
##$RELAX= 
##$RELAX= 
$$ Bruker specific parameters
$$ --------------------------
##$DU= <F:/spectra>
##$EXPNO= 1
##$NAME= <H-C>
##$PROCNO= 1
##$TYPE= <nmr>
##$USER= <she>
##$AMP= (0..31)
100 100 100 100 100 100 100 100 100 100 100 100 100 100 100 100 100 100 
100 100 100 100 100 100 100 100 100 100 100 100 100 100 
##$AQSEQ= 0
##$AQ_mod= 1
##$AUNM= <au_zg>
##$AUTOPOS= <>
##$BF1= 200.13
##$BF2= 200.13
##$BF3= 200.13
##$BF4= 200.13
##$BF5= 200.13
##$BF6= 200.13
##$BF7= 200.13
##$BF8= 200.13
##$BYTORDA= 1
##$CFDGTYP= 0
##$CFRGTYP= 5
##$CHEMSTR= <none>
##$CNST= (0..31)
1 1 145 1 1 1 1 1 1 1 1 1 1 1 1 1 1 1 1 1 1 1 1 1 1 1 1 1 1 1 1 1 
##$CPDPRG= <>
##$CPDPRG1= <>
##$CPDPRG2= <>
##$CPDPRG3= <>
##$CPDPRG4= <mlev>
##$CPDPRG5= <mlev>
##$CPDPRG6= <mlev>
##$CPDPRG7= <mlev>
##$CPDPRG8= <mlev>
##$CPDPRGB= <>
##$CPDPRGT= <>
##$D= (0..31)
0 0.7 0 0 0 0 0 0 0 0 0 0.03 0 0 0 0 0 0 0 0 0 0 0 0 0 0 0 0 0 0 0 0 
##$DATE= 1786436343
##$DBL= (0..7)
120 120 120 120 120 120 120 120 
##$DBP= (0..7)
150 150 150 150 150 150 150 150 
##$DBP07= 0
##$DBPNAM0= <>
##$DBPNAM1= <>
##$DBPNAM2= <>
##$DBPNAM3= <>
##$DBPNAM4= <>
$$ [...]
##$SUBNAM3= <"">
##$SUBNAM4= <"">
##$SUBNAM5= <"">
##$SUBNAM6= <"">
##$SUBNAM7= <"">
##$SUBNAM8= <"">
##$SUBNAM9= <"">
##$SW= 18.0517328524113
##$SWIBOX= (0..15)
0 0 2 0 0 0 0 0 0 0 0 0 0 0 0 0 
##$SW_h= 3612.71676300578
##$TD= 16384
##$TD0= 1
##$TE= 0
##$TE2= 300
##$TE3= 300
##$TEG= 300
##$TL= (0..7)
0 120 120 120 120 120 120 120 
##$TP= (0..7)
150 150 150 150 150 150 150 150 
##$TP07= 0
##$TPNAME0= <>
##$TPNAME1= <>
##$TPNAME2= <>
##$TPNAME3= <>
##$TPNAME4= <>
##$TPNAME5= <>
##$TPNAME6= <>
##$TPNAME7= <>
##$TPOAL= (0..7)
0.5 0.5 0.5 0.5 0.5 0.5 0.5 0.5 
##$TPOFFS= (0..7)
0 0 0 0 0 0 0 0 
##$TUNHIN= 0
##$TUNHOUT= 0
##$TUNXOUT= 0
##$USERA1= <user>
##$USERA2= <user>
##$USERA3= <user>
##$USERA4= <user>
##$USERA5= <user>
##$V9= 5
##$VALIST= <valist>
##$VCLIST= <CCCCCCCCCCCCCCC>
##$VD= 0
##$VDLIST= <DDDDDDDDDDDDDDD>
##$VPLIST= <PPPPPPPPPPPPPPP>
##$VTLIST= <TTTTTTTTTTTTTTT>
##$WBST= 1024
##$WBSW= 4
##$XGAIN= (0..3)
0 0 0 0 
##$XL= 0
##$YL= 0
##$YMAX_a= 534112
##$YMIN_a= -585769
##$ZGOPTNS= <>
##$ZL1= 120
##$ZL2= 120
##$ZL3= 120
##$ZL4= 120
##$ABSF1= 15.51001
##$ABSF2= -2.54184
##$ABSG= 5
##$ABSL= 3
##$ALPHA= 0
##$AQORDER= 0
##$ASSFAC= 0
##$ASSFACI= 0
##$ASSFACX= 0
##$ASSWID= 0
##$AUNMP= <proc_1d>
##$AZFE= 0.1
##$AZFW= 0.1
##$BCFW= 0
##$BC_mod= 2
##$BYTORDP= 0
##$COROFFS= 0
##$CY= -3
##$DATMOD= 1
##$DC= 0
##$DFILT= <>
##$DTYPP= 0
##$F1P= 0
##$F2P= 0
##$FCOR= 1
##$FTSIZE= 16384
##$FT_mod= 6
##$GAMMA= 0
##$GB= 0
##$INTBC= 1
##$INTSCL= 3.241238e-09
##$ISEN= 128
##$LB= 0.25
##$LEV0= 0
##$LPBIN= 0
##$MAXI= 10000
##$MC2= 0
##$MEAN= 0
##$ME_mod= 0
##$MI= 1.114404
##$NCOEF= 0
##$NC_proc= -5
##$NLEV= 6
##$NOISF1= 3.799351
##$NOISF2= 2.8
##$NSP= 0
##$NTH_PI= 0
##$NZP= 0
##$OFFSET= 15.5067
##$PC= 1
##$PHC0= -4217.272
##$PHC1= 9.992301
##$PH_mod= 1
##$PKNL= yes
##$PPARMOD= 0
##$PSCAL= 0
##$PSIGN= 0
##$REVERSE= no
##$SF= 200.130003003416
##$SI= 16384
##$SIGF1= 3
##$SIGF2= 2
##$SINO= 0.751879
##$SIOLD= 32768
##$SREGLST= <19F.Aceton>
##$SSB= 0
##$STSI= 16384
##$STSR= 0
##$SW_p= 3612.71676300578
##$SYMM= 0
##$S_DEV= 0
##$TDeff= 16384
##$TDoff= 0
##$TI= <>
##$TILT= no
##$TM1= 0
##$TM2= 0
##$TOPLEV= 0
##$USERP1= <user>
##$USERP2= <user>
##$USERP3= <user>
##$USERP4= <user>
##$USERP5= <user>
##$WDW= 1
##$XDIM= 16384
##$YMAX_p= 523596640
##$YMIN_p= -164686
$$ End of Bruker specific parameters
$$ ---------------------------------
##NTUPLES= NMR SPECTRUM
##VAR_NAME=  FREQUENCY,     SPECTRUM/REAL,   SPECTRUM/IMAG
##SYMBOL=    X,             R,               I
##VAR_TYPE=  INDEPENDENT,   DEPENDENT,       DEPENDENT
##VAR_FORM=  AFFN,          ASDF,            ASDF
##VAR_DIM=   16384,         16384,           16384
##UNITS=     HZ,            ARBITRARY UNITS, ARBITRARY UNITS
##FACTOR=    0.220516191357247, 1,           1
##FIRST=     3103.35582993069, 0,            0
##LAST=      -509.360933075091, 0,           0
##MIN=       -509.360933075091, -164686,     0
##MAX=       3103.35582993069, 523596640,    0
$$ Real data points
##PAGE= N=1
##DATA TABLE= (X++(R..R)), XYDATA
$$ [...]
7150a5375L72j348k135L4678K3140m4118K7287N1195n0530M8364m7365l1387O956
7137b66J9055m0190l0502n071m0181M6838P1812L0039K5977O144K455m6152j34905
7124i4947M8829J6758K3273j8743J7626p565m7879n427j9620L3544N9222p955
7112b884j1664L5408M7663n262p0301j6249l3421J9731J7954L4461j5885K8173
7100B7724K4211o2093q734O066J0696K9548N30K221J5726J0183L74k8265M6070
7087G4257n0332m1673L5422O5357m0797k8897p4234P162M1531o4488K373J7336
7075e6983L1041M9825j9965j5151n055k2848J1689r653P3768k4463k6233K0380
7063F352O4435j668l0260J0638k8633p1052j614L2767o627L433r229L455L24m353
$$ y = [-15375, -15003, -16351, -18486, 16192, 39332, -4786, 22501, 73696, 23166, 71530, 24165, -7222, -266, 18789, -21401, -51903, -56974, -97155, -50317, 21495, 51534, 77511, 83655, 86110, 39958, -94947, -46118, -29360, -6087, -24830, -7204, -14769, -62648, -68075, -87695, -54151, 5071, -2884, -14548, 20860, 68523, 63261, -7040, -23289, -56710, -36979, -19025, 15436, -449, 27724, 51935, -10158, -18892, -12826, -2130, 27418, 27948, 30169, 45895, 56078, 56452, 28187, 74257, 23925, -17748, 17674, 83031, 42234, 13337, -60897, -53735, -12204, -76692, -74319, -56983, -25942, 23883, 3918, -11233, -16288, -39136, -27447, -37100, 36668, 12205, -14028, 6352, 70787, 69119, 38859, 49497, 20864, -50188, -51802, -19035, -25662, -22229, -31458, -28003, -27679, -32032]
7049c2032j7947M7800J5673q6360J1597O0104J6026j8561J8187j6787r947P579
7037d668L840K754J7428J0290Q383l825m0255L5223q214k5310k3611k6581q740
7024f3286K4039N6942l6526K1542l9992o090N790J908L1256L5966n0925k8341
7012d7717k4544M0576K8757k4037O2139K5501o1032o485K6268n4510k760J7438
7000b0406N1249N435l5346m336k571j4732o4433K1402J2335L9882n8954J4726
6988e5749K2755j2429k2343L1676M3618o9776j7164J9322M592j1407L9571J4082
6976a3252m2953l497K063j4583M9288r0064m519M4147L3469l1048l572J2989R32
6963f0600J5976O5223k6951j1014j1674k1555p0250P1700M5718p7759k1564O6861
$$ y = [-32032, -49979, -2179, 13494, -72866, -61269, -1165, 14861, -3700, 14487, -2300, -12247, -4668, -828, 1926, 19354, 29644, 38027, 34202, -6053, 29170, 20956, -4354, -27965, -54546, -63286, -39247, 17695, -18831, 2711, -37281, -43371, -37581, -35673, -4417, 31549, -19376, -47717, -72261, -31685, -2928, -26965, 35174, 60675, -357, -6842, 19426, -35084, -37844, -20406, 30843, 36278, 932, -3404, -5975, -20707, -85140, -63738, -51403, -11521, -70475, -55749, -32994, -45423, -67766, -36090, 7528, -62248, -79412, -60090, -55498, -66905, -27334, -13252, -56205, -59702, -57639, -72222, -22934, -112998, -117517, -73370, -39901, -70949, -74521, -61532, -60600, -44624, 20599, -6352, -17366, -29040, -50595, -120845, -49145, -3427, -81186, -102750, -35889]
6951c5889K9180K4562o8675J5625o0975l5154J46471Q4305o4743k9956m796q565
6939h610k0225J7441J4732j2652j8253K9421M1280m083k0156m4245j3963o190
6927d5503k7113o3N5262m516M7533j9378J9540m7737l4098K1110j0219l8276l3786
6914a17244Q8286J448o7092k026j2536O5351M1796O667J5016k1916J8277j9440
6902c413l2625R680j233m995J7459N173k1503k7363o7354M1045O0847K0577q41
6889d546j0863k9003K9245J06432Q0171j13156n4281L587L9126r485K02K756J6092
6876E6277r1215p4582M043P8817l905m9690O1353L4731k2969k4710N351j4644
6864d1143N779M0246M1k3959j4484l9841L8566q101l4691J3408q609k6424N1941
$$ y = [-35889, -6709, 17853, -50822, -35197, -96172, -131326, 15145, 99450, 34707, 4751, -45, -8610, -28835, -11394, 3338, -9314, -27567, 1854, 43134, 39051, 18895, -25350, -39313, -45503, -72616, -72679, -17417, -21933, 25600, 6222, 25762, -21975, -56073, -34963, -45182, -83458, -117244, -28958, -27510, -94602, -96628, -109164, -43813, -2017, 4650, 19666, -2250, 16027, -3413, -36038, -26358, -27591, -32586, -15127, -9954, -31457, -58820, -126174, -85129, -24282, -3705, -4546, -15409, -44412, -15167, 91265, 171436, 58280, 3999, 7586, 46712, 37227, 37429, 40185, 56277, -34938, -109520, -105477, -26660, -30565, -80255, -18902, 15829, -7140, -31850, -26499, -41143, -35364, 4882, 4923, -19036, -33520, -73361, -34795, -42896, -77587, -64179, -72788, -99212, -47271]
6851d7271M69m8487L2401L0576L9691J8759K7812P946n7618j4685m450n5173j1855
6838h1885O1272l7801O0544k866k0349L3073L0629l5296o7128k6974J0728N2464
6826b3589l8013N8755R570r969n6236K2743o609l1190J01156P6765J2395p840
6814A07938l1243o2743j2849O5528l72J3461l9592q7959k018K2890J2781j9846
6802c4024K6227m5730J1505P3383m8669r521L193K8192J9898J8882K6620k2827
6790D7129P42o3686o648M086n2507K0214L8432Q937N7216p794j4757r994J9237
6777D0607k4553J8311l009J2460J4680K0579J7163k4440j8746j6396J8816l5430
6765B0042l1850J3047k5065M6546r35m6805Q277N4505o220k7937L7244m3070J3658
$$ y = [-47271, -46802, -95289, -62888, -32312, 7379, 26138, 53950, 61896, 4278, -10407, -14857, -70030, -81885, -20613, -58414, 2130, -736, -21085, 11988, 42617, 7321, -59807, -86781, -76053, -23589, -61602, -2847, 6723, -3246, -59482, -36739, -43348, -74538, 26618, 103383, 115778, 107938, 76695, 13952, 1103, 66631, 66259, 79720, 40128, -47831, -49849, -26959, -14178, -34024, -7797, -53527, -42022, 31361, -17308, -26829, -23636, 4556, 24454, 43336, 69956, 47129, 47871, -15815, -22463, -18377, -70884, -50670, -12238, -3301, 53915, 46121, 31364, 21370, 40607, 16054, 34365, 31356, 43816, 58496, 79075, 96238, 71798, 53052, 36656, 55472, 20042, -11808, 1239, -23826, 22720, 21785, -25020, -16743, 37762, 31542, 3605, 40849, -2221, 11437]
6752A1437P2855n690o6638l1784k368L7611L5678k919Q968L821l9260j1961l480
6739F270L031m2763p148M6275j1652n8221r5286O6589L5774K4373J7529m5032
6727f0261k8977J0814L6521K1533m2907L6117O495k4633L009k1126Q288O574k6181
6714g4734Q882K7069Q917l6046M7719L577k3726M5248P1380l6432j39756L5177
6702f2725N3964J2731o611N159K1820J7008o1415k7n3314K2781L0341n2321M8926
6689b3683l0364j9438O7808J1557l4005l824M5115O407n6093P262K4140J694n7407
6676f0831Q425M0288N5983K9300n8596j7598n8847L2268l6734j937J0282j323
6664e9320K5977K8428J9224l3575M6272O414O7454l3017p3165J2638J8469N1875
$$ y = [11437, 84292, 78602, 11964, -19820, -22188, 15423, 51101, 48182, 57150, 60971, 21711, 9750, 6270, 9301, -33462, -40610, 5665, -5987, -64208, -159494, -92905, -57131, -32758, -15229, -60261, -89238, -78424, -41903, -20370, -63277, -27160, -20665, -45298, -42289, -63415, -55127, -48553, -74734, -65852, -38783, -29866, -65912, -18193, -14616, -38342, 6906, 78286, 41854, -97902, -62725, -8761, 3970, -2641, 2518, 24338, 41346, -20069, -20096, -73410, -50629, -20288, -72609, -23683, -54047, -73485, -5677, 5880, -28125, -31949, 13166, 19573, -36520, -29258, -5118, -3424, -60831, -52406, -12118, 43865, 73165, 14569, -3029, -61876, -29608, -66342, -68279, -57997, -59320, -33343, -4915, 14309, -19266, 27006, 33420, 100874, 67857, -5308, 7330, 25799, 77674]
6652G7674q3637K4155J9377M027p719k4956k1824n140l077M5026j1316J9136J0544
6639D2270q0584k2635M8745J8360m6269l9545O5872O427j8929j2596O669M2784
6627A0569k4084l3112l2657P1295j4629J3477J1764r3743j2376M4367M8525j0229
6615b0833N841K4188M0835J1606j1090K1139m5358l7405L0601L67K7572k7234
6603B0229n7219M5118l1766o159N0932k9214m4100J5655Q314K1007j0797k1993
6591c9993O2146K2808k0941l2883K9050M2277Q8961J00046J5678R3475N38p689
6579C53473K7301m6264o5489m9362q5480j11404j0776k1150o017P4902l0451j646
6567B7637K8524l3714j1812J9182M6574l3095k6649k728l3408L2905p629J0191
$$ y = [77674, -5963, 18192, 37569, 41596, 33877, 8921, -12903, -18043, -21120, 23906, 12590, 31726, 42270, -38314, -60949, -12204, 6156, -40113, -79658, -13786, -7359, -26288, -38884, -32215, 10569, -13515, -46627, -79284, -7989, -22618, -9141, 2623, -91120, -103496, -59129, -10604, -20833, -14992, 9196, 50031, 61637, 50547, 71686, 26328, -11077, 19524, 19891, 47463, 20229, -36990, 8128, -23638, -29797, 21135, -8079, -52179, -36524, -28210, -7203, -18000, -39993, 22153, 44961, 24020, -8863, 20187, 62464, 151425, 251471, 267149, 360624, 361162, 353473, 380774, 334510, 269021, 219659, 134179, 22775, 11999, -9151, -15168, 59734, 29283, 27637, 56161, 22447, 10635, 29817, 76391, 43296, 16647, 13919, -19489, 13416, 5787, 15978]
6555A5978J5396N8303m8998p6747j5477j0820J8991L3894j2131J9621j4901K9345
6543A2454l9937j8496L903k0548K0982P4294k9610n1648q5563J0818J17170J3471
6531G290l574k4717M1954K0901j0301M8704j257n5775p4935j3172P5019r5654
6519h5517M1095J1515r555p237K9204J0141m6427L5390j1926k6717L651M034M4751
6506g598L8610n4178k2867K7793K1247M717n0423j9833R0204k577J5020K5913
6494F6028m2259L0913N436j2964p3311m2620L3427L3363p132K5253M6729n0216
6482A2647l7999N2577n7101m4318m3414L9739K8129l465O5288r159k5615J7397
6470e294K3845K5237l3570j7244O167m640M4651J8318m9023j5196L8164Q00j0897
$$ y = [15978, 31374, 89677, 40679, -36068, -51545, -62365, -43374, -9480, -21611, -1990, -16891, 12454, -27483, -45979, -42076, -62624, -41642, 32652, 3042, -48606, -134169, -123351, -6181, 7290, 3716, -21001, 20953, 41854, 31553, 80257, 79000, 23225, -51710, -64882, 10137, -85517, -44422, -32907, -42462, -49699, -20495, -10354, -56781, -21391, -33317, -60034, -56383, -52349, -7598, 31012, -23166, -46033, -18240, 3007, 7724, -42699, -62532, 27672, 25095, 40115, 66028, 23769, 54682, 60118, 47154, -26157, -68777, -35350, -1987, -9119, 16134, 62863, 12647, -25352, 27225, -29876, -74194, -117608, -77869, -49740, -53205, 12083, 2924, -22691, -5294, 18551, 43788, 10218, -7026, -859, -5499, 39152, 57470, 8447, -6749, 31415, 32215, 21318]
6457B1318m5240m9639L396R4103l7643j1853J2152O3181k9840m5614J2381j0707
6445b4005K2834l2814J4500N3384r811k3526K2779j6159j4660K6672L1866m68
6433E0592o566l2488k3238j1704L2820M6198j5919l1167j1344K722k7266L6518
6421I158k7125l5382L9386j280k5346J2892N9233k3003m1917K1450K7354K0256
6409C5676l2023l1062L5542L6272M466n3132l32n3519K2294L4186K3349l3169
6397a1452m5850k2759N9783O9061k569j4192l1021J6899M8033k8541l2555R617
6385A4454k5316K3592Q937N7533m192o3751l8503k2099N4732P826j3179J3927
6373A3961K538k158o0424l6345R6366K1692l2309M6909M0634J3428j7781n2137
$$ y = [21318, -23922, -73561, -70165, 23938, -13705, -25558, -13406, 49775, 19935, -25679, -13298, -24005, -1171, -33985, -19485, 33899, 24088, 562, 23341, 7182, -7478, 19194, 51060, 50592, 44026, 11538, -11700, -23404, 9416, 55614, 39695, 8528, -2816, -94, -27360, 9158, -17967, -53349, -13963, -15243, -40589, -27697, 31536, 8533, -33384, -11934, 15420, 35676, 3653, -27409, 8133, 44405, 48871, -4261, -4593, -58112, -35818, -1632, 21717, -11452, -57302, -80061, -20278, 48783, 46214, 32022, 1001, 17900, 65933, 37392, 4837, 14454, -10862, 12730, 21667, 79200, 75008, 11257, -27246, -49345, 5387, 13213, 34, 13961, 16499, 14341, -46083, -82428, 13938, 35630, 3321, 50230, 90864, 104292, 86511, 34374]
6361C4374l8419K1412N8442K031k9111P701R605l0478q4430J0303O5228k4870
6349A788l5557J9971J9557n0370M1882N7595k6959l1430l285L2177j3294o578
6337E497K048l816J3194L7558o0172n9311J296K8701j8975j20P7927l6403j248
6324a3824L4795n4689k2146j8431l317Q280L1165m6279J3116K5831P2801K4154
6312E1456J6368n1359j6197k034K7422Q0059j4788m6450l6836o545J6581j717
6300A5960j6974J3784j9265K6261M576l2602m146k1150k405P138L1319O4870n6619
6287A0747K2469M2777o322j0756l8739l2090j7131J3575k910l017K014r460K1004
6274g839p538J3680l0303o865K237k8210R788L8472j3208j070N3815l5382J9314
$$ y = [34374, -4045, 17367, 75809, 77840, 48729, 56430, 66035, 35557, -48873, -38570, 26658, 1788, -33769, -13798, 5759, -44611, -2729, 54866, 27907, -3523, -6808, 25369, 12075, 5497, 7545, 3729, 16923, 54481, -5691, -65002, -63706, -35005, -53980, -54100, 23827, -12576, -13824, 20971, -33718, -55864, -74295, -77612, -69332, -38167, -84446, -71330, -45499, 27302, 51456, 67824, 16465, 268, -1766, 25656, 105715, 90927, 44477, 7641, 1096, 17677, 15960, -1014, 12770, -6495, 19766, 24342, -8260, -12406, -33556, -35961, -28823, 2496, 67366, 10747, 33216, 75993, 69671, 58915, 20176, -11914, -29045, -15470, -18380, -21397, -19383, -28843, -7839, -15377, -1697, -32000, -38865, -36628, -64838, -55050, -16578, -29786, -30856, 22959, -12423, 6891]
6261F891J7941o6751K2625L5332K1162j7876Q624K885l4498O326O163n8144k5435
6248g4755K9145l6440k3989J8910J0316n8998L9398O5375O834M5901k3026L457
6236B128L6915K1227l8660n9623P899k3140R110M3473J1499j5955l8077L0934
6224a2270J5523n996p663l3848o981J1980P4077M3209n5705K2196m5111p020L4746
6211B7137J948M9893k8992n4894L6649o6077K8722Q7537k1824J0262o5496j3892
6199i027k5162j802J2970L7556l8567N0188J374l7766M8040q261j252q425Q853
6186B8719J4896j1302j7922J5155J8191j1617o1290p3266K0294L8639O9556j073
6174B8980l7800K7259j8387k0043K0138K998K8919O1938J9190J3316j17900M7824
$$ y = [6891, 24832, -41919, -19294, 16038, 37200, 19324, 27948, 30833, -3665, 2661, 8824, -49320, -74755, -45610, -82050, -106039, -87129, -76813, -135811, -96413, -31038, -24204, 21697, -1329, 2128, 39043, 60270, 21610, -38013, -30114, -53254, -44144, -671, 10828, -5127, -43204, -12270, 3253, -2743, -10406, -44254, -51235, -39255, 34822, 78031, 22326, 44522, -589, -7609, 27137, 29085, 78978, 49986, -4908, 31741, -34336, -5614, 81923, 60099, 70361, 4865, -9027, -34189, -35991, -23021, 14535, -24032, 26156, 27530, -10236, 37804, 29543, 28291, 19866, 28719, 43615, 32313, 14391, 29546, 47737, 36120, -25170, -98436, -78142, -39503, 30053, 28980, -8820, 18439, 52, -19991, 147, 3145, 32064, 94002, 113192, 126508, 8608, 56432]
6162E6432L5578j8218n4904l0305Q291L3221J75L4673j8418j11630J8767j2846
6150e9184p471O9284j4077j6715R317K058K2648m5233M9772M5956L9614j8541
6138G7428j7946p066o6758n8548K2792J7320m017L9404P2019R114k3673k0492
6126C9577n347n2595J1060q2920Q7413j7519j7901k6845l388Q4442j8800K398
6114d25k4956o1742J3570J06750k8053M9591n1000O1492R345J9516M799p4177
6102B4710l9138J4161M9728K5951n5087K1867J7013k1921J2005l1093m2375M9028
6090B4849K0709l2364L4944l8312r552M1494m6161L6794l2N776J7262k1363N8927
6077I2971L9060o1453k7079J9878m2487J0015P0258M4169L700p6608L38J9788
$$ y = [56432, 92010, 73792, 18888, -11417, -3126, 30095, 30270, 64943, 46525, -65105, -46338, -59184, -66655, 2629, -11448, -28163, -18846, -16788, 5860, -39373, 10399, 56355, 95969, 77428, 59482, 52416, -14342, -72890, -50098, -32778, -36795, 2609, 74628, 83742, 60069, 39577, 34230, -18365, -7305, -90225, -2812, -20331, -38232, -65077, -68465, 15977, -2823, -425, -25381, -87123, -73553, 33197, 5144, 54735, 3735, 65227, 74572, 94088, 98887, 24710, -14428, -267, 49461, 75412, 20325, 42192, 59205, 37284, 49289, 18196, -24179, 24849, 45558, 13194, 48138, 9826, 274, 41768, -4393, 32401, 32369, 38145, 55407, 34044, 92971, 132031, 70578, 43499, 63377, 20890, 30905, 101163, 145332, 149032, 72424, 72762, 92550]
6065I2550J2139p7479K7339r027n9540J2323P0446M3258n2273Q064j8351M7597
6053I7046k4617k248k5903j1775k0779R9817L515r230n5591J1443m9931R623L5158
6040E6528j1786K241n8408J1952O413m209M6917M777j6587k2099k5158j375k572
6027a3366k1036J3932q263K6344N2731M8694L2229p2606k2731J0032k7460j400
6015A7100M1214q5013n2604K2722L6361J840j9791j6887O6760K0400r3442J912
6003e9428J0871L8811o554L3160Q0495q6221r055L7474Q566l7199M0045n2452
5991a487q6281j257k056M9193N2957j9472l26P5686k0496J340O3303K8778o4230
5978G5652k5766L3019k0755p7806K620L6089O240K6405k6841K2084n7631k4514
$$ y = [92550, 104689, 27210, 54549, 45522, -14018, -1695, 68751, 112009, 59736, 67800, 49449, 97046, 72429, 70181, 44278, 32503, 11724, 111541, 115056, 105826, 50235, 61678, 11747, 21370, 56528, 44742, 46983, -11425, 527, 6940, 2731, 49648, 54425, 37838, 15739, -9419, -10794, -13366, -34402, -20470, -28733, -2389, 50342, 99036, 131265, 58659, 35928, 45960, 18500, 17100, 58314, -26699, -79303, -56581, -20220, -18380, -38171, -55058, 11702, 32102, -61340, -59428, -48557, -9746, -16300, 16860, 97355, 11134, 2079, 39553, 48119, 10920, 50965, -1487, -87768, -89025, -91081, -41888, 11069, -8403, -8729, 66957, 46461, 47801, 111104, 139882, 75652, 49886, 82905, 62150, -15656, -13036, 23053, 29293, 55698, 28857, 50941, -6690, -31204]
5966c1204J9700J0964K3275J0882R041J4602o8387K3276P258j6573J7264m9194
5954b9096L6525n5006N2076Q761o9528N4678P9952l3949p3523l4600J01957k6817
5942A1430k9808J0724J2993k0383k5067J9517J634L4281K3588L7816k4657k5358
5930B6710q6831N4574O543M3009R342j9792l1180K437k8372K9995l1434Q9728
5918F4729L2156m3925j2047k2151N4405k0530o4370N4309R1638j2641J2948k6459
5906A08062m4771k524l2487K4621O0069m1063M6973n957L4565L8754J09p5801
5894A10550K4679J7390j7240j7142m1774K1558M3736m204o6714l0023K3706j1968
5882E2554k7798K3320m957k685j6990j6134l9262N414j625K4986N0056m7909L3794
$$ y = [-31204, -11504, -540, 22735, 33617, 42658, 57260, -11127, 12149, 19407, 2834, 20098, -29096, 7429, -47577, 4499, 13260, -56268, -1590, 78362, 44413, -29110, -63710, 38247, 11430, -18378, -7654, 5339, -15044, -40111, -20594, -18960, 15321, 38909, 76725, 52068, 26710, -60121, -5547, 996, 44005, 53347, 33555, 2375, 4812, -23560, 6435, -24999, 64729, 96885, 52960, 40913, 18762, 73167, 52637, -11733, 42576, 134214, 121573, 134521, 108062, 63291, 60767, 28280, 52901, 112970, 71907, 118880, 112923, 147488, 186242, 186351, 110550, 135229, 152619, 135379, 118237, 76463, 98021, 141757, 137553, 70839, 40816, 64522, 52554, 24756, 48076, 43119, 40434, 23444, 7310, -31952, -26538, -28163, -3177, 46879, -1030, 32764]
5869C2764M2281j818j4660J6356k779o421j6093K9652J9413k3957L3314k9720
5857G8332r180k3600p039O3688k4549j1319K2396k204L0132k1918J5362J1105
5845A21206J1960n4050m5482M1347L6331k2962J2197K1998r781K1930K7661r2728
5833F9627q2127M4287P044M1585j9245m1205p5155K3839N474N5393M5690Q117
5821H3324m1798j2544J3496M7735p073j7313K2879q0235K3793N5045l4397L70
5809E3282J4691j6887J6131K7335n0684k9834O7628j1412o0436M8740m361L6687
5797I0880L0204j00014p310K6503k357j2980K1914K4122o4987P019n403K7367
5785C4958P3950L6828j3793k6853n0323L1118K1394N9149R1837p8666p2298M0349
$$ y = [32764, 75045, 73227, 58567, 74923, 72144, 65723, 49630, 79282, 98695, 74738, 108052, 78332, 69152, 45552, 38513, 102201, 77652, 66333, 88729, 86525, 116657, 94739, 110101, 121206, 133166, 79116, 33634, 74981, 111312, 88350, 100547, 122545, 112764, 134694, 162355, 69627, -12500, 31787, 38831, 80416, 61171, 19966, -55189, -31350, -25876, 29517, 75207, 83324, 41526, 28982, 42478, 90213, 83140, 65827, 88706, 8471, 32264, 87309, 52912, 53282, 67973, 51086, 67217, 94552, 43868, 14034, 81662, 70250, 9814, 58554, 54193, 90880, 121084, 21070, 13760, 40263, 37906, 24926, 46840, 70962, 5975, 12994, 7591, 34958, 108908, 145736, 131943, 105090, 54767, 85885, 107279, 166428, 258265, 179599, 107301, 147650]
5773A47650J5889l5790M554K8991L2967q3311k5404M8844j8156J4718L9001m637
5761A65316m2055k1145l334j8023P4183K2651k3895j9154O1923l6501o5498J7587
5749A12055m225j2332P599J7489K1278m5605K9425O4644K8341M23l7116j976J3267
5736A93267M216M5929l6000J19484P4802N9628m9287K2510J46180J35522M6802
5725G63053J24083N3328o8661m0838q0126J0551k0329p7055L3779Q0198L5109
5714H13092Q7965j346l3228j6012n72r6293j03594m0464m7676l3332k3527m6037
5702D58976K7333N8096M1341P548P0805n1673r0544n5916l8931L4690n0393k7147
5690C84185n4150j7937M2279m5505r2444O3186M4504n0739Q697R505l4829k4652
$$ y = [147650, 163539, 127749, 132303, 161294, 194261, 110950, 85546, 134390, 116234, 130952, 169953, 165316, 123261, 102116, 98782, 80759, 154942, 177593, 153698, 134544, 196467, 159966, 94468, 112055, 107830, 95498, 103097, 120586, 141864, 96259, 125684, 190328, 218669, 219092, 181976, 180000, 193267, 197483, 243412, 207412, 326896, 401698, 461326, 412039, 434549, 580729, 716251, 763053, 887136, 940464, 871803, 830965, 750839, 761390, 741061, 664006, 697785, 777983, 813092, 901057, 899711, 866483, 850471, 849899, 753606, 650012, 609548, 561872, 528540, 505013, 458976, 486309, 544405, 585746, 593294, 664099, 612426, 521882, 465966, 427035, 461725, 411332, 384185, 330035, 312098, 354377, 308872, 216428, 279614, 324118, 273379, 282076, 291581, 256752, 232100]
5678B32100O4851m9855K4885K8444R565O286P0004N6984O2650L8406J9574R8947
5666F62841O7504J05n8107j121j6746m5967q46O539Q4086J07847N2139J27869
5654I86143R9939J3393L8921k3416k1848k2977P8388j6762J9707J5914R998J7790
5642A195190L0232n5401n9322q0209l9896j6888k2470o7407p8623k841j32381
5631F69984j57065m5623O0733k6853m6597l5304O4897J9655J1870l5350k7628
5620D52719K020l0039k0765R291k8114j2630k1725m7632l6108P3938N0067P99
5608C91821j4247j5091m0267J8347M2168L6923m4937m5564N0015R701M117N2101
5596D45087o2137O175P0549l9445k8485N1208K30n265j3692J1647K4425j8377
$$ y = [232100, 296951, 247096, 271981, 300425, 309990, 316276, 386280, 443264, 505914, 544320, 563894, 662841, 730345, 730450, 672343, 671222, 654476, 608509, 607663, 614202, 698288, 806135, 858274, 986143, 1086082, 1099475, 1138396, 1114980, 1093132, 1070155, 1148543, 1131781, 1151488, 1167402, 1177400, 1195190, 1225422, 1170021, 1110699, 1030490, 990594, 973706, 951236, 883829, 805206, 802365, 669984, 512919, 467296, 528029, 501176, 454579, 419275, 484172, 503827, 515697, 480347, 452719, 454739, 424700, 403935, 413226, 385112, 372482, 350757, 303125, 267017, 340955, 391022, 391821, 377574, 362483, 322216, 340563, 382731, 419654, 374717, 329153, 379168, 388869, 392986, 445087, 382950, 389125, 459674, 420229, 391744, 442952, 443182, 437917, 424225, 435872, 460297, 441920]
5584D41920m3053N0996K6012J9718K1716k064l0749l1542O7581m1854N737l9388
5572D45030l1315l2955k450K8680J9491M7441O0096q677m3359K525M7199j8911
5560E12795n077l6143j0872J918J35463j763q027R4331l7587l6389J6521q916
5548F16254J4560K723j1262L1492o3048M8594N0108j5105M164L1213J04758J7386
5536H31837j8437J4850P3747R2290M6705r392J19914O1453J20839P1079l5240
5525A369645J58p307n6251k2294R3387k7272n544K5002J57156j3829o84P255o7845
5512A451577J9225Q679n823p0066m5077J2522o5332Q671n623k9188N2313N9326
5500A391204M685K7013K5017K6765N0221N5702L5521P007M8629P7336M2371N2635
$$ y = [441920, 398867, 449863, 475875, 495593, 517309, 515245, 484496, 452954, 520535, 478681, 484418, 445030, 413715, 380760, 378310, 406990, 426481, 473922, 534018, 525341, 481982, 484507, 531706, 512795, 507718, 471575, 460703, 462621, 598084, 596321, 588294, 682625, 645038, 608649, 625170, 616254, 630814, 633537, 622275, 653767, 590719, 639313, 689421, 674316, 678480, 709693, 814451, 831837, 813400, 828250, 901997, 994287, 1040992, 1031600, 1151514, 1212967, 1333806, 1404885, 1369645, 1369803, 1362496, 1306245, 1283951, 1377338, 1350066, 1344522, 1369524, 1526680, 1512851, 1512167, 1519422, 1451577, 1470802, 1479481, 1473658, 1403592, 1358515, 1371037, 1305705, 1314376, 1308753, 1279565, 1331878, 1391204, 1395889, 1422902, 1447919, 1474684, 1524905, 1580607, 1616128, 1623135, 1671764, 1749100, 1791471, 1844106]
5488A844106N885M0910p875M5469J5696M9962J16809L3162P0380O4398N758O6349
5476B351009R5157k2517L6240N7825N7555O7304P8116L5650O3057P3224M0021
5465B932641R4764J49135J21823K04002J90599J37228R8376J00848J10963m504
5455D135875L5411J29488M9782N5179Q3717J90445J52616R9522J55362J27315
5445E214712J79525R7498J85438K53861J83942K60769L60463L97107M36010M18701
5435G988026M07449N32120N80971O41782P85825P94671Q84921J084354J228689
5426A4928808J392344J694173J962318K317179K815911L395324M481240O534756
5418C9522053J0091187J5441409K1322597K4545600J9957500J0956315L489575
$$ y = [1844106, 1849991, 1890901, 1883026, 1928495, 1944191, 1994153, 2110962, 2144124, 2214504, 2278902, 2284660, 2351009, 2446166, 2423649, 2459889, 2517714, 2575269, 2642573, 2720689, 2756339, 2819396, 2892620, 2932641, 3027405, 3176540, 3298363, 3502365, 3692964, 3830192, 3928568, 4029416, 4140379, 4135875, 4171286, 4300774, 4350556, 4405735, 4489452, 4679897, 4832513, 4932035, 5087397, 5214712, 5394237, 5491735, 5677173, 5931034, 6114976, 6375745, 6736208, 7133315, 7569325, 7988026, 8395475, 8927595, 9508566, 10150348, 10936173, 11730844, 12615765, 13700119, 14928808, 16321152, 18015325, 19977643, 22294822, 25110733, 28506057, 32987297, 39522053, 49613240, 65054649, 86377246, 110922846, 130880346, 141836661, 145326236]
5411A45326236l412141q892743j1372959r906055n601168Q36402Q348415J4324452
5403A29650439J4517644P373939J63938o036854j2107446j6216087j7140074j5606534
5395H4598965j3611753j1502810j0058686q728104p104282n536585m085923k975284
5387B0995538k342377j851938j502002j135821q46147o56217n86834o11243o36874
5378A0826085n72658o80808m94612m87901m28430l48358l10257m20848l06235
5369F775978k66391k56728k86744k29913k53406k52265j85882j47696j28174j90561
5359D578218j68943j67007k05425j33514j13768r8130j09576j01016l7580j22941
5349C320318p9347j32056q3690m2138p4551o8351n5499l3436m7057q8788l8457
$$ y = [145326236, 141914095, 133021352, 121648393, 111742338, 106141170, 106977572, 115325987, 129650439, 144168083, 151542022, 151705960, 145669106, 133561660, 117345573, 100205499, 84598965, 70987212, 59484402, 49425716, 40697612, 33593330, 28056745, 23970822, 20995538, 18653161, 16801223, 15299221, 14163400, 13317253, 12661036, 12074202, 11462959, 10826085, 10253427, 9572619, 9078007, 8590106, 8161676, 7813318, 7503061, 7082213, 6775978, 6509587, 6252859, 5966115, 5736202, 5482796, 5230531, 5044649, 4896953, 4768779, 4578218, 4409275, 4242268, 4036843, 3903329, 3789561, 3691431, 3581855, 3480839, 3443259, 3320318, 3240971, 3108915, 3025225, 2983087, 2908536, 2840185, 2784686, 2751250, 2704193, 2615405, 2576948]
5338B576948p4296n2606p0623n3787n1311q9927q0775j28661Q58K8564r1263o3342
5326A849779m8397J1834K6158r5702m5922k5613j41636K7803n400l1785l143q4107
5314A433869M0678K1889j1743n3204r4651M5132j7255q0173q2198n2072J2394
5303A162666o9979m7990Q2071j9061k4898M758l0748p0293k5659j6113J2106k2990
5291I33870P14l3145L01l7799o2498M532J2705j1496l1751M2787P2911q2305o7731
5278G41095L626n0295l31L1144J9764k7355l7279m5808l4214j1060k1946o023
5266E61318M5758J770p136J8638m6918L3768J0991n1190m4892K0887j2009m8102
5254D82883n0720K1950Q964m2517N1673L8221m7542n1112q654J1605L5411p8916
$$ y = [2576948, 2502652, 2450046, 2379423, 2325636, 2274325, 2184398, 2103623, 1974962, 1975820, 2004384, 1913121, 1849779, 1801382, 1813216, 1839374, 1743672, 1697750, 1672137, 1530501, 1558304, 1552904, 1521119, 1517976, 1433869, 1474547, 1496436, 1484693, 1431489, 1336838, 1381970, 1364715, 1284542, 1202344, 1150272, 1162666, 1092687, 1044697, 1126768, 1107707, 1082809, 1087567, 1056819, 986526, 960867, 944754, 956860, 933870, 934584, 901439, 901740, 863941, 801443, 805975, 818680, 807184, 775433, 818220, 891131, 808826, 741095, 744721, 694426, 694095, 725239, 745003, 717648, 680369, 634561, 600347, 589287, 567341, 561318, 607076, 608846, 601710, 620348, 573430, 607198, 618189, 566999, 522107, 542994, 530985, 482883, 432163, 454113, 463077, 420560, 472233, 510454, 462912, 411800, 403146, 414751, 450162, 371246]
5242C71246l199L0289j7558j0109r876M5033n8797p3754N0508J2614j3997k7678
5230B94722j6812O6581m9066m4002Q659l8645j0958k4802M6L7094j2967J6940
5218B26790M8172o8700m8389M6209O6165J0441k459j1402j7951K2434J6425r4239
5206A93496r546J6098j5794P099j8502M9821K5585p7207k0509n286M2410l1408
5194A56257l0183m2657j8064O2019K0453l9l0821K1893j7101J1527R095l121j1772
5181A27486m2392J3507n8622j5600m064J6559J2672k5321P5292K3179j01483l2235
5169a1022J7648K2953M9428L8684K717o0848l6314j8502N2957j2701j0549P683
5157D2134k3130L5499N1558K7100l3604R136R804L3156l1398O638j05209j8069
$$ y = [371246, 368047, 398336, 380778, 370669, 360793, 405826, 347029, 273275, 323783, 336397, 322400, 294722, 277910, 344491, 295425, 251423, 260082, 221437, 210479, 185677, 185723, 222817, 209850, 226790, 274962, 206262, 157873, 204082, 270247, 280688, 278229, 266827, 248876, 271310, 287735, 193496, 183950, 200048, 184254, 191353, 172851, 222672, 248257, 171050, 150541, 145255, 187665, 156257, 126074, 83417, 65353, 127372, 147825, 147786, 116965, 138858, 121757, 133284, 142379, 139258, 127486, 85094, 98601, 39979, 24379, 20315, 36874, 49546, 24225, 99517, 122696, 21213, -11022, 6626, 29579, 79007, 117691, 120408, 59560, 23246, 4744, 57701, 45000, 34451, 42134, 19004, 54503, 106061, 133161, 99557, 108693, 118497, 151653, 120255, 126893, 21684, 3615]
5145C615J12252L1862l8121j4486L1692K7278l6715K3783l0279n1952M424K890
5133F6243J2392L15j8587N005M1675j97K2290P3713o7992L2408Q6057m0408r1293
5120A21621j2495K1269k0237o6246N951Q1771M4411q1329m5831J9020L7808P6907
5108A82620J6343P123R360M2378n4950J22471O3573O6062J17709J23860O2131
5097G58680r759j6426l2054p5243M3771r6075j2832M9354N7709M6286J9473K9674
5085G62558J474j02057q3035l1496n4838p1955p630j06783n3996l4071m8466l3858
5073A35847m5835j6051Q4058m366L1528n256q1492J3448l7827N422j919L5995
5061A13552L1783K6098m4180m2953j8969N9063m0615j33329n4550P2247P8079
$$ y = [3615, 115867, 147729, 109608, 95122, 126814, 154092, 117377, 141160, 110881, 58929, 63353, 66243, 78635, 78950, 60363, 65368, 107043, 106846, 129136, 202849, 134857, 167265, 253322, 212914, 121621, 109126, 130395, 110158, 43912, 49863, 131634, 176045, 94716, 48885, 67905, 105713, 182620, 198963, 206086, 215446, 257824, 202874, 325345, 388918, 454980, 572689, 696549, 758680, 748921, 732495, 700441, 625198, 668969, 572894, 560062, 609416, 667125, 713411, 732884, 762558, 764032, 661975, 578940, 547444, 492606, 420651, 413021, 306238, 252242, 218171, 169705, 135847, 90012, 73961, 158019, 153653, 185181, 179925, 98433, 111881, 74054, 79476, 77557, 113552, 145335, 171433, 127253, 84300, 65331, 124394, 83779, -49550, -104100, -31853, 46226]
5050D6226M6374l2536n5728n2714R5317r602p2738m575N1807O3938o9099L5408
5038D2078o5018k6479L7135r80j6792r811R9341L5397r609m7073m5663N578L8974
5025C7078K3971j6387j3773j515j8186L3358l9467k0230J4322N0065k1120R678
5013C7794R872K1338J3940n1917P2286K1255N476n8883R463N4848q176J0950o571
5000A31675O4349N543l5896J759o9300l3349k5318O4990P053m4775k5597L1638
4988G2772J3056J9213q968n9455K219J3700r056n4377k1163q081N8086k5544M5405
4975C7807m646J9732m2812j7673M005K7655m247k2661O437L1654n6016M7472J6126
4962D2833N8147q506n4247m420J2594J808r462j0789J3065N2344J7632j9603N99
$$ y = [46226, 92600, 60064, 4336, -48378, 46939, 37337, -35401, -39976, 11831, 75769, 6670, 42078, -22940, -49419, -12284, -13264, -30056, -39867, 59474, 94871, 85262, 38189, -7474, -1896, 37078, 61049, 44662, 30889, 29374, 11188, 44546, 5079, -15151, -829, 49236, 28116, 37794, 47666, 69004, 82944, 31027, 103313, 124568, 130044, 71161, 80624, 135472, 127296, 138246, 131675, 196024, 201567, 165671, 167430, 98130, 64781, 39463, 104453, 111506, 66731, 41134, 72772, 85828, 105041, 96073, 36618, 38837, 52537, 43481, -10896, -32059, -40140, 17946, -7598, 37807, 33161, 52893, 10081, -7592, -3587, 24068, 19821, -2840, 3597, 35251, -20765, 26707, 42833, 100980, 92474, 38227, 33807, 46401, 48209, 38747, 27958, 41023, 93367, 110999, 91396, 91995]
4949I1995n5029n7038M1311p493K9641k3354N2778k2235L2666l1468J1123j0955
4937E1942M9147K3965q665J0331O331l4709M1234j8565J5735l6856M0921m86n0645
4924H9680j3527L045l107p2009O8741j7145J9590k9076k1771J5300j1265J5917
4912D4373Q0028j8757j9146O481k3128p9335p3958J6412R3419P6992J9573m2569
4900H0385n4196L9050k3355l0314J4228K8763N085j5019j0512l656r213L6102
4888E7348J6463K2758k968M1909K5721m7324o0931j5226J5888K6749J9828L5995
4876A36210L7138k7697m8929N1271O1046Q155O2873l0232k5241J8688m5692M4669
4864B42259O5291J1854N6790J29766O699n1728o4028L1305m3201p9942J6960k0339
$$ y = [91995, 36966, -20072, 21239, 13746, 43387, 20033, 72811, 50576, 83242, 51774, 62897, 51942, 101089, 125054, 116389, 126720, 133051, 98342, 139576, 121011, 136746, 99890, 140811, 140325, 89680, 76153, 79198, 76091, 4082, 72823, 55678, 75268, 46192, 24421, 39721, 28456, 44373, 124401, 105644, 86498, 92979, 69851, -9484, -83442, -67030, 26389, 103381, 122954, 80385, 26189, 65239, 41884, 11570, 25798, 54561, 59646, 44627, 34115, 30459, 21246, 57348, 73811, 96569, 93601, 135510, 161231, 113907, 52976, 37750, 53638, 80387, 100215, 136210, 173348, 145651, 96722, 147993, 209039, 217194, 280067, 249835, 224594, 243282, 197590, 242259, 307550, 319404, 376194, 505960, 512659, 460931, 396903, 428208, 385007, 305065, 322025, 301686]
4852C01686l2685m5458N4533M4512p6211j8538l1155k2520L5047O523P320j0978
4840B12076l2841p3469K6043k3148K7380l2734j4716m8127m2807j2331R73Q5961
4828G2260M9071l5728J1080k3926K1550j813M5402j2050k6233M4042l6937l8086
4816F8632L5149M2959R497o013J1476k3914n459q2529j9054P2291o7134K2568
4804E8469J1289M3225k0750K159N4040L8753n7662K5562O3624m4248K8534k7604
4792A75391L9801M5028l6978l1601n6820J4584J3595j0964K9949l6182m4436N062
4780A06429P1946o8295q7807M5748L6068L115p393K5998N8744N91J4648K4887
4768B24679p838N8118m5841j41151k1551L4000r55q32j4808O483l9026J1346J7051
$$ y = [301686, 269001, 223543, 278076, 322588, 246377, 227839, 196684, 174164, 209211, 215734, 223054, 212076, 179235, 105766, 131809, 108661, 136041, 103307, 88591, 40464, -2343, -14674, -13701, 72260, 121331, 85603, 96683, 72757, 94307, 92494, 137896, 125846, 99613, 143655, 106718, 68632, 103781, 146740, 156237, 150224, 161700, 137786, 132327, 49798, 30744, 103035, 35901, 58469, 69758, 112983, 92233, 94392, 148432, 187185, 129523, 155085, 218709, 174461, 202995, 175391, 215192, 260220, 223242, 191641, 134821, 149405, 163000, 152036, 181985, 145803, 101367, 106429, 178375, 110080, 22273, 68021, 104089, 107204, 99811, 125809, 184553, 185144, 199792, 224679, 216841, 274959, 229118, 87967, 66416, 100416, 99461, 98629, 83821, 90304, 51278, 62624, 79675]
4755G9675N990J8618k8839k3016N7910l2917P3774m3771l158l5981j6274K683
4743E4694l54N1510j2658n3175k0970L7512K9886o5740K4245K8504n3728P2605
4731I2331m6554m952K9964J1614o63R350k5298K2786n6680k7574N5633K7475J6163
4718A03595j5563k896j5645K8132o22l2509L8654M9290r535q252K7473k3884J8659
4705A56897j406N3541l7217k4644k2478K6679L955p0303j9359j661l5375n470
4693B3159N7211J1990N3537l4561l977L4483l1922l2093M0033j0791J9851k108
4681A24812p904J6415j2587J3168J6265K3118L8158m6927l3550K6861K1459m156
4669A75132J7315O661n0113K5633m3524J5456l3305j2097N397k6567k9795N5030
$$ y = [79675, 85665, 104283, 75444, 52428, 110338, 77421, 151195, 107424, 104266, 68285, 52011, 54694, 54340, 105850, 93192, 40017, 19047, 56559, 86445, 20705, 44950, 73454, 19726, 92331, 45777, 40825, 70789, 82403, 81740, 91090, 65792, 88578, 31898, 4324, 59957, 87432, 103595, 88032, 85136, 69491, 97623, 97001, 64492, 103146, 152436, 142901, 134649, 162122, 138238, 156897, 155491, 209032, 171815, 147171, 124693, 151372, 155327, 85024, 65665, 64004, 28629, 23159, 80370, 92360, 145897, 111336, 107359, 141842, 109920, 77827, 117860, 107069, 126920, 124812, 116908, 133323, 120736, 133904, 150169, 173287, 211445, 164518, 130968, 157829, 179288, 175132, 192447, 199108, 148995, 174628, 131104, 146560, 113255, 101158, 106555, 79988, 50193, 105223]
4657A05223M5282n7743n006k3440n072K7937k8786K1458j2387Q385k1441k3065
4645C1345N0136p2155P4225j8875L6204K2440K8679J7016K1327J1082l9674K4032
4633A85782q7614m1760P2186q747n9100K1294n796m634r612j857O2719K2077o1948
4620H2990J8752Q919L9204L8214J7833k9529J522m3094j6497L6608j8760R40J7964
4607A55066p767P9753L5220n5301m1785q117m6160K5499j9694j9568L444k1766
4595G8824M5785P2825J5215m4186o138J5579l2332m3505N9937O4741M5555m8701
4583B23599K2957M1982j8436J8667k2661J2309k0159p0131K9119o363J3215l548
4571B20550k5639K8278o279r872J7160R1N4429M0607J4732N5219J1595n777L150
$$ y = [105223, 150505, 92762, 87756, 64316, 59244, 87181, 58395, 79853, 67466, 75851, 54410, 31345, 81481, 9326, 83551, 64676, 100880, 123320, 151999, 169015, 190342, 201424, 161750, 185782, 98168, 56408, 128594, 119847, 60747, 82041, 76245, 71611, 61999, 60142, 122861, 144938, 82990, 101742, 110661, 149865, 188079, 205912, 176383, 177905, 134811, 118314, 154922, 136162, 137102, 155066, 147299, 227052, 262272, 206971, 165186, 157069, 110909, 136408, 116714, 97146, 100590, 78824, 124609, 197434, 212649, 168463, 162325, 177904, 145572, 102067, 162004, 226745, 272300, 223599, 246556, 288538, 270102, 288769, 266108, 278417, 258258, 188127, 217246, 210883, 224098, 220550, 194911, 223189, 216910, 207038, 224198, 224289, 278718, 319325, 334057, 389276, 400871, 395094, 398244]
4558C98244L9380L3239l1328m1673m8759O3126J6076j7293r4198O4107K3937k2261
4546C82597K0449k640K6466J0146q0701j8319l1190Q0399j1450J2015K1947k9303
4534C80416M8713J3662J8575J487j4501J8336L0674k4122K8946k8538L7993O7428
4522E79069K6897M5762k7122j8259n683M9180L9732j1301l6488J9154L8988n5542
4510F44387O1398M0092M4916J9981N3216P550M1923J5015j2369l8989N1417K9571
4498I58108m134J1373j7059J8391j1908r5718j7422O0695J205J4348l8109k699
4486H77071O1379j1713q2234O311P025o9216o752L5240N7129n890J658M299n1491
4473H22816j1496N588j9780N3881j2070o8698l8617J5285l9563j8449J6796j3488
$$ y = [398244, 437624, 470863, 439535, 397862, 349103, 412229, 428305, 411012, 316814, 380921, 404858, 382597, 403046, 400406, 426872, 437018, 356317, 337998, 306808, 387207, 375757, 387772, 409719, 380416, 429129, 442791, 461366, 462853, 448352, 466688, 497362, 473240, 502186, 473648, 511641, 579069, 605966, 651728, 624606, 606347, 600664, 649844, 689576, 678275, 641787, 660941, 699929, 644387, 705785, 745877, 790793, 810774, 863990, 871540, 913463, 928478, 916109, 877120, 928537, 958108, 953974, 965347, 948288, 966679, 954771, 859053, 841631, 902326, 903531, 917879, 879770, 877071, 938450, 926737, 844503, 850814, 857839, 788623, 781871, 817111, 874240, 868350, 870008, 874307, 822816, 811320, 816908, 797128, 851009, 838939, 770241, 731624, 746909, 707346, 688897, 705693, 692205]
4461F92205j7644k7631J7880Q283L0942J129j533L8184n2684o3292j7663K0065
4449F28241K8510P8614L0180J3315k7556q065N418J4451Q547k6636N48M6998l8159
4436G54406l0298K0426J3710J6791K5157J7782o573l9661K7118Q9455j6345J0477
4424H82445K0524N3178R519N3348k025m3863O9690k0310n8490L7013Q5389J2069
4412A098487n3803N3314P7446L2631N5471L284O4472J26227n5600r2100l6822
4401A273007o042n6486j1087L6831J7246N0210K4442O6769l2726r8268l0574K0489
4389A253811M0691m0680K5022J9438N5207N864j6471M2480K1456K4028M3292M4610
4377A518748N5269M6898j3706Q624N7631k8769P4579Q0454O3484J26704K3846
$$ y = [692205, 674561, 646930, 664810, 673093, 704035, 705164, 703631, 741815, 689131, 625839, 608176, 628241, 656751, 735365, 765545, 778860, 751304, 743239, 748657, 763108, 771655, 745019, 745567, 792565, 754406, 724108, 744534, 758244, 775035, 800192, 817974, 811401, 771740, 798858, 888313, 871968, 882445, 902969, 956147, 965666, 1019014, 1016989, 973126, 1042816, 1022506, 964016, 1001029, 1086418, 1098487, 1044684, 1097998, 1175444, 1208075, 1263546, 1266830, 1331302, 1457529, 1401929, 1309829, 1273007, 1266965, 1210479, 1199392, 1236223, 1253469, 1303679, 1328121, 1394890, 1362164, 1263896, 1233322, 1253811, 1294502, 1253822, 1278844, 1298282, 1353489, 1359353, 1342882, 1385362, 1406818, 1430846, 1474138, 1518748, 1574017, 1620915, 1607209, 1615833, 1673464, 1644695, 1719274, 1799728, 1863212, 1989916, 2013762]
4366B013762j8211J31939K8655M7550O5627j5500M504R2128N3256P0112N2224
4355B526046k334L9411O3178J7234P3080N6729N5202R1358J05977P0094L0997
4344C126972M1000R6217Q3442L8996Q1447R8953L8231R4622J09919N3802N5021
4333C918622O5146J57727J47877J51433J00154J61119K36810K64843K83483L31674
4323E818888L54758L95467L72629M45948N42103O77132P94169J085603J383729
4314A1870426K036195L227401M673498O130604O257984M261299K338563P52129
4306D1548099p74367j730950j739155m40824J781985M981265Q189905J0269357
4298F2085315P305897K831291l8637l423070n838576p066423o157495m639920
$$ y = [2013762, 1995551, 2127490, 2156145, 2203695, 2269322, 2253822, 2258326, 2350454, 2403710, 2473822, 2526046, 2523712, 2563123, 2626301, 2643535, 2716615, 2773344, 2828546, 2919904, 3025881, 3095975, 3126972, 3167972, 3264189, 3347631, 3386627, 3468074, 3567027, 3605258, 3699880, 3809799, 3863601, 3918622, 3983768, 4141495, 4289372, 4440805, 4540959, 4702078, 4938888, 5203731, 5487214, 5818888, 6173646, 6569113, 6941742, 7387690, 7929793, 8606925, 9401094, 10486697, 11870426, 13906621, 17134022, 21807520, 27938124, 34196108, 38457407, 40795970, 41548099, 40773732, 39042782, 37303627, 36862803, 38644788, 43626053, 51815958, 62085315, 69391212, 72222503, 72183866, 68760796, 62922220, 55855797, 49698302, 45058382]
4290D5058382k512144l25921J222950J337949l34482j391969k476443l622408
4282C6955914m311830m278768l672256l129624k597155k278381j884492j512829
4274A3290579j043422o92099m78640l41277k79539k06200j53435j28007p1278
4265I896682J1295M0582N3982O8558N1345K3766M6659Q1685J19942J18850J08436
4254A0621782J04639Q3652Q6687J62529J67235K31668K49056K10618L38631L18248
4244A2574745M15705M61867L89840N38101N84762N58329O71666P10571P48039
4235A7653625R46022J042776J019970J224066J329713J362143J569818J729581
4227B7877714J869425J898439J965195K169583K210136K302413K246951K389475
$$ y = [45058382, 42546238, 42220317, 43443267, 44781216, 44446734, 43054765, 40578322, 36955914, 32644084, 28365316, 24693060, 21563436, 18966281, 16687900, 14803408, 13290579, 12247157, 11555058, 11076418, 10735141, 10455602, 10249402, 10095967, 9967960, 9896682, 9907977, 9948559, 10002541, 10071099, 10122444, 10146210, 10192869, 10274554, 10394496, 10513346, 10621782, 10726421, 10810073, 10896760, 11059289, 11226524, 11458192, 11707248, 11917866, 12256497, 12574745, 12990450, 13452317, 13842157, 14380258, 14965020, 15523349, 16195015, 16905586, 17653625, 18599647, 19642423, 20662393, 21886459, 23216172, 24578315, 26148133, 27877714, 29747139, 31645578, 33610773, 35780356, 37990492, 40292905, 42539856, 44929331]
4219D4929331K560788K648975K749288K782480K967342K990936L060409L053198
4211F7742747L144402L067067L044186K957300K831322K618156K568633K426788
4203I0400601K325143K127503K006452K005045J886066J737954J654680J293178
4195A05436622J040804P32369K67781m3049k60555n98574q06939r46522j104515
4186A03717422j271592j475156j549992j740114j932909k192045k321227k474298
4178H8760089k754386k893645l051413l152585l087531l165756l159961l090437
4170F4404375l010824l020197k898694k847957k721280k717248k664608k560727
4162D1962840k458741k536529k466223k307557k221716j987103j918990j830009
$$ y = [44929331, 47490119, 50139094, 52888382, 55670862, 58638204, 61629140, 64689549, 67742747, 70887149, 73954216, 76998402, 79955702, 82787024, 85405180, 87973813, 90400601, 92725744, 94853247, 96859699, 98864744, 100750810, 102488764, 104143444, 105436622, 106477426, 107209795, 107477576, 107434527, 107173972, 106575398, 105768459, 104821937, 103717422, 102445830, 100970674, 99420682, 97680568, 95747659, 93555614, 91234387, 88760089, 86005703, 83112058, 80060645, 76908060, 73820529, 70654773, 67494812, 64404375, 61393551, 58373354, 55474660, 52626703, 49905423, 47188175, 44523567, 41962840, 39504099, 36967570, 34501347, 32193790, 29972074, 27984971, 26065981, 24235972]
4154B4235972j575843j507277j461411j312839j213844j032855j049011j008132
4146A4074760q67155p69276p14405o87131o50880o42322n68722m98962m07161
4137H268746l16064l42800l24805k68651k57221k33127k41002j97053j45054j56383
4127E786586j46691j40176j16240j81104j25029j22824n2804j34760p4817j0170
4117D681971p4038j17253m1399o1526M507O8394M0393m3423j07025O6172Q739
4106D425512K7477J22028J06881N7862Q7907J31101J30831Q9384J30401J09003
4096E418387K3789j1724L3881J7335J763n6775o6001j26049p570o2534n1739m1187
4084E071576R193o463m5556j34152j13296q6067j05708r9260q8638q8672r1903
$$ y = [24235972, 22660129, 21152852, 19691441, 18378602, 17164758, 16131903, 15082892, 14074760, 13207605, 12438329, 11723924, 11036793, 10385913, 9743591, 9174869, 8675907, 8268746, 7952682, 7609882, 7285077, 7016426, 6759205, 6526078, 6285076, 6088023, 5942969, 5786586, 5639895, 5499719, 5383479, 5202375, 5077346, 4954522, 4901718, 4766958, 4692141, 4681971, 4607933, 4490680, 4449281, 4387755, 4392262, 4460656, 4501049, 4457626, 4350601, 4416773, 4425512, 4452989, 4575017, 4681898, 4739760, 4827667, 4958768, 5089599, 5178983, 5309384, 5418387, 5442176, 5430452, 5464333, 5481668, 5483431, 5426656, 5360655, 5234606, 5227036, 5164502, 5112763, 5071576, 5080769, 5074306, 5028750, 4894598, 4781302, 4695235, 4589527, 4490267, 4401629, 4312957, 4221054]
4073D221054j00162j78532l8371o5675j29220p6852n3880l5472n9464r5130p6937
4062C311359o9778j14250m5897L4167j1406O524n0128q6750n2694j8584n6038
4051B846525L835m9735n4059K1764m9380n6870p0916m4523L8222Q180k8821o406
4039B557816m5338l9223j2717l326j456l2512m8440J7326P0831o915J1428m359
4027B463115M78J185n5723J426o273J6291O223k5997N3443J9258N232M1477O2
4014B520197N8277J4189j5282L0687j8891Q6433Q9658J38651Q2342R4903k3605
4003C057559l3089Q6498M0360L207l5816o1023J28834M714M7308P225K207J45479
3991C393463K9143N3355l7001o781K3986k9624l5217j1529K8586J2165L2123L9439
$$ y = [4221054, 4120892, 3942360, 3903989, 3838314, 3709094, 3632242, 3578362, 3542890, 3483426, 3388296, 3311359, 3241581, 3127331, 3081434, 3115601, 3104195, 3110719, 3060591, 2973841, 2921147, 2902563, 2846525, 2850360, 2800625, 2746566, 2768330, 2718950, 2662080, 2591164, 2546641, 2584863, 2593043, 2564222, 2557816, 2512478, 2473255, 2460538, 2457212, 2455756, 2423244, 2374804, 2392130, 2462961, 2456046, 2467474, 2463115, 2463593, 2464778, 2409055, 2410481, 2404208, 2420499, 2426722, 2400725, 2454168, 2473426, 2478658, 2520135, 2520197, 2578474, 2592663, 2577381, 2608068, 2589177, 2675610, 2765268, 2903919, 2986261, 3081164, 3057559, 3024470, 3110968, 3151328, 3154535, 3118719, 3057696, 3186530, 3191244, 3238552, 3245777, 3247984, 3393463, 3422606, 3475961, 3438960, 3432179, 3456165, 3426541, 3391324, 3379795, 3408381, 3420546, 3452669, 3492108]
3979C492108K9301J4572M4470J56194R6652P5662K3370l4404M6436J2127j2529
3968C943959M1994j0372L3998l848P2992J8444M3890k0638K1104J6514M8915J2563
3956D219515m6600j8695k4436r522m3722m8495L5358N5543j4528M2626q354Q197
3944D146887Q2347Q8495Q1531L9056M5776Q1939J08340Q0164Q7179M3646M4357
3933D929717J12728J38131J51786J05804J75863J90816R6565J14900J22777Q4826
3923F223913J70595J60586J57590R1579J96478J12921R9735J01870J16563K09658
3913G641488O8262J57734J26104J36214J96516K11970K09985J83228J31821J15006
3903I178328J42193J77550J85907J83692K37779K44604L08525L84421L47083L64034
$$ y = [3492108, 3521409, 3535981, 3580451, 3736645, 3833297, 3908959, 3932329, 3897925, 3944361, 3956488, 3943959, 3985953, 3975581, 4009579, 4005731, 4078723, 4097167, 4141057, 4120419, 4141523, 4158037, 4206952, 4219515, 4172915, 4154220, 4129784, 4120262, 4076540, 4028045, 4063403, 4118946, 4104418, 4147044, 4138690, 4146887, 4229234, 4317729, 4399260, 4438316, 4484092, 4566031, 4674371, 4754535, 4841714, 4885360, 4929717, 5042445, 5180576, 5332362, 5438166, 5614029, 5804845, 5901410, 6016310, 6139087, 6223913, 6394508, 6555094, 6712684, 6804263, 7000741, 7113662, 7213397, 7315267, 7431830, 7641488, 7709750, 7867484, 7993588, 8129802, 8326318, 8538288, 8748273, 8931501, 9063322, 9178328, 9320521, 9498071, 9683978, 9867670, 10105449, 10350053, 10658578, 11042999, 11390082, 11754116]
3893A1754116M52880M32356N56501O64574O69327O35357Q42769R43729J041896
3884A7993505J297532J504459J619092J801194K040733K140656K098645K135317
3876C2631133J837410J632115J475861J163261J048525Q48078R35588R83504J017108
3867D3572583J137649J123813J194544J147783R70114P71493M53111J32421j49131
3858E0354380n17782p17015q34023r13448r00387q47663p36066o44965n04498
3849D3738533m99161l65409k68905j52253o1051k6944J15616K49300L78341N62794
3839D3670861Q40795R45621J325342J605706J988746K412219K911966L429465
3831E9130721L977076M894727N603776O503039P444887Q452870R584645J0958518
$$ y = [11754116, 12206996, 12639352, 13195853, 13860427, 14529754, 15165111, 16007880, 16951609, 17993505, 19291037, 20795496, 22414588, 24215782, 26256515, 28397171, 30495816, 32631133, 34468543, 36100658, 37576519, 38739780, 39788305, 40636383, 41571971, 42555475, 43572583, 44710232, 45834045, 47028589, 48176372, 49146486, 49917979, 50371090, 50503511, 50354380, 49836598, 49119583, 48285560, 47372112, 46471725, 45624062, 44887996, 44243031, 43738533, 43239372, 42873963, 42605058, 42452805, 42391754, 42364810, 42480426, 42729726, 43108067, 43670861, 44511656, 45457277, 46782619, 48388325, 50377071, 52789290, 55701256, 59130721, 63107797, 68002524, 73606300, 80109339, 87554226, 96007096, 105591741, 116550259]
3823A16550259J2364039J4008976J6152750J8828889K2251881K6508376L1043185
3816B57708355L5103860L7501732L7755074L5894027L2195357K6907308K0832284
3809D83897997J4435391Q740702M125435O44944j415104k025956j408733r6852
3801E06897824J482609K977976M285527M687457L265247p53000p306150j4718036
3793E00819454k1510090k6736789k9827053l0614916k9379356k7051083k3993351
3786C11706816k0976150j8190649j5607365j3275296j1411023r871064q898449
3779B13476820q353407q019348p851492p763731p768608p730327p539066p265314
3771A51185527o903436o493897o124847n782579n553417n585639n651842n757031
$$ y = [116550259, 128914298, 142923274, 159076024, 177904913, 200156794, 226665170, 257708355, 292812215, 330313947, 368069021, 403963048, 436158405, 463065713, 483897997, 498333388, 507074090, 511199525, 511844469, 510429365, 508403409, 506994676, 506897824, 508380433, 511358409, 515643936, 520331393, 523596640, 522843640, 515537490, 500819454, 479309364, 452572575, 422745522, 392130606, 362751250, 335700167, 311706816, 290730666, 272540017, 256932652, 243657356, 232246333, 222375269, 213476820, 205123413, 197104065, 189252573, 181488842, 173720234, 165989907, 158450841, 151185527, 144282091, 137788194, 131663347, 125880768, 120327351, 114741712, 109089870, 103332839]
3763A03332839n861354n916145n894536n835589n594781n300512m994202m558156
3755E9377564m070328l543956l106359k684169k298244j939890j497825j212318
3747C9024475q51929n00378k97087q4705n2806m6250j4843j17922j10185j19956
3737C6828414j42302j33070o6576R8326K11687L47442L97488L66020L50335K54981
3727C8512745R7581m3384j24057l30322m67915o48282q37767r52801j130441j045155
3717C3030202j119774r83020r66339r63359q63246r00549q39521r01337j028647
3708B4464410r96577j003163j045901j100430j163418j131362j026605q83335
3700A6113619q41310q63967p60035p08101o06571m36221m03628m07653m43202
$$ y = [103332839, 97471485, 91555340, 85660804, 79825215, 74230434, 68929922, 63935720, 59377564, 55307236, 51763280, 48656921, 45972752, 43674508, 41734618, 40236793, 39024475, 38172546, 37672168, 37375081, 37290376, 37237570, 37191320, 37176477, 37058555, 36948370, 36828414, 36686112, 36553042, 36486466, 36584792, 36796479, 37143921, 37541409, 37907429, 38257764, 38512745, 38610326, 38566942, 38442885, 38112563, 37644648, 36996366, 36158599, 35205798, 34075357, 33030202, 31910428, 30927408, 29961069, 28997710, 28134464, 27233915, 26394394, 25493057, 24464410, 23467833, 22464670, 21418769, 20318339, 19154921, 18023559, 16996954, 16113619, 15272309, 14408342, 13648307, 12940206, 12333635, 11897414, 11493786, 11086133, 10642931]
3691A0642931m07626l67027k99098k43585k75767k40646k48297k28474j96505
3682H135906j53541j35317j33415j33776k09066j03973j01061j34403j48896j81374
3672F701084p5912k8673j44133j47310j14169m9952p7108j22164p0638n0239j14010
3661E706776r0489p6102j07340o4562n0243o2803r3005m6513j2571p289n9952
3650E035907j02168q749l350o4638r0344q2480R595l0059k6833m2303n6983o7577
3638D470018n7836k1687j11495r8859L5069o5522l4380l9105j6243n0960l9931
3627C969069K4312o2169l7388k8404l3918l2830M8445r144p7799l5229j9195N7580
3615C763330N6704m2570K615n2561k4907K0016l6683l2404J4009O7170K2315m8349
$$ y = [10642931, 10235305, 9868278, 9569180, 9325595, 9049828, 8809182, 8560885, 8332411, 8135906, 7982365, 7847048, 7713633, 7579857, 7370791, 7266818, 7165757, 7031354, 6882458, 6701084, 6625172, 6596499, 6452366, 6305056, 6190887, 6140935, 6063827, 5941663, 5871025, 5820786, 5706776, 5616287, 5540185, 5432845, 5368283, 5318040, 5255237, 5162232, 5115719, 5103148, 5095859, 5035907, 4933739, 4924990, 4921640, 4857002, 4766658, 4684178, 4693773, 4663714, 4636881, 4594578, 4537595, 4470018, 4412182, 4390495, 4279000, 4180141, 4215210, 4149688, 4115308, 4076203, 4059960, 4009000, 3969069, 3993381, 3931212, 3893824, 3865420, 3831502, 3798672, 3847117, 3837973, 3760174, 3724945, 3705750, 3763330, 3820034, 3777464, 3780079, 3727518, 3702611, 3722627, 3685944, 3653540, 3667549, 3734719, 3757034, 3708685]
3603C708685l9472N0197J5073J2628J4221k7049L2693M280k6684N298M3560J6584
3591C810014L952O5699k52m0108L1222N8664L0493K9502N8496l0102K6708O7111
3579D111399L7127O898K2292K9702P3014L5678j8546M7240P2230P8380J03651
3568D599065M5469N032P6478J16073p197L6353L8642O1146J00940J61517Q4928
3557E318446J3458j6819J07435J80244N3241J14714J08512J73102J38111J07192
3547F297636J26732M2596J03177J93299J20669J91304J81852K16161J25044J99513
3537G797983K37395J93807K98242K99614K31843L53019L23459K80888L93557L38252
3527A0748059K97096L58412L28586L77255L56513L20592K66472M03228K91197
$$ y = [3708685, 3669213, 3719410, 3734483, 3747111, 3761332, 3734283, 3766976, 3771256, 3744572, 3749870, 3793430, 3810014, 3813966, 3879665, 3879413, 3839305, 3870527, 3929191, 3959684, 3989186, 4047682, 4017580, 4044288, 4111399, 4148526, 4155424, 4177716, 4207418, 4280432, 4316110, 4297564, 4344804, 4417034, 4495414, 4599065, 4644534, 4649566, 4726044, 4842117, 4834920, 4871273, 4909915, 4971061, 5072001, 5233518, 5318446, 5331904, 5315085, 5422520, 5602764, 5656005, 5770719, 5879231, 6052333, 6190444, 6297636, 6424368, 6466964, 6570141, 6763440, 6884109, 7075413, 7257265, 7473426, 7598470, 7797983, 8035378, 8229185, 8527427, 8827041, 9058884, 9411903, 9735362, 10016250, 10409807, 10748059, 11045155, 11403567, 11732153, 12109408, 12465921, 12786513, 13052985, 13456213, 13747410]
3518A3747410L37204L06600K61213K81195K19023L18767K87925L13591L66987
3509A6439915L26305K46598L65984K44400K41757J99626L08511K24389J83292
3500A8780777K32145J64602K73375K56274J58002K32602K01641K12282K16730
3491B0728430K15104J62317J53560J16195J84762J46477J20397N8945M6699J18080
3481B2050966L8105J0051j20364p1678o9068p9632j14756j47568k54983j78269
3471B1062804j36593j56321j72592k94862k76504k47623k82761l24927l39588
3462A8831033l70719l40673l24471l30768l00219l33231k42386m07217k34926
3453A5946423k22775l04280k54512k42373k08267l06222l08499l44123l21917
$$ y = [13747410, 14084614, 14391214, 14652427, 14933622, 15152645, 15471412, 15759337, 16072928, 16439915, 16766220, 17012818, 17378802, 17623202, 17864959, 18064585, 18373096, 18597485, 18780777, 19012922, 19177524, 19450899, 19707173, 19865175, 20097777, 20299418, 20511700, 20728430, 20943534, 21105851, 21259411, 21375606, 21560368, 21706845, 21827242, 21886187, 21932886, 22050966, 22089071, 22099122, 21978758, 21907080, 21838012, 21758380, 21643624, 21496056, 21241073, 21062804, 20926211, 20769890, 20597298, 20302436, 20025932, 19778309, 19495548, 19170621, 18831033, 18460314, 18119641, 17795170, 17464402, 17164183, 16830952, 16588566, 16181349, 15946423, 15723648, 15419368, 15164856, 14922483, 14714216, 14407994, 14099495, 13755372, 13433455]
3444A3433455l22258l54007l39387k71172k72720j86466j64783j53213k21716
3435A1147733j94739l16383l26429l43967l18926k54801k84179k07539k62496
3426H638274k07951k14764k24189j09673j82287j48110j38825j87611j65250j29567
3416F930047j68560j29633j64811j19016n8134j57286j30149l3710o0620j19035
3406E789093q6411k1584j6967j28428m0982r0246k00801r2357j45466j09023j49152
3395D707676j60804l8187r5672m6752q1892p8672j03622j22198r4648Mj3393q1813
3383C790027j25979n7892o3546j09661P311o7980m6234q8572n8982k4866n7476
3372C096150p9667j1377q2151j02017k6164l6298p824n6105j0758m7520o6832
$$ y = [13433455, 13111197, 12757190, 12417803, 12146631, 11873911, 11687445, 11522662, 11369449, 11147733, 10952994, 10636611, 10310182, 9966215, 9647289, 9392488, 9108309, 8900770, 8638274, 8430323, 8215559, 7991370, 7881697, 7699410, 7551300, 7412475, 7224864, 7059614, 6930047, 6761487, 6631854, 6467043, 6348027, 6289893, 6132607, 6002458, 5968748, 5908128, 5789093, 5702682, 5681098, 5664131, 5535703, 5494721, 5404475, 5203674, 5111317, 4965851, 4856828, 4707676, 4546872, 4508685, 4413013, 4366261, 4284369, 4205697, 4102075, 3979877, 3885229, 3885233, 3871840, 3790027, 3664048, 3606156, 3542610, 3432949, 3440260, 3372280, 3326046, 3237474, 3178492, 3153626, 3096150, 3016483, 3005106, 2922955, 2820938, 2794774, 2758476, 2750652, 2694547, 2683789, 2636269, 2569437]
3361B569437j1014j2655j14485K887m0762m6677K0320M1591r9634o9175k9795
3350B210038j5288l7839o4360m811j1784o9485l0631k1867j12248k2823K3310
3339A842212Q029q588J7023j6338k7942k3184p508l8695o9350j2153k6705l0661
3327A606140p832k4412l0794k981l5971l6901K5617o9319K1149L0247o7478l8863
3315A368602r768n8568j1234L6679o1810k9159M5561N0284n0244j3791l5462l6917
3303A194173J0884M2015l7263m239j0391j52093K5774k0473o3320k5584P1119
3292A030602k933j4002j623m0736L8155Q723m0597m2772k0146K3645n3594j956
3280H82766L8571J8371j1751r343j0466q0501l5969O9062J2523j11253k9951r92
$$ y = [2569437, 2558423, 2545768, 2431283, 2434170, 2393408, 2346731, 2367051, 2408642, 2309008, 2239833, 2210038, 2194750, 2156911, 2092551, 2087740, 2075956, 2006471, 1975840, 1953973, 1841725, 1818902, 1842212, 1850241, 1841653, 1858676, 1842338, 1814396, 1791212, 1783704, 1745009, 1675659, 1663506, 1636801, 1606140, 1598308, 1573896, 1543102, 1540121, 1504150, 1467249, 1492866, 1423547, 1444696, 1474943, 1407465, 1368602, 1358834, 1300266, 1289032, 1325711, 1263901, 1234742, 1280303, 1330587, 1280343, 1266552, 1231090, 1194173, 1205057, 1247072, 1209809, 1205570, 1195179, 1043086, 1068860, 1048387, 985067, 959483, 1030602, 1027669, 1013667, 1012044, 971308, 1009463, 1018186, 977589, 934817, 914671, 938316, 884722, 882766, 921337, 939708, 927957, 918614, 908148, 827647, 791678, 860740, 873263, 762010, 732059, 731067]
3268G31067r693m3617M9187J2575n2066M7018L4720n1984k7955r602J0593k1967
3256F68276k0210J9540k5729p534K6855M84l7548n667J1246K1952l8417n7318
3244E55930p459n804N4713P286J7960J1687r0545J6607l4689K5941m6120j6029
3232D89478m458N615J7811m0406O2101J0128J1130L6862o4699o5336p446j2265
3220D38515N6959k8040J0224K2603K000p9941L748M9165o937n1370k1097L2991
3208D28820Q011l0738K9340L4826p7919L5696J8871L0361k2619n7973K4939K9898
3196D51513O60k9162p068L6703m0942L042m574J5287m7490j864r38K0461K0937
3183D16565j4406j3896l7044N2872j1579q968k3514P869m4582L2628q380j6608
$$ y = [731067, 721374, 677757, 726944, 739519, 687453, 734471, 769191, 717207, 689252, 679650, 690243, 668276, 648066, 667606, 641877, 634343, 661198, 661682, 624134, 618467, 629713, 651665, 613248, 555930, 548471, 542667, 597380, 604666, 622626, 634313, 543768, 560375, 525686, 551627, 505507, 489478, 485020, 490635, 508446, 468040, 530141, 540269, 551399, 588261, 523562, 458226, 450780, 438515, 495474, 467434, 477658, 500261, 502261, 422320, 426068, 475233, 468296, 416926, 395829, 428820, 436831, 406093, 435433, 470259, 392340, 428036, 446907, 477268, 454649, 396676, 421615, 451513, 452173, 423011, 415943, 452646, 411704, 414746, 410172, 425459, 377969, 376105, 375167, 395628, 416565, 402159, 388263, 351219, 404091, 392512, 383544, 360030, 367899, 323317, 355945, 347565, 330957]
3171C30957k2371L7600N1582l6458L3740K230J5119o0176n8890L5107k5748J980
3159C04672j3211j8010k6777M5743J3814l930M2432K1320K5871Q12L9595l8210
3147C94121m3203L2229l6510J3277O5023M613j4158M2339l2684K8852N8881m3660
3135D69120j1322l4539o911p997M6008m484p6150k9141O6526J16015k2543j9732
3123D84850m1146J2012j246n0928N3398L8431N761L079P899L5415L5710k7521
3111E55714j0795J226j8383k7658l0580k1735l5088N6480j7410L459J2309l8503
3099D29036k9324q85j7326p8254Q7018J040J4121l468l0769o982n4262n178N6047
3086C60814j4305m6305N6877M2932J4390l448m7146n000j1667M0946l4883K268
$$ y = [330957, 308586, 346186, 397768, 361310, 395050, 397280, 412399, 352223, 293333, 328440, 302692, 304672, 291461, 273451, 246674, 292417, 306231, 302301, 344733, 366053, 391924, 392736, 432331, 394121, 350918, 383147, 346637, 359914, 424937, 429550, 415392, 457731, 425047, 453899, 512780, 469120, 457798, 423259, 416348, 408351, 454359, 449875, 373725, 344584, 411110, 527125, 504582, 484850, 443704, 455716, 454470, 403542, 456940, 495371, 501132, 504211, 512110, 547525, 583235, 555714, 544919, 546145, 527762, 500104, 469524, 447789, 412701, 469181, 451771, 455230, 467539, 429036, 399712, 398827, 381501, 303247, 390265, 391305, 405426, 401958, 371189, 364207, 309945, 304767, 360814, 346509, 300204, 357081, 400013, 414403, 410955, 363809, 358809, 347142, 388088, 353205, 355473]
3074C55473k6472m6802L5735J3605j6176j8535n703n629N1870r035l5797n8167
3062B34367K9244K2729n912k9905m501k9312m4927K950p321j864l4972L2235k1444
3049A41367K3345K9062j1127r571J0100P05j63n3328q3765L2866P442K3683K3237
3036A33853J3275M1613j0680k8072l5441N0377j3259k0846J0140J226k8197N072
3024A19061q744j0949K2660k7796l917k5921K2021O7121j8212m3706J7625J0824
3012A20067l4354J1610J3041m1169L508O3417o6875n7709N6778m0039K8094J171
3000E7540j8225K1666J8524K7128p7908j0778M2510l4756M2847m4698j1685O4343
2988G6508k0729L1985N088j5477l5401l4246M2253O9585l2169j0129K1727n7154
$$ y = [355473, 329001, 282199, 317934, 331539, 315363, 296828, 291125, 285496, 337366, 328331, 292534, 234367, 263611, 286340, 280428, 250523, 246022, 216710, 171783, 174733, 167412, 165548, 130576, 162811, 141367, 164712, 193774, 182647, 173076, 183176, 183881, 183718, 130390, 46625, 79491, 86933, 110616, 133853, 147128, 188741, 178061, 149989, 114548, 164925, 151666, 130820, 140960, 142186, 113989, 119061, 110317, 99368, 122028, 94232, 90315, 64394, 86415, 153536, 135324, 91618, 109243, 120067, 85713, 97323, 110364, 69195, 72703, 136120, 69245, 11536, 68314, 28275, 56369, 57540, 39315, 60981, 79505, 106633, 28725, 17947, 60457, 25701, 68548, 23850, 12165, 76508, 55779, 87764, 92852, 77375, 41974, 7728, 49981, 119566, 87397, 77268, 98995, 41841]
2976D1841m546O02P3851K0646J1132k2258k7976k9364q2287J5008P1469k771j8568
2963D6779k4419M6586J0913m1462m2885j4116L823P8462m801K856m1154L8507
2951E9089L050j1015n534k463J1256l3827l081K9297m586L21K1845N396P705N916
2937H3369k6191K7331j9014j6692l1689K7330L0013m9464L1608m9263K3839k2126
2925I051K2498L4716m185k2695J3568k4422M7648q286l0205l0909O892o795L3830
2912D0706j1623L827P818j8446j196l2612m263K9816K4739k4979L0568L474l7699
2899A0130J0169o8676O8898N966l1041n5063O2938M3183k829n2622m6505j5146
2887g0598L9355R0200j7211j41k2281N1871j0150q0088l0741J0286J8798N398
$$ y = [41841, 37295, 37897, 111748, 132394, 143526, 121268, 93292, 63928, -18359, -3351, 68118, 65347, 46779, 22360, 68946, 79859, 38397, -4488, -18604, -14781, 63681, 58880, 61736, 20582, 59089, 62139, 51124, 45590, 43127, 54383, 20556, 17475, 46772, 42186, 42507, 64352, 69748, 77453, 83369, 57178, 84509, 65495, 48803, 17114, 44444, 74457, 24993, 56601, 7338, 31177, 9051, 31549, 66265, 62080, 39385, 52953, 28531, 76179, 67893, 37688, 6779, 13671, 6876, 40706, 29083, 32910, 40728, 22282, 21086, -11526, -15789, 14027, 38766, 13787, 44355, 47829, 10130, 20299, -48377, 20521, 26487, -4554, -59617, 3321, 46504, 43675, -8947, -55452, -70598, -31243, 58957, 41746, 41605, 19324, 71195, 61045, -19043, -49784, -39498, -20700, -15302]
2875a5302N869Q054M3519r212K0516k6109J5883l1433l7428M6235j1860J6763
2863B5495K2480M090k8596n4057K5704Q189o0054M0592k4782m569N7288R208q8918
2850f7930Q7317L4527o2668j8889j6833j0019O4570K3063K3201J0447L1287m4690
2838E3383k3568j2124j2243j7279j3319J1248K917L5510k7351j3373M8422p968
2826B4255P113n3879J9323K0743o3499K4081L7436l4379p0570l7998M9866J5474
2814f2034K8318j6280J8183L1177k744j3290r6297k7708M7468K8260K3826k23
2802d1344o562J6678j238M9640l5721m8094n2331R2070n2391k7705R2732J1458
2790b808p5640k6183J0566O6405L6798j2365l060L277r293n716L7081n712o479
$$ y = [-15302, -9433, -1379, 42140, 32928, 53444, 27335, 43218, 11785, -25643, 20592, 8732, 25495, 47975, 52065, 23469, -30588, -4884, 3305, -56749, -16157, -40939, -45508, 11780, 20988, -67930, 19387, 53914, -8754, -27643, -44476, -54495, 10075, 33138, 56339, 66786, 98073, 53383, 29815, 17691, 5448, -11831, -25150, -13902, -10985, 24525, -2826, -16199, 32223, 24255, 31368, -22511, -3188, 17555, -45944, -21863, 15573, -18806, -89376, -127374, -77508, -62034, -33716, -49996, -31813, -636, -3380, -16670, -112967, -140675, -93207, -64947, -41121, -41344, -47906, -31228, -32466, 17174, -18547, -66641, -118972, -26902, -79293, -106998, -14266, -2808, -78448, -104631, -94065, -27660, 9138, -3227, -6287, -3010, -12303, -18019, 19062, 13350, 6871]
2777F871j6777K8605J6563n8894r664L8094m8195J820q301K0339N4667K1071k6316
2764A9883l0557J7592K3292Q393k4153n3379M768J0097k545J8723L0584k2015
2752F83R301m5975m744O4437k2297n0424K6393K9370l946J8641j9096k4638Q67
2739b1428L0594K4230r9883m311k1778o042N6029P552P006M870k3508k1770M4949
2726b3490P4850O2163p1530k9988o726j1391k8737M682L6867R757o7150M699q150
2713e4144o491k3250J9368K1442K7749k7784l3008N6621K8026O72k5226q718p644
2700c2387m667K2914N0481j4655j03232P9181P7013j5973k0978J03j8985j0388
2688H427M0063r484q8637q470L7642k7548j4960p110k4370L9082Q2350M8358o382
$$ y = [6871, -9906, 18699, 35262, -23632, -33296, 4798, -43397, -41577, -49878, -29539, 25128, 46199, 19883, -10674, 6918, 30210, 38603, 14450, -38929, -34161, -24064, -26609, -7886, 22698, 683, 9984, -35991, -40735, 23702, 1405, -49019, -22626, 6744, 2798, 21439, 2343, -22295, -21428, 9166, 33396, -66487, -70798, -92576, -98618, -42589, -35037, -28031, -23161, -46669, -68439, -23490, 51360, 113523, 41993, 12005, 5279, -6112, -34849, -30167, 6700, 16457, -50693, -45994, -54144, -60635, -83885, -64517, -43075, -15326, -43110, -76118, -19497, 8529, 9201, -16025, -24743, -32387, -37054, -14140, 36341, 21686, -81546, -2365, 74648, 58675, 37697, 37800, 18815, 8427, 48490, 39006, -49631, -58101, -20459, -48007, -62967, -70077, -94447, -55365, 26985, 75343, 68961]
2675F8961j6337p729l5580k1900K5325m8410m4666K9312L1305N0647o0957M5604
2663A5575O3964j03618m2829M2905m8642J213l8520n416J05335L1665k5826k917
2651g111m355p9084R309O4670N944L1173K8691M701q420m1151l5165l5542n725
2638g2065J1841K4559k8084n1952J6509L210K9530J02575r4768n7693R7846j5512
2626c4004J5916p9542L3121Q9441L2749K6684k0147k1863l5467M476M4726o7884
2614a1794P880M3972K9520p4954m0829M8463J2123k5218M7082k1305J0193k6242
2602a109l1175p428J0629R281q837k9880j9890J8533O608O5109K8126K418l8791
2589C594m1427j2906P9993M5301m3213R706O3339K8045n3110o103J24109J6680
$$ y = [68961, 52624, 44895, 9315, -12585, 12740, -35670, -80336, -51024, -19719, 30928, -30029, 15575, 79539, -24079, -66908, -24003, -72645, -71432, -109952, -115368, -10033, 21632, -4194, -7111, -11466, -90550, -81241, -16571, -10627, 20546, 49237, 53938, 45518, 4367, -30798, -66340, -72065, -60224, -35665, -63749, -115701, -99192, -95982, -66452, 36123, -58645, -116338, -18492, -34004, -18088, -97630, -64509, 24932, 57681, 84365, 64218, 42355, 6888, 11364, 56090, -11794, -3914, 40058, 69578, -5376, -46205, 2258, 14381, -10837, 36245, 14940, 25133, -1109, -32284, -39712, -29083, -19802, -28639, -58519, -78409, -59876, -53268, 11841, 39967, 42385, 3594, -37833, -50739, 29254, 74555, 31342, 41048, 104387, 132432, 79322, 73219, 197328, 214008]
2577B14008o3358K2498L1594r9018n4571k2022M2656p3122n9893M4003N415R92
2565a0818O1062j2648K9857o3934m9597K0441M2955J1126l5038O3745l3121J7620
2553D1650J6470j1789M818l0808M0826k1287j05400J8901Q7697o8050M0138L0447
2541D3613j3163M0726J6012o4123l4016N4609K0512R011p439q7519L1228K1074
2529C0525o2779J7522Q610J5050m5844L5547k367P900q739P542M7766J2336K9539
2516I2608n0185k1835l9663o9634K3804R610Q502o3288L0055K8481J5660P3362
2504C7477q6915J2480K5705L891L7645k181j8876m0417M4754l4934K4735j4983
2492a1619r15m199J2830J7898L6287j666k1520o5437k8619O1593j6973M0683k7050
$$ y = [214008, 150650, 173148, 204742, 105724, 51153, 29131, 71787, -1335, -61228, -17225, -11810, -10818, 50244, 37596, 67453, 3519, -46078, -25637, 17318, 28444, -6594, 57151, 24030, 41650, 58120, 46331, 51149, 20341, 61167, 39880, -65520, -46619, 41078, -26972, 13166, 43613, 30450, 71176, 87188, 23065, -10951, 43658, 64170, 73181, 65742, -21777, 9451, 30525, -32254, -14732, -6122, 8928, -36916, -1369, -3736, 4164, -4575, 2967, 50733, 63069, 92608, 42423, 20588, -19075, -88709, -64905, -55295, -46793, -110081, -80026, -51545, -35885, 37477, -49438, -36958, -11253, -7362, 30283, 28102, 9226, -31191, 13563, -21371, 3364, -11619, -12534, -16733, -3903, 13995, 50282, 48616, 27096, -38341, -66960, -5367, -22340, 18343, -8707]
2479h707k0554k7028P7794K5829j9596l2604M3034K5612k9892K5297q7524K4862
2467c477q728n6710J6290J1413P8089n666j4616l5715l3817m2684K4639R7914
2455B6932K7705k8182n888K6369L4902j6535o4977m309N1805M148j8437L2705
2443F6238l6591N0252L3396k150n2542k1862k1088l5045M263J9254K7173k0766
2431A0532P7453J7828P179K0768o4535k1068R9333N8546q4801J3272l2772n134
2419I6601k1993j3727Q9821n4476j9937n0781j3186L6026j5945N9356N0154J9728
2407A61641j5173l0880k25O0133l1734q5625O73Q6924J0014j1169o38L3541m3840
2394A33642n1750K1652l1027M2478O1603M008K9019j5261m5406J12367L3330o345
$$ y = [-8707, -29261, -56289, 21505, 47334, 27738, -4866, 38168, 63780, 33888, 59185, -28339, -3477, -12205, -68915, -52625, -41212, 36877, 31211, 16595, -19120, -52937, -95621, -70982, 26932, 54637, 26455, 20567, 46936, 81838, 65303, 326, -3983, 47822, 51970, 33533, 66238, 29647, 79899, 113295, 111145, 58603, 36741, 15653, -19392, -15129, 4125, 31298, 10532, 87985, 105813, 112992, 133760, 69225, 48157, 147490, 206036, 121235, 134507, 101735, 96601, 74608, 60881, 150702, 96226, 76289, 25508, 12322, 48348, 32403, 91759, 141913, 161641, 146468, 115588, 115363, 175496, 143762, 58137, 58810, 145734, 155748, 144579, 143941, 177482, 133642, 81892, 103544, 72517, 114995, 176598, 180606, 209625, 194364, 148958, 261325, 294655, 288310]
2382B88310m9539Q719O44k8141k7147L7472M8551Q25K5543N4283o8976J5434J08409
2369D14387K8568k0405k5755o069m4987L2776P4203n781J28K0034M4015R378J3041
2356E33533R071l3O8017N958N4887K0565P1001K5029m9287m0229L2733Q4887L7455
2343H53587m9613J0946O4166J7964J09582N4770K8291N1498J20534J04262Q8194
2332A454181R6536J17341K19543L36759L63107L43429M02743L43281K73370K42721
2322D193011K66171L16978M40585N80349Q23524J205527K017866L427676N600986
2313A8872673P982085Q581646M836840J670871n54109l102323m735310n500740
2305B8051633m750634m135773l477288l111479k671538k078478j413152q66055
$$ y = [288310, 238771, 247490, 248134, 219993, 192846, 230318, 278869, 279694, 305237, 359520, 290544, 305978, 414387, 442955, 422550, 396795, 390726, 345739, 378515, 452718, 446937, 447065, 467099, 511114, 520492, 533533, 542604, 542571, 610588, 616546, 671433, 691998, 762999, 788028, 738741, 698512, 731245, 816132, 853587, 803974, 814920, 879086, 897050, 1006632, 1061402, 1089693, 1141191, 1261725, 1365987, 1454181, 1550717, 1668058, 1887601, 2224360, 2587467, 2930896, 3333639, 3676920, 3950290, 4193011, 4459182, 4776160, 5216745, 5797094, 6620618, 7826145, 9844011, 13271687, 18872673, 26854758, 35436404, 40273244, 41944115, 41390006, 38287683, 33552373, 28051633, 23300999, 19165226, 15687938, 12576459, 9904921, 7826443, 6413291, 5547236]
2297E547236m97672n12672l94670l45861l43192l30466k55903k08077k67983j71125
2287B219615j60429k03601j12413j38320p4806n7880n6344n8287q5815o2242r3446
2276A116032k8347m8989m2647L417m1184j00228j3610Q229j6304k8947j31865
2265F75557n130m5480l2855K9972M6557Q997j16754o6431l8515M4499r968o7571
2253D22878k0718J05712k405n8816J9226j5071o0494P588K040L8174n106j9928
2241D13080k4812o2749p347M7832j4224Q497l9721r5385O8918R885j5146j1033
2229B77795M525m9965j4114n3287k4643K2072l6744R497O6780n972m5038j2923
2217A37983N6977L6535N4302p8830l1316K2126m4750J0147n2825J4402K7424O0074
$$ y = [5547236, 5049564, 4536892, 4142222, 3796361, 3453169, 3122703, 2866800, 2658723, 2390740, 2219615, 2059186, 1855585, 1743172, 1604852, 1530046, 1472166, 1415822, 1357535, 1271720, 1209478, 1116032, 1087685, 1038696, 996049, 999466, 958282, 858054, 844444, 852673, 836369, 807422, 675557, 670427, 624947, 592092, 622064, 668621, 677618, 560864, 494433, 455918, 500417, 490449, 422878, 402160, 507872, 505467, 446651, 465877, 450806, 390312, 397900, 399940, 438114, 433008, 413080, 388268, 325519, 318172, 366004, 351780, 360277, 320556, 225171, 294089, 303974, 288828, 277795, 282320, 232355, 218241, 164954, 140311, 162383, 125639, 135136, 201916, 195944, 150906, 137983, 194960, 231495, 285797, 206967, 175651, 197777, 153027, 163174, 110349, 124751, 152175, 212249]
2205B12249o6566K9771j4993n8238o413N6913l72R687p0610k819M8134o43m1825
2192I4275J6078k5274l6296M2321n0868L8898j3047p376l8713J9296l5691L5243
2180C8846K8515J5068K5659o7340n981L6357P346P667l4297k1287k2644n600M1438
2167D3747K57K7906j0519n764j0383j5786N1713j3608p6919M2979n2284l6016
2155e4677O9944N2102l3999j1431J3966L7697K0293k4651o924p2929N573M6609
2143D1573M3547n0376l2035L5199L9766O626p676q7189J9966O637K0803l8789
2131a948K7418o543j1134K0352q5104M757J2172j6608L9791J8311j4709l2569
2119d5814K5780L0789l9655M1161K767P0789n8501l1249k4758K210L9138O0134
$$ y = [212249, 145683, 175454, 160461, 102223, 95810, 152723, 152351, 162038, 91428, 88609, 136743, 136100, 94275, 110353, 85079, 48783, 91104, 40236, 79134, 66087, 58711, 19998, 39294, 3603, 38846, 67361, 82429, 108088, 40748, 34767, 71124, 78470, 86137, 51840, 30553, 7909, 2309, 43747, 44004, 71910, 61391, 55627, 45244, 29458, 81171, 67563, -9356, 33623, -18661, -54677, 15267, 67369, 33370, 21939, 35905, 73602, 93895, 69244, 62320, -10609, -5036, 41573, 85120, 34744, 2709, 37908, 77674, 84300, 76624, -10565, 9401, 16038, 36841, -1948, 25470, 18927, 7793, 28145, -56959, -52202, -40030, -56638, -16847, 1464, -13245, -45814, -20034, 10755, -28900, 12261, 15028, 85817, 27316, -3933, -28691, -26481, 12657, 72791]
2107G2791k4967n1351J1429J7632O3404m9443k8047j9966o9761L835l407M0107
2095c7744K2328j9978L6986j3979L4388k2251l5734R633p072K3310j5521q844
2083c4478M4519n5948J4481R0953K5129k4828p0486k0089q9068J1793O3733J3696
2071c0593p0340l0730O7117j4651m2907k0631O1230O1506Q713n171J429L7098
2059B2070n9291K0627J3815k8078j9238L6657Q0082J9889N962p5362k7152j1260
2047b1279p418O3751J08779o6128J8313N6175n435R754N665M3472l9222l4242
2035A32185n4320k1468k7561j6458k9648P4069n5596l2928Q940o700O9902l9369
2023A048j8406J2944O9591N314k8769j6609K3640l4880m8119L2628m3457j7019
$$ y = [72791, 47824, -3527, 7902, 25534, 88938, 39495, 11448, -8518, -78279, -74444, -77851, -37744, -15416, -35394, 1592, -12387, 22001, -250, -35984, -26351, -33423, -10113, -25634, -34478, 10041, -45907, -31426, 59527, 84656, 59828, -10658, -30747, -119815, -108022, -44289, -30593, -100933, -131663, -64546, -79197, -122104, -142735, -81505, -19999, -11286, -16457, -15028, 22070, -37221, -16594, -2779, -30857, -50095, -13438, 66644, 86533, 92495, 17133, -10019, -21279, -28697, 35054, 143833, 77705, 96018, 152193, 146758, 156512, 162177, 205649, 166427, 132185, 77865, 56397, 28836, 12378, -17270, 56799, 1203, -31725, -22785, -29485, 40417, 1048, -17358, -4414, 65177, 70491, 41722, 25113, 48753, 13873, -34246, -1618, -45075, -62094]
2011f2094N4994K122j4030J5686L6552l1175k9736j8525P2065n3490L236K1447
1999b948K6268K736j1332m4006o324k0864m6623P8117N714N9266J6268n8552m8645
1986e0925j6624O5184P584k2073L0953K691k6050k0003k3015p911P994L3538J1612
1973g045j2273j3942j3505M990K645J9702M1061j9932l9909o2k4086O4800M1987
1960D4431k4706j5813K3880j0769l7370J6672N9811K0845l3553o6108K1249J0144
1948H713j6525K4404P0296n4925k5389J6274j8899J0099j0052o7005l1230M0138
1936e4101P9322K9476j0232l3959m8064K0079M517j0495j6169k482L7082m8184
1924e3210L9720m0355j1803L1817n4996K5008P1785M5194J5445L3895r2404K660
$$ y = [-62094, -7100, -4978, -19008, -3322, 33230, 2055, -27681, -46206, 25859, -27631, -24395, -2948, 23320, 26056, 14724, -29282, -35606, -56470, -103093, -24976, -19262, 40004, 56272, -2280, -50925, -67549, -2365, 5219, -16854, 14099, 16790, -9260, -29263, -52278, -60189, -52195, -18657, -7045, -19318, -33260, -46765, -41775, -39130, -19428, 21633, 1701, -38208, -38270, -62356, 2444, 44431, 19725, 3912, 27792, 17023, -20347, -3675, 56136, 76981, 43428, -22680, -1431, 8713, -7812, 16592, 86888, 31963, 6574, 22848, 3949, 14048, 3996, -63009, -94239, -54101, 25221, 54697, 44465, 10506, -37558, -17479, -12962, -23457, -39626, -42108, -5026, -53210, -13490, -53845, -65648, -33831, -88827, -63819, 7966, 53160, 68605, 102500, 10096, 12756]
1912A2756j5935R550k5269m8509M533Q795M475L4562k8835K9008M371k2591O5428
1899C2339J7384J180l1734o4152M5037N2986l084q5656n9235P7413O568K7930
1887A6976m8055J9157N2985o2955K8112k3177j9137l7405j5556M2043k0795O6112
1875a695K1322n198j1291K3000j4183K3473k848n8640o9505L5169J4484M6761
1863H49L77l4073j1150N3646J3054p5962l1655N7113j4544k3260Q4957q8592l3
1850f9273K3447J6769k0116Q2105J909m9271o1569J4658M8987L0551o375l6668
1838b4846J3947j2180n0606L5707l3136L0917M1887m2897l3815p013N9364J4956
1826g715k9604M3722k7741l7259P966K259k2647L2300L8076k6756L5593o0418
$$ y = [12756, -3179, 6371, -18898, -67407, -62874, -54079, -49604, -15042, -43877, -14869, -10498, -33089, 32339, 49723, 50903, 19169, -44983, 54, 53040, 49956, -35700, -94935, -17522, -10954, 16976, -31079, -11922, 41063, -21892, 6220, -16957, -36094, -73499, -89055, -47012, -67807, -1695, 19627, 14429, 3138, 26138, 11955, 35428, 32580, -26060, -95565, -60396, -45912, 849, 1226, -32847, -43997, 9649, 22703, -53259, -84914, -27801, -42345, -65605, 19352, -69240, -69273, -45826, -29057, -49173, 32932, 34841, -14430, -75999, -61341, -12354, 18197, 11822, -24846, -10899, -23079, -73685, -37978, -71114, -40197, 1690, -41207, -75022, -82035, -22671, -7715, -37319, 6403, -21338, -58597, -50631, -48372, -71019, -38719, -643, -27399, 8194, -52224]
1814e2224p889n856O4506J1363j9559o8100m0678M7011L7133K0693K763k7163
1802c8000m0033k325K4430N846N5218r247n3675K2141J2251k5812M0133m305k4189
1789c7567K5634J8045m0801k5082l887l9567K022L0657N97j9157M2137j8456K8602
1776c6823O14j3130K4535L3164k22M224P66j1561k3708m3556K0656L3302O085
1763e654p7842l5574Q6377N2245q447J2582j6262M6698l7693k6710N154J6844
1751A1718L5365m1636L4509q4644k9296J8887k446L4124L6840l3359Q765J3887
1739B714m3586l1526J0024j1656j7086O2922O9059K1252p5497J4854j8498l3696
1727e0720M6305k080m0792P4032K668l178K1310O418m7781N8997r1108m7061K3484
$$ y = [-52224, -60113, -65969, -1463, 9900, -9659, -77759, -118437, -71426, -34293, -13600, -10837, -38000, -78033, -80358, -55928, -50082, 5136, -4111, -57786, -35645, -23394, -49206, -9073, -13378, -37567, -11933, 6112, -34689, -59771, -63658, -103225, -101203, -70546, -69949, -89106, -46969, -65425, -36823, -36209, -49339, -24804, 8360, 8138, 12362, 13128, 1567, -22141, -65697, -45041, -11739, -5654, -83496, -119070, -32693, 19552, 11105, 23687, 7425, 54123, 16430, -10280, -5126, 11718, 47083, 5447, 39956, -44688, -73984, -55097, -57543, -23419, 13421, -19938, -11173, 2714, -40872, -72398, -62374, -74030, -91116, -28194, 40865, 62117, -13380, 1474, -17024, -50720, -4415, -6495, -47287, 26745, 29413, 26235, 47545, 53963, 6182, 65179, -25929, -72990, -49506]
1714d9506l3512M5663J0279k0664k7882k6729m4743O5418J2246L5156m4743j0750
1702h9767O3566n0393O7128L3703k6511J0982m6753j8844N7941M810j4160M7948
1690C9650n5048j1978m3196L7173N3252n8351o9692O3880M0119l8735k013J0213
1678c4726K1099J1451o0889K2841l1801K0372J2223J5035O806m5118L6448j7373
1666d3632M8255q3513m0196L9609o426O0929P861k3152k5589p580O632J3747L9525
1653a3530O050k0192K0801J8931n9273l2176M1462N569l2669K9204P832O063K9522
1640G594p1932o5114M2666j4614N0382N8905j3245J6888o0631J0092k3482J7951
1628d4540l7124K8558N1008l9377M9185O597j0092n211j9125m1414J4051m5893
$$ y = [-49506, -83018, -37355, -27076, -47740, -75622, -102351, -147094, -81676, -69430, -34274, -79017, -89767, -26201, -76594, -9466, 24237, -2274, 8708, -38045, -56889, 1052, 5862, -8298, 39650, -15398, -27376, -70572, -33399, 19853, -38498, -108190, -44310, -4191, -42926, -44939, -34726, -13627, -2176, -63065, -40224, -72025, -51653, -39430, -24395, -17589, -62707, -26259, -43632, 4623, -78890, -119086, -79477, -85903, -24974, -17113, -40265, -65854, -73434, -66802, -53055, -13530, -7480, -27672, -6871, 12060, -47213, -79389, -37927, -32358, -65027, -35823, -27991, -21928, 7594, -64338, -129452, -86786, -101400, -51018, 7887, -5358, 11530, -49101, -39009, -62491, -44540, -81664, -53106, -2098, -41475, 7710, 14307, 4215, -996, -20121, -61535, -47484, -93377]
1616i3377L5920L0866p2261O54o538j4979N9739J4007M2959r525l8364l328K8183
1603b6044M4199m5020p4918K5780O4040J9053n0480M7826q265K4333K2500p466
1591C5538l3814J6941M3631n4280n6323n353K3896k2623K1486L5376O7916l9057
1579C3334p6504N410K6401j5862m5180n32J4857o268j1214J2125P2704Q605j8717
1566h41p3774J6371k3403k7885N2174N1657O5896q5792Q6497o3447j8230M7398
1554B6621K1414o0021k383N7513q8278m1517k125N1555n5689M3843J110J3444
1542c4513J9457j9622M8106l523J0989K1248m8620M151K8583n9808O232O4151
1530C6831K5070r2339k9504N6435r390o6756L7016K4924k916O1358p6401n0666
$$ y = [-93377, -57457, -26591, -98852, -98198, -104736, -119715, -59976, -45969, -3010, -12535, -50899, -54227, -26044, 18155, -26865, -101783, -76003, -11963, 7090, -43390, 4436, -3829, 20504, 43004, 35538, 1724, 18665, 62296, 8016, -48307, -53660, -29764, -52387, -30901, 4475, 72391, 33334, -43170, -37760, -11359, -27221, -72401, -72933, -58076, -64344, -75558, -63433, 9271, 17876, -841, -74615, -58244, -81647, -109532, -57358, -5701, 60195, -25597, 60900, -2547, -20777, 26621, 48035, -11986, -14369, 43144, -45134, -86651, -88776, -37221, -92910, -49067, -47957, -34513, -15056, -34678, 13428, 9905, 20894, 42142, -6478, -2327, 26256, -33552, -27320, 36831, 61901, -30438, -59942, -3507, -12897, -79653, -42637, -17713, -20629, 40729, -35672, -86338]
1518h6338k7378N0605k6608J3872o755O689j4976L9135r831J3736M4187K6680
1506B3018k4881j1782l4338q802M187l4096O3783L826K4571j8141J9722N1911
1494E8978J430n2534n8059k1226J11877K437n2608K3849j0808N0968k2316q3878
1482e1890k3637L9951l0825L712L2K3440O0203l4850m029k6513k2676m032o171
1469g7285L3356P3192K7943p4620M718n0065K3726P2467K135o5567J7940m0993
1457e3053m4948L7630J001J1844N1067N5826p7310K9297k5071l2090L4615N7823
1445D6631l9818n6577N27K0302K9334o9618o694P5947k5910J6793k3756L1529
1433a310K2507l8101n4162M9027N850J9192o4895K8167K4870K7344j3533R385
$$ y = [-86338, -113716, -63111, -89719, -75847, -82602, -75913, -90889, -51754, -61585, -47849, -3662, 23018, -1863, -13645, -47983, -56785, -52598, -86694, -22911, -19085, 5486, -12655, 7067, 58978, 60408, 7874, -50185, -71411, 40466, 42903, -9705, 14144, 3336, 54304, 31988, -51890, -75527, -35576, -66401, -62689, -62657, -39217, 20986, -13864, -17893, -44406, -67082, -71114, -77285, -43929, 29263, 57206, -17414, -12696, -62761, -39035, 33432, 35567, -30000, -12060, -53053, -98001, -60371, -59370, -47526, 3541, 59367, -17943, 11354, -13717, -45807, -11192, 46631, 6813, -49764, -49237, -28935, 399, -69219, -75913, 34, -25876, -9083, -32839, -1310, 21197, -16904, -71066, -22039, -16189, 3003, -61892, -33725, -8855, 18489, 4956, 14341]
1421A4341m2642n651J940J9640K0349m6447K3040M2860j5592l0619Q920j898p466
1408a9225n9176M9678j3588j4884O5525K5333p6135K6075k8255L1465M3009k8609
1396A213K1346J4575N314o7709j6044N5439o7564k2181r508K1544k5646L0070
1384e9151J2243j0523J9171l7054K8485J4986K7840L0067J1330j03084L6104J33928
1372A04342n5552p0352L2932j7615q7074M1805R118J1065L4536k3334n2308j8172
1360i0609P0860P2293o6173K6528J4585o7399m5599K6999k66Q1964O9770K9964
1348A22917k6246l8354j3285n9866l4402j5803J3499P1814J0303m2859m2188j0341
1336f4811l1400L6517N2753k6646J9518J9857L9259o7302J334o19l6493Q420N0159
$$ y = [14341, -28301, -33952, -32012, -12372, 7977, -38470, -15430, 27430, 11838, -18781, -9861, -11759, -19225, -78401, -28723, -42311, -57195, 8330, 33663, -42472, -16397, -44652, -13187, 29822, 1213, 22559, 37134, 42448, -25261, -41305, 14134, -53430, -75611, -85119, -63575, -89221, -59151, -46908, -57431, -38260, -75314, -46829, -31843, -4003, 26064, 37394, -65690, -29586, 104342, 48790, -21562, 11370, -6245, -93319, -51514, -42396, -31331, 3205, -20129, -72437, -90609, -19749, 52544, -13629, 12899, 27484, -39915, -85514, -58515, -58781, 23183, 92953, 122917, 96671, 58317, 45032, -14834, -49236, -65039, -51540, 20274, 30577, -12282, -54470, -64811, -96211, -59694, -6941, -33587, -14069, 5788, 45047, -22255, -20921, -21540, -58033, -49613, 546]
1323E46N193K0282n6941k9311O0931K7420l463k0574l5308p2923J5224J13961
1311B5037L6710L234P471q3058m3166j3729N3916J994o0570N0450O8210l2197
1299A4302K7613k3877n9048Q958l7738Q8177N301p780m0112R185N86L9400j865
1286B3102p119K4323m5121q32K5317K8233k3369m2910J9199m179j4372K8081J2403
1273B2756q7157m2411O7569O349m190l7829j519Q035k991M0618L4522K1000M655
1260B9407m3847Q552l2466R3333k2657l3134p173l5992L545j0629J0383O1625
1248B0947R809q9343j0132P5251q11m751N2926k5812l9330l6784j9066K4719r305
1235e1682n763Q41L6150M733k3950O0771J0765J0003k7493l2733k4192l7273O4044
$$ y = [546, 5739, 26021, -30920, -60231, 700, 28120, 24657, 4083, -31225, -104148, -88924, 25037, 61747, 64981, 72452, -10606, -53772, -67501, -13585, -11591, -72161, -21711, 46499, 14302, 41915, 18038, -41010, -32052, -69790, 18387, 23688, 15908, -24204, -15019, -14433, 24967, 23102, 15983, 40306, -4815, -5647, 19670, 47903, 24534, -18376, 823, -3356, -17728, 10353, 22756, -64401, -106812, -39243, -32894, -37084, -74913, -76432, -68397, -71388, -30770, 3752, 24752, 29407, -14440, -5888, -38354, 54979, 32322, -812, -7985, -43977, -40432, -51061, -40678, 20947, 30756, -58587, -68719, 6532, 5721, 970, 53896, 28084, -11246, -48030, -67096, -42377, -51682, -57445, -56604, -20454, -15721, -39671, 21100, 31865, 41868, 14375, -18358, -42550, -79823, -15779]
1222a5779J2435k0219k1981J9966M7879o1272K4259R4328o7032l4627j2130n742
1210c9915K2537J8258Q1449j4655l5106j749m0203k0938J19459n1130k2295j5168
1198E44o7644K8627K4867j6038Q226j0054N690J2462m564o122J9464m0327J5113
1185b9756L1629k7481l751K8416K940P878k4827J0989m7918k6446O4805L3235
1173A9713M5337j7929n6122M8795m1120l9215K3548P789L6732l0561J5062K5354
1161C7383k0520n0629M6336q261L828J0669L8764j15230M877O8292m3839K362
1149b5968J0338N4355M5153p4782j7252J933k5135M5886j5313j1756n8751J3928
1137e7364P0697J9731P26M055k9113l5054J746N9575J6415o7181N363j8444q61
$$ y = [-15779, -3344, -23563, -45544, -25578, 22301, -38971, -14712, 79616, 12584, -22043, -34173, -39915, -17378, 880, 82329, 67674, 32568, 30819, -9384, -30322, 89137, 38007, 15712, 544, -67100, -38473, -13606, -29644, -21418, -31472, -25782, -13320, -17884, -24006, -4542, -44869, -29756, 1873, -25608, -29359, -943, 1997, 9875, -14952, -3963, -51881, -78327, -13522, 19713, 65050, 47121, -9001, 39794, -1326, -40541, -16993, -9204, 27528, -3033, 12029, 37383, 16863, -33766, 12570, 4309, 8137, 18806, 57570, -57660, -52783, 15509, -28330, -25968, -15630, 38725, 83878, 9096, -8156, -6223, -31358, 14528, -785, -12541, -71292, -57364, 13333, 33064, 33790, 37845, 8732, -26322, -24576, 34999, 51414, -15767, -10404, -28848, -29709]
1124b9709R953l3770m653p963o321j1241l981K1963J04306R585l9699Q383j5634
1111A219J3789l7471J2468j2923l8474o8964R3119L0442L2656j2742m2346J2076
1099a7151O2315L878J4221m2921m0481P1010p0432K6350J4194J7527m9712N642
1087e560M7451m1340j9497K2276l7934l2142p292P5311J5242j2984j8332j0687
1075b5488N2586K4804l726j8348p11l083J8683l3654j1860K1847J9051o762q9496
1062e6157R675k2439M1831J0222o7625M3598k9369N787N944N6999P01j7528J0116
1049h245K2795q1422P809L7319N86j1967M2738L2446n1334N2638k462n5284J8
1036a4365o71J8976M33o9255N9532L4550j3502K5880O628k9300k3835j3107P0832
$$ y = [-29709, -19756, -53526, -58179, -66142, -72463, -83704, -87685, -65722, 38584, 48169, 8470, 16853, 1219, 15008, -22463, -9995, -22918, -61392, -130356, -37237, -6795, 25861, 13119, -29227, -17151, 45164, 49042, 63263, 20342, -20139, 50871, -19561, 6789, 20983, 38510, -11202, -5560, 41891, 551, -18946, 3330, -34604, -66746, -74038, 1273, 16515, 3531, -14801, -25488, 27098, 51902, 48176, 29828, 29117, 26034, 44717, 11063, -797, 21050, 40101, 33339, -56157, -46482, -68921, -27090, -16868, -84493, -40895, -70264, -64477, -58533, -1534, -833, -18361, -8245, 14550, -66872, -59063, -21744, -21158, -33125, 9613, 42059, -9275, 43363, 40901, -14383, -14365, -15036, 3940, 4373, -64882, -5350, 29200, 15698, 41578, 48206, 18906, -4929, -18036, 52796]
1023E2796l2148J0444j1579J7395J6090k5871j8849M9160L062l6891n340K8753
1011D7022o831k7902m0668j5437Q6617L1449l1001M9059j3790j08667M2626L1604
999D4081m8928m4853M4559J6740J8238P716j9576k0744j4516M6767J1803l4101
987G186o5870N8339K0100k1183l6500R4780K8897k3408J3498l5102k3347J0524
975B7914k9402j7560J1162l2164k5844L815O2007j3993P1397K7755M102l3175
963E6014k2134R159M7530k4663r697M963l0715l4838K1220J4052k5241q784L2423
950B9289j8779O728j1879o728p614n6472L9214K0976j5236j880M4627l546o829
937A1871K9604m003j3559J3449L8144m2059j8952P0789k1202j18464k1168J8932
$$ y = [52796, 20648, 31092, 19513, 36908, 52998, 27127, 8278, 57438, 60500, 23609, 18269, 47022, 40191, 12289, -28379, -43816, 42801, 74250, 43249, 92308, 78518, -30149, 12477, 44081, -4847, -49700, -5141, 11599, 29837, 37553, 17977, -2767, -17283, 29484, 41287, 7186, -58684, -345, 19755, -1428, -37928, 56852, 85749, 62341, 75839, 40737, 17390, 27914, -1488, -19048, -7886, -40050, -65894, -62079, -72, -14065, 57332, 85087, 89189, 56014, 33880, 43039, 90569, 65906, 56209, 61172, 30457, -4381, 16839, 30891, 5650, -3134, 29289, 10510, 17238, 5359, -1369, -8983, -65455, -26241, -5265, -20501, -22381, 22246, 18700, 11871, 41475, 37472, 23913, 37362, 75506, 33447, 14495, 85284, 64082, -54382, -75550, -56618]
925e6618K4633m5960K6023k6228j9635Q0982O8146o8782l1419l333L2960j9361
913c8592J3299N4835J9782o883o0787l0509j1232J6289k3632R3684M362j02369
901g1753K6021j6126j6641M6836n3240O4326K3701O645J4765m2871l4314Q4833
889C2182P2951K8457j02973l0163K1657M7358l677l9273o794K5694q145K0649
877E7923k5084K575M540l3035K387K9398M146l8794j7959k5833p920J88O6232
864A8764J4349k8774o8955m1393J7804L9490L4049J5665j0013P0562R524m0415
852C0657M2168o499l2633o438j6330L0747n0773n9793N9011k0318J3823k5380
840d1758R453P6781j3582J9630m8543M065L8219l9824j3211n3096N5948O1222
$$ y = [-56618, -31985, -77945, -51922, -78150, -97785, -16803, 51343, -17439, -48858, -52191, -19231, -38592, -25293, 29542, 49324, 42441, -18346, -48855, -60087, -43798, -67430, 26254, 30616, -71753, -45732, -61858, -78499, -31663, -84903, -20577, 3124, 9769, 24534, -18337, -52651, 32182, 105133, 133590, 30617, 454, 22111, 69469, 65792, 26519, 19725, 45419, 37274, 57923, 32839, 35414, 39954, 6919, 9306, 38704, 42850, 4056, -13903, -39736, -47656, -47468, 18764, 33113, 4339, -64616, -106009, -88205, -48715, -14666, 999, -9014, 61548, 71072, 30657, 72825, 66326, 33693, 27255, 10925, 41672, -9101, -68894, -9883, -30201, -16378, -41758, -32305, 44476, 30894, 50524, 1981, 6046, 44265, 4441, -8770, -61866, -5918, 55304]
828E5304j298k6494k5517L7597J6219o7134n1812N2873j4922R3327q0402k292
816a4551K3579L2238k3713o8472L1859j2527M5984m2116j1568M1166J8165j3909
804F135o4728K0839Q3709l4751n4046O8916J629n397K6595p7182L5148J1751J8526
791C7144j8657k6328J4633n1765L9160M4523o0187j0748L0917l608L408k361j16
778c985q250m5192L0135J3602k6170j5372P0967O8894j4332n9458n3737R241K9460
765d197K5713k0896J3616K8895J439n1463r807n973J6400K7305m3585K9165M2094
752D8706K1593p1163K6130N2597p346j8048p3706l5746M2536M1213L1377l1601
740B6542m8989N0046J0579m7683n938K5712R702m8387k797P313L6271j7601j3620
$$ y = [55304, 54006, 27512, 1995, 39592, 55811, -11323, -63135, -10262, -25184, 68143, -12259, -14551, 9028, 41266, 17553, -50919, -19060, -31587, 14397, -27719, -39287, 1879, 20044, 6135, -58593, -37754, 45955, 11204, -42842, 26074, 27703, 22306, 48901, -28281, 6867, 18618, 37144, 18487, -7841, 6792, -44973, -5813, 38710, -21477, -32225, -1308, -4916, -1508, -3869, -3985, -12235, -57427, -27292, -13690, -39860, -55232, 15735, 84629, 70297, 10839, -42898, -33657, -4197, 21516, 620, 14236, 43131, 44570, -6893, -16700, -22673, -6273, 21032, -22553, 6612, 48706, 70299, -864, 25266, 77863, 70517, 52469, -21237, -56983, -14447, 26766, 58143, 26542, -22447, 27599, 38178, -9505, -15443, 10269, 19971, -28416, -31213, -23900, 12371, -5230, -18850]
727a8850Q0947m9047j0007J1312Q7714o0742j6061J6220j2703n1012j2803k2158
715e7190N0993J2624k1062l30N392N6483l4425O6991K4463p1121n2742j0434N2980
702B2622k9618J8401L9657k4900J2680m2354O7635k3641r403p288k0853K3347
690B6285k4417l2390O419N2282K8358p058m6709m6326O4477P639k6497j8213J0101
677f049M9740O595L078J9517l5924k7121K6107M5507n0078l2053J7779j9793K6265
664B3570K0967j3529o0651Q0505R114o1915M5685q562M9740r618J8886n8616q880
651B6696l1119J4112K9961n1466M8520O9068m9877j7578K8256q0002N9530m1630
639D471l4947L6471l124n402j435l7417K4926l6949K8076l794o4303O127L4483
$$ y = [-18850, 62097, 13050, 3043, 14355, 102069, 41327, 25266, 41486, 28783, -22229, -35032, -57190, -6197, 6427, -14635, -14965, -9573, 46910, 12485, 79476, 103939, 32818, -19924, -30358, 22622, -6996, 11405, 51062, 26162, 38842, -3512, 64123, 40482, 31079, 23791, 2938, 26285, 1868, -30522, -24103, 28179, 56537, 49479, 2770, -43556, 20921, 28560, 2063, -16150, -6049, 43691, 50286, 53364, 72881, 36957, 9836, 35943, 81450, 31372, -681, 17098, -2695, 23570, 44537, 31008, -29643, 50862, 59976, -1939, 43746, 35184, 84924, 75306, 94192, 35576, 26696, -4423, 9689, 39650, -11816, 36704, 105772, 55895, 38317, 66573, -13429, 46101, 4471, -30476, 5995, 2871, -2531, -3966, -41383, -16457, -53406, -25330, -29124, -93427, -87300, -52817]
626e2817N7398M2834J6817p8409R431M4699j7128k725p796l7536q671m229P0681
613C2549L0236m4536J0492m9441N274K2412l1463M040k5092K5839J3172K1107
601A4589k4J7701L0159l5615m8450k8992Q4047L8055L4472l1190k4346l3605m2719
588b5918P7828L3003k3239q8881L0477J9146p2373j2419O1968l672k8201l0912
576f3193M587n132K3314j6032K0324K302j7258O8289M1166L777K8333k6915j39164
563g5602J2983K4116L5174Q677K596l7830k7740O0935N7601l7640N138q753J0146
550B9801k7233N2712M304l0306p1433j6285M4027L9960O853q2K6839q60m95n5663
536B139Q363O7172P457j3802k3991L4516J0495K7755q3076J3837K0287l6481Q312
$$ y = [-52817, 4581, 47415, 64232, -14177, -4746, 39953, 22825, 20100, 12304, -25232, -33903, -38132, 32549, 62785, 18249, 28741, -20700, -15426, 6986, -24477, -20437, -45529, -19690, -6518, 14589, 14565, 32266, 62425, 26810, -21640, -50632, 33415, 71470, 105942, 74752, 50406, 16801, -25918, 51910, 84913, 61674, -27207, 3270, 22416, -49957, -62376, -408, -4080, -32281, -63193, -58606, -63738, -40424, -56456, -36132, -33830, -51088, 17201, 58367, 62144, 90477, 63562, -75602, -62619, -38503, -3329, 5348, 7944, -29886, -57626, 3309, 60910, 23270, 28408, 19655, 29801, 2568, 55280, 59584, 29278, -42155, -58440, -14413, 25547, 32400, 32318, 59157, 58297, 57802, 2139, 10502, 77674, 85131, 71329, 47338, 81854, 92349, 120104, 37028, 50865, 71152, 34671, 42983]
523D2983k3116M7026l5869l2520J8524j8495M397J7849K8674K0275l5832k3689
511A0207k749K9702j4476R984n950J6859K0651K8436m8468L7244m3811l9298m473
498f142L864j1574O2848P208j2203Q645M6193p3550m434k4012K2698J4947o9424
485c4936O3227N1282K0670m7025j4640m784P0291l1521M5945J4390n7259k2938
473E2702l6327O1795p5785K1205Q0075j907J0856k9866L8162k3652n4496o2803
461b0041q171Q2352j3160Q453Q375p1037r28k3472m6964O1431J6824l305J4411
448D768N5954Q001l7742l1685l567k1127O4691n0479N281N4245k0929K4894j2383
435C9922q52J9773K3415K5240O267m3581j9106K3909k604l984p4261J75J19767
$$ y = [42983, 19867, 66893, 31024, -1496, 17028, -1467, 2930, 20779, 49453, 69728, 33896, 10207, 7458, 37160, 22684, 32668, 26718, 43577, 64228, 92664, 44196, 81440, 37629, -1669, -6142, -2278, -13852, 48996, 56204, 44001, 52646, 98839, 25289, 20855, -3157, 19541, 34488, -34936, 28291, 79573, 100243, 53218, 38578, 33794, 104085, 72564, 118509, 132899, 75640, 52702, 16375, 78170, 2385, 23590, 103665, 101758, 112614, 82748, 120910, 97258, 42762, -20041, -28212, 54140, 40980, 49433, 57808, -13229, -14157, -37629, -84593, -23162, -6338, -9643, 4768, 60722, 68723, 30981, -704, -4271, -25398, 39293, -11186, -5905, 48340, 27411, 52305, 39922, 39070, 58843, 82258, 107498, 113765, 70184, 51078, 74987, 72383, 68399, -5862, -5687, 114080]
422A14080l9786j0689J6281L0383m3104K7184p046p5179n1446L4344J244J7934
410A4200J7025J7636p2175O1403J1697m445R929l4817p6554N1981L9978j5237
398B0621l2655J0822Q3626m9552l793m2244l538m4039J04331m5995l4263K2860
386a3819J980K9301k1900O8616o771o2818J6936L6536j2028j9243p218k967l2921
373b6316K732N2465M7317k0778m5541O6407N453q9869K273M6839l5235J4527k8256
360g982n0135J01632k1411m6256P317R512k557N3789j5253M857L4760L047k8995
347D2325k8708J9695N0408k3571l9594j38L151J3572k3737l1826J860K8866P466
$$ y = [114080, 74294, 63605, 79886, 110269, 67165, 94349, 87303, 12124, -39322, -4978, -3734, 14200, 31225, 48861, -23314, 38089, 49786, 45341, 55270, 20453, -56101, -4120, 35858, 20621, -12034, -1212, 82414, 32862, 29069, -13175, -16713, -60752, 43579, -2416, -36679, -13819, -11839, 17462, -4438, 64178, 57407, -5411, 11525, 48061, 36033, 16790, 9572, 6605, -26316, -23584, 28881, 76198, 55420, 9879, 76286, 81739, -8130, -5857, 40982, 5747, 20274, -7982, -58117, 43515, 22104, -24152, -16835, -7323, -9880, 43909, 28656, 33513, 68273, 71320, 42325, 13617, 33312, 83720, 60149, 20555, 20417, 23568, 37140, 13403, -18423, -16563, 12303, 19769]
$$ [...]
##END NTUPLES=NMR SPECTRUM
##END=
