##TITLE=1H_EC-3384(6)-14
 200.13Hz, CDCl3.
 8 sc
 12.8.2026
##JCAMPDX= 6.0         $$ Bruker NMR JCAMP-DX V2.0
##DATA TYPE= NMR SPECTRUM
##DATA CLASS= NTUPLES
##ORIGIN= UXNMR, Bruker Analytische Messtechnik GmbH
##OWNER= pz
$$ XWIN-NMR		Version 3.5
$$ Tue Aug 11 12:27:01 2026 Russian Standard Time (UT+4h)  she@DPX200
##.OBSERVE FREQUENCY= 200.1313
##.OBSERVE NUCLEUS= ^1H
##.ACQUISITION MODE= SIMULTANEOUS
##.ACQUISITION SCHEME= undefined
##.AVERAGES= 8
##.DIGITISER RES= 18
##SPECTROMETER/DATA SYSTEM= spect
##.PULSE SEQUENCE= zg30
##.SOLVENT NAME= CDCl3
##.SHIFT REFERENCE= (INTERNAL, CDCl3, 0, 15.5045)
##AUDIT TRAIL= $$ (NUMBER, WHEN, WHO, WHERE, WHAT)
$$ ##TITLE= Audit trail, XWIN-NMR		Version 3.5
$$ ##JCAMPDX= 5.01
$$ ##ORIGIN= Bruker BioSpin GmbH
$$ ##OWNER= she
$$ F:/spectra/data/she/nmr/H-C/1/pdata/1/auditp.txt
$$ ##AUDIT TRAIL=  $$ (NUMBER, WHEN, WHO, WHERE, WHAT)
(   1,<2026-08-11 12:25:28.95 +0400>,<she>,<DPX200>,
      <created by zg, POWCHK disabled, PULCHK disabled
       configuration hash MD5:
       00 E9 B6 7A A2 85 ED C7 34 08 36 98 17 FE 4E 26
       data hash MD5: 16K
       FE 82 7C 69 C1 DB CC C3 A1 82 C2 3B 45 BE 95 72>)
(   2,<2026-08-11 12:25:31.68 +0400>,<she>,<DPX200>,
      <Start of raw data processing
       efp BC_mod = 2 LB = 0.25 FT_mod = 6 PKNL = 1 PHC0 = -4217.272 PHC1 = 9.992301 SI = 16K 
       data hash MD5: 16K
       DF 6C 51 9D D3 2A 3B 0E C9 40 77 29 83 0D 31 8F>)
(   3,<2026-08-11 12:25:52.29 +0400>,<she>,<DPX200>,
      <pk PHC0 = 2.443452 PHC1 = -3.6 
       data hash MD5: 16K
       48 3F CB 7E FE E6 45 BF F8 63 EE CF 6C 05 7F 4E>)
(   4,<2026-08-11 12:25:56.15 +0400>,<she>,<DPX200>,
      <abs ABSG = 5 
       data hash MD5: 16K
       DD B0 A0 15 71 AE F6 AC 2B AC 0F 1F 4D EB 76 4F>)
$$ ##END=
$$ 
$$ hash MD5
$$ 31 89 E3 16 8D 1A 75 AA 3A 36 D6 35 A7 39 1F FA
##$RELAX= 
##$RELAX= 
##$RELAX= 
##$RELAX= 
##$RELAX= 
##$RELAX= 
$$ Bruker specific parameters
$$ --------------------------
##$DU= <F:/spectra>
##$EXPNO= 1
##$NAME= <H-C>
##$PROCNO= 1
##$TYPE= <nmr>
##$USER= <she>
##$AMP= (0..31)
100 100 100 100 100 100 100 100 100 100 100 100 100 100 100 100 100 100 
100 100 100 100 100 100 100 100 100 100 100 100 100 100 
##$AQSEQ= 0
##$AQ_mod= 1
##$AUNM= <au_zg>
##$AUTOPOS= <>
##$BF1= 200.13
##$BF2= 200.13
##$BF3= 200.13
##$BF4= 200.13
##$BF5= 200.13
##$BF6= 200.13
##$BF7= 200.13
##$BF8= 200.13
##$BYTORDA= 1
##$CFDGTYP= 0
##$CFRGTYP= 5
##$CHEMSTR= <none>
##$CNST= (0..31)
1 1 145 1 1 1 1 1 1 1 1 1 1 1 1 1 1 1 1 1 1 1 1 1 1 1 1 1 1 1 1 1 
##$CPDPRG= <>
##$CPDPRG1= <>
##$CPDPRG2= <>
##$CPDPRG3= <>
##$CPDPRG4= <mlev>
##$CPDPRG5= <mlev>
##$CPDPRG6= <mlev>
##$CPDPRG7= <mlev>
##$CPDPRG8= <mlev>
##$CPDPRGB= <>
##$CPDPRGT= <>
##$D= (0..31)
0 0.7 0 0 0 0 0 0 0 0 0 0.03 0 0 0 0 0 0 0 0 0 0 0 0 0 0 0 0 0 0 0 0 
##$DATE= 1786436728
##$DBL= (0..7)
120 120 120 120 120 120 120 120 
##$DBP= (0..7)
150 150 150 150 150 150 150 150 
##$DBP07= 0
##$DBPNAM0= <>
##$DBPNAM1= <>
##$DBPNAM2= <>
##$DBPNAM3= <>
##$DBPNAM4= <>
$$ [...]
##$SUBNAM3= <"">
##$SUBNAM4= <"">
##$SUBNAM5= <"">
##$SUBNAM6= <"">
##$SUBNAM7= <"">
##$SUBNAM8= <"">
##$SUBNAM9= <"">
##$SW= 18.0517328524113
##$SWIBOX= (0..15)
0 0 2 0 0 0 0 0 0 0 0 0 0 0 0 0 
##$SW_h= 3612.71676300578
##$TD= 16384
##$TD0= 1
##$TE= 0
##$TE2= 300
##$TE3= 300
##$TEG= 300
##$TL= (0..7)
0 120 120 120 120 120 120 120 
##$TP= (0..7)
150 150 150 150 150 150 150 150 
##$TP07= 0
##$TPNAME0= <>
##$TPNAME1= <>
##$TPNAME2= <>
##$TPNAME3= <>
##$TPNAME4= <>
##$TPNAME5= <>
##$TPNAME6= <>
##$TPNAME7= <>
##$TPOAL= (0..7)
0.5 0.5 0.5 0.5 0.5 0.5 0.5 0.5 
##$TPOFFS= (0..7)
0 0 0 0 0 0 0 0 
##$TUNHIN= 0
##$TUNHOUT= 0
##$TUNXOUT= 0
##$USERA1= <user>
##$USERA2= <user>
##$USERA3= <user>
##$USERA4= <user>
##$USERA5= <user>
##$V9= 5
##$VALIST= <valist>
##$VCLIST= <CCCCCCCCCCCCCCC>
##$VD= 0
##$VDLIST= <DDDDDDDDDDDDDDD>
##$VPLIST= <PPPPPPPPPPPPPPP>
##$VTLIST= <TTTTTTTTTTTTTTT>
##$WBST= 1024
##$WBSW= 4
##$XGAIN= (0..3)
0 0 0 0 
##$XL= 0
##$YL= 0
##$YMAX_a= 642051
##$YMIN_a= -670565
##$ZGOPTNS= <>
##$ZL1= 120
##$ZL2= 120
##$ZL3= 120
##$ZL4= 120
##$ABSF1= 15.50669
##$ABSF2= -2.545159
##$ABSG= 5
##$ABSL= 3
##$ALPHA= 0
##$AQORDER= 0
##$ASSFAC= 0
##$ASSFACI= 0
##$ASSFACX= 0
##$ASSWID= 0
##$AUNMP= <proc_1d>
##$AZFE= 0.1
##$AZFW= 0.1
##$BCFW= 0
##$BC_mod= 2
##$BYTORDP= 0
##$COROFFS= 0
##$CY= -3
##$DATMOD= 1
##$DC= 0
##$DFILT= <>
##$DTYPP= 0
##$F1P= 0
##$F2P= 0
##$FCOR= 1
##$FTSIZE= 16384
##$FT_mod= 6
##$GAMMA= 0
##$GB= 0
##$INTBC= 1
##$INTSCL= 3.241238e-09
##$ISEN= 128
##$LB= 0.25
##$LEV0= 0
##$LPBIN= 0
##$MAXI= 10000
##$MC2= 0
##$MEAN= 0
##$ME_mod= 0
##$MI= 1.114404
##$NCOEF= 0
##$NC_proc= -5
##$NLEV= 6
##$NOISF1= 3.799351
##$NOISF2= 2.8
##$NSP= 0
##$NTH_PI= 0
##$NZP= 0
##$OFFSET= 15.50449
##$PC= 1
##$PHC0= -4214.829
##$PHC1= 6.392301
##$PH_mod= 1
##$PKNL= yes
##$PPARMOD= 0
##$PSCAL= 0
##$PSIGN= 0
##$REVERSE= no
##$SF= 200.130003442891
##$SI= 16384
##$SIGF1= 3
##$SIGF2= 2
##$SINO= 0.751879
##$SIOLD= 32768
##$SREGLST= <19F.Aceton>
##$SSB= 0
##$STSI= 16384
##$STSR= 0
##$SW_p= 3612.71676300578
##$SYMM= 0
##$S_DEV= 0
##$TDeff= 16384
##$TDoff= 0
##$TI= <>
##$TILT= no
##$TM1= 0
##$TM2= 0
##$TOPLEV= 0
##$USERP1= <user>
##$USERP2= <user>
##$USERP3= <user>
##$USERP4= <user>
##$USERP5= <user>
##$WDW= 1
##$XDIM= 16384
##$YMAX_p= 416166744
##$YMIN_p= -267622
$$ End of Bruker specific parameters
$$ ---------------------------------
##NTUPLES= NMR SPECTRUM
##VAR_NAME=  FREQUENCY,     SPECTRUM/REAL,   SPECTRUM/IMAG
##SYMBOL=    X,             R,               I
##VAR_TYPE=  INDEPENDENT,   DEPENDENT,       DEPENDENT
##VAR_FORM=  AFFN,          ASDF,            ASDF
##VAR_DIM=   16384,         16384,           16384
##UNITS=     HZ,            ARBITRARY UNITS, ARBITRARY UNITS
##FACTOR=    0.220516191357247, 1,           1
##FIRST=     3102.91361680343, 0,            0
##LAST=      -509.803146202355, 0,           0
##MIN=       -509.803146202355, -267622,     0
##MAX=       3102.91361680343, 416166744,    0
$$ Real data points
##PAGE= N=1
##DATA TABLE= (X++(R..R)), XYDATA
$$ [...]
6977a39133M0957K7354n576L3240O7197M0214n5192J2861J4901j02713M1056J7476
6965g358Q125J3572k5268L4036J3169m1793n4077J1939L0399L0782j5195r956
6953a1625M3104N298m2831m0862Q97Q6772j7368j8182o7491k9644L9822J5295
6941c6815j2494J9240k4049j5542J09376K190M4996K1327m1587m7797j4295M0375
6929D4925l0859n5751K0831M0446K9050N30j25344J8518M9453O1539J0535J2014
6917G5887k3004j8330L2744M8372k8197k1098j3817p0021J9270q353N4548l6727
6905A1274q6133K8019N1716o7504k7989k5412K6614K6159M3136m456j7883Q537
6893c3922K8871L5101N361p7790q7100K4301Q1852M225k3836m4486j0880N4764
$$ y = [-139133, -98176, -70822, -76398, -43158, 24039, 64253, 9061, 21922, 36823, -65890, -24834, -7358, 767, 14339, -10929, 23107, 36276, -5517, -59594, -47655, -17256, 13526, -1669, -11625, 31479, 36777, -6054, -46916, -46019, 40753, 23385, 5203, -62288, -91932, -52110, -36815, -49309, -30069, -54118, -69660, 39716, 41906, 86902, 108229, 66642, 18845, 4550, 44925, 14066, -41685, -20854, 19592, 48642, 49172, -76172, -57654, -8201, 53338, 63873, 75887, 52883, 34553, 67297, 115669, 87472, 66374, 52557, -17464, 1806, -6547, 48001, 11274, -74859, -46840, 4876, -62628, -90617, -116029, -89415, -63256, -20120, -24576, -42459, -33922, -5051, 30050, 35411, -42379, -129479, -105178, -23326, -19101, -42937, -87423, -98303, -43539]
6881d3539n253N9411n122o0417m0283P705N1390K9918o3052K469N0585J5717p4967
6868g5438k0311K1907K2926L7841N3024l4057m5375J7172K1612P1348k5154p7407
6856c1912o1131N2169R45M0647N3328q1921M8781j3174j4598J8518o9887n8028
6844a16263O9579j1006J778k3275r170N999K7942p957k2941j5371k4604M9943
6832g5346p514L0544k5823l2498m9050M9729K6283M3756q5074k9945J4511k0634
6820a61061L5924k2955K819l8686o5410K748Q6408J10802l0419m2451M2865j5230
6808i4646P657J7809l7895L856R4089j6651n310n2526Q398L9321j5478q8482k7346
6795a67204q825N935R9587M4985J488j0704m4889j2694M1163O503l0443j8852
$$ y = [-43539, -48792, 10619, 5497, -54920, -95203, -87498, -36108, -6190, -69242, -66773, -16188, -471, -75438, -95749, -73842, -50916, -13075, 39949, 5892, -39483, -22311, -699, 70649, 45495, -31912, -93043, -40874, -39929, 718, 54046, -27875, 20906, 7732, -6866, 11652, -58235, -116263, -46684, -57690, -55912, -79187, -88357, -82358, -54416, -62373, -85314, -100685, -125289, -75346, -82860, -52316, -78139, -110637, -159687, -109958, -83675, -39919, -124993, -154938, -140427, -161061, -125137, -148092, -145273, -183959, -249369, -246621, -160213, -49411, -79830, -122281, -79416, -94646, -86989, -69180, -107075, -103219, -9130, -25781, -31091, -83617, -75219, -35898, -51376, -139858, -167204, -176029, -170094, -70507, -25522, -24034, -34738, -79627, -92321, -51158, -44655, -75098, -93950]
6783i3950j6330L3656J1759o828P658p6124j3037J9265P0780L6917m0084k2241
6771h8559K6643K4972J3063m8870m4915Q7724N9633Q910r8468l1L6181n0128K9489
6758d4356J00523m6798r6971o5377N1362J36268o6255Q109l6641l576L2734k2926
6746e3904K8770J8362p2507j4854O9598m567K6154j1172J5327P2402o6197j2400
6734d988m9144K6160P5181K9127J9382k3652q9799L9538N0946n3158O2926p9115
6722C404l1317Q6409l6145O9505k3442o4703K3055M6282n6856l7892K381j3334
6710c2653j3472r849J09294l212J1909M0965m7878L1977p7712m2759N7812l215
6698B1207o201O1899M97o6001p9451n8509J32275M3618o9721q522L6552K4317
$$ y = [-93950, -110280, -76624, -64865, -71693, -64035, -140159, -153196, -133931, -63151, -26234, -66318, -88559, -61916, -36944, -23881, -72751, -117666, -29942, 29691, 38601, -59867, -59898, -23717, -73845, -44356, 56167, 9369, -87602, -152979, -101617, 34651, -31604, -23495, -60136, -63712, -30978, -53904, -25134, -6772, -79279, -94133, -24535, -29102, -2948, -14120, 1207, 73609, 7412, -4988, -54132, -27972, 47209, 76336, 95718, 72066, -17733, 21805, 72751, 19593, 82519, 3404, -27913, 58496, 22351, 91856, 68414, 3711, 26766, 73048, 16192, -21700, -19319, -32653, -46125, -55974, 53320, 50108, 62017, 102982, 55104, 87081, 9369, -33390, 24422, 21207, 15006, 76905, 77402, 11401, -68050, -126559, 5716, 49334, -20387, -28909, 7643, 31960]
6686C1960K1829o1947p0002R766N9195K4669k1302k0143N217k5911J09751j9757
6674D3325q5688l852m266L3541L6993l423m6711l3168K8848M8360M452o7549n5132
6661a04270J0842Q7966K5661L2370L884p8249L8281k0521J0686o2579j6816M5919
6649b6826J0735j2075J2388j1361j2337M339j3764M0235j2848l6967L1612K9849
6637B980k0150l7818l1832n052m358p329N5638q3248J4751M1515n401K1833J7697
6624d0774n087j05604L3010K688Q4025o2692k4036L8038L8723k0367J4662j5256
6612f2670j9433n528M2065L5364K4346o336M924J0935k492n9766m1062j5727L4076
6599f1304K3162J8434m3849j2057N6924l0279q402p5935J2714J7276L9704m319
$$ y = [31960, 53789, -8158, -78160, -68394, -9199, 15470, -5832, -25975, -20758, -46669, 63082, 43325, -42363, -46215, -50481, -16940, 20053, 16630, -30081, -63249, -34401, 13959, 18411, -49138, -104270, -93428, -5462, 20199, 52569, 56453, -21796, 16485, -4036, 6650, -55929, -72745, -26826, -16091, -28166, -15778, -27139, -39476, -35137, -48901, -8666, -21514, -58481, -26869, 2980, -17170, -54988, -86820, -91872, -96230, -103559, -47921, -131169, -116418, -74903, -80304, -58471, -40774, -45861, -151465, -118455, -115767, -31742, -94434, -118470, -80432, -41709, -62076, -47414, -62670, -82103, -87631, -45566, -10202, 14144, 7808, 12732, 23667, 21175, -38591, -79653, -95380, -61304, -38142, -19708, -63557, -75614, -18690, -48969, -57371, -133306, -120592, -103316, -63612, -67931]
6587f7931j1810L1655K0647j2800L7372r7321L1472O8123k3527j301Q753m5081
6575f1749O704O1325n376J7239l2273j0261K4779j7417L7890K3647J3946J5809
6563G4263l477p1131n2138j4556J12456L1930j2862n232l1537m6290j5285k4094
6551e7953j1532M3605k683k8459N8789o5835k9570O2075o0588P813R746k6770
6539a01362o9338K545Q0832k9759Q27K9711K7616P6848p5211j7347P828o2899
6527a29709R2493p1911j5882N1178n3493j3086O632K5962l696K6929k2887p1157
6515a78627P6839L9236l9811o150o7357R20l6296Q413j351M9178q115m5874J1956
6502a97039O9756o6347k0822Q474J895L7121l0430K6232l0969J5163N2578j2304
$$ y = [-67931, -79741, -48086, -27439, -40239, -2867, -100188, -68716, -593, -24120, -25421, -16668, -61749, -55045, 6280, 904, 18143, -14130, -24391, 388, -17029, 20861, 44508, 58454, 74263, 70786, -345, -52483, -67039, 45417, 77347, 64485, 59253, 27716, -18574, -33859, -57953, -69485, -25880, -28563, -57022, 1767, -64068, -93638, -31563, -92151, -84338, -74592, -101362, -170700, -168155, -87323, -117082, -116255, -86544, -58928, 17920, -57291, -74638, -66810, -129709, -37216, -109127, -125009, -73831, -127324, -140410, -133778, -107816, -111512, -84583, -107470, -178627, -101788, -62552, -102363, -108513, -175870, -174950, -211246, -202833, -204184, -155006, -163121, -208995, -197039, -127283, -193630, -214452, -205978, -204083, -166962, -197392, -171160, -202129, -186966, -134388, -146692]
6490a46692N4644K9838Q261j4782K3329n7838J2937J18309k4756l6476k0586O7345
6478A3533l2580k2945M9065q5742O610L410k537N5943M6817r9714j0487j3980
6466i2607j9468j6311K2677P5181J0930j9554j3511J1178l5490j0858k4336Q7931
6454b4238R1579J9340j5639n1569o6572N9142k584k3328N9476N2501j1976J8236
6442A04368k2324J5810o0471n146j4043j1106N6285o9680J1253K583o3285L5724
6430b0032M2206M731j5491j8629o9406K1970p090Q1176L7441k9856j4913l2625
6418b0518n7981L5087j1094o783K4370k6330J065N5569J10788l9049r2849m6550
6406g4275L5933K555M5970J9579o2811O765N5180n7702l7076j8856L8115L6742
$$ y = [-146692, -92048, -62210, -53949, -68731, -45402, -103240, -90303, 28006, 3250, -33226, -53812, 13533, -19047, -41992, 7073, -78669, -72059, -68649, -71186, -15243, 31574, -68140, -78627, -92607, -112075, -128386, -105709, -30528, -19598, -39152, -52663, -41485, -76975, -87833, -112169, -24238, 67341, 86681, 71042, 19473, -47099, 12043, 9459, -13869, 45607, 98108, 86132, 104368, 82044, 97854, 37383, 32237, 18194, 7088, 63373, -6307, 4946, 7529, -55756, -20032, 22174, 26905, 11414, -7215, -76621, -54651, -61741, 19435, 56876, 27020, 12107, -20518, -78499, -43412, -54506, -61289, -36919, -63249, -62184, -6615, 104173, 65124, -27725, -74275, -38342, -35787, 10183, 29762, -33049, -26284, 28896, -28806, -65882, -84738, -46623, -9881]
6394i881k2005R698q876p858q255j3219N079K0191o4371j13766J07109O2936j4353
6381e7571K3672J4470m5674L9020K1696L512J5244L1793j4444M4587m5532r549
6369B1224M5513K6349M1095R77l1624M1496n3504m7125N8655O2748j831r9081
6357F4892j1353l2799n336p1403J04612O0830j7763J1846o0275K0l5354l9194
6345c1277q290N8017o9L5336P295r476O919k2426j9219m8028K5523L6486l2463
6332a672p0289M7416N457j6458N0987r81J6119n6235K2216L5058q9299M0970K3204
6319F493l384L34j749M772p2104J3582K9855M3517p645m5600L3873L7668l2960
6306F652o0318l665r500m9415m078Q0144k0421o0756j9679M9694Q239m0114m0447
$$ y = [-9881, -31886, -22188, -31064, -38922, -47177, -60396, -55317, -35126, -99497, -213263, -106154, -43218, -57571, -33899, -19429, -65103, -26083, -4387, -875, 14369, 46162, 31718, 76305, 30773, 21224, 66737, 93086, 134181, 135158, 103534, 145030, 91526, 44401, 103056, 165804, 163973, 64892, 53539, 20740, 15404, -55999, 48613, 109443, 91680, 103526, 43251, 43271, 7917, -31277, -39567, 18450, 18381, 53717, 61012, 51536, 58455, 36029, 16810, -31218, -5695, 30791, -1672, -71961, -24545, -19088, -35546, 15441, 14460, 30579, -25656, -3440, 31618, -57681, -16711, 6493, 3109, 3443, 1694, 6466, -65638, -52056, -22201, 21316, 13671, -31929, 1944, 39612, 6652, -53666, -57331, -66831, -116246, -120324, -40180, -60601, -121357, -141036, -91342, -83103, -123217, -163664]
6293a63664K046P6403J3612n0466K4031O23o0465j6663J8985J1445L1624l5112
6281a47601P7712l6342l0645j3213P144K9531R812q1007k1920K3653P786M6489
6269a28601K3292r817p2241j8112O6051J5695r3812n0077L9169L337K3377j2473
6257b14212k6607M2201M7254N7349m510m6305k1943M385L5473L0478L8245n9491
6245a17683k5239l8769j0464R608j432L3961k2621J4553R652M0709K32l6627k4943
6232a69063M0637L3595L5871p6950N5071N123j7173N8112N979m7789j6572j4858
6220a08017n9866M2471K8015n7095Q5605L486N235K6462P4624j8617m9121L8701
6208A1883J4264m010k8715N2117j3990M504k9195l4440r81P8867j3845o9925N6105
$$ y = [-163664, -161618, -85215, -71603, -122069, -98038, -97415, -157880, -174543, -155558, -144113, -112489, -147601, -69889, -106231, -136876, -150089, -142945, -113414, -103602, -184609, -206529, -182876, -175090, -128601, -105309, -115126, -187367, -205479, -139428, -123733, -217545, -267622, -228453, -225116, -201739, -214212, -240819, -198618, -151364, -94015, -98525, -144830, -166773, -162388, -126915, -96437, -58192, -117683, -142922, -181691, -192155, -182547, -183979, -150018, -172639, -158086, -148434, -107725, -107493, -144120, -169063, -128426, -94831, -58960, -135910, -80839, -75716, -92889, -34777, -28798, -76587, -93159, -108017, -167883, -125412, -97397, -154492, -68887, -65401, -60166, -33704, 40920, 22303, -26818, 11883, 26147, 22137, -6578, 45539, 31549, 36053, 6858, -27582, -28563, 50304, 36459, -33466, 22639]
6195B2639K8685n2001l396j2950M15L9473k60l1207P0364L6812l0966J4755k5300
6182E7063J3976M3404k6211m5569K9017n315m6360r656J9887o6239K8651O0069
6170E2717M9703m6538p3895j3992O9018m5594J1101Q8457l1133j09255j2145M6169
6158a5387j9694K5326M4668J9371o2229l8816L2526k4425O80j0003j07836m052
6146a59871P6818j0644J7149K553k6678K2261m5600j7320R731K0107J37799L770
6134C0075J854o7218j03996P4185K2078K8918n0595L075N0911L159J1153K7823
6122C1422k786M6642m2762n5577j2985M8707k0050K2816L4903M7968k7018n8143
6110A3137L3162p030m0323m3949Q098M3541M1007j2353M1899K7096o3786K2338
$$ y = [22639, 51324, -677, -4073, -17023, -16608, 22865, 22605, -8602, 61762, 98574, 67608, 82363, 57063, 71039, 114443, 88232, 42663, 71680, 66365, 20005, 10349, 30236, -36003, -7352, 52717, 102420, 55882, -18013, -32005, 37013, -8581, 2520, 90977, 59844, -49411, -61556, -15387, -35081, -9755, 34913, 54284, -7945, -46761, -14235, -38660, -37980, -47983, -155819, -159871, -83053, -93697, -76548, -73995, -100673, -78412, -124012, -141332, -131601, -111494, 26305, 30075, 31929, -35289, -139285, -65100, -43022, -14104, -64699, -61624, -10713, -7554, 3599, 31422, 28636, 75278, 32516, -23061, -36046, 12661, -7389, 15427, 50330, 98298, 71280, 13137, 46299, 39269, -1054, -45003, -36905, 6636, 47643, 35290, 77189, 104285, 40499, 62837]
6098F2837P380J9622k9656k3850K1826P3014J6539m5687R878j5970l814O1213
6086A53332K6937o3310K3010K2993K5440K4152L4659l6878J1528j6546Q751k946
6074B11122k4802l3228J3149K3914l9817N6113l0401M2759m9192p6289P79M9051
6062A43158K2307k7603L7347M6968p5985m8095l1982N5502Q876P1857J9918k6738
6050A95530k4337q4495P8008M8946j17306J0830N7846J00120J8079j04595L7206
6039B15832k9350L2417o4793q6366k8369K607J3707M819j2349m48J904L695J5510
6026F8816J0613o6294n2873k5757O3478j4716j4774l0313m7285J4247K1198K9814
6014d3846O5176j8892n5574m0788J2163M8008r3236K7239P8300q015M423M9084
$$ y = [62837, 70217, 89839, 60183, 36333, 58159, 131173, 147712, 102025, 111903, 95933, 92119, 153332, 180269, 116959, 139969, 162962, 188402, 212554, 247213, 210335, 221863, 205317, 214068, 211122, 186320, 153092, 166241, 190155, 150338, 206451, 176050, 218809, 169617, 93328, 94107, 143158, 165465, 137862, 175209, 222177, 146192, 98097, 66115, 121617, 130493, 202350, 222268, 195530, 171193, 86698, 164706, 213652, 96346, 107176, 165022, 265142, 283221, 178626, 215832, 186482, 218899, 154106, 67740, 39371, 41978, 55685, 60504, 48155, 47707, 49611, 53306, 68816, 79429, 13135, -39738, -65495, -2017, -16733, -31507, -61820, -109105, -94858, -73660, -43846, 21330, 2438, -53136, -93924, -81761, -33753, -126989, -99750, -21450, -29465, -25042, 24042]
6002B4042n5288o89L9408p6474L9346o3922l8167j6882J3745L9596m84O562r526
5989i8733n5848K6544P0622l4782q5026m2658Q8810M4001N4348m6368M1130N9442
5977B1482J22681J17867J3211R876N3817J39912M9202J02636R1172N2616O3046
5966H37518j7378L1857O0307r5021o4179Q4942P4203p6931n0508l7891p5430n2372
5954F19117j21l6408j03290j01106j67411r416l404j00060N637n9027K0317l3927
5942C0901k2122L496l5492N1703m412k3746M5442l6224j8575M3404K0051j3999
5930D0427k9990M4726M6956m6940M2349o800L3949L2932l8723l6550K0706L6537
5918A39579K6619M4216J1577k9219k7596J9501k0229J0242j6038l7186M4571J07673
$$ y = [24042, -31246, -31935, 7473, -69001, -29655, -93577, -131744, -148626, -134881, -95285, -95769, -89207, -98733, -154581, -128037, -57415, -92197, -177223, -219881, -131071, -87070, -32722, -79090, -37960, 21482, 144163, 262030, 275241, 285117, 338934, 478846, 528048, 630684, 721856, 774472, 837518, 820140, 851997, 912304, 817283, 753104, 838046, 912249, 835318, 784810, 746919, 671489, 619117, 618996, 582588, 479298, 378192, 210781, 201365, 197961, 97901, 103538, 44511, 64828, 30901, 8779, 12275, -23217, 28486, 24074, 328, 45770, 9546, -9029, 34375, 54426, 40427, 10437, 55163, 102119, 55179, 97528, 90728, 124677, 157609, 118886, 82336, 103042, 139579, 166198, 210414, 221991, 192772, 165176, 184677, 164448, 174690, 158652, 121466, 166037, 273710]
5906B73710p4370l6261j2743k6927j6203m6717o6718P3529N4277l048K8934K6385
5894A73848p2772P619K6092J09892j1571j2532k0261J4511L2668K0674j0286O6986
5882C24868J1591N0944L6958m5416K0423J1377J4954m884j1078Q261k9156L4548
5870D23390n304o1980L229l2261L4569K6852j6552k8998l3654n8356M1808J1271
5858C04014q020P6773j3579p2243J34990O2956n6582n2318j1680J3067M7434L0422
5846D55234M5068K0823l4169P933J11286j7102L202M9649R9962q860n930k6569
5834G00527m745o239n862l1644p2304l8947N5759R3142O819k6415p2446m28K7584
5821F24801q928j6773J2884k3754j9925L1368J0714n3399m1579N1547O4246L3401
$$ y = [273710, 199340, 163079, 150336, 123409, 107206, 60489, -6229, 67300, 121577, 118529, 147463, 173848, 101076, 108695, 134787, 244679, 233108, 220576, 200315, 214826, 247494, 268168, 257882, 324868, 336459, 387403, 424361, 378945, 399368, 410745, 425699, 420815, 409737, 417998, 388842, 423390, 418086, 356106, 359335, 327074, 361643, 388495, 371943, 342945, 309291, 250935, 292743, 304014, 295994, 372767, 359188, 286945, 421935, 484891, 428309, 375991, 364311, 377378, 424812, 455234, 500302, 521125, 486956, 494889, 606175, 589073, 592275, 641924, 741886, 733026, 727096, 700527, 695782, 689543, 683681, 652037, 579733, 540786, 596545, 689687, 696506, 670091, 597645, 597217, 624801, 615873, 599100, 611984, 588230, 568305, 599673, 610387, 556988, 515409, 566956, 631202, 664603]
5809F64603M1250K3889l1335K1390O3393K483Q583L6012l3711M2678O6629P411
5797I13275J414R2521p142p4948O2451p7098p1578l2217K2192P9813m150n8251
5785H46282K1261l7073m1754K9270L0072m9151p8406L7380r748n244l1210J6337
5773G28016m2276L0371P4160L7721M4481J7587M3173N3651P3935K2993Q0268K5959
5761A190039M6265P1675j1231P6801K0157O799R1989J12041N0754m4505J891R9071
5749A711746J14571r548K8036L1068M7756M5916J5457m7500p8754N1582J17005
5738B027335n715R5990O1990m4847L6715K0353P3013K14925P4665Q5330J20291
5727B760045J49813R1366J17757J32882j2741O3467J60541K13739J59381P6288
$$ y = [664603, 705853, 729742, 698407, 719797, 783190, 785673, 794256, 830268, 796557, 839235, 905864, 913275, 914689, 1007210, 1000068, 925120, 987571, 910473, 838895, 806678, 828870, 908683, 904533, 846282, 867543, 830470, 788716, 817986, 848058, 798907, 720501, 757881, 748133, 742889, 711679, 728016, 685740, 716111, 790271, 827992, 872473, 890060, 933233, 986884, 1060819, 1083812, 1164080, 1190039, 1236304, 1307979, 1296748, 1373549, 1393706, 1400505, 1492494, 1604535, 1655289, 1610784, 1612675, 1711746, 1826317, 1816769, 1844805, 1875873, 1923629, 1969545, 1985002, 1937502, 1858748, 1910330, 2027335, 2021620, 2117610, 2179600, 2134753, 2171468, 2191821, 2264834, 2479759, 2554424, 2639754, 2760045, 2909858, 3001224, 3118981, 3251863, 3239122, 3302589, 3463130, 3676869, 3836250, 3912538]
5717C912538P6652J67105Q4275n12R3706O9759J12406N7688K4072J3402N9447
5706D670538k0255O3854J25694M1178O1161M7680P2377N7634M9330J78454J42020
5695E489665J23206O1202P7720J73633K11509K41646J66242J76746K72057L03116
5685G296742K23584K53439K19280M96403N65152N44389O25954O80402P01431Q85108
5675A2491884J039148J163719J219566J403464J605167J828195K034680K342400
5667B5128223K781955L453307M416333N585801P433071R803137J3019776J7288614
5659H8910217K1684608K4300315K3381022J8763652J1915625M869694j621860
5652A92203273n658345n664713k892188J821226O771775R216474P644156K708963
$$ y = [3912538, 3989190, 4156295, 4240570, 4240058, 4333764, 4403523, 4515929, 4573617, 4597689, 4611091, 4670538, 4650283, 4714137, 4839831, 4881009, 4942170, 4989850, 5062227, 5119861, 5169191, 5347645, 5489665, 5612871, 5674073, 5751793, 5925426, 6136935, 6378581, 6544823, 6721569, 6993626, 7296742, 7520326, 7773765, 7993045, 8489448, 9054600, 9598989, 10224943, 10905345, 11606776, 12491884, 13531032, 14694751, 15914317, 17317781, 18922948, 20751143, 22785823, 25128223, 27910178, 31363485, 35779818, 41365619, 48798690, 58601827, 71621603, 88910217, 110594825, 134895140, 158276162, 177039814, 188955439, 193825133, 192203273, 186544928, 180880215, 177988027, 179809253, 186581028, 195797502, 203441658, 206150621]
5644B06150621l748645r669308j4707815j8669856j9730491j9219337j8045691
5637A02359478j6192938j4063164j1918591r683082p663296n880234m452206l531431
5629B8974536k840019k328962j933545j684019j411990j288580j101376r71373
5621A5414672q60195p51702o61983o58109o51418n69560m88991m69954l90918
5612I911842l54370l57653l10006k36205l22405l73697k39722k20928k14935k18796
5602G063125j44141k64360j78976q2725q8668j71586k66081j65608q1513j30903
5592E488564j82195j75702j14127K050j08512k25215j41070r3932o9869j16104
5582D263888j09532k9527j25677j00036n9043o2608j2070j10314p2151j42818
$$ y = [206150621, 202401976, 192732668, 178024853, 159354997, 139624506, 120405169, 102359478, 86166540, 72103376, 60184785, 50501703, 42838407, 36958173, 32505967, 28974536, 26134517, 23805555, 21872010, 20187991, 18776001, 17487421, 16386045, 15414672, 14554477, 13802775, 13140792, 12482683, 11831265, 11261705, 10772714, 10302760, 9911842, 9557472, 9199819, 8889813, 8653608, 8331203, 7957506, 7717784, 7496856, 7281921, 7063125, 6918984, 6654624, 6475648, 6392923, 6304255, 6132669, 5866588, 5700980, 5619467, 5488564, 5306369, 5130667, 5016540, 5018590, 4910078, 4684863, 4543793, 4449861, 4379992, 4263888, 4154356, 4124829, 3999152, 3899116, 3840073, 3777465, 3765395, 3655081, 3582930, 3440112]
5572C440112m4094K9372j09175m5726r8250k9560m365p6611r6130J4632j15611
5561B864594l8549m1606r5039o1609l4064l3892p6784m0458N8672j10169n4654
5550B336442p1582j36255L2023j725n5137j525n9298m2007m9400o4159l3761m5476
5538A808140j29461L6889J6439l8669q0575Q823p5238p5364q557J0928l5730J0525
5526A448150O1287N8677o8875r9177Q3818j0229n5728L1794L4270j1651K3866
5515A496202l1813M8733L6897p171j5770K5546p9920K0020M1391O2609L4194Q2376
5503A713294K5221M4121Q8899J08486J39399J09581K58892L89568M22407O99007
5493C998875O76154N11026K42368K9078j49795j83528k42217k00533l802J93567
$$ y = [3440112, 3396018, 3425390, 3316215, 3270489, 3172239, 3142679, 3138314, 3061703, 2965573, 2980205, 2864594, 2826045, 2784439, 2689400, 2627791, 2593727, 2559835, 2483051, 2442593, 2501265, 2391096, 2336442, 2264860, 2128605, 2160628, 2158903, 2103766, 2102241, 2042943, 2000936, 1951536, 1887377, 1853616, 1808140, 1678679, 1715568, 1732007, 1693338, 1612763, 1621586, 1546348, 1470984, 1462427, 1473355, 1437625, 1448150, 1509437, 1568114, 1499239, 1400062, 1483880, 1473651, 1417923, 1449717, 1483987, 1472336, 1496202, 1464389, 1513122, 1550019, 1542848, 1527078, 1552624, 1472704, 1492724, 1534115, 1596724, 1630918, 1713294, 1738515, 1782636, 1871535, 1980021, 2119420, 2229001, 2487893, 2877461, 3299868, 3998875, 4675029, 5186055, 5428423, 5457501, 5307706, 5124178, 4881961, 4681428, 4677626, 4871193]
5483D871193L30583M60367L21031J22602q1411k80353m41067m27585l88467l85410
5473D101483l33188k82992k38180j64709j19247j31386p2159q0883N9365k0347
5463B717757p502m1424j4240m9020o8017K5208P589J3854N0595Q7957N7520J8254
5451B798531J2561K1772O1329M1682M2770J38192R7383N3668M3766J35271K25616
5440C672541J52839J87803K69940K89913K75971L08387L39009L40439M03885M70470
5430F711197N57002O24307Q16838R55941J119718J381278J684091K130555K817409
5421A8798336M060178O385435R386981J1335692J0913805P844887L692535J34070
5413G2551919l006349n184010n078980l757543j340155K281411N656419O947617
$$ y = [4871193, 5201776, 5662143, 5983174, 6105776, 6024365, 5744012, 5302945, 4875360, 4486893, 4101483, 3768295, 3485303, 3247123, 3082414, 2963167, 2831781, 2759622, 2678739, 2738104, 2717757, 2710255, 2668831, 2654591, 2605571, 2537554, 2562762, 2570351, 2584205, 2634800, 2722757, 2780277, 2798531, 2811092, 2832864, 2894193, 2935875, 2978645, 3116837, 3214220, 3267888, 3311654, 3446925, 3672541, 3825380, 4013183, 4283123, 4573036, 4849007, 5157394, 5496403, 5836842, 6240727, 6711197, 7268199, 7892506, 8709344, 9665285, 10785003, 12166281, 13850372, 15980927, 18798336, 22858514, 29243949, 38630930, 49966622, 60880427, 68725314, 72417849, 72551919, 69545570, 64361560, 59282580, 55525037, 54184882, 56466293, 62122712, 69070329]
5405F9070329N319522J892931j572609m532161p435593q444308p919817p321301
5397C9056993o445882n554470m748873l935089k991435k286321j618751j347924
5389A0128248j072005q02923p02243m95195m12414m69057l01821k21042l03893
5380E347655k77443k67405k73897k28130j76463k25128j44555j57201k26872j36581
5370C233980o5095j49337j47829r5767j02366l8969j16614j93493k2037k8691
5360B273782o4502j05411l1070l8952o4746N981m4153R227r502j62294k7503M7094
5348A787951O876l7889k7939L9855p67Q690l7290J63228L4930r60J17036O2777
5336B116498p152k1150p5910k5120k9377j384p836j10014n7020p162M9195k169
$$ y = [69070329, 74389851, 76282782, 74710173, 70178012, 62742419, 54298111, 46378294, 39056993, 32611111, 27056641, 22307768, 18372679, 15381244, 13094923, 11476172, 10128248, 9056243, 8253320, 7551077, 7055882, 6643468, 6174411, 5872590, 5651548, 5347655, 5070212, 4802807, 4528910, 4300780, 4124317, 3899189, 3754634, 3597433, 3370561, 3233980, 3168885, 3019548, 2871719, 2775952, 2673586, 2634617, 2518003, 2324510, 2302473, 2273782, 2209280, 2103869, 2072799, 2033847, 1969101, 1975082, 1930929, 1940156, 1930654, 1768360, 1740857, 1787951, 1794827, 1756938, 1728999, 1768854, 1768087, 1776777, 1739487, 1902715, 1937645, 1936685, 2053721, 2116498, 2109346, 2088196, 2012286, 1987166, 1957789, 1956405, 1948569, 1838555, 1781535, 1774373, 1823568, 1821399]
5324A821399j25659o2271r3131l579p4233j25211j22877j60855k4000k0440p7158
5313I31985j7647Q954l4472l2360m3248m5048p6056M0958J2553M646M5394n2248
5301G43411n8280J9239R496O419m0128l3208k8567p4919k2122K2201K8089m8517
5289E23114m1266k872o612j5503k6323J7577k8805m4916l8256M1312Q3771j5704
5277D45517k3259M1685m4294m4241q092n125k3273j098Q2300L7176q105M6037
5265D95228j5193m4298j5005k1943k7846J7263O6361M5210p8004k6013j1284m8670
5253C35806k6464P75J3869L5269K3650L8724l4806o6328q5431M4376l214L8731
5241C14957j3030p4039j921R3559K4767j7539m7498j0326m8537M4284K3095N4946
$$ y = [1821399, 1695740, 1633469, 1540338, 1536759, 1462526, 1337315, 1214438, 1053583, 1029583, 1009143, 931985, 914338, 923292, 888820, 856460, 813212, 768164, 692108, 733066, 745619, 750265, 795659, 743411, 685131, 704370, 713866, 720285, 680157, 646949, 618382, 543463, 521341, 543542, 571631, 523114, 481848, 478976, 472364, 456861, 430538, 448115, 419310, 374394, 336138, 377450, 461221, 445517, 422258, 463943, 419649, 375408, 367316, 362191, 338918, 337820, 420120, 457296, 449191, 495228, 480035, 435737, 420732, 398789, 370943, 388206, 454567, 499777, 421773, 395760, 384476, 335806, 309342, 310117, 323986, 359255, 382905, 421629, 386823, 320495, 235064, 279440, 276226, 314957, 301927, 227888, 225967, 319526, 344293, 326754, 279256, 268930, 220393, 264677, 287772, 342718]
5229C42718P7180q2982L0556J8799k1268K0306M35o3695K6910K2356L8037p3244
5217C36108o981J6257j2937M0324O412j13282J8190J6872L5345j7181m1970l4676
5205B42481p0319P1192M608m8829k1036J375K1554K5235L0933N2532o7566o0129
5193A82031Q578N9295l9571n9156N8749k0920J4661k6959k2768J2272J6728j9463
5181A63477R1681K6889j6387r2435Q560K5788k2911o758o0740l9319P547K5387
5169A10779r591p5939O2037m341n0157j8691o4678o8252o0685R7166K2538L8012
5157b1802k339k4862K7650L054l769K7893n0501k4770O5334L7830n7621J7779
5145f124J7005L568J6154p7290J645J3451Q215j3198M2328L5432n7568q4368L1315
$$ y = [342718, 419898, 336916, 367472, 386271, 365003, 385309, 385744, 322049, 348959, 371315, 409352, 336108, 329127, 345384, 332447, 372771, 379183, 265901, 284091, 300963, 336308, 319127, 277157, 242481, 172162, 243354, 247962, 199133, 178097, 179472, 201026, 226261, 257194, 309726, 242160, 182031, 190609, 249904, 210333, 151177, 209926, 189006, 203667, 176708, 153940, 166212, 182940, 163477, 255158, 282047, 265660, 173225, 181785, 207573, 184662, 177904, 117164, 77845, 85392, 110779, 101188, 25249, 87286, 82945, 32788, 14097, -50581, -118833, -179518, -82352, -59814, -21802, -24141, -49003, -21353, -18299, -22068, 5825, -44676, -69446, -4112, 33718, -23903, -6124, 10881, 14449, 30603, -46687, -45042, -31591, -23376, -36574, 5754, 41186, -16382, -100750, -69435]
5132f9435K0635j1685n2023k5578L5749N0678o5331m758J8633j6333m2830L5221
5120a27057Q4052p0649k6427k905O8618K2127m4667K0006K5233l7538J04940M7580
5108F3313m9853J4265J6061M5977J04789R0821k2889n7581O8101j0150p119j2524
5096B43211o2071k9541n703M9693N7584J32145k0959l8652l2569l3657q996r4816
5084A55669p3832J5883J8061m559n6755l838l3678p791j0425k5123k6766k3898
5072g7052J860M7849O7703l487k2312k2915J443K763P2198n5677J2218L6362K8948
5059H9901q3645m955l1079l0274q471L3954M260M1014j2443k1681l0726J6401
5047c7744L7243l2129N386N8529P5211j42837m288Q0093l6805o1559Q9340O3866
$$ y = [-69435, -48800, -60485, -112508, -138086, -102337, -51659, -116990, -121748, -103115, -119448, -162278, -127057, -43005, -113654, -140081, -142986, -74368, -52241, -96908, -76902, -51669, -89207, 15733, 63313, 13460, 27725, 43786, 89763, 194552, 285373, 262484, 204903, 273004, 262854, 255735, 243211, 181140, 151599, 145896, 195589, 253173, 385318, 364359, 325707, 293138, 259481, 250485, 155669, 81837, 97720, 115781, 111222, 54467, 50629, 16951, 9160, -1265, -26388, -53154, -77052, -75192, -27343, 40360, 36873, 14561, -8354, -6911, -4148, 68050, 12373, 24591, 60953, 89901, 6256, 1301, -29778, -60052, -68523, -34569, -30309, 10705, -1738, -23419, -54145, -37744, -501, -32630, -27244, 31285, 106496, -36341, -40629, 39464, 2659, -58900, 30440, 94306]
5035I4306K363J995J5201j8270j07418N1522l3453R043K9946Q114m7345N3345
5023E9349M0609O2411q561j9246o7689o5336J04868K6722J4113L9484J2469r3814
5011A05379N977o807Q7840m0192r4082l5411k873K1092R508P4457O6726l5516
4999A56098J4112L6390J3677j272m6185j386J21959j4986j20685K1323K132L191
4987A84368N358k2710K9527l4932l0211R0466K5815K9443k1034q7309N6747L843
4975B29371P239o7986k7224l5567N9002J3185k832O1553n0600n4127M975o740
4963A30249k219N5715n6244k4107j103j7405J134l7102n151q502P0434j1179L07
4950I4827K2267p3563M5989M1817p4156n726R1328M9481k8582k1893J2023k5504
$$ y = [94306, 96669, 98664, 113865, 95595, -11823, 39699, 6246, 15289, 45235, 53349, 6004, 59349, 99958, 162369, 153808, 134562, 66873, 1537, 106405, 133127, 147240, 186724, 199193, 105379, 111356, 104549, 192389, 152197, 58115, 22704, 19831, 40923, 50431, 124888, 191614, 156098, 170210, 206600, 220277, 219005, 172820, 171434, 293393, 278407, 157722, 179045, 181177, 184368, 189726, 167016, 196543, 161611, 131400, 221866, 247681, 277124, 256090, 168781, 225528, 229371, 236610, 168624, 141400, 105833, 164835, 178020, 175188, 236741, 186141, 132014, 136989, 130249, 128030, 183745, 127501, 103394, 102291, 84886, 86020, 48918, 43767, 35265, 105699, 94520, 94827, 117094, 43531, 89520, 131337, 57181, 51455, 142783, 192264, 163682, 141789, 153812, 128308]
4938A28308o2007k2503R567k56J9184l0713N8698J4793q4411l2310l0422J172
4926c0900P8952l1548m2444K1851M0100K1993l3335l5467n5938q33M7960O3651
4914D4042J7971K1701k8521l5577j1292n138M0810l0430L3097M589J42M271O3667
4901A19332k4948j2878j2491n0681J5023L246L6547L4955P9278m2176q807k0618
4889A15782J458L6566J06989L6913J7373P1787k9558K9360q807m1302r896N1403
4877C78068P0351N0207J10641N4605N6091K8633n2903j5441q7935L821O775n7900
4865E45013K0961J4211Q1810K1053n7502p3291l2552o4434j2285m8303n6196M2126
4853C80611n6458r676j31095k8522L1774m0819m2527P448N2051k2538m0932m0857
$$ y = [128308, 66301, 43798, 53365, 53109, 72293, 41580, 100278, 115071, 30660, -1650, -32072, -30900, 48052, 16504, -25940, -4089, 36011, 58004, 24669, -10798, -66736, -67569, -19609, 44042, 62013, 83714, 55193, 19616, 8324, 3186, 43996, 13566, 46663, 51252, 51394, 55665, 119332, 94384, 81506, 69015, 18334, 33357, 36603, 73150, 108105, 187383, 145207, 136400, 115782, 117240, 153806, 260795, 297708, 315081, 386868, 357310, 386670, 377863, 336561, 326665, 378068, 448419, 498626, 609267, 663872, 719963, 748596, 695693, 680252, 592317, 596138, 602913, 545013, 565974, 580185, 661995, 683048, 625546, 552255, 519703, 455269, 442984, 394681, 338485, 380611, 324153, 314477, 183382, 154860, 186634, 145815, 103288, 110736, 162787, 140249, 99317, 58460]
4841E8460K0104q19m0024k8265J0586N2643L2174p0688M4709m7215r771k6164
4829d270l1991M5349m1317L2427L1188m4843o7205N0340k3122p6419J5656P4865
4817c9342l1072K5524n4839l13J2328k7046k5797N6834l7934o8001m6199Q5291
4805a50566l072k1488L7464l4829r820O0457k74L7341J1418m6122N2607o0154
4793a27038n885N6904L9494n2937l8374k6501O3181l5229J5405j0831M7283K2528
4781e2000l3198K5957N399p952K0222j4599n9854n843j9055N795J7192O9162r0016
4768a38790l8447N6924k8333O6434k188L0524l7280k9282L0537l1382Q6559K7802
4756f922J9570l4214o4821J07289N8185n5764k9467k3958N635L269L2438R1141
$$ y = [58460, 78564, 77745, 37721, 9456, 20042, 72685, 104859, 34171, 78880, 31665, 21894, -4270, -36261, 9088, -32229, 198, 31386, -13457, -80662, -30322, -53444, -129863, -114207, -39342, -70414, -44890, -99729, -100042, -87714, -114760, -140557, -83723, -121657, -189658, -235857, -150566, -153638, -175126, -137662, -172491, -182311, -121854, -122128, -84787, -73369, -119491, -66884, -127038, -132923, -76019, -36525, -89462, -127836, -154337, -91156, -126385, -110980, -121811, -74528, -52000, -85198, -59241, -53842, -61794, -41572, -56171, -116025, -121868, -140923, -135128, -117936, -48774, -138790, -177237, -120313, -148646, -82212, -84400, -53876, -91156, -120438, -89901, -121283, -34724, -6922, 12648, -21566, -86387, 20902, 79087, 23323, -6144, -30102, -24467, -21198, 11240, 102381]
4744A02381j67o7546M9408N9879n2316M7814j9371k8270Q160L80K0909J0161k1795
4731A09627N8233L79N853n0524q1898N8668J17471L6152m5194J5348o314j4617
4719B03184o435L6145K5085l0916n6328j0328L0223J2986j613M1966M0307J8507
4707C02783J718k7580N790N1536K8810k9277l7046k1130O8579K7141j3595l8202
4695C19527k3189n5609L7260Q974j2085j4891K2310Q7504j536M346q1770n3371
4683B37470O0395J56m7998J6451j03153P3053R5691j010L2797Q881j1903o595
4671C54235o1m5541j6342J3416O3370l8941r6906j9196N8833j5478q2421L6432
4659B11400L0262K2191K157j9235p0442J7963l5538q7251P2266M0494m737N8811
$$ y = [102381, 102214, 34668, 84076, 143955, 91639, 139453, 120082, 91812, 99972, 100352, 121261, 131422, 109627, 167860, 168239, 174092, 123568, 41670, 100338, 217809, 253961, 208767, 224115, 217801, 203184, 196749, 232894, 257979, 227063, 170735, 160407, 190630, 203616, 202003, 243969, 284276, 302783, 304501, 276921, 282711, 334247, 363057, 333780, 296734, 275604, 344183, 371324, 357729, 319527, 296338, 240729, 277989, 286963, 274878, 259987, 282297, 369801, 368265, 372611, 290841, 237470, 297865, 298021, 250023, 266474, 163321, 236374, 332065, 331055, 363852, 372733, 360830, 354235, 354174, 308633, 292291, 305707, 369077, 330136, 233230, 214034, 272867, 257389, 174968, 211400, 241662, 263853, 266010, 246775, 176333, 194296, 158758, 71507, 143773, 184267, 179530, 238341]
4647B38341p313o4174J9662j4447n7856n3508J0751o034O1071P3944M697L0436
4635B35570j8280o2500o4962j965M1628L1412k0612J0103m8466n0658M8545n6609
4623D3206k0208L6482L1725J6264p2901K8507J31496m5124o7001O8973q0265m4594
4611B6560R735l5876M7661N8863k6997j3868k4579j0653k544n203J4878j4387
4599B3590j3035J2380o288M3333M4860Q395j03887m9654J4654L3047j1017K0253
4587A6631j793L4913J02823k4370r1323M6528L5719p89N2226n883j0205K8234
4575A82711J5674n2294o38M068J6952j638m137m9861J0645L5407M956N907k6985
4562A40767P467j2557L6862j4052J5667O8395n0105O4481K0274l2076K7027J8281
$$ y = [238341, 231028, 166854, 186516, 172069, 114213, 60705, 71456, 65422, 126493, 200437, 205134, 235570, 217290, 154790, 89828, 87863, 129491, 160903, 140291, 150394, 101928, 51270, 99815, 43206, 22998, 59480, 91205, 107469, 34568, 63075, 194571, 149447, 82446, 151419, 71154, 26560, 36295, 419, 48080, 106943, 79946, 66078, 41499, 30846, 28302, 23099, 37977, 23590, 10555, 22935, 16647, 59980, 104840, 113235, 9348, -40306, -25652, 7395, -3622, 16631, 14838, 49751, 152574, 128204, 36881, 83409, 119128, 118339, 170565, 164682, 154477, 182711, 198385, 146091, 145453, 149521, 166473, 164835, 160698, 110837, 121482, 156889, 161845, 167752, 140767, 148234, 135677, 172539, 158487, 174154, 242549, 192444, 256925, 277199, 245123, 272150, 290431]
4550B90431l3674L5871P054R2308o527L5014k7814m6861P444L9880K1941n0221
4538C64846k5035L0063Q3205Q4413P4760k3286k2973n0270M3462j4917L0683L2753
4526F07704q866Q4128L7542l909K6624O5983R5399P6866L999m9663l2728P3111
4514I76190J08825n999P1391M4795R1737O9377J4889Q7776L4999J7938J4892K6708
4502A553518K1604q8598P960l630n7690j22190j4007O4511L4998j1135k6448M0636
4490A399529m5023m044l0816p902k0700k49k6209J6408J8810p3093l7832O3133
4478A252012J017m6906n1750P065l0920M8228L7031K3409l2642r4374J602L6788
4466A150560o1151K1820P7045l6972m0941P0340M0353n6477o4548M794N0611l278
$$ y = [290431, 256757, 292628, 299682, 391990, 385463, 420477, 392663, 345802, 353246, 393126, 415067, 364846, 339811, 369874, 453079, 537492, 612252, 588966, 565993, 515723, 559185, 544268, 574951, 607704, 598838, 682966, 720508, 716599, 743223, 809206, 904605, 981471, 985470, 935807, 903079, 976190, 1085015, 1079016, 1150407, 1195202, 1286939, 1356316, 1371205, 1458981, 1493980, 1511918, 1526810, 1553518, 1575122, 1486524, 1494484, 1490854, 1433164, 1310974, 1296967, 1361478, 1396476, 1385341, 1358893, 1399529, 1354506, 1350462, 1319646, 1311744, 1291044, 1290795, 1264586, 1280994, 1299804, 1226711, 1188879, 1252012, 1253029, 1206123, 1154373, 1161438, 1130518, 1178746, 1215777, 1239186, 1206544, 1112170, 1113772, 1150560, 1089409, 1111229, 1188274, 1151302, 1110361, 1180701, 1221054, 1164577, 1100029, 1104823, 1155434, 1152156]
4454A152156L573N9854l3676k0231M2445j0251n3698k9290L4880M905L323L4068
4442A188058J7080K472K5643o0745M2987L9453q062Q229M0920J6168P2106J17481
4430A501790J1755p523K6498p7201l4188Q7962J08099R5288J56206J00209K0670
4419A989565m5046j2846L3233l299q1095M7149O8725R1637N8508M2085j8659j1642
4407B158315k5232L5608O5241m7678Q045P5217P6439O9953L1589J1484N5453R3184
4395B607618J05643J00694J29682J53776J76113K02449M9981N5827J3961k5227
4385C570517P9201J84061K46300K89884L08678K01461J72629M3438N7500j02022
4375E051647q9450n8133L168J00726K03921J48931Q0960P0600K8362r1910j06660
$$ y = [1152156, 1155729, 1215583, 1181907, 1161676, 1204121, 1193870, 1140172, 1110882, 1145762, 1150667, 1153990, 1188058, 1205138, 1207610, 1233253, 1172508, 1215495, 1254948, 1246886, 1255115, 1296035, 1312203, 1384309, 1501790, 1513545, 1506022, 1532520, 1455319, 1421131, 1509093, 1617192, 1712480, 1868686, 1968895, 1989565, 1944519, 1931673, 1964906, 1961607, 1880512, 1927661, 1996386, 2088023, 2146531, 2188616, 2169957, 2158315, 2133083, 2168691, 2233932, 2186254, 2194299, 2269516, 2345955, 2415908, 2447497, 2458981, 2514434, 2607618, 2713261, 2813955, 2943637, 3097413, 3273526, 3475975, 3525956, 3581783, 3595744, 3570517, 3649718, 3833779, 4080079, 4369963, 4678641, 4880102, 5052731, 5096169, 5153669, 5051647, 4962197, 4904064, 4907232, 5007958, 5211879, 5360810, 5441770, 5512370, 5540732, 5448822, 5342162]
4364E342162j02435o9468m0516p3847m2383m1445k2997K115N4159P2257J8038
4353E095640J44115J05364L2661J10217J64637J20494J55824J12685J03564J99234
4343F344435K59818K33472K57402L14537L05121L56729M14212M99663N71427O61789
4333A0218605Q46562R35080J194088J627245K015831K563238L163987L931619
4325B6496255M657234N400432N873396N706333N023772M103635L085974K538370
4317F2885401K815148L975600O143176Q528271R760985R089081O370326K835594
4309A12403582m31461l343633n542313n569914m504161k211311N60726K206919
4301I3568434J791993l59777k893200m952842o922164q379382q161615p432300
$$ y = [5342162, 5239727, 5170259, 5129743, 5055896, 5013513, 4972068, 4949071, 4951186, 5005345, 5077602, 5095640, 5239755, 5345119, 5377780, 5487997, 5652634, 5773128, 5928952, 6041637, 6145201, 6344435, 6604253, 6837725, 7095127, 7409664, 7714785, 8071514, 8485726, 8985389, 9556816, 10218605, 11065167, 12000247, 13194335, 14821580, 16837411, 19400649, 22564636, 26496255, 31153489, 36553921, 42427317, 48133650, 53157422, 57261057, 60347031, 62885401, 65700549, 69676149, 75819325, 84347596, 94108581, 103197662, 109567988, 112403582, 111972121, 108628488, 103086175, 97516261, 93012100, 90800789, 91361515, 93568434, 95360427, 95000650, 92107450, 87154608, 80232444, 71853062, 63691447, 56259147]
4293E6259147o189385m697704l068128k215144k000514k236682k461373k548999
4285C0841218k929943k948276k541155k178613j885958j554363j261345j064463
4277A4477102p55554n27316m46149k70842j80162j98677j90855p3879L8882k9633
4267A1842917O2784P0642Q7401J96133J20173J20711K39453K81664K94600L61579
4257A3678057L87657M03930L84645M03394N85279N98986O92167Q04022P93587
4248A8731724Q88350R58724J060719J217047J268319J349500J426497J563526
4240B8464406J715531J799713J932793J994310K115859K199932K259761K460921
4232D4943226K598221K754575K981389L108500L169216L229633L340059L342193
$$ y = [56259147, 50069762, 45372058, 42303930, 40088786, 38088272, 35851590, 33390217, 30841218, 27911275, 24962999, 22421844, 20243231, 18357273, 16802910, 15541565, 14477102, 13721548, 13194232, 12748083, 12477241, 12297079, 12098402, 11907547, 11833668, 11872550, 11842917, 11905701, 11976343, 12063744, 12259877, 12380050, 12500761, 12740214, 13021878, 13316478, 13678057, 14065714, 14469644, 14854289, 15257683, 15842962, 16441948, 17134115, 17938137, 18731724, 19620074, 20578798, 21639517, 22856564, 24124883, 25474383, 26900880, 28464406, 30179937, 31979650, 33912443, 35906753, 38022612, 40222544, 42482305, 44943226, 47541447, 50296022, 53277411, 56385911, 59555127, 62784760, 66124819, 69467012]
4224F9467012L445877L348626L303998L298501L215436L097818L111246L070053
4216I5358567L002179L010278K949514K986705K896138K810675K449242K161772
4208A17625070J915718J520814J219774R29842O35927M31179K26412J26284k9024
4199A24601996l14648n03584p93771j104080j284331j651455j984433k160489
4191A14805205k440787k669961k940420k901684k956624l173534l172944l179503
4183I1369748l279012l251743l316959l376629l397192l426810l381125l308437
4175F4631841l285272l271029l128781l063731k855844k754750k690275k496142
4167D1086017k345079k297644k293320k144462j941234j875371j799472j689646
$$ y = [69467012, 72912889, 76261515, 79565513, 82864014, 86079450, 89177268, 92288514, 95358567, 98360746, 101371024, 104320538, 107307243, 110203381, 113014056, 115463298, 117625070, 119540788, 121061602, 122281376, 123211218, 123847145, 124278324, 124504736, 124631020, 124601996, 124287348, 123783764, 122989993, 121885913, 120601582, 118950127, 116965694, 114805205, 112364418, 109694457, 106754037, 103852353, 100895729, 97722195, 94549251, 91369748, 88090736, 84838993, 81522034, 78145405, 74748213, 71321403, 67940278, 64631841, 61346569, 58075540, 54946759, 51883028, 49027184, 46272434, 43582159, 41086017, 38740938, 36443294, 34149974, 32005512, 30064278, 28188907, 26389435, 24699789]
4159B4699789j582370j471691j257776j174037j115649r35686r49258q94515q03334
4150A4515473p06543o75241o90197n77132m56832n06177m54251l69851l16672
4141I762577l38902l40441k55660k93994k63692j96802j68811j89512j77954k74981
4131G261828k18381n9322j37604q6371j84628j84725p2383m7669r7125r6066k0707
4120F056847r5079o7241n2448m5534p1442l9929p95j16868j02060k9814m2707
4109E392930o0328n9924J2657K5450m7312J7649J4743O3470P2802N3754M1547
4098E527438o1061O7825k9550m6927M270N690o5220P1668K1978l4037L5098K9284
4086E526456J67557m218m3595R1205O4074M5300Q0559o6157k7880l4728k8685
$$ y = [24699789, 23117419, 21645728, 20387952, 19213915, 18098266, 17162580, 16213322, 15318807, 14515473, 13808930, 13133689, 12443492, 11866360, 11409528, 10903351, 10449100, 10079249, 9762577, 9423675, 9083234, 8827574, 8533580, 8269888, 8073086, 7904275, 7714763, 7536809, 7261828, 7043447, 6984125, 6846521, 6760150, 6575522, 6390797, 6318414, 6270745, 6173620, 6077554, 6056847, 5961768, 5894527, 5842079, 5796545, 5725103, 5685174, 5684379, 5567511, 5465451, 5435637, 5392930, 5332602, 5272678, 5285335, 5310785, 5263473, 5281122, 5295865, 5359335, 5432137, 5485891, 5527438, 5466377, 5534202, 5504652, 5457725, 5461995, 5467685, 5402465, 5474133, 5496111, 5462074, 5497172, 5526456, 5694013, 5689795, 5646200, 5737405, 5801479, 5846779, 5927338, 5861181, 5833301, 5798573, 5769888]
4075E769888P434p848o320j9169r397o4424o2356N519J6240r5773l3164N5352
4063E555982j6819k8834k0638n0720K2915L1358K2062Q548j4578K3524K7685J12143
4051E672628Q8262M1820O8654R4172J26977Q8558N6437J23489J63680J72200K00187
4040F897064J44220J07028J52046J79776J03313J39212J71946J32809K04787J97627
4030H429828J22199J80559J74633J73316J66460J27636J13686J99452J65255J53011
4020A0006035K63155K56798J69891K09859K04273K45026K94300L88891L45654
4011A2383882L92543M56543L61449N56269N49109N45388N79678O21521P59405
4002A7205787P62713Q45869J010284J108295J399200J519724J777844K025587
$$ y = [5769888, 5777322, 5769474, 5763154, 5743985, 5734588, 5670164, 5607808, 5613327, 5629567, 5533794, 5500630, 5555982, 5539163, 5510329, 5489691, 5438971, 5461886, 5493244, 5515306, 5523854, 5509276, 5532800, 5560485, 5672628, 5760890, 5802710, 5871364, 5965536, 6092513, 6181071, 6237508, 6360997, 6524677, 6696877, 6897064, 7041284, 7148312, 7300358, 7480134, 7583447, 7722659, 7894605, 8027414, 8232201, 8429828, 8552027, 8732586, 8907219, 9080535, 9246995, 9374631, 9488317, 9687769, 9853024, 10006035, 10269190, 10525988, 10695879, 10905738, 11110011, 11355037, 11649337, 12038228, 12383882, 12776425, 13232968, 13594417, 14150686, 14699795, 15245183, 15824861, 16446382, 17205787, 17968500, 18814369, 19824653, 20932948, 22332148, 23851872, 25629716, 27655303]
3994B7655303K407625K804252L271985L809382M434337N157724O046076P423684
3986F3010368R107815J1241040J3697080J6317861J8812177K0586795K1028273
3979A73801409K0085873J7723469J4010774R770123N686396J934780r09720k689818
3971B39413286l517326l392062k610314j285884J0472J287636J873120J350470
3963B33129398j03733k855537o157608r788929j3073349j5653723j7278464j7825045
3955A50393010j7374828j6282403j4774090j3061257j1331317r634252q085584
3948E9849279o743070n584241m636210l859614l310680k729404k233083j943610
3940B8809367j713552j516943j250546j053336q63803q33459p69001n93400n77391
$$ y = [27655303, 30062928, 32867180, 36139165, 39948547, 44382884, 49540608, 55586684, 63010368, 72118183, 83359223, 97056303, 113374164, 132186341, 152773136, 173801409, 193887282, 211610751, 225621525, 235391648, 241078044, 243012824, 242103104, 239413286, 235895960, 232503898, 229893584, 228607700, 228618172, 229905808, 231778928, 233129398, 233025665, 230170128, 224012520, 214223591, 201150242, 185496519, 168218055, 150393010, 133018182, 116735779, 101961689, 88900432, 77569115, 67934863, 59849279, 53106209, 47521968, 42885758, 39026144, 35715464, 32986060, 30752977, 28809367, 27095815, 25578872, 24328326, 23274990, 22411187, 21577728, 20808727, 20215327, 19637936]
3931A9637936n38648m20592m14286l30660m03693l34985k50392k05108j94786
3922A6544786k28570j79107j87138j95642o7352r2042j15952j9156o8412l1419
3912A5359996m9125j12347n1709Q6734J5819L9932Q181r2606L3576m8127L5812
3901A5226136N1789N282M9049K3307P8972J85623J75535J04411J57473K03805
3891A6261382K44962K84776K51763M05050M20313N18026O34322N94480P14605
3882B0329679P18628O75701P13669P37905O90341O61783P70645Q12195P65030
3873B6875576P54947Q57289R61198J034335J042746R71053R30632Q06457O75447
3864C4909680O03820M66582L12841K59003J38983K19446J47032J54403K89970
$$ y = [19637936, 19099288, 18678696, 18264410, 17933750, 17530057, 17195072, 16944680, 16739572, 16544786, 16316216, 16137109, 15949971, 15754329, 15686977, 15594935, 15478983, 15459827, 15391415, 15359996, 15310871, 15198524, 15146815, 15233549, 15249368, 15289300, 15297481, 15204875, 15238451, 15190324, 15226136, 15277925, 15283207, 15332256, 15355563, 15434535, 15620158, 15795693, 15900104, 16057577, 16261382, 16506344, 16791120, 17042883, 17447933, 17868246, 18386272, 19020594, 19615074, 20329679, 21048307, 21724008, 22437677, 23175582, 23865923, 24527706, 25298351, 26110546, 26875576, 27630523, 28487812, 29449010, 30483345, 31526091, 32497144, 33427776, 34234233, 34909680, 35513500, 35980082, 36292923, 36551926, 36690909, 36910355, 37057387, 37211790, 37501760]
3855C7501760L03164J93492J82834M4440j14718j05851j74908j79921j05114p7687
3845C7467491j53504j04374M7939K67396M03340M32665N91969Q27757J014642
3836D0795321J271303J527148J902087K225880K662860L222209L752255M433234
3828F1792297N047808N797726O779519P659765Q801855J0316321J2058876J4301276
3820A32555443J6844278J9400797K1501580K2596331K2601057K1670861J9836950
3813B77007297J7285792J4371719J1607005R294892P468496O489817O160715O453681
3805C56139414P200604P922574Q621959R221295R306246Q434573O356891K963188
3797D16166744j275630n578729r153218j1649475j3025723j3372144j2727889
$$ y = [37501760, 37804924, 37998416, 38181250, 38225690, 38110972, 38005121, 37830213, 37650292, 37545178, 37467491, 37313987, 37209613, 37257552, 37524948, 37928288, 38360953, 38952922, 39780679, 40795321, 42066624, 43593772, 45495859, 47721739, 50384599, 53606808, 57359063, 61792297, 66840105, 72637831, 79417350, 87077115, 95878970, 106195291, 118254167, 132555443, 149399721, 168800518, 190302098, 212898429, 235499486, 257170347, 277007297, 294293089, 308664808, 320271813, 329566705, 337035201, 343525018, 349685733, 356139414, 363340018, 371262592, 379884551, 389105846, 398412092, 406846665, 413203556, 416166744, 414891114, 409312385, 400159167, 388509692, 375483969, 362111825, 349383936]
3790C49383936j1800043j0697211r642701q857917q308554q139365q105478q445603
3782B75387064r012111r711697j0521974j1130330j1387718j1552252j1321317
3775B00749665j0854768j0348997r567469r133878q770397q308719q149726q024081
3767A27591630p979195q009380q034241p973267p753386p396405o806283o208506
3759F7430967n605908m853214m159321l668651l105151k541949k085637j590145
3751C9820991j339779r77798n85997k97529j81191j45524m3324j02221j37137
3742C6010491k05651k63389m01083l13120j42533n2277k8635K01722K51565L50569
3732C5407659L91697K70581J94635n9551j82147l57580o75494q54373r17045r89451
$$ y = [349383936, 337583893, 326886682, 317243981, 308386064, 300077510, 291938145, 283832667, 275387064, 266374953, 256663256, 246141282, 235010952, 223623234, 212070982, 200749665, 189894897, 179545900, 169978431, 160844553, 152074156, 143765437, 135615711, 127591630, 119612435, 111603055, 103568814, 95595547, 87842161, 80445756, 73639473, 67430967, 61825059, 56971845, 52812524, 49143873, 46038722, 43496773, 41411136, 39820991, 38481212, 37503414, 36917417, 36619888, 36438697, 36293173, 36249849, 36147628, 36010491, 35804840, 35541451, 35140368, 34827248, 34684715, 34632438, 34603803, 34805525, 35057090, 35407659, 35799356, 36069937, 36264572, 36205021, 36022874, 35665294, 34989800, 34135427, 33218382, 32228931]
3722C2228931j057113j120842r26068q63090r00002q32461p14254p14914p13353
3713B4386834q64650q86719r63907j058728r56742j010870j058017r71493r53945
3704A5661763q48848q06409p20547p00334n95122n30378l92041l57531l46998
3695A0363555l15823l70024l02357k35744j93344j57628j73345k39118j81706
3686H194466k12557j81397j92680j45759j38780j60271k06423q6272j34196j90394
3676F545737j38635j08956q2298o9166j91444j17965p7715j52788j53011j22434
3666E331325q1278j70513j71240k01194n3229o4871k37899j02225m6223r0835
3656D111818j05681k7237r4731j29110j25164k7178P8411M495m7646k7309M1657
$$ y = [32228931, 31171818, 30050976, 29124908, 28261818, 27361816, 26529355, 25815101, 25100187, 24386834, 23522184, 22635465, 21671558, 20612830, 19656088, 18645218, 17587201, 16615708, 15661763, 14812915, 14006506, 13285959, 12585625, 11990503, 11460125, 11068084, 10710553, 10363555, 10047732, 9677708, 9375351, 9139607, 8946263, 8788635, 8615290, 8376172, 8194466, 7981909, 7800512, 7607832, 7462073, 7323293, 7163022, 6956599, 6870327, 6736131, 6545737, 6407102, 6298146, 6215848, 6146682, 5955238, 5837273, 5759558, 5606770, 5453759, 5331325, 5250047, 5079534, 4908294, 4707100, 4653871, 4589000, 4351101, 4248876, 4202653, 4111818, 4006137, 3978900, 3884169, 3755059, 3629895, 3602717, 3681128, 3685623, 3637977, 3610668, 3652325]
3645C652325n4460l9271Q482J1475K48L2454k3207k9810N1544K1959o1585O9138
3633C639292R914p884J27357J067N3943k7518r400M5034j5584R0761Q2248J7519
3621D006749l6555K9416K8553j4468P7352J5847r191P2530P6172j4276m6671J04304
3609D289762L0674k1369P0848L6143K077N3997j7008r5890N4220Q3144O3011P0378
3597D619987J1240J4608m8329Q3310J12192O4050R7595r548M0823J18537P1742
3586E176207j9559J4705Q5807m956M6232J26918N2749k8R0092Q7751l2677J24819
3574E748060P4553R486O9894Q2992O1573J510N0927J0118M5901O1523M9589M6084
3562F312210M2059r600N9057N1274K0487R4575J09511O7333J38026N4101J6884
$$ y = [3652325, 3597865, 3558594, 3567076, 3578551, 3578799, 3611253, 3588046, 3558236, 3609780, 3631739, 3570154, 3639292, 3649206, 3641322, 3768679, 3769746, 3823689, 3796171, 3786771, 3831805, 3816221, 3906982, 3989230, 4006749, 3970194, 3999610, 4028163, 4013695, 4091047, 4106894, 4097703, 4170233, 4246405, 4232129, 4185458, 4289762, 4320436, 4299067, 4369915, 4406058, 4408135, 4462132, 4445124, 4349234, 4403454, 4486598, 4549609, 4619987, 4631227, 4645835, 4597506, 4680816, 4793008, 4857058, 4954653, 4945105, 4985928, 5104465, 5176207, 5156648, 5171353, 5257160, 5252204, 5298436, 5425354, 5478103, 5478075, 5568167, 5655918, 5623241, 5748060, 5822613, 5832099, 5901993, 5984985, 6046558, 6048068, 6098995, 6109113, 6155014, 6216537, 6266126, 6312210, 6354269, 6344669, 6403726, 6455000, 6475487, 6570062, 6679573, 6746906, 6884932, 6939033, 6955917]
3551F955917J21115O3266L9601N0216R1875O8813J04734J01646M3986J26944J32379
3540G900492O6968J91496J18927J7778L8243J72327J00603J89949J51924M3210
3530H991917J20525R0281J46854J55707L4708M1481J36797R3437M6691L9842P0303
3519I968543N0072K2905L0129q8913K6556L7571k1489o2811K4297K1489p2118
3508I936231n8159j40147m8232n5398j43219q4037r0026p8943j27916j14327j91142
3497H804685p6458j03425q4603l7024j90716j93537j76755r9195j37717j69142
3487G536113j40524j04436j22547r3225j28788j6510j13457j09632r6825r2841
3477F517328j07173o1508q9837j18997j3890n7314p7315j9195n232j2870m8563
$$ y = [6955917, 7077032, 7140298, 7179899, 7230115, 7321990, 7390803, 7495537, 7597183, 7641169, 7768113, 7900492, 7967460, 8158956, 8277883, 8295661, 8333904, 8506231, 8606834, 8796783, 8948707, 8991917, 9112442, 9202723, 9349577, 9505284, 9539992, 9581473, 9718270, 9811707, 9858398, 9898240, 9968543, 10018615, 10041520, 10071649, 9982736, 10009292, 10046863, 10025374, 9962563, 9986860, 10008349, 9936231, 9878072, 9737925, 9689693, 9634295, 9491076, 9407039, 9317013, 9238070, 9110154, 8995827, 8804685, 8728227, 8624802, 8540199, 8503175, 8312459, 8118922, 7942167, 7842972, 7705255, 7536113, 7395589, 7291153, 7168606, 7075381, 6946593, 6930083, 6816626, 6706994, 6610169, 6517328, 6410155, 6348647, 6258810, 6139813, 6125923, 6068609, 5991294, 5972099, 5966867, 5953997, 5905434]
3466E905434k5261o3365J27992J5480n3733m5099l1301r7600q3023j352p1544
3455E576628l2721l3887j20550J2809j8109j79826n3436p2197j36500j80479m3123
3444D718609j10209j53609j84331q6911K9018j25865j69019o6927j0106q6895
3434C753755n9406k3011j11919r6290K7777J3701o9489j47472j01793Q4650j1642
3423C258861l9268j7408m7469j06171o5480j5790p3087m8756m328m0867j0824
3412B789413J5162K4468j35300j55392l3734j8292l343j5668m6600j843L487n7714
3400B364644r5728r5619q1778k1179O6071n0219p8670M055j393q094p3678p9169
3388A849243N7249m7671l31l3562j2211K8242p4532o7670J6471M9023q3430M042
$$ y = [5905434, 5880173, 5816808, 5944800, 5960280, 5906547, 5861448, 5830147, 5732547, 5649524, 5648172, 5576628, 5543907, 5510020, 5389470, 5402279, 5384170, 5204344, 5150908, 5078711, 4942211, 4761732, 4718609, 4608400, 4454791, 4270460, 4183549, 4212567, 4086702, 3917683, 3850756, 3840650, 3753755, 3694349, 3671338, 3559419, 3463129, 3490906, 3504607, 3435118, 3287646, 3185853, 3270503, 3258861, 3219593, 3202185, 3154716, 3048545, 2983065, 2967275, 2894188, 2845432, 2841104, 2800237, 2789413, 2804575, 2829043, 2693743, 2538351, 2504617, 2486325, 2482982, 2467314, 2420714, 2418871, 2422358, 2364644, 2268916, 2173297, 2091519, 2070340, 2136411, 2086192, 2007522, 2011577, 2010184, 2002090, 1928412, 1849243, 1906492, 1858821, 1858490, 1824928, 1812717, 1840959, 1766427, 1698757, 1715228, 1764251, 1680821, 1684863]
3376A684863m581n1644k0790M165m2318o6091k6926q1224o6503L429j8146j134
3364A313100P459o8468M8658P147o7054m4661J7883m9884n1822l8697K1043O6017
3352A160721m1712l0166L153M7075k0169n3887k6926L3N23K0220K9068N2429l7175
3339A103187k5541k5521j9621J1664N3512K5907P9589j5467j6583l0869j4577
3328A125680j01242r8446K2518k187r9236M9888P0510r0893o4508l2885K0023
3317G99222N40M5405J2010J1847r04r270m8366o4003L4298J04275N1864K6719
3305I63637L5858n8619l2030L8923k5901L3865J9076j09462k5599P9770k5321
3294H94197p9922j7107M958l0233J5586j3052k2509o5560m3622O7380P3458L6735
$$ y = [1684863, 1680282, 1628638, 1607848, 1612013, 1569695, 1503604, 1476678, 1395454, 1328951, 1332380, 1314234, 1313100, 1320559, 1252091, 1300749, 1307896, 1240842, 1196181, 1214064, 1164180, 1112358, 1073661, 1094704, 1160721, 1119009, 1088843, 1091996, 1139071, 1118902, 1065015, 1038089, 1038122, 1038645, 1058865, 1087933, 1140362, 1103187, 1077646, 1052125, 1032504, 1044168, 1097680, 1123587, 1203176, 1187709, 1171126, 1140257, 1125680, 1024438, 925992, 948510, 946323, 847087, 896975, 967485, 876592, 812084, 779199, 799222, 799762, 845167, 857177, 869024, 868120, 858850, 810484, 746481, 780779, 885054, 936918, 963637, 999495, 940876, 908846, 947769, 921868, 955733, 974809, 865347, 839748, 919518, 894197, 814275, 797168, 802126, 771893, 787479, 774427, 751918, 686358, 642736, 710116, 783574, 820309]
3282H20309o3568q7579M3219o104j4827j6618n4657N6612j7266q3555M2293K1104
3270F39363L614j8274j1022L8895m350n9928n5252k1953N7229L1357K110n233
3258E96556n9015p4408K0621k4494L0730K708j4828l7142j8140r9315k9871j40
3246B93262N6668M2865r4115q2224O1951K5726n1929q632j1735M399n3394M5083
3234B27925n6242p2506m7263P2433J386N1309J5735n6765J0458o5202M2539L7818
3222A61625q9259Q6971k861n3734M5562j2051m3334q7320k022r726o4337M2861
3210b7625M6579P650j8202J4994K2759j4093j1975q583r117o181L7837P070P631
3197D8744O327j7107K8671L6021j4647k1739N730l3030k7045N2317K3537J0663
$$ y = [820309, 756741, 669162, 712381, 706277, 691450, 674832, 620175, 676787, 659521, 575966, 618259, 639363, 642977, 624703, 613681, 652576, 648226, 588298, 533046, 511093, 568322, 599679, 601789, 596556, 537541, 463133, 483754, 459260, 489990, 492698, 477870, 440728, 422588, 323273, 293402, 293262, 349930, 392795, 298680, 216456, 278407, 304133, 252204, 243572, 231837, 236236, 182842, 227925, 171683, 99177, 51914, 124347, 125733, 177042, 192777, 136012, 146470, 81268, 123807, 161625, 72366, 159337, 156476, 102742, 148304, 136253, 92919, 5599, 3577, -6149, -70486, -27625, 18954, 26604, 8402, 23396, 46155, 32062, 20087, 11504, 2387, -3794, 34043, 41113, 48744, 55071, 37964, 66635, 102656, 88009, 66270, 72000, 38970, 11925, 64242, 87779, 98442]
3185I8442O6893J4608l0969o8462R7801L9818p634Q0604q635K348O591N9276m393
3172C46288l7266L9313N4425n4794j9270J2487n0394n039Q606M8954j5200j6463
3160C11647R2267L7382M1415O3070L855M941K9036k1299J0477K3246j1085L5149
3148F20101L0828J1728N0469P8772M0129M1170l4195k4822J6565r989K0662L4875
3136H76293Q8785j11995j23005K6115Q346N0134J3799r175J6293k6616O434J3097
3124H28505j0514M148O1005Q5771K521r820Q0638J18862M7711O0282k4563o8257
3112A176289m8871p701j00598J1835p2973j00957J0686l7910m9077l2909n4955
3101F92859J00509j7240k2625J7172k6334M5392K2906n3013p7624Q08o6793K0079
$$ y = [98442, 165335, 179943, 148974, 80512, 178313, 218131, 210497, 291101, 282466, 284814, 291405, 350681, 346288, 309022, 348335, 402760, 347966, 328696, 341183, 290789, 285750, 294356, 343310, 328110, 311647, 403914, 441296, 482711, 545781, 549636, 554577, 583613, 562314, 572791, 596037, 584952, 620101, 650929, 662657, 713126, 791898, 832027, 873197, 839002, 814180, 830745, 820756, 841418, 876293, 965078, 853083, 730078, 756193, 764539, 814673, 828472, 819297, 835590, 808974, 815408, 828505, 817991, 822139, 883144, 968915, 971436, 961616, 1042254, 1161116, 1208827, 1269109, 1244546, 1176289, 1127418, 1119717, 1019119, 1030954, 957981, 857024, 867710, 829800, 780723, 747814, 692859, 793368, 776128, 753503, 770675, 744341, 789733, 812639, 759626, 682002, 682810, 616017, 636096]
3089F36096N6471P6221J7159q3467Q6975J4820j0057m9216o9258J2007n2907J960
3077F36804p5794K6818M82k9589P981m1981k6077O3786k4442J3252P2573K6620
3065F50433n4885K7366J6585m6741n2895j08617m5230l326j7231O8887j4729n1190
3053C68427p2426L5535k4629K1009J00443l8799J5457p7229r1335K8804q723M2317
3041B98851j4550M809j5670O946O0286m7258l214O2177n0322o7059O8220L5900
3029C39116M68q0136q3104K9574O5458n2219k1579L316k1018l4178L4577o955
3017A73320l0677M1461m9459L6281n8586r4161m9717P8151J5916k6014L5510j2093
3005E9932o590m0584m2809O8951p402n3635M927O2105K0487n2412Q7885J5807
$$ y = [636096, 692567, 768788, 785947, 702480, 789455, 804275, 794218, 745002, 675744, 687751, 634844, 636804, 561010, 587828, 588310, 558721, 566702, 524721, 498644, 562430, 537988, 551240, 623813, 650433, 595548, 622914, 639499, 592758, 539863, 431246, 386016, 382690, 365459, 434346, 419617, 368427, 296001, 331536, 306907, 327916, 428359, 389560, 405017, 327788, 236453, 265257, 256534, 298851, 284301, 289110, 273440, 280386, 340672, 293414, 290200, 352377, 302055, 234996, 303216, 339116, 339584, 259448, 176344, 205918, 271376, 219157, 197578, 200894, 179876, 145698, 180275, 173320, 142643, 184104, 134645, 170926, 112340, 18179, -31538, 46613, 62529, 36515, 72025, 59932, 53342, 12758, -30051, 38900, 31498, -22137, -17210, 44895, 65382, 12970, 100855, 116662]
2993A16662j5121j12347m8902m6340O3772R007J11820m0135j36967L527K2387
2982g2637J7835M2272k0347m3211O7967o789K2937j3646l6251l1714n925k1772
2970a01281r0382L5682L1724j0564l361N5174r483l558q0554K5758J05497o784
2958e2132j6363k7299P4436m3803l8472Q6042k7067k6773L6911L5269l099m2065
2946d4415M6371J1112M9750o7631l8551j2973m6276N3767M673P5429J2535j3386
2934C0405o349J6294L4827o7467o7870k1410N6431L1973J3235j8800Q1946k8690
2922E4525q198N3245l8790p1612R733O2811N301p1204j817J5585O6432J4792o3232
2909B7571k1393J5455j2878Q104J17295j2699M4364l689j27148q046N0786L0935
$$ y = [116662, 101541, -10806, -59708, -106048, -42276, -33269, 78551, 38416, -98551, -95024, -72637, -54802, -12530, -32877, -76088, -8121, -14910, 8027, -5619, -41870, -73584, -79509, -101281, -191663, -155981, -124257, -134821, -138182, -83008, -92491, -96049, -176603, -150845, -45348, -52132, -68495, -95794, -21358, -65161, -103633, -17591, -44658, -71431, -34520, 749, -2350, -44415, 1956, 13068, 62818, -4813, -43364, -56337, -102613, -48846, -44173, 31256, 43791, 30405, 24056, 40350, 75177, 7710, -60160, -81570, -25139, 6834, 20069, 1269, 83215, 54525, 46327, 99572, 60782, -10830, -1097, 61714, 67015, -4189, -6006, 9579, 76011, 90803, 27571, 6178, 21633, 8755, 16859, 134154, 121455, 165819, 162130, 34982, 26936, 77722, 108657]
2897A08657k1625N9073J2940m0972O946J5574J1938o9573o2677n1547J3233L7570
2885A9537P9141q8743m2055m5758J4324k381P299O4277Q753j946k2660j8787j0060
2872c9059Q1417j1462j9195j0672j28077k7198Q3766K1126J3588O6892k2999p3208
2860f5081p4933p3065P1271J12055o1387J7923L5848j7617o2790J9915K6327j9381
2848i0915j7711n1944M5371k3171j8651P400j401j2123M6195o0634K338N1077
2836a24169m505m74J007J7843J2R649J1072j6154J528j7819r0643M1604M2132
2823a28917O282R6770k3440r217N250m200n0419O6755O8413j5559K1200J7059
2811D9977n5360N3085j45j05617J5290J5261o3616R6551L6412M8047p4208k963
$$ y = [108657, 87032, 146105, 159045, 118073, 125019, 140593, 152531, 82958, 20281, -31266, -18033, 19537, 98678, 9935, -32120, -77878, -63554, -65935, -58636, 5641, 14394, 12448, -10212, -28999, -39059, 42358, 30896, 11701, 1029, -127048, -154246, -70480, -49354, -35766, 31126, 8127, -65081, -140014, -213079, -141808, -29753, -91140, -73217, -37369, -54986, -117776, -97861, -71534, -90915, -108626, -160570, -115199, -138370, -157021, -149621, -151022, -163145, -116950, -177584, -175246, -124169, -128674, -129148, -128141, -110298, -110286, -100637, -89565, -105719, -104191, -122010, -212653, -171049, -128917, -122635, -25865, -49305, -58522, -53272, -57472, -107891, -41136, 27277, 11718, 32918, 49977, -5383, 47702, 47557, -58060, -42770, -27509, -91125, 5426, 41838, 89885, 15677, 12714]
2799A2714l8762m6133R7071J9134j9843m9400M4055N2277M0308l3294o6718M2364
2787E3773O035J5175q253j1065N0511O4602M9896k7520m8680o2837K9173J5799
2775A26609M02n5666N0736k8030Q57M5378r4209o5155K9853j3232J7351M1758
2763E6652N5716o3281m3755K115P6041m2710p2542n29O7982J4040k9011K3029
2751D3747n0992J5116K3112k6305k26k5352j6775J09552M1493J0850p682m0296
2739G6242j9243n978K818n9944l1133M7211K3996r797J7170m8201K7120J6587
2727C6848n1408L6467K3037j26397j2996K3046N2115K7188n0767M4600K9409n7526
2715b6384m9791j0658M6549L581K8897K9682L1290l200p6493n537K6090J1873
$$ y = [12714, -26048, -72181, 24890, 44024, 24181, -25219, 18836, 71113, 111421, 78127, 11409, 53773, 59808, 74983, 66730, 55665, 106176, 170778, 220674, 193154, 144474, 81637, 110810, 126609, 127011, 71345, 122081, 94051, 94908, 140286, 46077, -19078, 10775, -2457, 14894, 56652, 112368, 49087, 5332, 7447, 83488, 40778, -31764, -32293, 35689, 49729, 20718, 43747, -7245, 7871, 30983, 4678, 4452, -20900, -37675, 71877, 113370, 124220, 116538, 76242, 56999, 51021, 53839, -6105, -37238, 9973, 33969, 24172, 41342, -6859, 20261, 36848, -14560, 21907, 44944, -81453, -94449, -71403, -19288, 7900, -42867, 1733, 31142, -26384, -76175, -86833, -40284, -36703, -7806, 21876, 53166, 49966, -26527, -32064, -5974, 5899]
2703E899o0500L4674n837j2711L6622p140K4379m2060k0157J1991k232l6618K0028
2690e3662R7218n1508k2118o243L5864k0396k6407M3085l2347N1397J3813k4946
2678C750p5347n219Q4931J0661m7838o9250j7260O9706n6692L4581O3822l1432
2666c5587j5081n7787K6451m1047M579K9949L9832L8718j8520N871J5169j38947
2654a46400M1262L4252l2273K4502k3715j986Q3416k6153j54261K0211L4384J4651
2642a32110N4906n9648m2413j820k1578J6912J16221L4392k4343l6545L1421m1706
2630a06311m753l4867j2545N0411O986M079j4981l2208K9391M0538m6330L5442
2618h5148Q7617o0964k1188N8016l4770p6448K6266j7209k7637P997J5481j571
$$ y = [5899, -54601, -19927, -25764, -38475, -1853, -8993, 15386, -26674, -46831, -34840, -37072, -73690, -53662, 43556, -7952, -30070, -36313, -449, -20845, -47252, -4167, -36514, 14883, 28696, 3750, -71597, -76816, 8115, 18776, -29062, -98312, -115572, -45866, -102558, -67977, -4155, -35587, -50668, -108455, -82004, -123051, -118472, -88523, -48691, -9973, -28493, -22622, -7453, -146400, -105138, -70886, -103159, -78657, -102372, -104358, -20942, -47095, -201356, -181145, -146761, -132110, -77204, -136852, -179265, -181085, -202663, -185751, -69530, -35138, -59481, -96026, -64605, -106311, -111064, -145931, -158476, -108065, -101079, -97000, -111981, -144189, -114798, -74260, -120590, -85148, 2469, -58495, -79683, -21667, -56437, -132885, -106619, -123828, -151465, -143468, -127987, -129558]
2606a29558K9025L5802j4391N7508P112q7827L4189L802k7520J5161j4269P3650
2594a7316Q5500p5785l5989o777n108Q5118q550M5950n6171L7087k3244K9566
2582E4281Q0670N6866j5789R254O6401L448l6464m0914n626P89j9760j1871n2610
2569H8675j0396J8932n8480J1736L0415l3119k8667k9687J9058k2461N2880L1963
2557G0849Q967l542K0246p5697l2489K812M0030j7113J8324J8035l0283R4744
2545A14883J6971n0499o4374j5037O101K8255O711M9643m91N6870l2995p6990
2533C9048K4406L0224l6202p2170j6010O5964L202k5373Q5899m7867o709j4762
2521B9650l0965k1630j9308M3614n3365P0672l733o0424O0235L8680n145k0542
$$ y = [-129558, -100533, -64731, -79122, -21614, -14502, -102329, -68140, -64338, -91858, -76697, -90966, -17316, 68184, -7601, -43590, -50367, -55475, 29643, 21093, 67043, 10872, 47959, 24715, 54281, 134951, 191817, 176028, 185282, 251683, 255131, 218667, 177753, 172127, 172916, 153156, 141285, 88675, 78279, 97211, 38731, 50467, 80882, 47763, 19096, -10591, 8467, -13994, 38886, 70849, 79816, 76274, 96520, 20823, -11666, -8854, 31176, 14063, 32387, 50422, 20139, 114883, 131854, 81355, 16981, 1944, 8045, 36300, 43011, 92654, 92163, 149033, 116038, 39048, 63454, 93678, 57476, -14694, -30704, 35260, 38462, 13089, 98988, 51121, 44412, 29650, -1315, -22945, -42253, 1361, -52004, 18668, 14935, -45489, 14746, 53426, 48281, 27739]
2509B7739k2997j0232L6708r372k1710m1902Q127p261l5931N3233J7178j6634
2497b3054k2588J5733L5693j7421n3458P239Q331L8881l2231j4526j9651l4301
2485a11353L0901M1773o5951m379j9719o378N4756n2668k0463L8084M9553l1898
2473i7742L0987j9973P772j073O1074k660K6943J5308n2148J3237O1658N2000
2461I5383p1606n2468M3031L3415j1531N5990r299k7037J8120j2187m7606N9350
2449G3555p0000q4990J1662Q1825K2605l682J0621K869l6534j625J3428L6178
2437E5912r249K7758N7806o6999N2550Q5333r2183L1641J3276m3905l1585Q753
2425H9108J22506j482J666O370J8645M9568J4206n0914q7842K0338M1628j0184
$$ y = [27739, 4742, -5490, 31218, 21846, 136, -41766, -33639, -40900, -76831, -23598, -6420, -23054, -45642, -29909, 5784, -11637, -65095, -57856, -49525, -10644, -42875, -57401, -77052, -111353, -80452, -38679, -104630, -109009, -128728, -135106, -80350, -133018, -153481, -115397, -65844, -97742, -66755, -86728, -78956, -80029, -18955, -21615, 5328, 20636, -31512, -18275, 43383, 95383, 23777, -28691, 14340, 47755, 36224, 92214, 82915, 55878, 73998, 61811, 14205, 73555, 3555, -81435, -69773, 12052, 34657, 30975, 41596, 44465, 7931, 6306, 19734, 55912, 46663, 74421, 132227, 65228, 117778, 203111, 110928, 142569, 155845, 111940, 80355, 89108, 211614, 210132, 211798, 218168, 236813, 286381, 300587, 249673, 161831, 182169, 223797, 213613]
2413B13613J7242m3583M0529K792n0418j8962l4838O5905O1809J1195J4379k2063
2401B57600K2977J7079j0877k3554o5513J4572L530L9284P9335L1327p9229r101
2389B77430M6085M282K3971m0369K9456p633Q2019k0824O648M7202k1138k1471
2377D05658L250m320J5874j3464o590J8880l6373K4670K7778K4990M8253O0033
2365E68639o6520m3922J040k2804J7386N8930N3325l4935l2151L8100J6567N337
2353E58992m8488k8488O7429R279K9320P6682J0653L4572O5959K1116j2115R6740
2341H81651K0181R1660J04959J8982L0107J43574Q4316J45795K04575L03082L46042
2330B374924M05319M11271L81578K37701K57170J98098L12137N75337O94686R70202
$$ y = [213613, 230855, 187272, 227801, 230593, 180175, 161213, 126375, 192280, 254089, 265284, 279663, 257600, 280577, 297656, 286779, 263225, 197712, 212284, 215814, 255098, 334433, 365760, 286531, 277430, 323515, 327797, 351768, 311399, 340855, 333222, 415241, 394417, 401065, 448267, 427129, 405658, 408908, 404588, 420462, 406998, 400408, 419288, 382915, 407585, 435363, 460353, 508606, 568639, 502119, 458197, 459237, 436433, 453819, 512749, 566074, 531139, 498988, 537088, 553655, 558992, 510504, 482016, 549445, 558724, 588044, 664726, 675379, 709951, 775910, 797026, 784911, 881651, 901832, 993492, 1098451, 1117433, 1147540, 1291114, 1375430, 1521225, 1725800, 2028882, 2374924, 2780243, 3191514, 3573092, 3810793, 4067963, 4266061, 4578198, 5153535, 5848221, 6818423]
2320F818423J275555J803253L218533N765936P716894P730290N312513J904633
2312D1546030n74823k525873n121687n211740m664449m249726l661405l113695
2304A2422632k646537k075752j405368r42252m71682l39314l74753m02517l19103
2295C445354m36653k49501k10202l03205j89165r0304j18474j85559j95827o9909
2285A396555m3640l6178m7418o0149q6770k9679q017k3100k9557l9661o9955n1526
2273H70905m3918m1912n1501j2874K1115K8856j7562k8916m5405L03m9128Q8043
2261G18006k0069r5518j0119Q706K0884j02158m0218o683k6442J1953m549l9818
2249D13975j5861q87n0451P1646Q972l239l9438n3102J0711J8586n5212p8484
$$ y = [6818423, 8093978, 9897231, 13115764, 18881700, 26598594, 34328884, 39641397, 41546030, 40971207, 38445334, 33323647, 28111907, 23447458, 19197732, 15536327, 12422632, 9776095, 7700343, 6294975, 5352723, 4881041, 4541727, 4166974, 3764457, 3445354, 3008701, 2759200, 2548998, 2245793, 2056628, 1966324, 1847850, 1662291, 1466464, 1396555, 1352915, 1316737, 1269319, 1209170, 1122400, 1092721, 1084704, 1061604, 1032047, 992386, 922431, 870905, 826987, 785075, 733574, 720700, 741815, 770671, 753109, 724193, 678788, 679091, 629963, 718006, 697937, 602419, 592300, 601006, 621890, 519732, 479514, 472831, 446389, 458342, 453793, 413975, 398114, 397227, 346776, 418422, 427394, 424155, 384717, 331615, 342326, 360912, 305700, 227216]
2237B27216J5497P1105N1551o4181l1279q4001m4519M8817k8710k3721R32K7022
2225A65729N1128K1654M2836l8073j13974j6434N0489m5566j1774M795J5810O2809
2213A89429K9587k2291r3937o7189N0496L2116l2159o66n422k937N9916j7107
2201A19836j113n2440m2058K1941L1520J260J1498L4899l0174q197l4544k207
2189E0221j4140j4051O1363K8238q9223j9100K459J5857m4143P6444k8592o0267
2177c4934O463M2972m957o3138J2637l8473P964k6137P6907M7974p1392m0939
2165h5053k735K2946J8573J3018M7145k7656k0897k5755j4154j8011n0594O4918
2153g8255N1033n8416M1070L1671r6316q538L6240j7749N7854O3085k3981m2007
$$ y = [227216, 242713, 313818, 365369, 301188, 269909, 185908, 141389, 190206, 161496, 137775, 138707, 165729, 216857, 238511, 281347, 243274, 129300, 112866, 163355, 117789, 106015, 110810, 126620, 189429, 219016, 196725, 102788, 35599, 86095, 118211, 86052, 85386, 79964, 77027, 136943, 119836, 118723, 66283, 24225, 46166, 77686, 78946, 90444, 125343, 95169, 86972, 52428, 50221, 36081, 22030, 83393, 111631, 22408, 3308, 5767, 21624, -22519, 53925, 25333, -34934, -28471, 14501, 9544, -53594, -40957, -79430, -71466, -97603, -20696, 27278, -44114, -85053, -87788, -64842, -46269, -33251, 13894, -13762, -34659, -60414, -74568, -92579, -143173, -78255, -27222, -85638, -44568, -12897, -109213, -117751, -81511, -99260, -41406, 21679, -2302, -44309]
2141d4309J4839l9820m0175j1570L2666M4946M7278l0208l9454J2365J4410Q263
2129c0769j2868n4186n13L8643o480M6481K8114J970K3583l3159M110l2122p5954
2116a03150l9342J6637Q5061J7694n1148L1254K826j3229J9734K5248O592r337
2104a1160j8894l7901L4192M0682j4220O686K5262n4066K986j1200L7282R4384
2092I4033j0890j5152l3545L685K78o7297m0310K3746L8940n2539j280J6348N5874
2079A1891k5468L141l058K470j2578j2102Q4239P4350n5219m4695m4976J3680
2067h325l2921O4181O9689o0166o5079J4347r28R874N5281Q149k0806m9239N5521
2054C9578J7006j9845l0389R0272j8246L9735K7131M8787M188p3306Q4536J9652
$$ y = [-44309, -29470, -69290, -109465, -121035, -88369, -43423, 3855, -26353, -65807, -53442, -39032, -30769, -43637, -97823, -98336, -59693, -66173, -19692, 8422, 10392, 33975, 816, 4926, -27196, -103150, -142492, -125855, -40794, -23100, -74248, -42994, -40168, -53397, -33663, -8415, -1823, -11160, -30054, -67955, -33763, 6919, -7301, -615, 24647, -29419, -26433, -37633, -351, 94033, 83143, 67991, 34446, 38131, 38409, -28888, -69198, -45452, -6512, -59051, -60331, -43983, 11891, -13577, -10436, -13494, -11024, -23602, -35704, 48535, 122885, 67666, 22971, -22005, -8325, -41246, 22935, 92624, 32458, -32621, -18274, -19202, -9328, 45953, 54102, 33296, -15943, 39578, 56584, 36739, 6350, 96622, 78376, 118111, 145242, 194029, 198217, 124911, 209447, 229099]
2042B29099l7346J4402k4786j2214n1647l8398L164j3707k1544j7620k9149L1717
2030C1971l6397m4427o5867K4653K4083M449j2579L1445R962j01950k1249L8047
2018a17859L3037O315k6872q209n4144k3583L1105K8569N0163m0439m6837k853
2006a71607j6572O183L1604j5512q0554K0694J7183M7512l527J0191k2927p2119
1994b49451j4520J4892O8418p9874M6414k3509J3322k6826M303N7941r326n2986
1982b51202K6884N2896j5116j6239O1011Q284M8108L185k6916p7703J4693L3684
1970a38431K2216J4398L0540N3948l6462m4491j5489J9135K8754O0695J3838K7029
1958C5680K7806l7054L618l8143q4778P6484l6906l8129J83271K748p2341Q070
$$ y = [229099, 191753, 206155, 181369, 169155, 117508, 79110, 82274, 68567, 47023, 29403, 254, 31971, -4426, -48853, -114720, -90067, -65984, -61535, -74114, -42669, -32707, -134657, -155906, -117859, -84822, -78507, -105379, -113588, -167732, -191315, -160210, -131641, -81478, -121917, -168754, -171607, -188179, -181996, -150392, -165904, -246458, -225764, -208581, -161069, -164596, -154405, -177332, -249451, -263971, -249079, -180661, -260535, -214121, -237630, -224308, -251134, -246831, -188890, -198216, -251202, -224318, -171422, -186538, -202777, -141766, -133482, -85374, -82189, -109105, -186808, -172115, -138431, -116215, -101817, -71277, -17329, -53791, -98282, -113771, -94636, -65882, -5187, 8651, 35680, 63486, 26432, 30050, -8093, -92871, -16387, -53293, -91422, 91849, 94597, 22256, 30326]
1946C0326L4601n7216m2604M6383J6617O919J4589K0130L6995l339n2836K0764
1934G1329k7682l6405K6469j5110P380J03827M1943j6415n7581m9313M6614j053
1922I4003m0613l5690L9866J33148n3182n373J8088q488n1640J6343k9857Q392
1910H4997k37o0725J0161P962L1051m0601N718J22009n5238n1268r909n2411K9852
1897B1361O028K9201N3737p2977J677J0830n6887L9947l0463n3512R649L3889
1885g520M9482l8443k2172r400o5598N0833L9951j6185R183p7914P2787L4526
1873A9530p1872J6508n8786l9631M829M0440L4738l8435m7212L1476Q4903N3155
1861B9643j33992j1674O7131p9917K9956J5143P1480l874m4586M5692m9349k3878
$$ y = [30326, 64927, 7711, -34893, 11490, 28107, 35026, 49615, 69745, 106740, 103401, 50565, 71329, 43647, 7242, 33711, 18601, 25981, 129808, 171751, 155336, 97755, 48442, 95056, 94003, 53390, 17700, 57566, 190714, 137532, 132159, 150247, 141759, 90119, 106462, 76605, 84997, 84760, 24035, 34196, 42158, 73209, 32608, 38326, 160335, 105097, 53829, 43920, -8491, 21361, 27389, 56590, 110327, 37350, 39027, 49857, -7030, 32917, 2454, -51058, -41409, -7520, 41962, 3519, -18653, -28053, -93651, -42818, -2867, -19052, -9869, -87783, -14996, 19530, -52342, -35834, -94620, -134251, -129422, -88982, -54244, -92679, -139891, -108415, -23512, 29643, -104349, -116023, -48892, -128809, -98853, -83710, -12230, -16104, -60690, -14998, -64347, -88225]
1849h8225l1902l028M4336k4018K489j9045R2340l3258p0968l3788O4506K1199
1837g9362o1248J48498R0995l3042n6108q5518m5278N786k575K1145M56K7865
1825f8386n113k5513J8943K4040o1122O2420n2633L3906K9366K560O5438J0552
1813C4458j7376q6711j00631J3025M2752L2647r457J4772L072j0799j8970N7711
1801d5507M5225k159q1567k2111J6733L8291l7622o7839J6652K2467N7670q8425
1789a48192J5640l088L6142M6878p8293O757N873j6808R370Q138L8790j8911J9771
1776g7933k3357L6680n4934L5706o3632m1233r744k3661Q7652L4432J0648p9063
1764a68439j5639J4195L402q364R0824M0021j14094K3068j4347n9065N4570l6072
$$ y = [-88225, -120127, -123155, -78819, -102837, -100348, -119393, -27053, -60311, -131279, -165067, -100561, -79362, -140610, 7888, 98883, 65841, 9733, -75785, -121063, -115277, -117852, -96707, -96251, -68386, -73499, -99012, -80069, -56029, -117151, -54731, -107364, -73458, -44092, -41532, 23906, 34458, 17082, -69629, -170260, -157235, -114483, -81836, -91293, -76521, -73449, -84248, -103218, -45507, -282, -2441, -84008, -106119, -89386, -51095, -88717, -156556, -139904, -117437, -59767, -148192, -132552, -135640, -99498, -52620, -130913, -124156, -118283, -135091, -125721, -117583, -78793, -97704, -77933, -101290, -64610, -119544, -83838, -147470, -188703, -198447, -222108, -134456, -100024, -89376, -168439, -184078, -169883, -166481, -174845, -84021, -44000, -158094, -135026, -149373, -208438, -153868, -189940]
1752a89940J0368Q0763n0355r5953K0527O4374k748K3250K0538R112j9473M0825
1740h8712R788R535l8520o3232N619l060O9391O4333n7846l9305J4747p141N3960
1727g0443j1624L285j024Q998J8204j7367m0169j0529n842R8348R509o2464K964
1714g8154J1032R785K207N7948O543K124K7962Q356j9756o5274j0495K8092N2584
1701C2954J3617n778l8687K4909j9339M4934K7605m7480k2174M1297N1418j9307
1689H3969j1733J5649p9386L606L5624q5739K2829N384J391L4646J9593j3606
1677C2227p606l4089J3017Q7807L9604l9755o2703j594M6584k3110k2537k9277
1665a432k7877N4816l2675j2228L9005r3560j9777J9249J3069N1810J0533K3203
$$ y = [-189940, -179572, -98809, -149164, -245117, -224590, -160216, -162964, -139714, -119176, -110064, -129537, -88712, -78924, -69389, -107909, -171141, -165522, -168582, -99191, -34858, -92704, -132009, -117262, -124403, -70443, -82067, -78782, -79806, -70808, -52604, -69971, -110140, -120669, -126511, -28163, -18654, -81118, -78154, -67122, -57337, -55130, 2818, 9361, 11485, 39447, 47803, 28047, -37227, -47722, -19630, 32954, 46571, 40793, 2106, 27015, 7676, 52610, 80215, 32735, 10561, 51858, 103276, 83969, 72236, 87885, 8499, 12105, 47729, -38010, -15181, -9797, -8406, 26240, 45833, 32227, 24621, -9468, 3549, 91356, 130960, 91205, 28502, 26908, 73492, 50382, 27845, -1432, -29309, 25507, -7168, -19396, 19609, -73951, -93728, -74479, -61410, -9600, 933, 24136]
1653B4136j3888l720p582l5828M886l223j288j7479N0806p589j12599q219J26983
1640d604J1769j0214L3869q526q5385l6456O8224k8574r647N3440j4329Q829n6705
1627g8309J186K2740O6824l1601n8593Q948O830Q3699o5757m0760M3530n5402
1615i6665o8809M5151K2643K290J1051j5664J4540k441L2326P426K0701J7540
1603i911m6597j2383Q932J0748Q7112o6295N363k0630K5732m7065n5856K2904
1591i7946J0665O6272q48J4455K6458K828p0544O7846P2980j17429l3040Q8158
1579B9855Q71l9749L0020m5078l3906q706n958O9748m9175O1278r771L962o5551
1566f2160J3402O6020J7772O5015l1933k7024O584l9223k0487N4033j1089r146
$$ y = [24136, 10248, 6528, -1054, -36882, -31996, -35219, -36507, -53986, -3180, -10769, -123368, -131587, -4604, 7165, -3049, 30820, 22294, -63091, -99547, -31323, -59897, -69544, -16104, -30433, -21604, -78309, -77123, -54383, 12441, -19160, -77753, -68805, -61975, 21724, -44033, -84793, -41263, -96665, -165474, -120323, -97680, -95390, -84339, -100003, -85463, -87904, -55578, -48152, -27451, -9911, -56508, -68891, -59959, -49211, 37901, -28394, -23031, -43661, -17929, -64994, -120850, -97946, -87281, -21009, -21857, -7402, 19056, 21884, -48660, 19186, 92166, -25263, -58303, 29855, 30726, -9023, 20997, -24081, -57987, -66693, -72651, -2903, -52078, 9200, -571, 3391, -62160, -48758, 17262, 35034, 100049, 68116, 41092, 47676, 8453, -12034, 41999, 30910, 21764]
1554B1764L0725r2557l549Q1575L2551j7493j4753l4247j8820K6860J4966L0850
1542E7872R251j9923n1998L721N1368m2158J5897j5338m1449J0138J4606M3003
1530C4990J4482l4809l1420l9864J26108q8648l9369N3347j8469R801p7301r598
1518a00750O5950P396n087m3673n1329K7476P5915j5988l9650P0517m4067n187
1506e8477p613l3418m0518O340l7214j0926k842j607N2987L7035j8484j266J7622
1493i8381l6361o9594j3382M2438L3122q50o9551M2879J9084l9586k9318J3515
1481b05985O0276k3385P637O8445k8496O2955l6827p3604R0275j11065N034K7035
1469a57705Q194K0222K5068j865k3159m0937j4774j4931J998M6630M8501l8809
$$ y = [21764, 52489, -40068, -43617, 37958, 70509, 53016, 38263, 4016, -14804, 12056, 27022, 57872, 67123, 47200, -4798, -1077, 50291, 8133, 24030, 8692, -32757, -22619, -8013, 34990, 49472, 14663, -16757, -56621, 69487, -19161, -58530, -5183, -23652, -13851, -91152, -100750, -34800, -27404, -32491, -76164, -127493, -100017, -24102, -40090, -79740, -9223, -53290, -58477, -66090, -99508, -140026, -133686, -170900, -181826, -184668, -186275, -133288, -96253, -114737, -116003, -98381, -134742, -204336, -217718, -175280, -142158, -143008, -212559, -169680, -150596, -190182, -219500, -205985, -145709, -169094, -161457, -93012, -121508, -58553, -95380, -168984, -78709, -189774, -184740, -157705, -149511, -129289, -104221, -106086, -129245, -170182, -184956, -199887, -197889, -151259, -102758, -141567]
1457a41567k3955M9076Q860n1009M7575P0131n3460J3920k8522K9036M6242M82
1445c3191r730q2818Q5948M2343o1458M3811k2098k7790K3483M9216N4301k7719
1433C4298J7582R619j0983k2072o8634J5068R6877j4480r1556M5009n023R625
1421A5330K8511M2549J7714l1769m8164O5057O9849k4425j3640k9108l4118o4618
1409f832O768R4430R574J1165K7764q2960m4977M9910o919m5959p031M856j9448
1396i659o351K5209k7914K9248j532o350N2338J0970j7347o589p7310N223k6608
1383e6672j0262J30425R018n3082n0073L568q658p5882J5914L8339L3836m8269
1371g1798J4578K8588k4416m6785N680M8721R612k5623J9001m1M9035j07693p6310
$$ y = [-141567, -165522, -116446, -107586, -158595, -111020, -40889, -94349, -80429, -108951, -79915, -33673, -33191, -42921, -125739, -39791, 2552, -58906, -15095, -37193, -64983, -41500, 7716, 62017, 34298, 51880, 61499, 50516, 28444, -40190, -25122, 71755, 57275, -34281, 10728, 5705, 15330, 43841, 86390, 104104, 72335, 24171, 89228, 159077, 134652, 121012, 91904, 57786, -6832, -64, 94366, 103940, 115105, 142869, 59909, 14932, 64842, 57923, 11964, 4933, 9789, -9659, -16010, 9199, -18715, 10533, 9001, 2651, 54989, 65959, 48612, 42023, -35287, -30064, -56672, -66934, 63491, 72509, 19427, -30646, -27078, -35736, -111618, -95704, -57365, -23529, -71798, -57220, -28632, -53048, -99833, -94153, -45432, -35820, -61443, -42442, -42483, 6552, -101141, -177451]
1358a77451J4660L1938Q2598m335K0710j1511n622q9354n038J5320M7556L3803
1346d6726k4447m4824n2294J6255L1248L5140O7004L345K5883k3382N879l6588
1334d3507j2859K3147J7878l7009l3244k296L4088k1709N62J5190M6526L6992
1322B3759J8848l3300K1237L083j1322P4165J2197q581J5334l5224j5772M5158
1310A09582J8189n4117k5682L4454K0333J4288m1486L36K2764k1N061K5623m7182
1297H2142l2563l4301J3753K2384L7045K5208n7428J0518k5826m7544M12j1256
1285a7456j561Q3910Q9073p2703m7980m5440j1358M0066J8496k5090l3218N119
1273a8142L9632J8841p35j31554m7920R1550M8917n7812M9152N910n4988j9021
$$ y = [-177451, -162791, -130853, -48255, -52590, -31880, -43391, -49013, -138367, -143405, -128085, -80529, -46726, -71173, -115997, -168291, -152036, -120788, -85648, -18644, -15299, 10584, -12798, -6919, -43507, -56366, -33219, -15341, -52350, -85594, -87890, -53802, -75511, -74949, -59759, -13233, 23759, 42607, 9307, 30544, 33627, 22305, 96470, 108667, 100086, 115420, 80196, 64424, 109582, 127771, 73654, 47972, 82426, 102759, 117047, 75561, 75897, 98661, 98640, 103701, 129324, 82142, 49579, 15278, 29031, 51415, 88460, 113668, 56240, 66758, 40932, -6612, -6200, -17456, -19017, 64893, 153966, 81263, 33283, -12157, -23515, 16551, 35047, 9957, -23261, -18142, 21490, 40331, 39596, -91958, -139878, -48328, 589, -57223, -8071, -2161, -57149, -76170]
1261g6170L468O7015J2288m5055n869j8340k1558j6199j5200L0345L8995l5422
1249h1702j7415P544k5434l9613j2378J39997N9027n1173p2217j9846J4906J2839
1237h5465o4736L1991r028l7765M001N1623m0258N5248j297j0853J3859l545k9002
1224a25227p3605J04938J7200j5302L1091j7763R077J3161p6621J3937j958j5307
1212a36379J491R997l0261L4563K6978q6068N7987L5257p2665K3147O1515K851
1200g1587l1824m616j81O1058o005l9218M4361J5583n8745J8676M4415J4964P5638
1187F2519r2912q4962R4392O6465K6804k5676j5671l2720N797j4836M029J6430
1175I659o1095k4605K6096J17183K1595k0441N9631j1322k7152k1346m2567N3402
$$ y = [-76170, -72702, -5687, 6601, -38454, -44323, -62663, -84221, -100420, -115620, -85275, -46280, -81702, -99117, -91573, -117007, -156620, -168998, -29001, 30026, -21147, -93364, -113210, -98304, -85465, -150201, -118210, -127238, -165003, -161002, -109379, -149637, -94389, -95686, -106539, -92680, -96225, -125227, -198832, -93894, -76694, -91996, -60905, -78668, -69591, -56430, -133051, -119114, -121072, -136379, -134888, -124891, -155152, -120589, -93611, -179679, -121692, -86435, -159100, -135953, -74438, -71587, -103411, -108027, -108208, -47150, -53155, -92373, -48012, -32429, -91174, -72498, -28083, -13119, 62519, -30393, -115355, -20963, 45502, 72306, 46630, 30959, -1761, 4036, -10800, -6771, 9659, -51436, -76041, -49945, 67238, 88833, 68392, 128023, 116701, 89549, 68203, 25636, 79038]
1163G9038J2894j3036k4022q1593J9977k3916P168J11257m185q274k7328l2779
1151A5201J8609j4159M8067k836M218j5042P6370m8689j9669J4271k6883l4452
1139A5006J991J9634K8693K7227k1226J2339l7584J75p1454j0958j7622m457j9254
1126g7490n354J4983M0163L9513M1488l9565n3604J8079J3845l9670j0577L4626
1114b3563j9659m2515j0866J414M1929m099o7353J37620l4463l1698M2286J6271
1102E304o9486K729N383k478N696l2260j2087J4772O0153j45625p7909L5211L6691
1089a73906M4363K580j26036M6414N8118L3696J00522k6585r1540K4764J0376
1078i7234M9769J489p4287l1932M0945o825K5265L5932K4439Q3381n081q8158
$$ y = [79038, 91932, 78896, 54874, -26719, -6742, -30658, -23490, 87767, 83582, 75308, 47980, 15201, 33810, 19651, 67718, 64882, 69100, 54058, 130428, 81739, 62070, 76341, 49458, 15006, 16997, 36631, 65324, 92551, 71325, 83664, 46080, 46255, -25199, -36157, -53779, -58236, -77490, -82844, -67861, -27698, 11815, 53303, 13738, -39866, -21787, -7942, -47612, -58189, -23563, -43222, -85737, -96603, -95189, -53260, -57359, -124712, 12908, -21555, -53253, -10967, 5304, -64182, -61453, -56070, -58548, -52852, -85112, -97199, -82427, -22274, -167899, -245808, -210597, -173906, -129543, -126963, -252999, -206585, -148467, -114771, -14249, -40834, -132374, -107610, -97234, -47465, -45976, -120263, -152195, -111250, -118075, -92810, -56878, -32439, 50942, 45861, -42297]
1066d2297j513L1440J1614l966P8464p097j400J973k4100L1528l784o02j9422
1053E0838j1561N658L1168m0787R242o747r4613P0215Q986M9315K8656q6229M6416
1040F0557L6343m4594q888J7008m5163j5884j0399J05982N468q9155J2921P6439
1028A00635J9937l3717k3557N6111N3127Q894n7892n0695L3672k0357k5218R174
1016G0114O1003K3867k8609m9573O0054k9114n0415N6416K9884j7496p3682n912
1004D6537m2799l25J5472L1606o6191K2035j9755j1350K4449K428J7852O1132
992H1091j9798n1411J6238q325K7329l8725j8117J9803M1137l9791l1492k4789
980d6850L6796R99j2129k9273k9755O3007K740q376J9262l2600m9952O4721l0325
$$ y = [-42297, -43810, -12370, -756, -4722, 73742, 66645, 65245, 67218, 43118, 74646, 70862, 70260, 50838, 39277, 44935, 76103, 35316, 44558, 37811, -56802, 13413, 22399, 71714, 100370, 14141, 60557, 96900, 52306, 43418, 60426, 15263, -621, -11020, 94962, 100430, 11275, 24196, 100635, 120572, 86855, 63298, 119409, 172536, 181430, 123538, 72843, 106515, 86158, 60940, 70114, 131117, 154984, 126375, 76802, 136856, 107742, 57327, 113743, 143627, 126131, 52449, 46537, 3738, 3413, 18885, 50491, -15700, 6335, -13420, -24770, -321, 2107, 19959, 81091, 61293, 9882, 26120, 17795, 45124, 6399, -11718, 8085, 49222, 9431, -22061, -46850, -10054, -9055, -21184, -50457, -80212, -17205, -14465, -22841, -3579, -36179, -86131, -21410, -51735]
967e1735m0046J1251M079O833M7688l7546J3362m3694q4953L2365P1650k6870
955i7616M6467m833q8343L9101L9701N643m7451N2516m2688j231J4898k1389o197
942a11422J4887n4626j0155O6468P7000M1784j4026o020N739J8727j5843r3937
930h1424l0839P5053l0480k1266j8283N655k7888M1379K9055l0106j4833K1482
918h2495j1608k9084O484M8472L3651J4798j2462K4802J4574n1337m0368K9212
906e5361M5829j2241K4288m249j096j3139M0927m7945l0344Q4259j6242O439m3420
893b2295P1038P372p6060j4666m5425N2092N5683L1394k1631o4549j0666J0811
881b6902J872M3968j0281j6532J4756l540m6045K4949K668P521j2227K3315P016
$$ y = [-51735, -91781, -80530, -76451, -69618, -21930, -59476, -46114, -89808, -174761, -142396, -70746, -97616, -51149, -55982, -144325, -105224, -65523, -59880, -107331, -54815, -97503, -98734, -83836, -105225, -111422, -96535, -151161, -161316, -94848, -17848, 23936, 9910, 3890, 9629, 28356, 12513, -81424, -112263, -37210, -67690, -88956, -107239, -101584, -129472, -88093, -59038, -89144, -103977, -82495, -94103, -123187, -116703, -68231, -34580, -19782, -32244, -7442, 7132, -44205, -84573, -55361, -9532, -21773, 2515, -1734, -2830, -15969, 24958, -22987, -53331, 30928, 14686, 21125, -22295, 48743, 56115, -19945, -34611, -80036, -27944, 27739, 59133, 37502, -27047, -37713, -26902, -25030, 18938, 8657, -7875, 6881, 3341, -42704, -17755, -15087, -7566, -19793, 3522, 10538]
868A0538j8805n550K6493J11K8301N4686J0656k7741L1551n574k0897M2384j2697
855A13456q0011j3625J941J2061l4466N8772O3115j4782n3809k3649k1227J4536
843B2312J9774l8489J1065n3162l4806J1912r668K5473k4588l2070J06983M8297
831E3033j3685J9639N391k6136J7442n0887n5494J1081M5877M5712K2250J0195
819H4418l0805k8896k6457Q320P1729J0083n1206M4853K2001j11179J3712Q77
807G450o3199J0346M6094n4341J0804j3531n0676M1451K61J3239j3049K2972L9710
794b469M13q4404J4841M0914J9706k1391l8388P0523Q3478p8816p1368M0760L0867
781D666M3284K504k3057j7629k9199o0484K2007Q2456k4402n5388J1561K8524
$$ y = [10538, -8267, -13817, 12676, 12787, 41088, 95774, 106430, 78689, 110240, 104666, 83769, 126153, 113456, 33445, 19820, 21761, 33822, -644, 58128, 121243, 106461, 52652, 29003, 7776, 22312, 42086, 3597, 14662, -38500, -73306, -61394, -71062, -45589, -70177, -102247, 4736, 53033, 39348, 58987, 64378, 38242, 55684, 4797, -50697, -39616, 6261, 51973, 74223, 84418, 53613, 24717, -1740, 6580, 78309, 88392, 37186, 82039, 104040, -7139, 6573, 7450, -55749, -45403, 691, -53650, -42846, -56377, -107053, -65602, -65341, -52102, -65151, -42179, -2469, -2056, -86460, -71619, -30705, -10999, -32390, -70778, -255, 83223, 4407, -66961, -26201, 4666, 47950, 50454, 27397, 9768, -19431, -79915, -57908, 24548, 146, -55242, -43681, -15157]
769a5157J023N2379L487l1284j1987l8557m0315k2980O0736N8032k7138R779N6661
756E4679j15503n4252L6546O5442J3910m0584n1015P8024J5082N1880o7280j9522
744c2593M1985m2639L9658j2732J3585N1367L422J3092k4918L4393J0499L6467
732A31586k9932K3222J2184n5016P504o998J414k6301j2648j2846M3069J0472
720H5710n2782J24798k3750o6935J2507K7808K0128o2252M74k0647n5575L9524
708B9008L0611K2670M519j7643P2485o4783o7967m3985P1503K5568P385Q982j3223
695F5130M34M4546P6528l8523J2082J4401k0077M1243j3536m3551q9652j9855
683B9170K0260M4280l3517N6796j9307r5084P8629J4976j2501N4581n5367l9626
$$ y = [-15157, -14134, 38245, 41732, 10448, -1539, -40096, -80411, -103391, -42655, 15377, -11761, -1982, 54679, -60824, -115076, -78530, -13088, 822, -39762, -90777, -12753, 2329, 54209, -13071, -32593, 9392, -33247, 6411, -6321, 7264, 58631, 62053, 75145, 50227, 84620, 95119, 131586, 101654, 124876, 137060, 82044, 89548, 82550, 83964, 57663, 45015, 32169, 75238, 85710, 32928, 157726, 133976, 67041, 79548, 107356, 127484, 65232, 65706, 45059, -10516, 29008, 59619, 82289, 86808, 69165, 141650, 76867, 8900, -35085, 36418, 61986, 69371, 78353, 65130, 65564, 110110, 186638, 148115, 160197, 174598, 154521, 195764, 182228, 138677, 49025, 29170, 49430, 93710, 60193, 116989, 97682, 2598, 81227, 96203, 83702, 138283, 82916, 43290]
671D3290M5093j5380q6301l3936L1158j5583J9584L127o202l967l2064J8490M588
658b8103Q5873j0088m958L6445J822n8080L6525j6590k5507l1156k3172N0835
646A3846n5692j1996K9218O0072j04996n4505j3840Q2088O6602m0497k3697k7354
634h0751m775m2539Q1980j6848n7874L8101j5499k6808M6144j7863j7186L9540
622g4378L538p4233j6494k1140P3550P5726M4384J0444n4155k9313m5335j2329
610a19735J1554L1130L7687n1518j5676O9281p4110J609J4554N7819K1608l1968
598d7765M9503O631K3912M084m4939j9078J0306O3452K931k4349l8346L770O4615
585E4727k0191k6755k8722K6290N7222p0832L0743K1606o0150K1271J03107j4266
$$ y = [43290, 88383, 73003, -13298, -47234, -16076, -31659, -12075, -8948, -15150, -19117, -51181, -32691, -28103, 57770, 47682, 42724, 79169, 80991, 22911, 59436, 42846, 17339, -13817, -36989, 13846, -41846, -53842, -24624, 35448, -69548, -124053, -137893, -55805, 10797, -29700, -53397, -80751, -85526, -128065, -46085, -62933, -120807, -82706, -98205, -125013, -78869, -96732, -113918, -74378, -70840, -145073, -161567, -182707, -109157, -33431, 10953, 21397, -32758, -62071, -107406, -119735, -108181, -77051, -39364, -90882, -106558, -37277, -111387, -109778, -95224, -37405, -15797, -47765, 1738, 8369, 32281, 36365, -8574, -27652, -17346, 46106, 49037, 24688, -13658, -9888, 54727, 34536, 7781, -20941, 5349, 62571, -8261, 22482, 44088, -16062, 5209, 108316, 94050]
573I4050j3057J3039l2467K1482J0087k0439K0019K8631l7739K7765j8260J944
561I5055L437k2631K0256J2539P32l7433L6650j8160k3344k962J8963m2859P289
548D7532Q6812K1420m0660o3811M3846k274P759L9351p7374K5661L379p0407K3451
535D4685N6590j9087l591k437n4715r521L3644N0110k7836K8359l9588M0271R225
522A06109r3594L2679j5175M2658k2014m0146L6615l0051j0430M1981o8653O5827
510D5806k0244L147p6392j5745J8610o2218R907K6890K4402K8750J4070l5902
498c8919k6888j6619O6539M5354K6864O2994o0434j14454j3524r667P2975P1295
486F5516o036p5514L9564l736R1321o3816q4695O8555N8342Q2008k6942n5662
$$ y = [94050, 80993, 94032, 61565, 83047, 93134, 72695, 92714, 121345, 83606, 111371, 93111, 95055, 98492, 75861, 96117, 108656, 109388, 71955, 108605, 90445, 67101, 64139, 83102, 40243, 47532, 134344, 155764, 115104, 51293, 95139, 92865, 100624, 139975, 62601, 88262, 91641, 21234, 44685, 101275, 82188, 78597, 76160, 21445, 11924, 45568, 95678, 67842, 96201, 56613, 96884, 106109, 12515, 45194, 30019, 72677, 50663, 10517, 47132, 17081, 6651, 48632, -20021, 45806, 25562, 28709, -47683, -63428, -44818, -107036, -97129, -70239, -45837, -17087, -3017, -38919, -65807, -82426, -15887, 29467, 56331, 119325, 58891, -55563, -69087, -78754, -5779, 65516, 59480, -16034, 23530, 19794, 111115, 47299, -37396, 31159, 89501, 171509, 144567, 88905]
474H8905r2916P585K6946K4366Q110K6929j3850l7949L4107p592k3752O3478J1262
461A15629l2103Q445k5062o034P900j3096N900k4573j776J04735j8690k1843K5458
448A24890n5402n5763k2620Q1981N5314L0321p4072o5810M1692j2148K5051j721
436G1713j6539K8463K9426K2936m4103m1569L2376l4517J2382J8485M936q3932
424E7l2367L5576P1775k4101r437J9267M7330j4050k8625j0732N9039R425j0332
411A12825q9511m810k334n2423K7414O1901p008j2237M236n3140M2987l2560n3076
398e7736K8185k4525J8518J4917q420M3569K7152P948l1560M9788o958l8022J3100
$$ y = [88905, -4011, 3574, 30520, 54886, 62996, 89925, 76075, 38126, 72233, 64641, 40889, 104367, 115629, 83526, 91971, 66909, 60875, 68775, 55679, 61579, 37006, 35230, 139965, 121275, 99432, 124890, 69488, 13725, -8895, 73086, 128400, 158721, 84649, 18839, 60531, 48383, 73434, 71713, 55174, 83637, 113063, 135999, 91896, 50327, 82703, 48186, 60568, 79053, 83989, 57, -32310, 3266, 75041, 50940, 41503, 60770, 108100, 94050, 65425, 54693, 113732, 123157, 112825, 23314, 18504, 16170, -36253, -8839, 53062, 46054, 33817, 38053, -15087, 27900, -4660, -57736, -29551, -54076, -35558, -20641, -29061, 14508, 41660, 49608, 18048, 67836, 60878, 22856, 35956]
$$ [...]
##END NTUPLES=NMR SPECTRUM
##END=
