##TITLE=1H_EC-3384(6)-12
 200.13Hz, CDcl3.
 8 sc
10.8.2026
##JCAMPDX= 6.0         $$ Bruker NMR JCAMP-DX V2.0
##DATA TYPE= NMR SPECTRUM
##DATA CLASS= NTUPLES
##ORIGIN= UXNMR, Bruker Analytische Messtechnik GmbH
##OWNER= pz
$$ XWIN-NMR		Version 3.5
$$ Mon Aug 10 13:29:44 2026 Russian Standard Time (UT+4h)  she@DPX200
##.OBSERVE FREQUENCY= 200.1313
##.OBSERVE NUCLEUS= ^1H
##.ACQUISITION MODE= SIMULTANEOUS
##.ACQUISITION SCHEME= undefined
##.AVERAGES= 8
##.DIGITISER RES= 18
##SPECTROMETER/DATA SYSTEM= spect
##.PULSE SEQUENCE= zg30
##.SOLVENT NAME= CDCl3
##.SHIFT REFERENCE= (INTERNAL, CDCl3, 0, 15.5122)
##AUDIT TRAIL= $$ (NUMBER, WHEN, WHO, WHERE, WHAT)
$$ ##TITLE= Audit trail, XWIN-NMR		Version 3.5
$$ ##JCAMPDX= 5.01
$$ ##ORIGIN= Bruker BioSpin GmbH
$$ ##OWNER= she
$$ F:/spectra/data/she/nmr/H-C/1/pdata/1/auditp.txt
$$ ##AUDIT TRAIL=  $$ (NUMBER, WHEN, WHO, WHERE, WHAT)
(   1,<2026-08-10 13:28:14.15 +0400>,<she>,<DPX200>,
      <created by zg, POWCHK disabled, PULCHK disabled
       configuration hash MD5:
       00 E9 B6 7A A2 85 ED C7 34 08 36 98 17 FE 4E 26
       data hash MD5: 16K
       FB A3 D8 6B 93 65 01 4B D5 5B E5 69 75 3D 71 ED>)
(   2,<2026-08-10 13:28:19.23 +0400>,<she>,<DPX200>,
      <Start of raw data processing
       efp BC_mod = 2 LB = 0.25 FT_mod = 6 PKNL = 1 PHC0 = -4217.04 PHC1 = 10.7923 SI = 16K 
       data hash MD5: 16K
       1B 6C B5 98 14 62 CC 3B C2 B1 97 7B 4A 72 F7 F8>)
(   3,<2026-08-10 13:28:42.21 +0400>,<she>,<DPX200>,
      <pk PHC0 = 2.280216 PHC1 = -1.6 
       data hash MD5: 16K
       3D 77 97 3B 07 2C 8C 48 5E DD 56 77 99 E8 5C AF>)
(   4,<2026-08-10 13:28:46.45 +0400>,<she>,<DPX200>,
      <abs ABSG = 5 
       data hash MD5: 16K
       A5 D2 58 26 1B C5 2C A9 04 5E 76 75 2D D9 BB A1>)
$$ ##END=
$$ 
$$ hash MD5
$$ 23 90 EE B3 AC 49 FA 2D 8F 78 6A 4C 10 02 22 9E
##$RELAX= 
##$RELAX= 
##$RELAX= 
##$RELAX= 
##$RELAX= 
##$RELAX= 
$$ Bruker specific parameters
$$ --------------------------
##$DU= <F:/spectra>
##$EXPNO= 1
##$NAME= <H-C>
##$PROCNO= 1
##$TYPE= <nmr>
##$USER= <she>
##$AMP= (0..31)
100 100 100 100 100 100 100 100 100 100 100 100 100 100 100 100 100 100 
100 100 100 100 100 100 100 100 100 100 100 100 100 100 
##$AQSEQ= 0
##$AQ_mod= 1
##$AUNM= <au_zg>
##$AUTOPOS= <>
##$BF1= 200.13
##$BF2= 200.13
##$BF3= 200.13
##$BF4= 200.13
##$BF5= 200.13
##$BF6= 200.13
##$BF7= 200.13
##$BF8= 200.13
##$BYTORDA= 1
##$CFDGTYP= 0
##$CFRGTYP= 5
##$CHEMSTR= <none>
##$CNST= (0..31)
1 1 145 1 1 1 1 1 1 1 1 1 1 1 1 1 1 1 1 1 1 1 1 1 1 1 1 1 1 1 1 1 
##$CPDPRG= <>
##$CPDPRG1= <>
##$CPDPRG2= <>
##$CPDPRG3= <>
##$CPDPRG4= <mlev>
##$CPDPRG5= <mlev>
##$CPDPRG6= <mlev>
##$CPDPRG7= <mlev>
##$CPDPRG8= <mlev>
##$CPDPRGB= <>
##$CPDPRGT= <>
##$D= (0..31)
0 0.7 0 0 0 0 0 0 0 0 0 0.03 0 0 0 0 0 0 0 0 0 0 0 0 0 0 0 0 0 0 0 0 
##$DATE= 1786354093
##$DBL= (0..7)
120 120 120 120 120 120 120 120 
##$DBP= (0..7)
150 150 150 150 150 150 150 150 
##$DBP07= 0
##$DBPNAM0= <>
##$DBPNAM1= <>
##$DBPNAM2= <>
##$DBPNAM3= <>
##$DBPNAM4= <>
$$ [...]
##$SUBNAM3= <"">
##$SUBNAM4= <"">
##$SUBNAM5= <"">
##$SUBNAM6= <"">
##$SUBNAM7= <"">
##$SUBNAM8= <"">
##$SUBNAM9= <"">
##$SW= 18.0517328524113
##$SWIBOX= (0..15)
0 0 2 0 0 0 0 0 0 0 0 0 0 0 0 0 
##$SW_h= 3612.71676300578
##$TD= 16384
##$TD0= 1
##$TE= 0
##$TE2= 300
##$TE3= 300
##$TEG= 300
##$TL= (0..7)
0 120 120 120 120 120 120 120 
##$TP= (0..7)
150 150 150 150 150 150 150 150 
##$TP07= 0
##$TPNAME0= <>
##$TPNAME1= <>
##$TPNAME2= <>
##$TPNAME3= <>
##$TPNAME4= <>
##$TPNAME5= <>
##$TPNAME6= <>
##$TPNAME7= <>
##$TPOAL= (0..7)
0.5 0.5 0.5 0.5 0.5 0.5 0.5 0.5 
##$TPOFFS= (0..7)
0 0 0 0 0 0 0 0 
##$TUNHIN= 0
##$TUNHOUT= 0
##$TUNXOUT= 0
##$USERA1= <user>
##$USERA2= <user>
##$USERA3= <user>
##$USERA4= <user>
##$USERA5= <user>
##$V9= 5
##$VALIST= <valist>
##$VCLIST= <CCCCCCCCCCCCCCC>
##$VD= 0
##$VDLIST= <DDDDDDDDDDDDDDD>
##$VPLIST= <PPPPPPPPPPPPPPP>
##$VTLIST= <TTTTTTTTTTTTTTT>
##$WBST= 1024
##$WBSW= 4
##$XGAIN= (0..3)
0 0 0 0 
##$XL= 0
##$YL= 0
##$YMAX_a= 565716
##$YMIN_a= -624049
##$ZGOPTNS= <>
##$ZL1= 120
##$ZL2= 120
##$ZL3= 120
##$ZL4= 120
##$ABSF1= 15.50449
##$ABSF2= -2.547359
##$ABSG= 5
##$ABSL= 3
##$ALPHA= 0
##$AQORDER= 0
##$ASSFAC= 0
##$ASSFACI= 0
##$ASSFACX= 0
##$ASSWID= 0
##$AUNMP= <proc_1d>
##$AZFE= 0.1
##$AZFW= 0.1
##$BCFW= 0
##$BC_mod= 2
##$BYTORDP= 0
##$COROFFS= 0
##$CY= -3
##$DATMOD= 1
##$DC= 0
##$DFILT= <>
##$DTYPP= 0
##$F1P= 0
##$F2P= 0
##$FCOR= 1
##$FTSIZE= 16384
##$FT_mod= 6
##$GAMMA= 0
##$GB= 0
##$INTBC= 1
##$INTSCL= 3.241238e-09
##$ISEN= 128
##$LB= 0.25
##$LEV0= 0
##$LPBIN= 0
##$MAXI= 10000
##$MC2= 0
##$MEAN= 0
##$ME_mod= 0
##$MI= 1.114404
##$NCOEF= 0
##$NC_proc= -5
##$NLEV= 6
##$NOISF1= 3.799351
##$NOISF2= 2.8
##$NSP= 0
##$NTH_PI= 0
##$NZP= 0
##$OFFSET= 15.51221
##$PC= 1
##$PHC0= -4214.76
##$PHC1= 9.1923
##$PH_mod= 1
##$PKNL= yes
##$PPARMOD= 0
##$PSCAL= 0
##$PSIGN= 0
##$REVERSE= no
##$SF= 200.130001899668
##$SI= 16384
##$SIGF1= 3
##$SIGF2= 2
##$SINO= 0.751879
##$SIOLD= 32768
##$SREGLST= <19F.Aceton>
##$SSB= 0
##$STSI= 16384
##$STSR= 0
##$SW_p= 3612.71676300578
##$SYMM= 0
##$S_DEV= 0
##$TDeff= 16384
##$TDoff= 0
##$TI= <>
##$TILT= no
##$TM1= 0
##$TM2= 0
##$TOPLEV= 0
##$USERP1= <user>
##$USERP2= <user>
##$USERP3= <user>
##$USERP4= <user>
##$USERP5= <user>
##$WDW= 1
##$XDIM= 16384
##$YMAX_p= 434239860
##$YMIN_p= -219350
$$ End of Bruker specific parameters
$$ ---------------------------------
##NTUPLES= NMR SPECTRUM
##VAR_NAME=  FREQUENCY,     SPECTRUM/REAL,   SPECTRUM/IMAG
##SYMBOL=    X,             R,               I
##VAR_TYPE=  INDEPENDENT,   DEPENDENT,       DEPENDENT
##VAR_FORM=  AFFN,          ASDF,            ASDF
##VAR_DIM=   16384,         16384,           16384
##UNITS=     HZ,            ARBITRARY UNITS, ARBITRARY UNITS
##FACTOR=    0.220516191357247, 1,           1
##FIRST=     3104.45859520863, 0,            0
##LAST=      -508.258167797146, 0,           0
##MIN=       -508.258167797146, -219350,     0
##MAX=       3104.45859520863, 434239860,    0
$$ Real data points
##PAGE= N=1
##DATA TABLE= (X++(R..R)), XYDATA
$$ [...]
9448 10149 -3081 14591 26305 58107 70142 41523 34561 73019 56794 4404 -7380 -36180
9436 -36180 -35436 14774 -28446 -48239 -43866 -78599 -40791 -10042 -18550 49735 98551 -11506
9424 -11506 -30405 -24883 19407 75560 84957 -37486 -19254 67365 52578 -12769 -7513 18222
9412 18222 -29749 21562 9980 62523 39561 86256 152630 148399 192575 211653 251447 284341
9400 284341 279675 302720 406074 468892 465053 441569 460345 414498 420988 358836 395022 406552
9388 406552 369855 359134 320938 268833 252919 212345 163550 149569 126243 112479 96121 30281
9376 30281 18152 46678 47532 23676 15409 -22697 -28974 -880 -41132 -34662 25229 19053 4723
9363 4723 28085 50211 31282 -18389 -57006 -22712 -27727 22199 18882 21547 19344 17885 29291
9350 29291 51503 46058 -10232 -10853 8411 -59826 -25911 8119 -37452 11471 7489 53347 -8101
9337 -8101 657 -696 3039 4584 -50487 -44092 -20905 -25430 2823 -17183 -18065 8766 38620 103406
9323 103406 125169 114517 56551 67879 52746 56333 50829 66381 68720 75081 99699 64636
9311 64636 51234 45031 55445 25991 66644 -3867 -53555 -48597 -3961 9841 21483 53769
9299 53769 6989 -36954 -52030 33077 22652 31380 55038 19393 -10523 60958 46236 70818
9287 70818 132239 164441 198516 219233 186481 211152 243614 271589 254922 189794 189459 193628
9275 193628 197132 115529 70101 112984 114928 116913 130712 88144 128180 86839 95931 73156
9263 73156 120939 115646 47017 20300 49549 32830 19780 53531 31153 66104 76561 56019
9251 56019 76243 13422 17956 22061 36315 70575 72664 114279 117781 48686 81510 98729 160775
9238 160775 210194 244196 245490 214093 238598 263566 243366 223099 256054 269819 256039 212433
9226 212433 256235 180861 109902 122175 94301 118199 136065 148738 124598 39576 37175 96445
9214 96445 41431 4018 31738 387 14845 -15116 30237 79639 69291 31876 107726 113019
9202 113019 78312 168544 160831 109528 158578 175785 147605 122537 142607 91642 34162 58896
9190 58896 123840 158355 138352 165421 139330 128458 140888 101545 102533 98158 142853 143685 136285
9177 136285 191302 193306 199044 270585 312048 342375 338469 321956 313210 312440 263592 231667 188975
9164 188975 199466 216190 174488 199195 246221 199310 150465 171879 164645 170561 157344 155854
9152 155854 168994 184937 114721 114363 134170 95492 100113 77070 116139 208034 168432 91300
9140 91300 112980 102842 46489 76141 106108 146244 113219 87783 104285 87274 94465 116454
9128 116454 119213 114487 131461 146152 148026 200138 290683 260157 197824 264526 305273 340364
9116 340364 403156 369594 402084 365756 334140 365430 392951 380341 326973 296497 252515 220834
9104 220834 169407 196922 233692 258439 233064 253996 271671 255317 235442 191666 149175 127891
9092 127891 113113 168867 175463 177247 280386 217545 207869 255722 227349 171809 166159 188565
9080 188565 157206 150140 179172 188865 213516 198104 223143 307266 296769 272363 227634 222049
9068 222049 177868 206818 276731 310363 355274 291449 339960 326904 303284 289725 269571 303539
9056 303539 339566 337717 348361 293140 303955 380962 291607 277266 362871 404740 348500 389606
9044 389606 386338 408824 392711 388373 452647 451414 422653 435766 443624 396116 482842 516844
9032 516844 515846 544498 536488 538773 586212 607100 558851 507989 485948 528637 501914 456680
9020 456680 475006 525623 545913 537442 599807 662764 781998 878419 946544 1035385 1069574 1122037
9008 1122037 1220524 1301363 1378837 1409944 1386269 1367358 1236453 1191472 1171095 1086701 1173666
8997 1173666 1206595 1202099 1238057 1247751 1288037 1287948 1181257 1156766 1206972 1175532 1206683 1271503
8985 1271503 1332851 1370794 1383867 1412367 1416972 1389109 1341722 1323151 1217267 1149469 1089254
8974 1089254 977288 926106 932972 926434 920571 976653 1027526 1052907 1126410 1148649 1124390 1139375
8962 1139375 1189403 1289528 1270299 1288471 1302621 1392848 1415035 1455258 1464204 1459222 1517254 1554147
8950 1554147 1580602 1600460 1675351 1712066 1808743 1949476 2022367 2143423 2275291 2427443 2651017
8939 2651017 2849786 3172217 3522898 3912056 4343630 4882353 5648057 6781330 8550440
8930 8550440 11671073 17302108 24913050 32509487 38040977 40480413 40459132 38468499 33980559
8921 33980559 28701003 24174093 19912521 15944915 12615526 10001793 8050302 6606994
8913 6606994 5665991 5019079 4513166 4126113 3701377 3479178 3302752 3151227 2912794 2814896
8903 2814896 2671445 2533187 2402073 2280354 2178793 2036505 1898613 1815738 1822206 1754252
8893 1754252 1633271 1528827 1439727 1297308 1282135 1332224 1298735 1281038 1175103 1066340
8883 1066340 1101106 1081321 1090415 1083470 1102081 1063124 1006437 977663 927931 907938 885381 882336
8871 882336 867627 880131 834948 844568 784826 749123 777927 789411 782698 770466 672986 638795
8859 638795 642801 633847 613621 615086 589430 539228 458303 478359 523663 544669 548752 553909 508637
8846 508637 465943 509087 533317 461241 373412 401334 425708 407419 362524 380645 365886 343852
8834 343852 317639 317638 321826 318063 333503 347746 296593 284721 346738 293271 264668 345552 308685
8821 308685 274058 237830 259446 186401 174574 224027 191949 144086 195324 225810 190769 224304
8809 224304 248286 196865 216341 263092 262792 227383 223714 217513 252490 264282 257231 222612 207969
8796 207969 196884 189115 212507 217884 237149 242238 167623 122722 178289 189351 167362 169543
8784 169543 199530 202697 203144 212559 199378 220962 251525 237411 285643 344095 323532 313561 345361
8771 345361 383798 424431 366193 389928 329704 331874 406101 379679 465205 488458 482101 409925
8759 409925 387944 370003 310968 307987 259335 218195 269067 220737 155988 143189 137698 195069
8747 195069 209891 171900 176607 188468 216287 207436 205857 218688 198459 178126 239183 212996
8735 212996 154561 93159 92115 115011 129954 122570 113672 120118 125302 142859 190930 141988 87828
8722 87828 119299 107591 153735 132312 115700 62327 33314 40244 80053 80734 71994 50128 116637
8709 116637 103347 165310 150237 136390 176520 167215 168397 254330 240494 192308 236137 278647
8697 278647 268810 169264 208789 272583 285083 336398 373482 361691 357493 379188 347511 318430
8685 318430 296956 302229 245052 256181 243493 213465 234145 310548 358430 339184 298426 308658
8673 308658 318888 314275 321500 315661 246507 198612 155905 120517 182300 200285 185514 144585
8661 144585 110914 150126 166257 230363 308438 345127 325526 313161 310530 239944 215694 121960
8649 121960 130178 169875 136942 193323 238894 222433 215084 235656 288211 242854 224559 210348
8637 210348 178872 156229 175704 195414 138306 48685 95608 206763 235933 242215 206308 192528
8625 192528 252260 225740 227613 194726 219024 176879 160398 189986 210274 184409 213458 245199
8613 245199 214968 247782 243741 229575 189830 132176 128251 137348 121099 75600 43366 67780
8601 67780 53198 30356 71354 193303 218715 203890 248265 290725 243680 141218 113256
8590 113256 119582 179125 157530 176398 123178 129423 169692 207989 171681 216868 259933 294328
8578 294328 249174 233588 167398 85600 28223 30667 96629 74287 144828 100319 106822 109285
8566 109285 144432 122216 153922 165014 121562 81591 60199 48415 130348 92273 133569 121967
8554 121967 92833 113594 139009 182117 190116 137936 84895 88394 89755 77800 54513 119366
8542 119366 82955 47485 57000 58746 59457 56300 96059 92104 133901 46321 28831 33655 74625
8529 74625 -7673 -27269 90125 51238 23018 27487 1892 -1238 36837 50859 25391 -15727
8517 -15727 4786 45547 79369 41522 -6955 -26600 -17386 -86368 -62663 -48838 29118 -11921
8505 -11921 -19349 -26397 -62743 -35928 5763 5241 -15066 -18847 -68356 -69052 -76509 -55646 -18032
8492 -18032 -29172 -9305 26489 -11513 14805 -2225 -35969 -54500 -27722 -9291 -61774 -26938
8480 -26938 24765 -44061 -124000 -103149 -103669 -52608 -79569 -89217 -45910 -18029 -45302 -52402 -69184
8467 -69184 -48031 -29272 -8373 32253 -29676 -68721 -66184 -17331 -41435 -18256 -13985 27128
8455 27128 6087 -73841 -35166 29733 79187 115513 105722 147428 166310 131012 108198 122383
8443 122383 166365 119323 65108 96603 119805 40875 -7122 -33186 30847 60578 26521 6168
8431 6168 -2537 -7312 -43380 -82092 -60222 -34610 -27476 -10070 -10808 -395 -57607 -28426 -76246
8418 -76246 -54479 -58231 -71883 -43888 -56587 -86318 -65729 -59745 -38623 -45453 -27044 -53209
8406 -53209 -56346 12097 -40268 -48667 -32538 -21574 -52924 -94878 -88463 -79360 -55376 -25381 -3572
8393 -3572 -4445 -65466 -80055 -51879 -65417 -41898 -78428 -69338 -31082 -15945 -115848 -135026 -46546
8380 -46546 -134212 -107328 -122310 -91475 -70671 -61291 -44802 -83252 -8950 -9224 -53568 -24237
8368 -24237 -40422 -45123 -81338 -104230 -80441 -13899 -13295 -13329 14130 31813 42229 60503 27352
8355 27352 67666 124969 77826 44813 76077 97066 97154 136146 151984 166599 127519 90296
8343 90296 44196 31637 51502 -18866 -35561 7231 -15416 -51919 -63901 -49016 -47096 -14410
8331 -14410 7667 -7040 20758 -12631 -78817 -77454 -103227 -113881 -104148 -71795 -25727 -89800
8319 -89800 -55460 -61345 -104186 -121333 -93982 -66628 -69614 -84591 -79056 -80086 -91143 -46285 -4812
8306 -4812 -81094 -88074 -74386 -77414 -94945 -132772 -173059 -167097 -130496 -69290 -51406 -25082 -89672
8293 -89672 -105097 -43544 -114631 -117159 -71174 -95762 -112755 -125245 -85227 -93148 -98225 -87025
8281 -87025 -91732 -49591 -107010 -40251 -65177 -20850 -84047 -109489 -88307 -72815 4060 65142
8269 65142 -78886 -31048 -37255 -83676 -63612 -71754 -55143 -77502 -129978 -100395 -49400 -66507
8257 -66507 -100518 -62800 -65029 -58663 -5053 -92830 -106333 -121172 -74509 -112628 -105060 -113527 -86962
8244 -86962 -143059 -137168 -122669 -81069 -86513 -82803 -75960 -96945 -131727 -129637 -40448 -72909 -87702
8231 -87702 -68176 -53281 -137508 -75319 -95912 -102714 -17611 -28245 -56014 -44617 -78459 -43069
8219 -43069 -83070 -86606 -42525 -67441 -28976 -97358 -94272 -119947 -96460 -87691 -71042 -4356
8207 -4356 46953 39139 -14990 -99228 -142837 -102179 -19438 -36478 -3622 10207 47956 45990
8195 45990 -12763 -64469 90097 579801 367963 188138 168886 178488 170991 172861 191123 195170
8183 195170 204927 233339 257662 218090 178870 88905 145860 124342 93760 118776 85281 10763
8171 10763 43293 30262 28619 19549 75906 25261 -97524 -79047 -22014 -25344 -69345 -122647
8159 -122647 -130736 -77942 -67297 -75232 -13888 -21022 -15902 -7984 -44652 -48430 19201 66487 91461
8146 91461 129319 87668 97821 99894 119207 146990 156515 205415 259295 249940 249879 295056 262950
8133 262950 283065 305228 362781 356080 368918 377600 309292 300126 267012 210219 203762 163182
8121 163182 104543 83122 43646 27139 10377 60512 48069 16254 -13359 -33968 -19597 -47587
8109 -47587 -56848 -22786 25100 24640 10002 -27556 -111590 -101209 -18352 -41082 -64915 -62875 -62459
8096 -62459 -75007 -66410 12319 -19807 -33565 -1756 -4283 -1129 -12288 31826 95766 118523
8084 118523 81482 71912 72714 107631 146156 115884 89801 95897 110829 88287 124592 111558
8072 111558 19564 30013 5130 -6484 -11593 -6694 -41697 -51890 -74105 -79354 -43491 -12787
8060 -12787 -59988 -36404 -55457 -62700 -31613 -53537 -17009 -74725 -47767 -52587 -104971 -95873
8048 -95873 -84263 -104289 -62752 -79055 -69006 -105888 -118995 -62856 -93833 -43792 -40941 -102436
8036 -102436 -120747 -83021 -103584 -84604 -28705 -116726 -113306 -149420 -138727 -150077 -160185 -133725
8024 -133725 -118601 -90920 -94843 -75930 -90768 -127455 -146595 -108029 -130517 -164381 -207998 -198794
8012 -198794 -155192 -139623 -116512 -142231 -94303 -120325 -60778 -40584 -56246 -111688 -85188 -47018
8000 -47018 -67113 -90901 -68319 -112562 -119070 -111192 -130480 -114116 -156113 -92785 -82317 -88592
7988 -88592 -94439 -21302 -47559 -65899 -119927 -135114 -126377 -89142 -46584 -22177 -6817 -64142
7976 -64142 -136595 -113518 -77209 -43461 -52677 -96708 -45484 -41254 -105960 -92340 -39531 -106645
7964 -106645 -76617 -47239 -66985 -78991 -3033 -26125 -106315 -28304 -10202 74220 76976 6194
7952 6194 -12943 -2306 -16282 11211 4613 -10943 99065 121351 66311 28450 43795 56193
7940 56193 36089 40728 63578 42926 35309 663 5343 2990 -35064 -55827 -30520 -74545 -3236
7927 -3236 -20369 -101659 -22899 37457 14610 -38463 -36669 -46059 -77223 -84090 -96303 -73297 -54533
7914 -54533 -68478 -18342 -51756 -52579 -100789 -166198 -204554 -162553 -163782 -110363 -64256 -77198
7902 -77198 -44783 -43312 -82585 -67587 -89086 -158404 -113145 -71087 -106417 -102585 -104912 -68757
7890 -68757 -48371 -63051 -65484 -105473 -87170 -110286 -96571 -85177 -131250 -113878 -116499 -64060
7878 -64060 -82574 -102232 -101285 -87142 -22271 -67454 -133402 -143749 -117383 -104205 -98107 -77297
7866 -77297 -67199 -102481 -59778 -76973 -55661 -43277 -83544 -74629 3645 -92853 -78375 -97266
7854 -97266 -147478 -126791 -115064 -94903 -85486 -34959 -44433 -24307 -10430 -52222 -495 -60253
7842 -60253 -117980 -111068 -78337 -76722 -170920 -110360 -77200 -77161 -82662 -40133 -75516 -76144 -122297
7829 -122297 -155905 -160578 -97918 -88631 -93589 -148505 -67936 -99848 -140050 -121141 -110869 -144580
7817 -144580 -130218 -115782 -115481 -112708 -55452 -60643 -44746 -24294 -208476 -167579 -81369 -69476
7805 -69476 -70321 -99204 -62666 -36917 -6850 -12013 -64790 -75068 -91233 -83514 -131315 -146178 -77799
7792 -77799 -40002 -89174 -66261 -101142 -40651 -74044 -63833 -32175 -50637 -82865 -99386 -107090
7780 -107090 -107606 -93900 -63941 -137097 -118077 -62549 -59131 -48438 -58693 -63222 -58828 -81424 -72113
7767 -72113 -31930 -81267 -59861 -61621 -78461 -69655 -85184 -84192 -89995 -35506 -26989 -107044 -106489
7754 -106489 -96543 -52916 -42562 -47893 -34799 -110486 -123453 -144037 -49613 -62010 -90891 -25341
7742 -25341 -60053 -130693 -85922 -34375 -54240 -7965 28303 -62523 -140278 -137565 -60800 -17901
7730 -17901 -25704 -52279 -32822 -14108 29451 23743 -40024 -27425 -33324 4912 -755 -4884 -9591
7717 -9591 43455 5740 -76842 -78264 -69065 -82291 -20363 -39249 -68260 -44092 -51880 -30864 3934
7704 3934 15753 -67637 -98853 -67342 -72805 -46480 -53948 -22167 4711 -38019 -75319 -53342
7692 -53342 -27756 2871 42800 56238 8934 -38799 21383 94972 -20830 -61913 -9040 11624
7680 11624 28107 104148 131360 115024 58774 89660 72286 43681 83766 155968 161263 128418
7668 128418 173918 157838 126765 139554 167804 92908 98115 78490 66754 36810 69207 109504
7656 109504 64079 95185 103853 106515 122461 129164 149147 139138 118479 91910 109502 171119
7644 171119 161803 105667 34409 71550 69354 120929 238203 149097 162534 207980 220811 206765
7632 206765 179700 165738 201164 192017 186916 212281 168553 200090 210131 274951 258263 182511
7620 182511 187741 256245 260262 219577 222231 247834 245382 242816 148403 175762 202251 200032 133301
7607 133301 148829 235475 193872 199560 190690 126335 172519 186710 255246 304678 272491 273366
7595 273366 300042 274657 237588 242886 248248 260489 237147 225965 209912 224030 205477 281342
7583 281342 264338 249618 221634 177845 249858 255247 223436 219639 266116 246743 220502 241975
7571 241975 276749 262211 267839 261440 250367 271060 277927 341346 297637 263943 220101 276275
7559 276275 251787 273688 224412 272680 263947 267580 242848 298285 298886 327512 329063 354777 334767
7546 334767 295494 278061 284443 322303 325344 331171 313533 349174 269928 233361 275171 298381
7534 298381 287799 257864 229258 242394 196620 246842 247774 224510 198576 111858 179967 237737
7522 237737 210977 152449 125792 100363 117094 125747 145647 127856 188013 231665 228353 182558
7510 182558 145766 148801 124606 188105 150981 132115 50487 108825 69506 102769 136964 146530
7498 146530 150205 187926 132087 113748 103236 115280 129326 138394 114388 82863 64589 14796
7486 14796 36101 27987 50421 70562 94895 78241 -33609 -40187 62947 56173 -1598 -47330
7474 -47330 -19800 38349 -27570 13750 38607 19423 6464 -21947 -36227 -28288 16359 49416
7462 49416 84511 113216 66295 76294 63360 108671 69210 24493 61772 31980 -4713 -24021
7450 -24021 30574 -29683 6950 -28133 -36733 12155 11369 2211 -20807 31794 16389 -38201 -54829
7437 -54829 -28071 -59077 -64583 -126940 -59096 -7750 5295 -53670 -132174 -81025 -40654 -49440
7425 -49440 -25473 -23132 -49025 -5751 -28464 -50900 -28294 -37061 -52115 -10176 24442 47245
7413 47245 30044 48572 23874 51374 -29549 -65167 -57631 -47873 -88706 -58655 -75182 -24945
7401 -24945 -9092 -17878 -34545 -34183 -29994 11823 5148 -57760 -16816 41373 74690 44445 22137
7388 22137 15834 -5439 31120 16206 -56594 -34583 -37413 -77573 -80654 -129709 -93537 -73463
7376 -73463 -91714 -70679 -86037 -62493 -25948 -45315 -107463 -82462 -113872 -94791 -73100 -49990
7364 -49990 -47470 -38540 -71279 -129977 -120088 -65488 -39299 -21763 -97203 -74980 -83969 -85998 -79626
7351 -79626 -54984 -24561 -8533 -24241 -81096 -68947 7572 -38101 -72360 -20113 -40779 -12679
7339 -12679 -4838 61270 58830 56593 21983 54594 -35812 -42226 49151 -25086 -36131 -3729 -26289
7326 -26289 18255 -10617 -47947 -42285 -87486 -66473 -36783 -48529 -90439 689 -7520 18860
7314 18860 35817 -340 -25127 -14167 31122 22850 -7464 -42130 -26025 -37173 -37438 -69830
7302 -69830 -70366 -63571 -29686 -61940 -53572 -93914 -104381 -48901 32122 47098 -33799 -36780 -6689
7289 -6689 -11143 -42789 -61083 -25100 8359 -23600 42796 3156 -29191 2946 25719 -2754
7277 -2754 30736 20893 10045 43161 4320 15824 -7404 49052 36972 60811 91781 131863
7265 131863 131578 124008 196532 186805 195196 173912 86657 60825 79405 46760 116149 155088 143902
7252 143902 161694 97215 26236 20034 -46675 -40146 -32436 59162 54070 32927 37805 36833 29144
7239 29144 28736 -14297 2295 55164 64980 93475 83001 107288 123325 161111 183919 235853
7227 235853 177585 125912 176201 177486 157599 136495 148197 168843 93102 101908 164614 220044
7215 220044 146748 186329 133270 126192 136436 241274 308528 271363 246189 274378 345788 293901
7203 293901 232881 168442 220245 136943 158706 169573 200248 248690 183200 134593 215431 221378
7191 221378 175426 171184 156375 165621 184490 138795 161994 215080 244341 277445 207912 168425
7179 168425 127930 200492 245694 228164 301443 281532 273659 246850 262329 293883 425438 404679
7167 404679 382769 358248 356212 363126 262921 263685 275450 299757 313940 255892 273591 249774
7155 249774 303354 352367 345094 303963 261424 365896 291627 311915 317586 255139 230301 265636
7143 265636 252457 282582 270878 272547 255816 274107 214318 180939 220670 255542 329348 304519
7131 304519 285443 282453 262113 246445 251102 205858 204634 212031 144528 224446 233983 241906 209230
7118 209230 140034 117720 107664 122326 142516 159130 194156 196561 181526 203675 181796 143231
7106 143231 142818 108713 98729 120774 71727 102094 136347 134053 143223 102375 118108 158231 179373
7093 179373 185765 110916 98332 123885 96722 89307 117641 164079 167686 137547 184255 161681
7081 161681 127124 76026 138745 125858 60846 76395 70905 124066 120960 51661 62777 93558
7069 93558 65670 30822 72020 67231 141436 150633 100424 107314 44183 115646 78400 64409
7057 64409 91532 45341 88252 69298 20965 13140 7476 13752 22861 21874 31783 41580 43455 43254
7043 43254 -40099 -12125 -2369 -42976 7927 42577 -23300 -52346 33183 104906 43322 9529
7031 9529 -28858 -77534 16246 4406 -718 -19158 -42195 -3012 -83198 -63380 15136 -36245
7019 -36245 998 -15021 -2004 -9724 13301 -9751 -1643 -1151 -49858 -55557 -56635 -46826 17428
7006 17428 69614 -20206 -26436 -30913 -12701 -34434 -62890 -98708 -46255 -6285 41960 -1654
6994 -1654 -71776 -37753 -19460 10315 -45892 -32618 -76960 -101916 -97939 -33457 -52618 -110786
6982 -110786 -69830 -106374 -60471 -74570 -73634 -57349 -33809 -41781 -96429 -67670 -82423 -34070
6970 -34070 -24275 -46878 -33882 -1098 -17979 -23159 -39935 -51928 -20460 -24406 -74923 -20919
6958 -20919 25610 -40599 -16503 -64328 -151006 -110924 -102788 -103206 -58320 -41961 -35681 -57581 -68630
6945 -68630 -92478 -151882 -169006 -138128 -54623 -76054 -67053 -8282 -34667 -63300 -82849 -88457
6933 -88457 -75162 -73549 -72513 -121860 -215551 -184600 -146556 -127927 -121046 -101755 -108742 -82281 -39980
6920 -39980 -59986 -121839 -118308 -109217 -84529 -99598 -98444 -77480 -38618 -62288 -80934 -105348
6908 -105348 -93069 -89759 -14845 12094 -58149 -23370 -19174 16634 -2378 12477 -35898 -58321
6896 -58321 -15965 -16829 -50861 -54872 -13123 -531 -54295 -49405 -34132 -75076 -34628 -17873 -8723
6883 -8723 -33747 -37821 -56289 -75346 -23512 -60816 -50329 -47570 -9734 -61648 -44917 -36897 -64556
6870 -64556 -99032 -105836 -98895 -93802 -53965 -39732 -42776 -92261 -69166 -79369 -82541 -97822 -91267
6857 -91267 -78005 -40563 3068 -9644 -53445 -55268 -92766 -44049 -34875 -39191 -63088 -89932
6845 -89932 -19699 -54484 -72078 60465 153712 119561 117085 199747 331588 403055 443412 486659
6833 486659 486831 477474 435242 434777 358990 434726 476993 519937 469207 469060 506884 453004 369329
6820 369329 328535 249803 222609 201777 165345 153516 142826 134511 103776 72468 64394 123889
6808 123889 92635 171345 262877 333706 373050 454442 468364 500497 432940 435463 428428 455773
6796 455773 451216 475486 484767 516589 550542 527722 475585 437643 375555 310640 214484 179392
6784 179392 127614 90850 165659 156631 97063 28716 11351 25630 19401 104439 66756 54609
6772 54609 36852 20650 38648 -5689 -43304 -23004 -18986 8664 2644 -61647 -49082 -38402
6760 -38402 -19218 4177 1933 3296 32766 30052 22018 5604 -7181 -30357 -34600 -16687 24519
6747 24519 -42757 -2398 10099 -58651 -92311 -46485 35590 57792 13576 15880 13165 36321
6735 36321 33161 12917 36689 105865 28013 37095 63873 34297 43775 9046 -10898 44025
6723 44025 12230 -27357 -72703 -41884 1336 -15852 2541 -33425 -7773 -35883 -62968 -74682
6711 -74682 -62473 17590 33993 31781 34785 26085 -6982 -213 -45192 -92440 -80455 -73197 -97258
6698 -97258 -86918 -126522 -96944 -71669 -70364 -48327 -73107 -61644 14510 -8303 -54209 -74959
6686 -74959 -71840 -20679 -22947 -7913 -50636 -65468 -80484 -75848 -48505 -39684 -32823 -46179 -83965
6673 -83965 -69737 -89557 -92753 -117560 -91263 -100505 -31958 -105598 -125399 -119009 -74712 -17750
6661 -17750 -45887 -35682 -84988 -124420 -85706 -91676 -96268 -77517 -101474 -87294 -115570 -100555
6649 -100555 -24674 -32924 53433 25579 -42959 -47639 -85676 -108902 -61207 -15037 -46680 -87082
6637 -87082 -98258 -47755 -26183 6920 5140 -52491 -44567 -63897 -100200 -64649 -75164 -68632
6625 -68632 -50398 -45278 -80891 -28966 -15947 -25115 -38989 -40636 -44949 273 -32612 -90873 -80612
6612 -80612 -89216 -2579 -16989 -56717 -33790 10416 -17863 -75343 -71754 -46645 47215 31182
6600 31182 -40166 -90463 -70477 -61212 -66165 -35766 10077 23915 31432 24544 74637 22772 79442
6587 79442 158247 184445 209473 301259 403711 519766 672789 919977 1114106 1241047 1474600
6576 1474600 1551817 1511451 1354692 1172553 1015236 900232 734753 593871 420085 263570
6566 263570 245272 196099 170037 134614 -29226 -28076 72284 84385 -27084 -37220 -52990
6555 -52990 -69817 -82471 -130136 -114929 -114151 10965 33876 -716 -13165 -10017 -25369 -56432
6543 -56432 -37516 7523 -77075 -45036 -31247 -71275 -71710 -92755 -36579 8386 58162 40579
6531 40579 68122 -23738 -75177 -81621 -68649 -118977 -60200 15863 -14530 22927 57033 50701
6519 50701 51555 51775 29046 57916 41096 81719 163211 230466 266393 312308 331031 338155 358564
6506 358564 260169 243149 248410 214899 242193 309723 374190 398530 413292 387995 329655 298517
6494 298517 264994 163215 175114 149694 114553 192084 179201 121123 143493 154992 128156
6483 128156 132136 158260 187804 138816 51984 -24278 10473 23703 -44199 -26731 12770 26454
6471 26454 -2724 -16301 39372 -60588 -39108 -10398 -32582 -23988 22656 -22922 -6030 -25557
6459 -25557 -7190 -35587 -25729 -25826 -15261 16013 -7853 -45402 -24704 -17657 -70367 -100609 -60985
6446 -60985 -13352 -46370 8624 -22447 23469 3929 -34657 -20013 -911 -42656 -53089 -29446
6434 -29446 15959 -2645 -27850 3886 32775 -12724 -1911 -3080 -54839 -70630 -31107 -20891
6422 -20891 -25758 -34917 -49430 -815 42766 651 -16257 215 15160 -68627 -37732 22087
6410 22087 46578 76156 126230 186645 237904 244300 301871 398472 478404 581427 659288 619700
6398 619700 570229 545587 521441 446508 370292 283073 224336 184385 116658 28290 31483 10767
6386 10767 25250 39524 31880 88265 111963 17300 20994 -22563 -37188 62408 38533 -46701
6374 -46701 -66835 -25772 -54425 -54134 17389 -2406 -29127 13401 -54280 -46799 -22397 -37294
6362 -37294 -40474 -30147 -6309 41802 58684 42012 30430 15781 -60399 -33187 -71662 -35598
6350 -35598 -53094 -87289 -81829 -39651 -37304 -22815 -29293 -33394 11613 -40813 -55095 -66171 -67223
6337 -67223 -55901 -60877 -79093 -105533 -109269 -145030 -151172 -107366 -115769 -125216 -116786 -52247 -37512
6324 -37512 -73749 -79689 -111773 -101827 -124628 -102632 -151102 -150361 -89052 -88565 -95756 -80264 -60766
6311 -60766 -52004 -101776 -89452 -37462 -45178 -96238 -81626 -113376 -93277 -115146 -115078 -103417 -115008
6298 -115008 -84155 -147841 -219350 -150492 -81893 -127360 -155038 -101980 -50657 -51158 -84225 -160655
6286 -160655 -179265 -132751 -139432 -119445 -67949 -122962 -126084 -144117 -142842 -147776 -172699 -100180
6274 -100180 -120250 -135783 -112136 -149086 -118911 -96195 -120930 -113891 -61196 -125247 -131181 -138174
6262 -138174 -157601 -89598 -81064 -103162 -107906 -96854 -128432 -129165 -82712 -33453 -53708 -129890
6250 -129890 -149035 -126070 -161282 -177073 -144956 -154799 -180792 -190308 -163155 -87937 -44253 -141119
6238 -141119 -180450 -167084 -160002 -169539 -126119 -62121 -14047 -12948 3237 -16775 -77248 -96764
6226 -96764 -97152 -57271 -60257 -85241 -15974 -43851 -34688 -32839 -39990 -38018 51069 3856 45407
6213 45407 47031 -28310 -90580 -81442 -21634 -40647 16388 24794 17644 8580 28832 54940 73173
6200 73173 77310 63134 19952 3615 82237 85378 97577 118319 168317 137391 138172 207719 273734
6187 273734 364297 355314 360147 465409 437501 427719 428907 320968 328751 340091 356117 460597
6175 460597 515967 492940 539442 501303 487807 462057 360051 231427 157441 118721 141193
6164 141193 84393 27574 -2185 -820 18101 -1817 42848 34162 -1411 31330 8486 27888
6152 27888 34064 12584 68963 136628 100645 53330 27697 74160 72331 69048 8164 -4758
6140 -4758 51642 48212 71810 112086 90859 69158 42478 88080 112744 51831 91479 109651
6128 109651 123760 94650 72589 80743 84562 128093 207083 225379 216030 250487 237951 263707
6116 263707 214472 264198 272323 289217 334946 276903 269043 401731 453471 513661 531974 540496
6104 540496 600575 619190 695157 713029 736442 734054 736269 695582 698517 701909 665990 645382
6092 645382 646676 650195 636257 656371 609792 667774 678505 627652 548238 468517 464851 434388
6080 434388 366539 351053 317490 275467 215570 201128 240424 247972 221185 192062 157556 73711
6068 73711 76916 129025 97354 99314 82474 83155 111567 71525 111375 117984 221843 146182 134848
6055 134848 121245 132967 89532 31371 93431 112715 82796 87835 38774 62489 56936 70420
6043 70420 58953 78541 82749 53274 28110 -23187 56179 103595 82539 4295 1277 43165
6031 43165 65837 69962 -21612 13847 35934 -11271 -37593 -55167 -78463 -53437 -83849 -87327
6019 -87327 -20704 19572 51514 -9659 -688 6095 36153 8309 -47733 -44861 -38297 -48863 -33584
6006 -33584 -59094 -14553 34527 3963 29807 13284 -29379 -49394 -6851 -38150 -762 -15933
5994 -15933 -26761 -54829 -51470 -25507 -25995 -16454 -42654 -26193 -80898 -109752 -111888 -120257 -109130
5981 -109130 -113648 -89250 -93904 -165643 -94353 -47616 -65299 -127506 -165144 -138683 -109945 -103758
5969 -103758 -36370 -45063 -1646 -2024 -25426 -50041 -37797 13203 27985 -11608 -81969 -87647
5957 -87647 -19669 -45943 -98497 -86556 -24133 -72595 -76837 -58019 -53082 -85129 -62735 -50384
5945 -50384 -76439 -14112 -2686 -69987 -87726 -57316 -4547 -71561 -67443 -65669 -128250 -69756
5933 -69756 -29876 -21280 -51811 -44146 9360 -29805 -813 1520 33139 95515 -26578 -27834
5921 -27834 13590 67776 94661 158529 137038 174362 261751 295197 378729 492756 562799 613115
5909 613115 657479 634218 598063 584202 506844 508148 539809 575887 625180 646877 688080 652487
5897 652487 675856 603125 557955 493175 395776 341305 213860 196435 227135 204576 108536
5886 108536 58870 35673 15776 -95359 -94508 -49901 -21521 -15492 -59558 -31572 -5913 -11758
5874 -11758 -8641 -13835 -190 -39641 -55608 -95177 -36283 21503 34176 4063 -35602 24587
5862 24587 -4092 -60350 -48056 11584 24487 -14474 -50652 -44621 -40580 -51050 -10408 24115
5850 24115 41437 -2331 11033 39887 39585 35017 44764 46230 34322 48918 141896 146560 98156
5837 98156 105024 87865 72558 89241 118846 127554 59805 32235 87912 35443 40945 63138
5825 63138 149541 68311 50703 16986 -46546 -8099 19185 88242 90447 28370 10818 87433
5813 87433 88662 40137 30655 49115 87081 45649 11701 38172 -23529 -4762 2967 16381
5801 16381 -1103 22369 45022 -2241 -27697 8005 59210 74420 60695 33153 139385 95179
5789 95179 111598 150344 155589 100544 106984 106950 87793 56825 20903 -55992 -69796 -42340 -67415
5776 -67415 -37358 -14058 -22753 -40287 47765 57382 58500 6864 50416 23979 16374 78809 56786
5763 56786 83241 56115 67412 104102 65380 56629 17309 47909 110711 93780 103855 85647
5751 85647 103186 123573 110324 109222 72641 26881 74066 109999 116401 166102 211325 225579
5739 225579 202760 253638 272261 207031 231397 203199 254104 347278 376654 325653 476663
5728 476663 584684 674251 805796 929810 1009005 1040682 1038777 995848 894610 857086 869722
5717 869722 787568 808313 826665 860899 848918 900098 914870 905437 800059 766041 739635 668873
5705 668873 561940 514614 475654 418779 433478 489594 535247 601163 648680 760899 922568
5694 922568 924563 927453 924742 925995 854111 734123 602101 531017 486885 351533 330807 295733
5682 295733 264551 345538 324715 270074 256156 226274 285478 309861 393363 389655 362388 383522
5670 383522 399302 375023 405558 480772 614134 714469 825684 958387 1064412 1143601 1308510
5659 1308510 1453539 1464026 1461713 1396704 1335154 1205675 1165817 1178842 1232364 1256292 1299323
5648 1299323 1331074 1317422 1323340 1381625 1406592 1440805 1405036 1408837 1465762 1490773 1529090 1578771
5636 1578771 1523080 1540481 1532437 1501495 1528058 1487273 1476698 1420587 1425476 1409507 1351647 1208258
5624 1208258 1089384 1063553 1007348 999976 977789 980939 930597 907610 879039 782829 781354 799133
5612 799133 695856 665531 654398 665227 622285 674244 671585 664467 688698 667029 717913 670743
5600 670743 637616 651081 639218 601821 586756 514063 552764 549664 517246 519708 495328 526872
5588 526872 562252 546970 566890 603743 591732 558383 542036 532476 580119 554372 493201 444062
5576 444062 459470 498967 502940 536003 582129 553363 522483 612565 593704 583168 590636 569750
5564 569750 612697 582715 607551 625226 644966 593258 621010 611904 563346 591772 589451 645837
5552 645837 680836 669648 705145 735785 713979 689792 717007 658724 671505 668254 680203 715472
5540 715472 691395 749448 726395 672077 693567 780996 780558 765603 756187 730939 739067 797118
5528 797118 887402 1003312 1042383 1116701 1131242 1151984 1078945 1043975 1088878 1099849 1093040 1124051
5516 1124051 1159379 1185840 1235266 1226848 1219429 1232887 1254477 1216447 1202210 1153388 1140222 1189952
5504 1189952 1183973 1172301 1093982 1088960 1129278 1099312 1026739 1051380 1052178 1161334 1163646 1128298
5492 1128298 1168970 1248659 1216410 1244497 1319678 1350372 1411795 1401615 1392406 1394004 1456969 1536577
5480 1536577 1616969 1616546 1664900 1689442 1674160 1640895 1713070 1750903 1784984 1746834 1836856 1937190
5468 1937190 1952594 1994203 1994396 2043799 2074971 2177119 2343479 2473900 2572546 2734773 2923115
5457 2923115 3225814 3700730 4191371 4724283 5108276 5363367 5479018 5440170 5235573 5052129
5447 5052129 4961732 4874194 4771997 4728910 4699088 4731355 4827800 4915980 5092807 5393186 5717836
5436 5717836 6023916 6361189 6698325 7076861 7484956 7838190 8271412 8807885 9462356 10253484
5426 10253484 11220916 12357297 13715131 15316731 17127613 19331491 22159535 25838978
5418 25838978 31337450 40393083 54305120 72044346 89728859 103225354 110566373 112302568
5410 112302568 109066556 101689242 93246856 86808805 83672722 85744709 93721015 104826016
5402 104826016 114482908 119224409 118746259 113477393 103538168 90623690 77914362 66281763
5394 66281763 55479646 45956626 38174290 31939572 26949748 23234965 20464713 18288370
5386 18288370 16415107 14948759 13666388 12601419 11824566 11136620 10482801 9949879 9383174
5377 9383174 8850057 8354998 7887495 7475193 7152365 6772063 6397526 6028120 5714986 5502746
5367 5502746 5240186 4988322 4830671 4741213 4591296 4405032 4290550 4191760 4069754 3913665
5357 3913665 3837724 3715595 3689256 3612771 3439881 3337957 3238519 3196104 3154331 3089333 2996338
5346 2996338 2899458 2852188 2794085 2656857 2562530 2473623 2379640 2299763 2250137 2170910 2089600
5335 2089600 2100217 2044248 1984265 1923316 1912885 1852203 1787894 1756670 1680384 1702454 1686153
5324 1686153 1604659 1578193 1565149 1479591 1417508 1401234 1392539 1328506 1281570 1284512 1313107 1262741
5312 1262741 1190302 1177289 1137430 1057955 1089969 1139290 1055777 1012028 985036 943884 1013486
5301 1013486 991274 931515 933476 899357 805119 837321 841788 820100 824718 851227 841919 792771
5289 792771 769576 800722 747865 759470 687855 668522 677537 679746 679114 607055 672371 678819 639873
5276 639873 593161 597762 567517 558554 517277 577741 574259 563732 515726 492807 441641 415537
5264 415537 424019 433217 442249 489825 506290 502238 538690 490914 510842 518020 528881 547190 556549
5251 556549 520840 496322 444514 420669 416548 457856 403203 418627 430205 468269 510448 387015
5239 387015 423253 432483 408891 424361 494362 500708 437358 417814 464593 426735 415453 488882
5227 488882 473866 323914 277709 344158 295363 317418 299683 309472 320518 260519 247683 262795
5215 262795 285041 345422 313083 263084 247455 216028 175403 127716 177731 264069 247272 217396
5203 217396 228141 179003 197603 132343 120795 186322 190741 104741 130883 182540 229072 183525
5191 183525 104792 167454 197789 189578 152483 202327 169337 183159 115127 116595 140203 95976
5179 95976 41725 64479 121099 125224 144978 109244 100953 126034 174550 186773 130950 131180 88123
5166 88123 124056 140396 70399 117875 147622 115987 139993 162824 185491 238580 172543 162357
5154 162357 154143 156041 170700 252249 235228 138668 129757 81724 157594 157915 123049 90299 128035
5141 128035 199962 154017 129914 125178 172610 212354 226509 155523 154092 158628 140680 192749
5129 192749 186818 216922 227488 170778 221667 218103 174044 183528 151964 121334 133266 176857
5117 176857 157976 166474 203025 181989 175786 204442 161736 261337 322718 267015 260397 228754
5105 228754 268770 231648 256313 274458 358043 373941 418939 506932 554929 613995 623922 631983
5093 631983 563581 531568 496742 563801 675850 721801 740295 728595 759199 779683 738646
5082 738646 655583 598001 573942 524622 460563 395377 318977 217753 231863 296447 238164
5071 238164 237033 267111 311329 242627 197534 202764 218651 202440 128969 171151 223014 236305
5059 236305 217008 224974 198007 108035 135925 149755 124517 148042 137092 146138 211096 218558
5047 218558 215645 220707 242078 259360 193717 139265 114994 182328 189035 140014 133257 159952
5035 159952 160884 186567 152371 159562 195098 245861 242781 199020 186965 127968 183397 186558 180725
5022 180725 148719 132491 146833 139706 175863 188616 209389 252370 180337 157421 153168 163463
5010 163463 125680 104179 116332 99090 128958 159775 110426 98622 201887 220758 316466
4999 316466 364152 366673 353910 419579 327185 349550 336011 292943 281524 248921 228190 229631
4987 229631 166103 201807 226927 205677 187735 237181 264112 243920 244342 209868 186104 217967
4975 217967 250714 216021 227704 227937 253580 222834 196764 190156 255958 226113 233805 277740
4963 277740 274291 266915 238262 168438 220346 290177 248681 248052 200347 155435 180776 217302
4951 217302 260497 249473 281667 230184 158148 183304 229594 240759 213108 212017 253458 203790
4939 203790 227406 214426 239670 235326 240885 284688 276701 264629 278189 322807 385288 429878
4927 429878 461868 520576 492707 370858 351873 336968 312239 330329 344541 343447 275290 238100
4915 238100 292542 266232 260306 273880 272062 293947 233165 218624 221101 250749 277707 255262
4903 255262 305011 319127 303183 256200 280789 334232 323230 352990 426497 419211 345737 370021
4891 370021 342248 305865 292636 285840 264305 326031 273266 274705 284776 313887 281982 233234
4879 233234 296183 409420 412369 402729 435687 426529 440717 430052 448694 409562 458314 495284
4867 495284 549899 519363 464350 511832 486303 534759 586076 655031 672975 670418 695441 679928
4855 679928 656195 686756 664940 664017 651974 647515 613954 556307 576179 518008 536272 537227 482519
4842 482519 519832 471029 409765 417538 387731 357517 392161 393736 413654 456558 453533 406952
4830 406952 425055 503866 476899 414248 348353 449733 450953 434117 403194 484621 550119 575718
4818 575718 513865 497922 528374 507761 516184 427838 487789 448443 413227 446985 396930 429657
4806 429657 406088 429937 508211 490407 476006 484033 434701 499297 580227 591362 617016 651246
4794 651246 749762 782869 764704 761560 757879 729627 742137 678487 562768 504567 551470 609782
4782 609782 565524 598986 575310 493761 507291 485284 476970 489979 494693 545679 596936 632571
4770 632571 592240 619209 702833 659809 685239 640016 548692 553668 582550 525911 492892 503177
4758 503177 504598 504461 428928 449779 443248 474272 446312 430319 427683 450336 474161 437713 502081
4745 502081 546282 582890 499240 512127 514862 524313 567131 557134 463403 500109 519346 602751
4733 602751 594508 552387 500787 482416 525684 552544 544521 545367 571693 525494 561062 533814
4721 533814 497143 555254 590805 624613 651440 686278 685144 670520 668809 712136 823618 798965
4709 798965 864487 999208 1068539 1110764 1266578 1270617 1279723 1313297 1366516 1351258 1326537 1368279
4697 1368279 1526427 1713081 1927603 2238619 2356357 2335577 2249807 2041922 1830089 1607592
4687 1607592 1361827 1251583 1174333 1159239 1097105 1012061 980584 952551 851414 850788 930801
4676 930801 905110 879303 827160 823548 848415 850896 836112 807125 837043 840598 856047 868232
4664 868232 838096 810791 849539 838394 848819 932480 901517 868111 863416 824758 813382 881200
4652 881200 886646 896226 987523 923661 896213 882553 891698 918527 889261 922872 914891 913095 900663
4639 900663 941944 946261 991303 996699 1042042 1052655 1056840 1064412 974793 997007 1011368 1023327
4627 1023327 1041407 1157611 1166946 1067680 1110067 1097300 1111936 1146621 1150048 1174692 1140571 1156257
4615 1156257 1228783 1212248 1222330 1221899 1256258 1231869 1185305 1188341 1175131 1210752 1297492 1233260
4603 1233260 1270877 1306892 1354184 1364672 1377713 1358515 1403511 1423362 1352296 1430059 1473826
4592 1473826 1405687 1443137 1447387 1401370 1412447 1447937 1532167 1548309 1654426 1682590 1748476
4581 1748476 1747065 1701602 1739460 1778790 1825108 1872442 1835369 1856656 1937304 1957619 1958271 2018612
4569 2018612 2052713 2090064 2105561 2129327 2211999 2265248 2298044 2336350 2372473 2468854 2501681
4558 2501681 2539897 2556024 2649951 2677580 2724313 2754433 2740248 2749910 2870069 2977331 3042859
4547 3042859 3156577 3202911 3200663 3244694 3343129 3436577 3408366 3423454 3545675 3573691 3568716
4536 3568716 3580589 3699168 3746058 3767299 3788265 3805744 3868312 3867552 3808102 3860369 3873514 3853554
4524 3853554 3896489 3902316 3880475 3911855 3934568 3897455 3817030 3765358 3866730 3956640 4034168
4513 4034168 4042436 4127209 4113237 4079238 4073183 4032797 4002753 4062315 4065755 4048847 4072518 4022387
4501 4022387 4076294 4098168 4101449 4150681 4167650 4137983 4108613 4059922 4075075 4070338 4057220 4071918
4489 4071918 4129263 4132210 4117002 4112986 4091338 4103003 4081237 4076936 4170452 4158078 4184115 4278761
4477 4278761 4250523 4282207 4248098 4287715 4348949 4408773 4454043 4444433 4435662 4462100 4481237 4501565
4465 4501565 4502102 4582962 4654772 4666089 4737901 4741007 4788770 4777055 4756890 4746900 4769583 4793349
4453 4793349 4800741 4872914 4958877 4903422 4934946 4972516 5018582 5083345 5131430 5169784 5164130 5104901
4441 5104901 5179179 5262047 5322788 5315034 5378928 5469761 5490976 5508206 5587203 5655007 5648596 5640249
4429 5640249 5696205 5760615 5787186 5812412 5929545 5981258 6080690 6142535 6207239 6285120 6345681
4418 6345681 6389873 6473145 6531646 6537612 6596430 6703939 6831903 6883947 7006763 7037544 7095127
4407 7095127 7187390 7279241 7371997 7399894 7464926 7518807 7586044 7689002 7770704 7850713 7897067
4396 7897067 8024029 8090635 8155075 8264140 8299938 8408977 8523542 8660372 8769331 8800642
4386 8800642 8923506 8997536 9157437 9367803 9478402 9594194 9783526 9925737 10077065 10168098
4376 10168098 10325490 10514551 10654185 10749566 10855520 11011150 11178116 11375556 11588536 11828311
4366 11828311 12169453 12492477 12756943 12920734 13077519 13154776 13114057 13171433 13243796 13284826
4356 13284826 13373166 13347408 13335796 13363397 13397976 13481331 13603732 13718007 13845766 14004443
4346 14004443 14184436 14260240 14368330 14533651 14551990 14568624 14640307 14645982 14656318 14736629 14848493
4335 14848493 14912329 14995726 15070382 15244323 15397053 15526485 15704546 15794286 15982705 16189135
4325 16189135 16475722 16739931 17001544 17354840 17743815 18179078 18795611 19454519 20139074
4316 20139074 21074037 22305976 24091425 26999474 31232849 36021196 40326466 43303347
4308 43303347 44732939 44946242 44061083 42437922 41245749 41209120 43132384 48093178 55162083
4299 55162083 62297629 67211929 69164141 68727259 66037308 61270411 56068882 51942879
4291 51942879 48822743 47151712 47233402 48383500 49255751 49169820 48265629 46486628 43753106
4282 43753106 40519447 37486338 34801946 32516042 30466131 28834254 27681328 26806302
4274 26806302 26216830 25856224 25652416 25504664 25340603 25333084 25400587 25458557 25525176 25650171
4264 25650171 25849937 25999797 26162127 26355640 26537972 26709529 26908028 27018171 27192166
4255 27192166 27376369 27604838 27799325 28025083 28233456 28389439 28560684 28697177 28928820
4246 28928820 29221792 29436748 29640744 29795598 30029196 30382296 30681677 31068258 31463751
4237 31463751 31774503 32178550 32676820 33197603 33888838 34553853 35255961 36070840 36951172
4228 36951172 37977290 39017808 40228270 41523012 42933047 44398295 45908695 47592626
4220 47592626 49309426 51075027 52891435 54814055 56843807 58931557 61094193 63303041
4212 63303041 65557428 67925129 70296659 72591761 74810775 77064310 79188202 81296591
4204 81296591 83325787 85250787 86989173 88652435 90240587 91838561 93232592 94532629
4196 94532629 95691257 96699982 97601617 98231141 98572169 98648270 98614348 98221439 97611736
4187 97611736 96798348 95880058 94859928 93675532 92355565 90960149 89408110 87740430
4179 87740430 85984549 84070047 81992166 79791346 77427584 74937250 72445180 69873230
4171 69873230 67322934 64751813 62253607 59811182 57450472 55148879 52916670 50831949
4163 50831949 48920775 47016651 45200998 43617581 42169486 40862032 39582144 38403675
4155 38403675 37322236 36170137 34982241 33813361 32545921 31290805 30102782 28898690
4147 28898690 27715582 26705960 25872292 25058636 24383656 23705935 23094269 22539179 21951966
4138 21951966 21467313 20861413 20247498 19672687 19117237 18587396 18113374 17637238 17101356
4129 17101356 16582674 16121828 15705864 15438774 15049461 14627523 14388617 14148379 13872116
4120 13872116 13617619 13387020 13229071 13080556 12984442 12883914 12787602 12621374 12516171 12429144
4110 12429144 12270568 12195864 12093372 11927734 11861854 11795375 11771862 11774638 11766261 11753006 11811430
4099 11811430 11868238 11879835 11861035 11842565 11788755 11692786 11562630 11377397 11247160 11092464
4089 11092464 10959486 10812879 10621727 10495557 10498182 10429648 10334341 10313316 10245389 10123765
4079 10123765 10102895 10106412 10076907 10070348 10087443 10103495 10090856 10109982 10084807 10111603 10131931 10200104
4067 10200104 10335251 10376232 10346297 10331700 10263197 10159170 10075865 10028436 9952641 9831968 9696748
4056 9696748 9599470 9471588 9350238 9290670 9169582 9069152 8944350 8870518 8701340 8543288
4046 8543288 8403365 8254823 8060006 7949846 7870580 7732891 7633681 7560624 7512070 7478327
4036 7478327 7506467 7534054 7571166 7552419 7597758 7728076 7945884 8110444 8229945 8471171
4026 8471171 8767256 9091552 9347355 9584159 9877951 10054350 10186492 10290873 10376381 10463890
4016 10463890 10496896 10543712 10553512 10585810 10688884 10806838 10950479 11045252 11101722 11192711 11267607
4005 11267607 11312119 11342261 11408989 11417575 11479424 11516678 11586578 11595488 11686672 11917179 12287451
3994 12287451 12765657 13392137 14121437 15008360 16016721 17041367 17945805 18834075 19556992
3985 19556992 20157445 20501296 20733000 20861135 20850509 20872218 20934020 21195875 21429251 21835985
3975 21835985 22343911 22937060 23576919 24177002 24807738 25390947 25987040 26616048 27215579
3966 27215579 27935083 28665276 29466464 30231105 31076046 31918721 32649150 33278228 33807026
3957 33807026 34167669 34522194 34799762 34959944 35085050 35100121 35157053 35057156 34944915 34713865
3947 34713865 34298704 33731920 32996105 32089384 31087560 29985038 28825489 27608993 26388495
3938 26388495 25238840 24014777 22970144 21985945 21035757 20204194 19434369 18805157 18287140
3929 18287140 17817932 17447278 17241658 17072560 16944103 16740857 16674164 16769906 16810136 16834210
3919 16834210 16887370 16838154 16855999 16936756 17023298 17182845 17287443 17241434 17243814 17294740 17397597
3908 17397597 17549706 17603695 17622322 17635510 17726107 17799259 17838790 17801197 17909089 18014894 18241371
3897 18241371 18396618 18534590 18708379 18953376 19259299 19661066 20040265 20418459 20885383
3888 20885383 21482008 22140441 22894213 23778567 24751019 25852028 27145367 28711690 30519714
3879 30519714 32582306 34959363 37496343 40229070 43010485 45680067 48138177 50317552
3871 50317552 52170535 53684321 54995098 56232258 57426233 58634246 59977074 61484600
3863 61484600 63031466 64687335 66370408 67910956 69317091 70504147 71417832 71892961
3855 71892961 72060645 71944802 71667702 71157542 70604915 70085555 69667055 69386008 69232538
3846 69232538 69221266 69348735 69602228 70044134 70656993 71342118 72013964 72815340 73590208 74404311
3836 74404311 75353875 76414333 77694246 79205695 80928289 83113512 85777917 88955524
3828 88955524 92861419 97495320 103022654 109496005 117078195 125955823 136435485 148936536
3820 148936536 164025382 182215988 204034459 229350520 257417470 286514590 314772961
3813 314772961 340761972 363201340 381213833 394768611 404132341 410173829 413835345
3806 413835345 415924292 417376081 419043114 421314765 424093411 427235433 430268527 432854087
3798 432854087 434239860 433573105 429936215 422196592 409928232 393474997 373689715 351840610
3790 351840610 329335436 307587890 287492661 269508365 253707912 240241203 228736124
3783 228736124 218951869 210633867 203333578 196659523 190570802 184693943 178954902 173300571
3775 173300571 167663542 161919030 156129173 150191577 144333427 138731384 133243749 127949845
3767 127949845 122962485 118199887 113630462 109046973 104480543 99829372 94967691 90029192
3759 90029192 84974691 79921448 75008880 70344857 65976757 61942511 58242449 54901455
3751 54901455 51933116 49315381 47021439 45044194 43293109 41832243 40703209 39733346
3743 39733346 38959573 38409182 37920754 37602052 37229166 36891496 36537675 36183008 35795828
3734 35795828 35420047 35152366 34974731 34844695 34782621 34895591 34976989 35090579 35170668 35132851
3724 35132851 35128709 34953034 34650286 34184881 33615638 32941932 32120045 31252610 30379886 29466032
3714 29466032 28552945 27641695 26853096 26039880 25279739 24526120 23742698 22911284 22106474
3705 22106474 21224618 20283557 19405623 18531775 17535725 16642631 15838959 15017411 14277906
3696 14277906 13651465 13051617 12493162 11974161 11459245 11045890 10682565 10422824 10134231
3687 10134231 9864597 9625109 9402065 9146206 8910018 8672077 8435151 8257500 8162952 8017230
3677 8017230 7855017 7732755 7540609 7335118 7241998 7189189 7058653 6869898 6761984 6701582
3667 6701582 6545338 6452157 6304122 6216899 6130776 5997877 5820784 5729087 5682715 5605371 5490807
3656 5490807 5447897 5378558 5220852 5175936 5200122 5132043 5010559 4947572 4873698 4794213 4671724
3645 4671724 4695932 4669985 4632316 4554942 4484979 4430334 4354401 4297934 4286743 4296523 4188266
3634 4188266 4123459 4134248 4052271 3989463 3932281 3844406 3802911 3773592 3770146 3745396 3673560 3611742
3622 3611742 3625535 3587527 3456646 3443918 3514919 3515955 3466974 3419527 3333916 3317225 3283802
3611 3283802 3222214 3156082 3125881 3144526 3053162 3050294 3085584 3075597 3051194 3028207 3027715 2988349
3599 2988349 2981630 2930575 2898385 2813531 2852469 2881018 2813223 2725370 2722703 2781884 2798641 2786733
3587 2786733 2807940 2792522 2812461 2791262 2828605 2841374 2842736 2828662 2816632 2851470 2848318 2820572
3575 2820572 2812622 2830877 2849908 2876988 2872371 2929102 2902793 2900063 2912308 2967878 2965922 2896087
3563 2896087 2834150 2887893 2881302 2955029 2938957 2883892 2875070 2878517 2870639 2856881 2941805 2936737
3551 2936737 2952104 2996808 3025854 3028177 2999968 3066404 3114051 3070112 3097343 3182908 3198698 3240072
3539 3240072 3299477 3349063 3423154 3499060 3552769 3682415 3753525 3923065 4123311 4184642 4321043
3528 4321043 4437021 4573998 4711658 4811930 4925039 5055314 5109477 5180450 5274136 5353839
3518 5353839 5418306 5442381 5555975 5558316 5605742 5648648 5681356 5702363 5781133 5841710 5912708
3507 5912708 5967656 5882644 5913617 5909333 5914378 5913117 5978916 5910894 5929186 5973321 5961234 5960268
3495 5960268 6047273 6006405 6088622 6163396 6172673 6205742 6303095 6408157 6438375 6484891 6521078
3484 6521078 6648852 6787431 6899645 6959936 7035058 7096596 7225148 7338858 7404978 7446793
3474 7446793 7555555 7693207 7780607 7871028 8067669 8301311 8502947 8699603 9056566 9465759
3464 9465759 9753247 9943096 10206413 10500986 10863468 11239760 11549989 11962459 12546837 13180858
3454 13180858 13963624 15023282 16206426 17506925 18838911 20091875 21220221 22294400
3446 22294400 23256011 24059892 24824526 25405481 25793656 25998902 25906246 25544150 25044611 24230447
3436 24230447 23109211 21809627 20538601 19184966 17680995 16150180 14659569 13326445
3428 13326445 12020400 10855910 9813255 8903721 8134354 7439563 6890779 6464963 6052952
3419 6052952 5645708 5419471 5099850 4858102 4663569 4465612 4316810 4163557 4014742 3940595
3409 3940595 3840528 3785154 3633672 3497452 3464362 3460205 3512786 3516005 3518900 3450030 3375695
3398 3375695 3298382 3211002 3118434 2994562 2843575 2747228 2754319 2709878 2555181 2482064 2463595
3387 2463595 2368046 2274504 2325078 2250067 2141054 2131841 2106479 2125472 2069864 1989279 1959455
3376 1959455 1853659 1878058 1892618 1895535 1846089 1809465 1751296 1720394 1640645 1672814 1682828
3365 1682828 1698083 1656996 1635825 1640250 1607839 1606420 1587977 1533939 1557433 1565258 1517122 1568214
3353 1568214 1591746 1577732 1492645 1423078 1391307 1357023 1410266 1502843 1484427 1464619 1434956
3342 1434956 1398579 1347584 1321806 1260158 1243592 1214906 1230630 1280207 1311246 1365790 1317167
3331 1317167 1250727 1264470 1260582 1280285 1284371 1258020 1198810 1140226 1199070 1150851 1132276 1204894
3319 1204894 1168591 1163213 1128722 1109577 1120188 1058292 1100664 1066119 1060324 1080812 1081058 1091916
3307 1091916 1093015 1086139 973997 1002969 1039267 1047728 1018455 1019362 1015122 1034562 1011606 964097
3295 964097 949610 907431 920819 935152 945468 914334 819332 856333 851395 744913 746435 788432
3283 788432 830986 830002 858742 884911 793924 757029 827930 850477 812155 838706 858459 861354
3271 861354 813217 819243 827596 833574 853986 829268 801046 796889 764947 786888 798754 786496
3259 786496 752603 716158 772953 817463 804205 749058 757053 789476 822446 780113 755552 758576
3247 758576 751516 680352 719038 696722 694982 683710 673664 663745 629059 677141 671497 676639 717854
3234 717854 734341 652072 689137 714528 723552 684873 617800 629385 678458 755453 776513 788367
3222 788367 812810 721493 640898 607853 631681 695726 673952 659334 651636 660103 590437 591523
3210 591523 603995 632344 640216 653614 660899 655453 619978 603216 686542 681683 654300 674316
3198 674316 728905 732081 749967 755711 675431 649766 618505 633126 694880 686014 671323 675269
3186 675269 641444 627784 670956 689437 711798 606477 599937 705542 736654 715894 653679
3175 653679 741209 788317 746043 778804 819963 773161 761344 763121 817243 786752 778968 789137
3163 789137 760353 721640 757895 789446 764537 781841 773980 834472 808288 776849 814606 910617
3151 910617 917505 884092 877820 929170 964741 1023681 1062314 1157365 1152118 1119810 1195458 1238844
3139 1238844 1306231 1407731 1515244 1585735 1646084 1725379 1731045 1816782 1858524 1862571 1816816
3128 1816816 1790353 1808219 1842534 1839598 1778513 1720264 1746219 1765570 1725686 1713709 1761263 1824454
3116 1824454 1871826 1914658 1996232 1992907 2071981 2214352 2334727 2552774 2771872 3046270 3173442
3105 3173442 3331640 3338812 3240165 3109582 2959930 2764515 2543182 2322515 2124932 2044995
3095 2044995 1943344 1873425 1803897 1726576 1711110 1694078 1679441 1645595 1635764 1582584 1595441
3084 1595441 1639974 1672421 1662533 1707089 1780777 1773562 1839920 1910304 1895265 1932259 1945715 1839469
3072 1839469 1798242 1750865 1734016 1621299 1441089 1435501 1368912 1292308 1249633 1153546 1136766
3061 1136766 1090694 997741 938361 969719 1004574 934905 888171 885676 895700 873549 811277 794273
3049 794273 728108 697258 722378 709331 695637 654034 661695 678469 646248 572940 524616 532554
3037 532554 579767 544906 569700 557443 560210 495093 489739 478434 478819 476175 498209 533183 557684
3024 557684 499024 451897 459421 509998 443363 384687 379298 398053 435187 400373 443893 443324
3012 443324 424340 393275 398547 398145 393822 436392 417065 348945 385156 286596 296830 286531
3000 286531 341855 300842 322957 335563 317529 368537 330905 298895 293217 336901 309510 323174
2988 323174 281165 367882 259069 253777 285362 242234 217167 251102 263496 256217 297201 236410
2976 236410 293666 244340 251038 274082 319598 319105 368423 330674 292713 311446 320747 274262
2964 274262 288385 227805 243631 273964 240489 218791 236290 201394 263770 217578 207823 232768
2952 232768 239101 287900 260947 262736 278838 169606 88276 100048 145454 232751 220697 202398
2940 202398 244594 228064 198480 223055 242044 274180 299221 251988 228026 217601 145717 209306
2928 209306 189261 158320 156739 145337 195154 213629 214466 190596 155285 179987 240452 227191
2916 227191 266934 193713 129243 119720 132592 193018 199988 178530 160344 209941 154773 144887
2904 144887 146391 157969 177309 217964 170320 160393 134394 179048 211329 161871 168928 197016
2892 197016 168838 156027 161089 187807 152604 170764 133810 111105 93588 85196 109955 87998
2880 87998 65057 87383 73098 134904 181525 204862 141026 184153 206895 247471 185470 137516
2868 137516 147426 148917 128579 128154 161564 162692 196575 176368 103758 69101 165826 166068 123128
2855 123128 119589 118940 115109 141889 172916 211723 160960 186481 180551 151056 135305 143811 206347
2842 206347 196541 129709 120944 152579 178163 181738 205870 292817 256299 159740 110912 181674
2830 181674 233695 214264 168513 185237 153745 121489 177119 165814 179769 162214 159840 150081
2818 150081 165549 189776 139040 76311 98325 109000 118754 121153 132325 141217 143143 73742
2806 73742 87983 43170 94761 112159 173483 177753 136761 159206 158327 140860 85097 82594 152422
2793 152422 149448 194077 194422 154099 126714 -20914 63794 110182 68212 86550 62002 92375
2781 92375 39671 105396 83818 158721 133277 53679 28028 21263 56574 74574 109658 52521
2769 52521 33675 5084 108453 142712 95671 83915 61790 70275 87547 -1255 60870 54820
2757 54820 25467 77795 61107 90832 96388 96886 111035 69190 87971 154404 143809 57485
2745 57485 87928 100497 156278 91920 -1147 29185 25041 27052 78340 75061 95231 142392
2733 142392 131937 124150 99752 179748 188577 136461 96134 98728 93918 54745 57050 61912 34751
2720 34751 27492 86285 79146 35227 24254 17962 54225 25456 58368 117699 49755 18899
2708 18899 59543 144472 77163 -2831 65152 125210 80259 45118 110543 69461 3722 -27612
2696 -27612 35660 68055 75826 99845 77090 65288 95955 89374 53754 101690 56975 74554
2684 74554 162604 162299 104126 75210 26242 11350 14209 146347 182355 114872 79440 79659 128213
2671 128213 185781 119969 70011 14058 52078 71005 52146 186599 141879 119077 45446
2660 45446 52650 59401 72198 135617 211995 135064 55749 125976 98314 130154 112507 61453
2648 61453 97169 88330 24589 68852 120915 122168 57350 -4039 -62749 2784 115230 112297
2636 112297 138780 118376 73785 97052 75363 91451 105749 88102 81015 120373 123436 113776
2624 113776 131643 88111 48886 89354 110905 78965 20953 28923 -38508 -6742 10048 36111
2612 36111 8639 36767 94525 116981 59520 52142 88230 -386 48548 39716 57946 91105
2600 91105 146093 127608 112993 99687 162258 135733 75557 40681 -1946 -8325 38766 27500
2588 27500 46215 61795 66691 91427 88854 102846 93589 92554 84909 130561 135837 152581 200643
2575 200643 232918 279709 230008 270148 233983 143852 139998 234332 200855 177517 130363 69433
2563 69433 75755 112335 137001 158903 169911 153320 79745 80928 39772 53918 55964 52087 32537
2550 32537 33406 71509 73249 135494 125371 122031 90598 98976 94337 27048 39546 50677 88929
2537 88929 135767 82863 18757 61600 66125 3348 -29171 1753 117871 107975 126388 100574
2525 100574 90378 75001 74847 59507 81663 102936 119061 141550 90983 30366 14761 48695
2513 48695 65989 47312 111961 124270 82765 -927 52940 79075 108779 98971 118150 142929
2501 142929 108403 137152 63747 32360 10401 -13481 49960 36417 40296 34523 39359 46786
2489 46786 10745 32434 8634 30414 65828 46255 20539 43217 100048 46123 17630 65887
2477 65887 78744 92149 47313 79470 104899 134039 166580 95489 93566 112145 100218 58864
2465 58864 30944 40410 23158 55094 81137 96995 141400 79194 81251 60215 31417 20620
2453 20620 -23317 28722 51915 60374 36823 47708 108393 85931 82223 88164 120102 114305 51870
2440 51870 47818 81466 54071 111888 69195 58310 97072 185375 125463 102356 142295 131147
2428 131147 107866 163647 214550 182026 185121 187618 250693 197989 153145 159162 171329 97154
2416 97154 156699 133213 165702 181120 198646 177075 149970 130500 161125 141289 174323 150141
2404 150141 190912 176621 125665 174841 158870 210712 223161 251283 306239 274233 252086 253056
2392 253056 256771 242016 232390 256189 268471 278182 254111 238900 240879 258755 260429 243218 300893
2379 300893 296799 280913 297134 270560 173567 201301 306168 321821 320917 254204 214246 270478
2367 270478 293507 317770 324527 339593 372152 396015 390514 379003 477480 465294 421428 407107
2355 407107 418664 466678 532531 570158 651935 625372 571968 626439 624524 679746 723834 765779
2343 765779 791649 811900 829556 863172 939977 985990 973534 1023945 1076501 1071038 1149719 1178361
2331 1178361 1347378 1425847 1546438 1752305 1900623 2047674 2401927 2816058 3147286 3431322
2321 3431322 3715572 3986485 4234082 4524149 4983433 5553433 6356648 7435736 9232347
2312 9232347 12342544 18025057 25825754 33689793 39389545 41858879 41845366 39821845 35355648
2303 35355648 29965842 25369464 21039828 16947934 13411259 10851445 8860858 7400297
2295 7400297 6480396 5963108 5501434 4983177 4609234 4294992 3816718 3436007 3133148 2876522
2285 2876522 2690434 2496385 2318836 2158466 2022266 1931609 1823313 1633852 1542742 1499210
2275 1499210 1406936 1340239 1296691 1237353 1217082 1192872 1189449 1209196 1128294 1038506 980068 938788
2263 938788 914436 897718 879469 867471 846116 839783 871256 894447 785130 731407 759369 775049
2251 775049 717834 717269 687401 595336 549963 576952 561931 536648 534793 590837 561925 504801
2239 504801 484524 484985 457371 439323 441966 389530 410395 396788 391349 414437 353336 355059 344765
2226 344765 301853 333257 308434 274049 301605 305516 311124 352057 318754 372340 275302 261675
2214 261675 287005 252245 266036 288212 296916 246627 254737 284832 226057 201890 227282 214696
2202 214696 172819 141891 182430 208887 231873 220944 186998 191842 163020 122306 134939 238326
2190 238326 225643 193447 147297 125605 114811 82029 119979 124741 96783 113137 127884 97390
2178 97390 98381 145837 110602 120866 143824 103347 142366 145335 100562 94262 153033 79852 29507
2165 29507 88802 60045 66793 88010 64413 27242 -2676 29749 64153 88409 129204 142396
2153 142396 81189 74320 167588 79332 30448 92911 119761 74598 53065 99025 122920 22375
2141 22375 66415 98041 64975 111532 111636 45721 25317 123327 142195 42158 7331 67646
2129 67646 38225 73099 56816 49748 80732 115603 69671 98055 48795 44853 37828 43796 19290
2116 19290 8486 14411 52954 10196 68138 56599 22083 99451 73058 77181 46380 67989
2104 67989 71605 101167 82547 28486 -1929 38177 50909 79562 35121 4992 23486 -19290
2092 -19290 4354 38829 123090 128772 82563 91498 14916 71205 -15982 -27976 64442 62440
2080 62440 75812 59567 67782 42818 16925 -21354 76 97331 88436 51081 59888 85776
2068 85776 75933 82417 32159 57824 64753 31745 23678 65148 -1490 -30894 -20685 -57500 73939
2055 73939 40121 -46313 366 55165 24335 -13668 15063 129080 201295 100823 106814 147222
2043 147222 137677 83962 110514 200690 248574 271200 192219 248034 282439 223519 195857 145080
2031 145080 104287 96527 36726 9240 12247 38572 39460 -2798 40197 20601 -32824 -170
2019 -170 24699 20973 -280 3257 -71309 -98476 -50518 -29092 -54305 -219 -60015 -40765 -29929
2006 -29929 11255 75616 5053 19265 16889 -40359 -75864 -46060 -920 24951 8349 -10121
1994 -10121 -22509 -61746 -16071 55602 71381 63051 72827 67513 32005 92504 104487 66359
1982 66359 34522 -10535 4169 9252 8553 2490 38899 92572 35141 -5969 11502 50630 41193
1969 41193 35939 28269 96850 125972 101366 96025 90001 35317 24011 2815 -76210 -53138 -47303
1956 -47303 -52530 -20388 -40673 -109348 -118714 -34209 18764 -22760 -30488 -343 20122 13564 -19774
1943 -19774 -18493 -19926 -22847 -53918 -50276 -24958 -11544 49021 49342 -19091 -54574 -76762 -40751
1930 -40751 -4306 -36465 -65656 -26386 -7213 9567 14024 22542 11003 12710 -22693 -113140
1918 -113140 -156578 -56000 -10844 -36123 -50173 -19810 -46874 -23044 11733 -3594 -8494 -8374
1906 -8374 -44527 -120517 -101195 -97180 -40966 23940 24995 -20803 -40417 -51592 -68569 -23740
1894 -23740 -7176 -14117 7899 7908 37313 47139 42680 21816 -16396 -8698 -1784 -43521 -11134 -5075
1880 -5075 10447 -3505 -49432 -76552 -24191 28119 29820 53073 62758 8885 35109 -810
1868 -810 -8205 -29646 -28973 -44672 -25545 -44936 -23917 -20844 -28762 -56352 -97500 -39903 -28712
1855 -28712 -6073 -1993 -21189 -22028 -18539 -45833 2765 34086 24131 12743 -6412 -42751 -57110
1842 -57110 -93661 -81619 -53362 -11310 -4398 -11364 9998 10742 6371 53358 13079 32107 -5394
1829 -5394 -101238 -25618 -23298 -11864 1452 -7211 -25583 -50687 -18846 -68558 -53433 -74957
1817 -74957 -52683 -78241 -59994 -30461 -41224 -39564 -114370 -102812 -268 16486 5178 -9682
1805 -9682 -54604 -36079 -63907 -40575 -95969 -75522 -91991 -99305 -59968 -16870 8136 32479
1793 32479 -6711 -3746 43369 -41943 -40180 -35280 16793 -41460 -2613 -1896 -95739 -68091 20123
1780 20123 25153 28651 16719 9410 -17567 -20661 -10030 -66093 -39161 -6123 -66413 -87872 -58754
1767 -58754 -29622 -30659 -32499 -31527 -31380 -29388 -40984 -29843 -25995 -30234 -6412 29010 18602 -17200
1753 -17200 -11048 32804 43778 16883 -41641 -20881 -42272 -120815 -44644 -22119 -54911 618
1741 618 43382 34872 -12789 -52386 -51585 -43568 -24302 -43339 12560 -27456 -75596 5336 -56692
1728 -56692 -11210 1629 67023 44564 -60851 -56118 545 -41459 -20271 -1256 20602 -10878
1716 -10878 -44823 -36293 -2577 -8584 27728 6250 -51958 -43149 43314 31290 13205 38344
1704 38344 -33540 -61415 -121333 -95155 -64259 -67205 -28013 19789 -23452 -50926 -7050 -23952
1692 -23952 -31710 17654 -3304 -56295 -90696 -98175 -46429 -20214 -54916 -52713 -57264 -49243 -68781
1679 -68781 -16136 -1335 -44513 -65997 -52493 -2488 -47937 -67790 12165 50589 89925 116011
1667 116011 82672 52745 3199 -34147 -43170 -22174 37936 24210 -18218 -89750 -49304 -22219
1655 -22219 -21637 -22049 -17221 -43633 -59933 -104410 -36391 11838 -38466 -20417 -8553 -72561 -56982
1642 -56982 -1553 -7465 -49103 -89078 -94178 -62062 -62938 -41587 -14220 -91243 -153132 -80621 3021
1629 3021 43300 32433 -326 5705 -32088 -59266 -80036 -101191 -104080 -101441 -66856 3438 -56796
1616 -56796 -52175 -39639 14877 -9636 -47193 -33495 -66659 -70951 -13460 1456 -43185 -63498
1604 -63498 10580 25470 -8098 62128 8490 -12695 9705 37016 -29293 -72817 -67068 -90126
1592 -90126 -75979 -46757 1313 -58308 -109223 -126700 -124022 -101941 -115190 -55268 -72459 -61690
1580 -61690 -35304 -72901 -11078 34198 38178 -26683 -40700 -10396 -19516 -12103 32953 16772
1568 16772 -48163 -139442 -81975 -36022 -25144 -7985 -63626 -79704 -25571 -11073 14778 -9826
1556 -9826 -82236 -101073 -86116 -38244 -81079 -91712 -113699 -72607 -6529 15194 20374 3435
1544 3435 11654 -39847 9073 11655 22729 -9893 14717 -5465 -46617 -4193 -57316 -103454
1532 -103454 -120300 -45414 -65471 -5271 45523 9982 67650 8566 -14308 47011 60746 3436
1520 3436 -86064 -53808 -35339 -82010 -41822 -43793 -24745 46485 36820 -97838 -83959 -29847
1508 -29847 -52151 9912 38503 18961 -5153 339 -32651 -37472 -8629 34149 93314 46651
1496 46651 -55667 -57356 -16904 46397 -71084 -69765 -34988 -13723 -43440 -76056 -69426 -51005
1484 -51005 -45414 -44204 -23272 43729 8718 -50243 -80813 -55244 -53320 -39887 7883 -22461
1472 -22461 -18100 -18796 -46422 -104188 -111561 -70093 2629 -32750 -44448 -28780 -53191 -114720 -68684
1459 -68684 -42120 -59330 -12042 21989 -23895 -38753 -87594 -100997 -36616 10946 2572 -22927
1447 -22927 -39282 -13196 -45871 -57478 43340 -11892 -66394 -52730 7456 11062 -28300 -27797
1435 -27797 -33513 -12494 30886 -12804 -24276 -50635 -69527 -25433 14421 -6063 -34344 -54298
1423 -54298 -71256 -66239 -37607 -25821 -88441 -72351 -106956 -102875 -116535 -57158 14700 -36053
1411 -36053 -87899 -88093 -48207 -77231 -139401 -116143 -95019 -69746 -43523 -35706 -51805 -59278 -117411
1398 -117411 -144167 -57788 3760 -6324 4788 16670 -12214 -66277 -3672 -17393 -94493 -53829
1386 -53829 -21170 -31363 -47514 -84040 -117633 -119479 -89057 -26930 14718 -23577 -22383 15453
1374 15453 -37714 -17161 -24045 -22087 -31527 -65083 -14636 -66692 -88308 -43216 12356 -14328
1362 -14328 -33213 78466 75051 57107 1616 13270 68961 58291 79050 101996 90303 -12245
1350 -12245 -83298 -34534 -42161 741 -33642 -38590 -123856 -81346 -83482 -117490 -43913 -42843 -53493
1337 -53493 -41145 -80506 -50317 -204 -59595 -44369 -3703 14435 55016 41515 -33263 -85856
1325 -85856 -81048 742 39295 32054 1223 7701 -25478 -40808 -23042 -42101 -16536 2036
1313 2036 -11334 -15665 -7363 26629 -6734 -40741 -40455 37305 38627 -31603 -46190 10352 46494
1300 46494 56180 30454 44448 14618 -19540 -50326 -26522 -58561 -76359 -24488 -58691 -46780
1288 -46780 -27286 -72680 -56465 -48513 -34015 -95057 -95459 35985 23294 -25286 -63671 -37927
1276 -37927 -23883 -61378 -107267 -101133 -125009 -91242 -94003 -22735 -47873 -96125 -39592 -76229
1264 -76229 -50193 -3582 8334 -3141 -23360 -41832 -45983 -29719 -21560 -12023 49444 50605 2745
1251 2745 -47940 -66735 -9228 61021 -6990 -62370 -70469 -16804 -84876 -90498 -24436 -5104
1239 -5104 -41759 -42525 -65015 -50319 -32800 -26791 -12083 -48786 -50787 -1253 -2274 -48263 -6105
1226 -6105 55689 61486 25531 -149 -47635 -5197 34847 -11302 -34279 1759 11777 17935
1214 17935 12415 66328 39168 -52 -29878 -22154 -5518 21850 3864 30884 61741 30913
1202 30913 -34640 2660 7408 -43589 -17924 -45392 -88472 -65865 -47968 -69678 -84199 -10776
1190 -10776 31179 72536 52067 -1928 5268 -7617 -20811 -77272 -42757 -73326 -53591 -30231
1178 -30231 -43956 -11173 -7985 45016 17140 -7711 -25905 -25090 -30922 -14014 33377 -26402 -62084
1165 -62084 -18947 33937 20063 -60079 -75482 12200 71172 20472 2192 26545 3525 -20481
1153 -20481 -56102 -45743 -24085 -49418 -48706 628 14076 -50639 -38770 15341 -27578 -5750
1141 -5750 41805 81413 72616 28886 48871 67673 2115 -110409 -69430 16873 37170 -51542
1129 -51542 -133709 -75827 -56203 -84126 -75742 -15498 -39692 -87938 -68182 909 -31316 -2082
1117 -2082 -48577 -91138 -43194 -56321 33716 1162 10130 3454 -39041 -36832 7744 26311 -35347
1104 -35347 -61759 45224 92466 53145 -12253 -49531 -23067 -33858 -29211 -51611 -79695 -36723
1092 -36723 -21776 -32096 -50419 -53719 -30750 -6445 -23481 -32732 -12725 -18054 1350 -23801
1080 -23801 -30400 -47481 -17476 20514 -23778 -80185 -51135 -34310 28901 -8254 -20217 28832
1068 28832 -16086 -38031 -33699 -67890 -72839 -83395 -13044 2072 1858 6840 -73856 -50322 -2047
1055 -2047 -69448 -46588 -70064 -36015 1428 -95 -61347 -46097 -10260 -24145 -39636 -45834
1043 -45834 -11284 -89677 -113284 -10675 -8252 -56864 -48526 -77455 -52068 -11780 -26851 -94597
1031 -94597 -73936 -6637 -19850 -117012 -71518 -366 -9363 -20693 -54783 -88464 -86415 -112647
1019 -112647 -41213 -32440 -55930 -55360 -47942 -62674 11563 -1478 -69618 -78769 -84739 -60750 -89445
1006 -89445 -67387 11560 -8971 2861 49259 5467 -2956 -13956 -55070 -60197 -58399 -15869
994 -15869 -18219 -42213 -51899 -54273 -33783 -83584 -57640 1168 -45897 -29240 -5668 -28366 -11236
981 -11236 24422 -43367 -22513 -10723 -36648 11687 24387 -52863 -43878 -26465 7832 42947
969 42947 -27823 8078 17309 22471 8370 -15038 -3582 -46579 33571 34581 -10157 -29944 31194
956 31194 74833 72743 47456 5068 -27613 -55277 -29831 -73929 -53829 -9120 14023 19204
944 19204 -21146 -16682 -15264 -27374 -27138 -35043 -16446 -60628 -84785 -31437 16299 -40934 -100449
931 -100449 -51087 -54901 -96830 -23630 22511 29691 17205 7491 -28192 -50762 -32569 13157
919 13157 -44465 -19373 3298 8283 14218 -25552 -51150 3660 -42366 -40790 31917 38284 12705
906 12705 -15570 -86147 -54788 -4336 1374 -3710 -34732 -31142 -27445 -52128 -60319 -3234 -20165
893 -20165 -51578 -101525 -58501 -8650 -21208 -93933 -56701 34570 16544 4532 -46599 -42626
881 -42626 2436 -16478 -73844 -35272 -15108 -31069 -45659 -45359 -47151 -19752 3077 51480 26041
868 26041 25826 42111 13665 27192 -17951 -31125 13232 -2421 -54562 -8550 -23557 28319
856 28319 18100 27588 4944 -10990 -10503 49741 36808 40024 88662 97459 43813 32736 59609
843 59609 15333 23300 58023 38532 -9403 -21288 -38892 -30876 6429 51959 10746 -32863
831 -32863 -28171 -39059 -43322 -14077 22985 -38524 6371 -11795 -60678 -10006 -13182 -29608 -52328
818 -52328 -10918 -23508 -54288 -39155 -33262 -41685 18058 43837 56066 4489 19153 17463 -27455
805 -27455 21416 -1209 -7501 37959 62814 5284 30327 31671 31199 64782 54438 1204 25576
792 25576 9022 -29187 27183 82618 57519 -9116 85115 74698 54965 -9151 25159 53963
780 53963 52523 -205 -4615 -24960 14310 52454 71283 5242 -80207 -72180 -19982 2692 -16496
767 -16496 -3918 6527 912 -11590 34411 4628 -19782 -35527 -30483 -2377 -24364 -11095
755 -11095 33273 1715 34794 17634 72021 123945 80395 14017 19227 -35565 28380 19101
743 19101 -22401 -31159 -45243 -40721 -21561 -19085 -61559 8946 60184 76630 63100 32600 22581
730 22581 12266 -25180 -38754 4906 -21950 8223 20143 11289 69423 74262 17963 -10168
718 -10168 33826 19008 59153 62857 54734 40120 16879 -15261 -27299 -31230 -59441 -24629 48869
705 48869 74370 42556 -16969 31376 19470 17657 28333 -65393 -47438 -6111 -13768 -19099 -9310
692 -9310 -59767 -102827 -62260 -44500 -54229 -56100 -17260 65126 57393 43446 34298 -11307 5731
679 5731 36861 19666 -9304 -8295 26207 2903 31023 -3066 31239 51861 25306 60242
667 60242 13694 9740 38877 -2792 78303 12745 19109 64005 2646 -1747 -3137 -13553 -7479
654 -7479 -16849 -16882 9179 -46314 24473 1952 -66799 -37944 -17212 10929 15528 35471 -33143
641 -33143 -103450 -81569 -31807 -67968 -38409 3465 31191 13773 -50238 -49211 -71248 -11085
629 -11085 -27799 25643 21800 58066 45713 49261 -9562 14122 34462 24865 21797 47187 -38246
616 -38246 -36768 -14947 -46208 -6864 31217 104386 56973 28427 -9837 -33579 41408 94703
604 94703 64937 42181 33735 21810 42091 22603 -27923 -16084 -17160 24834 -13430 -87372
592 -87372 -32880 -18744 -41777 -59113 -21833 6259 76054 67323 81262 54912 17526 48178
580 48178 57594 22036 5492 33251 51968 116808 30878 15345 41125 65213 70827 20724
568 20724 12588 47309 57937 57081 89221 139569 53749 -27614 -35593 -33819 7645 -26293 -36598
555 -36598 -33340 25508 29560 59093 -18607 -84574 -25764 -5862 47906 40131 73199 71160 41285
542 41285 19959 44388 69625 24241 5589 104175 40521 75069 68041 8558 14425 97999
530 97999 75657 40456 62611 69269 64275 49545 23342 -20121 -45267 -11014 32287 27489 -10757
517 -10757 54903 36580 68552 97951 89260 55172 39052 73756 58739 40020 39587 54744 80405
504 80405 61608 43533 58624 16488 -212 -8462 11455 11079 24816 -39667 -62001 -7830 -3684
491 -3684 -40542 -15063 -17235 -18251 28477 13133 53670 52461 24751 -9108 -25916 5107 -47038
478 -47038 -45163 -58350 -38178 -6481 -7677 29302 30732 12096 17151 22166 76358 32316 50468
465 50468 51162 22795 66730 129050 80350 10629 -19808 48926 68607 43907 42522 1479 32438
452 32438 -37841 -44691 -8055 6524 -29618 13904 4393 34595 48610 22617 21986 9608 43313
439 43313 24933 76130 93013 81079 55592 80467 82740 128589 53506 42734 19087 9289
427 9289 -14287 -3341 77914 20971 33168 27202 -17037 48480 84307 81781 -17975 -1856 -8780
414 -8780 6911 56152 -37075 13008 43662 -5810 17722 92499 53462 -7830 64851 100445
402 100445 76522 44953 40498 -42400 43719 46035 -4039 -785 29258 -17511 16225 39589
390 39589 59998 134806 127213 131631 107183 75861 39258 63469 40315 52094 60274 79321 63353
377 63353 121721 19292 93923 91933 121965 116411 46806 69129 55134 81437 61704 21350
365 21350 -996 -2925 55358 28755 -36412 -44591 -25813 -8463 -19439 43176 87523 33140
353 33140 14397 71131 126621 76437 15589 886 21898 50043 54411 42570 78804 108092
341 108092 57585 93206 113452 83407 68367 75704 78062 74778 100050 100979 16852 19815 -2333
328 -2333 21352 17847 -20735 33023 97238 107735 89893 69202 75196 80966 13056 8847 35093
315 35093 34186 32310 62739 2804 53293 103737 136867 100637 27217 24637 4347 -1293 66635
302 66635 16433 49286 119118 76080 42132 -22952 -19583 86494 22221 36785 26921 24108
290 24108 14285 35035 78678 106650 63330 2303 51403 39694 63202 70463 77777 49179 66893
277 66893 46219 59586 13524 6140 10620 23 -4931 32742 79712 47619 56016 76887 96448
264 96448 160694 74828 24155 18174 66939 91439 56504 47893 38201 74889 75924 107405 159621
251 159621 100686 35217 23808 54403 46156 77280 36060 40647 96266 113324 58333 108999
239 108999 107267 77276 82686 49259 38888 24178 62910 109640 127125 115851 101639 54173
227 54173 54005 119869 110869 124559 166122 78593 16411 71740 35487 37690 57476 48035 23790
214 23790 -34198 -10643 -27064 -51396 -13673 -4122 36638 67866 8410 50358 25866 37694
202 37694 42668 5034 57915 62370 68665 17591 17029 100420 84039 111078 44932 65107 76486
189 76486 124943 142072 143567 95003 70001 103764 100149 98020 110493 111861 85728 96034 59017
176 59017 98731 91794 43412 -18115 29291 11080 97989 111992 40133 33927 75955 113154
164 113154 152792 136209 72162 37244 17256 16791 -24443 -11876 3959 31502 32166 104648 108707
151 108707 93715 29138 37886 85301 101957 111007 46369 26531 51057 57355 89209 98429 53548
138 53548 7976 20772 39620 2031 3167 35073 15897 -12711 55240 77242 83739 42181
126 42181 40850 56662 51597 52718 36628 55216 55188 85212 105954 88746 68834 75251 19049
113 19049 37186 20700 72588 65458 51239 90211 73056 44632 44084 63057 55850 101603 21715
100 21715 56794 59794 60093 123493 105583 139103 140693 149512 119479 87389 34118 13262 42004
87 42004 20333 12320 6285 24142 56604 40965 55643 83641 83907 115490 100188 66035 106974
74 106974 129892 82439 74210 61125 114436 116921 98416 70387 45226 4776 12956 62167 88728
61 88728 128263 109290 94749 65581 92182 42465 15249 56632 92367 88103 71857 88701
49 88701 120142 65090 39449 79397 86851 48155 71078 71595 56319 83524 109695 70060 9884
36 9884 89150 89878 62083 50935 65890 80906 88951 87659 65779 41608 20525 56217 39938
23 39938 34305 77545 44296 63649 65991 28019 72199 82235 69014 50391 56266 96861 89121
10 89121 58187 39995 74556 92418 103595 98428 92281 50373 67344 75829
0 75829
$$ Imaginary data points
##PAGE= N=2
##DATA TABLE= (X++(I..I)), XYDATA
16383 -1166527 -1138415 -1112049 -1089931 -1098386 -1120034 -1072472 -1031252 -1030232 -1045491 -982456 -1014280 -984185
16371 -984185 -942166 -934977 -898437 -888115 -879709 -872775 -838307 -825241 -844416 -810272 -792597 -774253
16359 -774253 -720513 -703711 -723015 -739242 -698191 -683801 -673333 -628077 -613517 -624327 -633136 -586957
16347 -586957 -553859 -582722 -565633 -518152 -565267 -565216 -497396 -472490 -435843 -410902 -447285 -431785
16335 -431785 -373434 -331586 -362230 -347687 -331169 -353923 -322976 -342924 -336749 -304046 -300610 -261169
16323 -261169 -194270 -197911 -157927 -154775 -177503 -197070 -166661 -133034 -124174 -122962 -116367 -53484
16311 -53484 -82760 -52056 -19457 15863 2535 12358 22858 18869 29080 50142 70250 85139
16299 85139 97423 98841 140296 98200 130336 122383 109216 174990 191274 172402 219971 225258
16287 225258 252481 250288 225754 266076 337120 309582 325268 345493 351165 354279 318762 340933
16275 340933 368203 380859 339081 377158 357136 374300 434429 442182 461149 523008 549641 567110
16263 567110 540250 489939 528500 546439 530742 543001 494202 500074 545946 563117 548239 530091
16251 530091 534648 574162 596558 662935 650076 613092 654463 714679 717623 643969 687868 677575
16239 677575 674186 703644 777532 781049 754637 733942 771525 777904 754110 776431 721478 813638
16227 813638 852278 797286 808164 852939 839370 794795 807378 819532 847694 861003 867502 884756
16215 884756 855084 869200 823702 852918 887396 843767 914396 938983 895379 930269 945755
16204 945755 911163 944813 972452 963825 906613 939551 989172 1057622 1124927 1104776 1086911 1104613
16192 1104613 1069338 1090053 1080860 1013807 1010642 997997 1032186 1036343 1057744 1059063 1085805 1119478
16180 1119478 1062985 1062946 1157277 1196547 1199682 1190455 1139383 1143535 1164376 1127847 1122125 1130459 1130499
16167 1130499 1133911 1160850 1129979 1079387 1189379 1228243 1229152 1227237 1237124 1199065 1098009 1086280
16155 1086280 1121599 1145606 1151181 1196873 1172674 1203788 1178002 1166254 1217497 1242600 1253524
16144 1253524 1193040 1152484 1164702 1168231 1122906 1175945 1202912 1213985 1201188 1219228 1207541
16133 1207541 1200074 1150066 1142374 1160263 1222617 1298671 1292393 1245491 1240522 1249072 1250351 1263305
16121 1263305 1317742 1326550 1277920 1282642 1299362 1249060 1210255 1228086 1239765 1289284 1304238 1309259
16109 1309259 1318339 1286445 1309532 1241854 1225360 1299258 1271997 1271711 1267061 1277586 1281360 1377773
16097 1377773 1367377 1266155 1228909 1224267 1264391 1249948 1281721 1256737 1262912 1255258 1252771 1277321
16085 1277321 1303103 1382031 1380812 1367050 1326412 1308122 1295745 1327935 1279458 1368800 1354150
16074 1354150 1337667 1346382 1328726 1358113 1344660 1308018 1321684 1327268 1338928 1321722 1328725 1355290
16062 1355290 1306819 1265821 1294198 1296411 1284811 1353555 1340681 1348370 1336905 1309894 1304232 1334669
16050 1334669 1392921 1394000 1393082 1350943 1296311 1354572 1407630 1375589 1369934 1366215 1324341 1312158
16038 1312158 1335483 1351687 1367037 1335008 1314290 1332189 1328549 1331371 1306937 1233400 1239034 1317098
16026 1317098 1365225 1376633 1304047 1350289 1388466 1353830 1326782 1353890 1308225 1315629 1345911
16015 1345911 1338924 1287507 1258187 1324190 1281928 1305001 1351348 1362512 1383459 1363335 1336225
16004 1336225 1293400 1254680 1311631 1357329 1289025 1296987 1334596 1339711 1325733 1287236 1351241 1373399
15992 1373399 1341895 1335360 1317921 1341872 1361298 1336301 1337684 1306362 1310405 1320214 1310997 1302375
15980 1302375 1307233 1328728 1340616 1343258 1380298 1356863 1309396 1296713 1288425 1338196 1326050 1316901
15968 1316901 1371497 1322931 1317663 1260505 1275210 1312931 1300363 1321260 1331714 1320084 1253602
15957 1253602 1322952 1352934 1333397 1340967 1311851 1288234 1349142 1378739 1364906 1342632 1285378
15946 1285378 1317892 1342747 1365411 1369015 1312070 1344009 1315011 1316741 1384098 1363000 1380213 1349530
15934 1349530 1359238 1328503 1317818 1373066 1332389 1353579 1285487 1303282 1317567 1340083 1352986
15923 1352986 1344338 1339800 1369238 1326573 1340897 1381917 1405706 1296398 1267103 1287355 1308178
15912 1308178 1337986 1371713 1364206 1344312 1357119 1377905 1375862 1329177 1311578 1314493 1329583 1314049
15900 1314049 1305719 1302732 1318837 1321072 1345481 1328953 1316274 1323415 1363378 1324621 1340347 1350385
15888 1350385 1360186 1362757 1371446 1430435 1397421 1365583 1376396 1418338 1363984 1367886 1399537 1336023
15876 1336023 1345511 1379880 1368708 1335525 1376511 1347416 1352036 1313879 1313317 1317544 1335350 1330197
15864 1330197 1355285 1370854 1370754 1339967 1269985 1310719 1324502 1281195 1278538 1348612 1416296 1337313
15852 1337313 1340152 1388689 1362888 1374671 1402449 1337737 1357109 1391435 1384457 1386430 1402780 1368811
15840 1368811 1300878 1261599 1275418 1274471 1306134 1300232 1315705 1372177 1364203 1372594 1394262 1407745
15828 1407745 1412550 1427844 1342406 1363965 1322403 1347707 1387804 1391587 1385700 1365356 1352694 1414533
15816 1414533 1384440 1279831 1224832 1241952 1253486 1245002 1296105 1295213 1333604 1357245 1330998 1327821
15804 1327821 1321071 1328051 1268672 1307503 1272582 1276680 1374229 1366345 1376057 1338026 1385825 1423351
15792 1423351 1426042 1417150 1373672 1377018 1383248 1375090 1348550 1336223 1336685 1301904 1286609 1254154 1350185
15779 1350185 1363212 1319029 1329301 1371255 1372402 1387394 1345636 1339084 1360555 1378210 1382395 1379788
15767 1379788 1371753 1308227 1320579 1393939 1398551 1380733 1322129 1303423 1356180 1381373 1381802 1345872
15755 1345872 1327705 1274270 1350087 1401979 1350038 1367477 1430839 1459087 1409611 1497239 1460242
15744 1460242 1371821 1357129 1365942 1411650 1436754 1420040 1325287 1303223 1351330 1393265 1389966 1349271
15732 1349271 1326614 1369901 1367654 1383463 1394507 1367388 1324861 1315925 1321689 1337507 1371477 1384078
15720 1384078 1348540 1404833 1442902 1387905 1322026 1330221 1298636 1292060 1299963 1363640 1373764 1389694
15708 1389694 1336031 1365465 1379366 1372246 1347325 1344035 1352923 1338235 1372130 1358562 1366863 1347218
15696 1347218 1352105 1449543 1518326 1482752 1415851 1444140 1382621 1405961 1383004 1396227 1465073
15685 1465073 1467838 1429380 1377548 1384733 1362202 1363737 1382587 1434119 1352561 1312165 1355403 1339268
15673 1339268 1366212 1405233 1424310 1367659 1339201 1408955 1444232 1426963 1387996 1355941 1353783
15662 1353783 1423912 1340232 1302816 1347528 1392671 1384675 1387882 1361943 1377241 1321519 1337517 1322751
15650 1322751 1338571 1323991 1356913 1405696 1394252 1451865 1392909 1308454 1356257 1395994 1425186
15639 1425186 1430451 1416632 1416723 1351886 1338795 1305181 1326963 1332238 1328359 1347253 1406534 1399168 1362324
15626 1362324 1379497 1409075 1404321 1381447 1404474 1406721 1390700 1389014 1341029 1331694 1362123 1303684
15614 1303684 1350182 1339418 1357512 1374953 1356411 1350635 1380957 1332201 1420716 1403884 1426486
15603 1426486 1398124 1389955 1382482 1355320 1447499 1432982 1456332 1426285 1389656 1370263 1354503 1332861
15591 1332861 1401262 1391464 1384533 1378563 1415005 1394937 1358784 1350034 1390307 1456110 1440756 1441756
15579 1441756 1410205 1323942 1377152 1375464 1335020 1360806 1403924 1406114 1425125 1402898 1416491 1400544
15567 1400544 1349200 1357896 1383406 1369270 1369831 1437331 1407124 1396519 1425711 1363222 1403613 1459926
15555 1459926 1423954 1437927 1412828 1413000 1411985 1390913 1397100 1393824 1325072 1338539 1319565 1352582
15543 1352582 1385686 1365214 1375304 1409681 1420053 1375957 1375055 1389546 1425070 1433619 1411121 1373900
15531 1373900 1339793 1350593 1351859 1402842 1431746 1400395 1386490 1385061 1410430 1379866 1351598 1317402
15519 1317402 1370879 1376034 1326117 1414778 1415171 1315549 1315786 1370869 1378443 1416861 1414861 1383717 1417866
15506 1417866 1413943 1393370 1387313 1343971 1335590 1357432 1423957 1421742 1356143 1395421 1395795 1397449 1374674
15493 1374674 1386717 1407029 1426867 1403510 1380410 1386367 1365629 1366792 1390630 1392933 1417646 1383722
15481 1383722 1397532 1408630 1379733 1347856 1391085 1330871 1332589 1332479 1369086 1442002 1440658 1488588
15469 1488588 1442376 1422286 1441362 1416055 1360217 1389981 1398326 1404369 1420217 1437931 1456805 1451166
15457 1451166 1449025 1396545 1396526 1462512 1474431 1475094 1426858 1360063 1379702 1412000 1357531 1354504 1366139
15444 1366139 1360242 1428775 1427583 1408686 1349541 1386107 1456367 1454009 1412486 1384548 1426346 1468342
15432 1468342 1410677 1424811 1436571 1358340 1373291 1407511 1407999 1343135 1365890 1381290 1372480 1431706
15420 1431706 1404059 1328969 1381348 1351165 1385781 1433798 1489211 1416668 1392864 1398676 1357920
15409 1357920 1371644 1370719 1383108 1378056 1413234 1428522 1374419 1339257 1395246 1417814 1382183 1376815
15397 1376815 1372253 1344050 1369487 1425090 1392880 1448719 1461004 1428914 1390480 1461026 1472581
15386 1472581 1428084 1388131 1370339 1374788 1416556 1456859 1493392 1540149 1414127 1362594 1378257
15375 1378257 1352165 1328849 1384292 1446649 1490854 1427361 1380962 1397431 1342855 1355778 1441876
15364 1441876 1482814 1503800 1454031 1341036 1383327 1365949 1385356 1473083 1512569 1439398 1504577
15353 1504577 1421144 1432546 1451510 1375246 1426384 1393644 1335564 1367908 1435604 1413317 1494243
15342 1494243 1443086 1440881 1416982 1453103 1480264 1477918 1420607 1464868 1431885 1397216 1457643 1502133
15330 1502133 1482401 1435773 1411610 1437530 1436814 1378519 1402276 1441506 1458394 1444003 1427078 1443777
15318 1443777 1488098 1453631 1508319 1546197 1475799 1391143 1382269 1449001 1475301 1486776 1477761 1442527
15306 1442527 1415850 1409098 1440546 1497567 1463802 1442167 1415722 1421769 1404160 1389256 1487258 1490745
15294 1490745 1459402 1501670 1494002 1456307 1463297 1489538 1454441 1437961 1420756 1375821 1406163 1402301
15282 1402301 1455730 1523042 1517032 1445170 1416378 1445679 1408827 1423829 1430087 1420073 1402960 1468729
15270 1468729 1434212 1493948 1510341 1416133 1423617 1413558 1391292 1420784 1448476 1455064 1410866 1448394
15258 1448394 1493600 1476263 1496811 1460713 1450129 1422340 1433293 1421490 1435030 1429008 1406464
15247 1406464 1417490 1421621 1398230 1368480 1430873 1449929 1370544 1386368 1422122 1383677 1418500
15236 1418500 1384168 1410316 1417130 1382263 1406544 1431379 1350859 1321749 1380924 1383051 1440314 1506960
15224 1506960 1463358 1431630 1453767 1450872 1474802 1460686 1441481 1471864 1514883 1504950 1479544 1464545
15212 1464545 1506986 1456600 1474444 1495596 1495730 1512186 1521798 1472391 1412051 1402334 1455949 1384333
15200 1384333 1349531 1414271 1478559 1476570 1481160 1470740 1432525 1397873 1380110 1350362 1399623 1378669
15188 1378669 1384520 1458964 1496054 1499559 1461787 1440508 1465736 1465285 1438855 1445425 1428261 1462757
15176 1462757 1419273 1416166 1357013 1374593 1408261 1411982 1420274 1379481 1401198 1441127 1477393 1465689
15164 1465689 1471087 1452567 1425419 1438013 1396118 1385366 1453009 1480849 1456357 1432885 1438979 1471855
15152 1471855 1482269 1452676 1470901 1502972 1493393 1503300 1455140 1402521 1392858 1457316 1470993 1462993
15140 1462993 1417613 1387784 1480412 1460262 1482449 1482324 1437477 1433031 1437592 1431935 1445036 1428647
15128 1428647 1435956 1463434 1511788 1530078 1485844 1477961 1465872 1438435 1444095 1443774 1505456 1540222
15116 1540222 1519641 1488769 1429376 1412443 1440294 1452782 1413002 1435554 1443026 1444889 1424012 1445748
15104 1445748 1444243 1492439 1499608 1504735 1473690 1393317 1370473 1392144 1402265 1458153 1432204 1476686
15092 1476686 1497665 1477039 1489820 1515012 1493423 1488397 1511445 1460416 1396200 1503399 1515153
15081 1515153 1485980 1443987 1428319 1480674 1538193 1530308 1412655 1438907 1436877 1426640 1383117
15070 1383117 1422267 1382982 1404949 1420202 1432475 1463742 1482122 1453442 1371269 1341330 1393932
15059 1393932 1429469 1436899 1511101 1511535 1502281 1486007 1458647 1400123 1366210 1390733 1462231 1485782
15047 1485782 1523807 1516515 1448717 1421119 1403902 1420049 1472902 1526671 1581899 1550803 1466587
15036 1466587 1469103 1514874 1516793 1429861 1468075 1480991 1453344 1390273 1473016 1439961 1403353 1477945
15024 1477945 1500284 1533210 1476958 1454568 1430739 1400501 1442741 1522048 1505386 1471061 1505340
15013 1505340 1460448 1443737 1478210 1431937 1462967 1498633 1497171 1436322 1420701 1491264 1500671 1460469
15001 1460469 1489110 1553933 1448003 1396484 1461663 1479380 1461441 1420901 1462980 1504389 1481470
14990 1481470 1512979 1473986 1461999 1495832 1440807 1375135 1433403 1417018 1397458 1486593 1499859
14979 1499859 1501959 1495044 1453012 1436368 1459002 1452393 1506327 1470497 1493113 1507360 1515317 1443532
14967 1443532 1418487 1481107 1482335 1423140 1412292 1441677 1434334 1446250 1400797 1422697 1450516 1440653
14955 1440653 1450184 1472740 1481100 1429641 1466806 1472606 1461375 1475284 1449573 1494353 1514032 1541494
14943 1541494 1530321 1586191 1579247 1490458 1501614 1528958 1494713 1402898 1410521 1397616 1408566 1436824
14931 1436824 1457991 1497901 1489727 1491234 1513102 1472819 1442794 1496156 1480417 1497178 1452801 1431066
14919 1431066 1436096 1486005 1476261 1478064 1465980 1482415 1467143 1396713 1440340 1489823 1540238 1548919
14907 1548919 1503612 1482138 1498809 1457585 1472464 1468545 1454817 1492804 1528490 1602107 1603178 1562674
14895 1562674 1521217 1532108 1514204 1459494 1420805 1490253 1474402 1455578 1477983 1472127 1481699 1528009
14883 1528009 1524397 1484401 1454717 1467563 1448364 1406513 1402510 1478162 1494547 1417513 1446141 1433747
14871 1433747 1507639 1540977 1443975 1446168 1511908 1528804 1486735 1471256 1491193 1460710 1480954
14860 1480954 1487803 1521268 1506937 1491568 1534460 1484438 1437530 1468232 1445708 1463432 1436997
14849 1436997 1391656 1433096 1534817 1501097 1456376 1494459 1451949 1402417 1415542 1437503 1547008
14838 1547008 1537643 1507114 1453560 1488724 1552510 1482145 1461817 1473764 1478650 1447253 1455653 1469061
14826 1469061 1444681 1389911 1414070 1478141 1507884 1534578 1472456 1418483 1436936 1470123 1544125
14815 1544125 1564446 1463608 1444360 1457286 1481684 1511926 1538049 1540622 1561084 1525993 1579736
14804 1579736 1577752 1521431 1530885 1531096 1533820 1517189 1494597 1510708 1519883 1486315 1566993 1555354
14792 1555354 1529171 1487050 1483592 1448061 1449767 1514672 1572604 1600609 1488584 1487944 1469139 1458508
14780 1458508 1464312 1514451 1492785 1487783 1541549 1484869 1494025 1464474 1483267 1515892 1507379 1497996
14768 1497996 1500555 1506367 1581816 1527638 1473889 1492584 1520383 1475635 1435620 1455174 1446941 1475150
14756 1475150 1463931 1434385 1484007 1446199 1481581 1493458 1450683 1498252 1558343 1538404 1484996
14745 1484996 1459465 1494183 1490085 1542457 1537879 1482877 1500727 1458732 1482867 1552003 1477410 1437409
14733 1437409 1438991 1448273 1480278 1497966 1441887 1479783 1501836 1499820 1537302 1575078 1536836 1567276
14721 1567276 1593561 1571218 1511354 1446412 1493699 1539604 1550680 1519409 1493461 1468703 1557593
14710 1557593 1512783 1567304 1563493 1559165 1625610 1638058 1613619 1538663 1522070 1513239 1466936 1427158
14698 1427158 1413730 1514764 1503577 1541047 1562265 1596460 1565244 1533953 1585492 1540624 1515973
14687 1515973 1508657 1546085 1543650 1573525 1528176 1439297 1572943 1597123 1532578 1521142 1490806
14676 1490806 1507069 1576492 1534243 1518753 1554214 1564028 1547939 1507012 1500523 1538370 1532274 1554076
14664 1554076 1555400 1593706 1549905 1475956 1477642 1472022 1493250 1497846 1482621 1509620 1556169 1507777
14652 1507777 1546249 1514281 1556147 1513716 1455912 1483436 1485244 1463626 1513706 1549080 1550572 1485894
14640 1485894 1487231 1535657 1526106 1548556 1535702 1516395 1546554 1597728 1576068 1547862 1530571 1475844
14628 1475844 1497582 1559549 1562104 1532131 1540919 1551570 1556657 1565020 1540057 1509564 1568010 1581628
14616 1581628 1487614 1480528 1498031 1483873 1471218 1512344 1560880 1576657 1550261 1494973 1525767
14605 1525767 1566986 1557173 1537412 1492285 1526193 1461919 1531961 1560479 1565840 1591523 1537176 1567794
14593 1567794 1548317 1502226 1477679 1519310 1530298 1559701 1520000 1463584 1506413 1601021 1588578
14582 1588578 1547360 1546628 1527789 1519581 1550185 1580979 1642284 1633487 1629736 1570275 1554456 1565808
14570 1565808 1536696 1479894 1492858 1499247 1488482 1534549 1479865 1444619 1410902 1473528 1531167
14559 1531167 1493340 1511032 1552274 1480742 1483664 1558242 1610961 1614694 1561427 1527264 1565837 1579375
14547 1579375 1528733 1534131 1547732 1533969 1512915 1454361 1498018 1537588 1530305 1508552 1544084 1526592
14535 1526592 1530122 1570501 1611131 1627293 1629282 1614259 1602723 1582949 1586029 1542063 1572584 1628110
14523 1628110 1542336 1550012 1579826 1590930 1582487 1577050 1589807 1548650 1459791 1441493 1474184 1490390
14511 1490390 1493737 1538410 1536525 1571758 1580784 1553715 1575760 1528407 1506931 1545297 1544783 1534309
14499 1534309 1575011 1553917 1469906 1481456 1483777 1457987 1448853 1470545 1493538 1505379 1549173 1522568
14487 1522568 1489790 1482968 1529609 1570130 1542228 1547558 1589680 1546155 1513863 1504849 1500011 1529854
14475 1529854 1525931 1538388 1509239 1525222 1534732 1549285 1548025 1579381 1587706 1538336 1536560 1508445
14463 1508445 1509819 1464357 1464943 1520795 1544433 1500960 1465532 1452339 1491613 1541441 1513306 1565380
14451 1565380 1615774 1596383 1598557 1573351 1607518 1580208 1536099 1547300 1610550 1651732 1632901
$$ [...]
##END NTUPLES=NMR SPECTRUM
##END=
