##TITLE=1H_EC-3384(6)-11
 200.13Hz, CDcl3.
 8 sc
10.8.2026
##JCAMPDX= 6.0         $$ Bruker NMR JCAMP-DX V2.0
##DATA TYPE= NMR SPECTRUM
##DATA CLASS= NTUPLES
##ORIGIN= UXNMR, Bruker Analytische Messtechnik GmbH
##OWNER= pz
$$ XWIN-NMR		Version 3.5
$$ Mon Aug 10 13:23:23 2026 Russian Standard Time (UT+4h)  she@DPX200
##.OBSERVE FREQUENCY= 200.1313
##.OBSERVE NUCLEUS= ^1H
##.ACQUISITION MODE= SIMULTANEOUS
##.ACQUISITION SCHEME= undefined
##.AVERAGES= 8
##.DIGITISER RES= 18
##SPECTROMETER/DATA SYSTEM= spect
##.PULSE SEQUENCE= zg30
##.SOLVENT NAME= CDCl3
##.SHIFT REFERENCE= (INTERNAL, CDCl3, 0, 15.5045)
##AUDIT TRAIL= $$ (NUMBER, WHEN, WHO, WHERE, WHAT)
$$ ##TITLE= Audit trail, XWIN-NMR		Version 3.5
$$ ##JCAMPDX= 5.01
$$ ##ORIGIN= Bruker BioSpin GmbH
$$ ##OWNER= she
$$ F:/spectra/data/she/nmr/H-C/1/pdata/1/auditp.txt
$$ ##AUDIT TRAIL=  $$ (NUMBER, WHEN, WHO, WHERE, WHAT)
(   1,<2026-08-10 13:21:20.39 +0400>,<she>,<DPX200>,
      <created by zg, POWCHK disabled, PULCHK disabled
       configuration hash MD5:
       00 E9 B6 7A A2 85 ED C7 34 08 36 98 17 FE 4E 26
       data hash MD5: 16K
       DA 33 52 C4 95 42 C6 2A F3 85 EE F8 C4 CD 68 24>)
(   2,<2026-08-10 13:21:22.82 +0400>,<she>,<DPX200>,
      <Start of raw data processing
       efp BC_mod = 2 LB = 0.25 FT_mod = 6 PKNL = 1 PHC0 = -4218.701 PHC1 = 9.7923 SI = 16K 
       data hash MD5: 16K
       D6 87 49 6F 83 6F 77 F1 F3 41 08 C6 7C 11 7D E6>)
(   3,<2026-08-10 13:21:46.20 +0400>,<she>,<DPX200>,
      <pk PHC0 = 1.661001 PHC1 = 1 
       data hash MD5: 16K
       6C 9D B2 EA 94 96 74 31 2D DB F6 FE C7 B9 E8 2B>)
(   4,<2026-08-10 13:21:50.85 +0400>,<she>,<DPX200>,
      <abs ABSG = 5 
       data hash MD5: 16K
       58 40 4C FD 86 4C 7E 8B 41 EF E4 B7 F0 9E 23 C3>)
$$ ##END=
$$ 
$$ hash MD5
$$ 1F F2 56 1B 37 C0 34 D7 8E 40 40 3E AB D1 F4 91
##$RELAX= 
##$RELAX= 
##$RELAX= 
##$RELAX= 
##$RELAX= 
##$RELAX= 
$$ Bruker specific parameters
$$ --------------------------
##$DU= <F:/spectra>
##$EXPNO= 1
##$NAME= <H-C>
##$PROCNO= 1
##$TYPE= <nmr>
##$USER= <she>
##$AMP= (0..31)
100 100 100 100 100 100 100 100 100 100 100 100 100 100 100 100 100 100 
100 100 100 100 100 100 100 100 100 100 100 100 100 100 
##$AQSEQ= 0
##$AQ_mod= 1
##$AUNM= <au_zg>
##$AUTOPOS= <>
##$BF1= 200.13
##$BF2= 200.13
##$BF3= 200.13
##$BF4= 200.13
##$BF5= 200.13
##$BF6= 200.13
##$BF7= 200.13
##$BF8= 200.13
##$BYTORDA= 1
##$CFDGTYP= 0
##$CFRGTYP= 5
##$CHEMSTR= <none>
##$CNST= (0..31)
1 1 145 1 1 1 1 1 1 1 1 1 1 1 1 1 1 1 1 1 1 1 1 1 1 1 1 1 1 1 1 1 
##$CPDPRG= <>
##$CPDPRG1= <>
##$CPDPRG2= <>
##$CPDPRG3= <>
##$CPDPRG4= <mlev>
##$CPDPRG5= <mlev>
##$CPDPRG6= <mlev>
##$CPDPRG7= <mlev>
##$CPDPRG8= <mlev>
##$CPDPRGB= <>
##$CPDPRGT= <>
##$D= (0..31)
0 0.7 0 0 0 0 0 0 0 0 0 0.03 0 0 0 0 0 0 0 0 0 0 0 0 0 0 0 0 0 0 0 0 
##$DATE= 1786353679
##$DBL= (0..7)
120 120 120 120 120 120 120 120 
##$DBP= (0..7)
150 150 150 150 150 150 150 150 
##$DBP07= 0
##$DBPNAM0= <>
##$DBPNAM1= <>
##$DBPNAM2= <>
##$DBPNAM3= <>
##$DBPNAM4= <>
##$DBPNAM5= <>
$$ [...]
##$SUBNAM3= <"">
##$SUBNAM4= <"">
##$SUBNAM5= <"">
##$SUBNAM6= <"">
##$SUBNAM7= <"">
##$SUBNAM8= <"">
##$SUBNAM9= <"">
##$SW= 18.0517328524113
##$SWIBOX= (0..15)
0 0 2 0 0 0 0 0 0 0 0 0 0 0 0 0 
##$SW_h= 3612.71676300578
##$TD= 16384
##$TD0= 1
##$TE= 0
##$TE2= 300
##$TE3= 300
##$TEG= 300
##$TL= (0..7)
0 120 120 120 120 120 120 120 
##$TP= (0..7)
150 150 150 150 150 150 150 150 
##$TP07= 0
##$TPNAME0= <>
##$TPNAME1= <>
##$TPNAME2= <>
##$TPNAME3= <>
##$TPNAME4= <>
##$TPNAME5= <>
##$TPNAME6= <>
##$TPNAME7= <>
##$TPOAL= (0..7)
0.5 0.5 0.5 0.5 0.5 0.5 0.5 0.5 
##$TPOFFS= (0..7)
0 0 0 0 0 0 0 0 
##$TUNHIN= 0
##$TUNHOUT= 0
##$TUNXOUT= 0
##$USERA1= <user>
##$USERA2= <user>
##$USERA3= <user>
##$USERA4= <user>
##$USERA5= <user>
##$V9= 5
##$VALIST= <valist>
##$VCLIST= <CCCCCCCCCCCCCCC>
##$VD= 0
##$VDLIST= <DDDDDDDDDDDDDDD>
##$VPLIST= <PPPPPPPPPPPPPPP>
##$VTLIST= <TTTTTTTTTTTTTTT>
##$WBST= 1024
##$WBSW= 4
##$XGAIN= (0..3)
0 0 0 0 
##$XL= 0
##$YL= 0
##$YMAX_a= 666303
##$YMIN_a= -702714
##$ZGOPTNS= <>
##$ZL1= 120
##$ZL2= 120
##$ZL3= 120
##$ZL4= 120
##$ABSF1= 15.49788
##$ABSF2= -2.553969
##$ABSG= 5
##$ABSL= 3
##$ALPHA= 0
##$AQORDER= 0
##$ASSFAC= 0
##$ASSFACI= 0
##$ASSFACX= 0
##$ASSWID= 0
##$AUNMP= <proc_1d>
##$AZFE= 0.1
##$AZFW= 0.1
##$BCFW= 0
##$BC_mod= 2
##$BYTORDP= 0
##$COROFFS= 0
##$CY= -3
##$DATMOD= 1
##$DC= 0
##$DFILT= <>
##$DTYPP= 0
##$F1P= 0
##$F2P= 0
##$FCOR= 1
##$FTSIZE= 16384
##$FT_mod= 6
##$GAMMA= 0
##$GB= 0
##$INTBC= 1
##$INTSCL= 3.241238e-09
##$ISEN= 128
##$LB= 0.25
##$LEV0= 0
##$LPBIN= 0
##$MAXI= 10000
##$MC2= 0
##$MEAN= 0
##$ME_mod= 0
##$MI= 1.114404
##$NCOEF= 0
##$NC_proc= -5
##$NLEV= 6
##$NOISF1= 3.799351
##$NOISF2= 2.8
##$NSP= 0
##$NTH_PI= 0
##$NZP= 0
##$OFFSET= 15.50449
##$PC= 1
##$PHC0= -4217.04
##$PHC1= 10.7923
##$PH_mod= 1
##$PKNL= yes
##$PPARMOD= 0
##$PSCAL= 0
##$PSIGN= 0
##$REVERSE= no
##$SF= 200.130003444017
##$SI= 16384
##$SIGF1= 3
##$SIGF2= 2
##$SINO= 0.751879
##$SIOLD= 32768
##$SREGLST= <19F.Aceton>
##$SSB= 0
##$STSI= 16384
##$STSR= 0
##$SW_p= 3612.71676300578
##$SYMM= 0
##$S_DEV= 0
##$TDeff= 16384
##$TDoff= 0
##$TI= <>
##$TILT= no
##$TM1= 0
##$TM2= 0
##$TOPLEV= 0
##$USERP1= <user>
##$USERP2= <user>
##$USERP3= <user>
##$USERP4= <user>
##$USERP5= <user>
##$WDW= 1
##$XDIM= 16384
##$YMAX_p= 443699892
##$YMIN_p= -533598
$$ End of Bruker specific parameters
$$ ---------------------------------
##NTUPLES= NMR SPECTRUM
##VAR_NAME=  FREQUENCY,     SPECTRUM/REAL,   SPECTRUM/IMAG
##SYMBOL=    X,             R,               I
##VAR_TYPE=  INDEPENDENT,   DEPENDENT,       DEPENDENT
##VAR_FORM=  AFFN,          ASDF,            ASDF
##VAR_DIM=   16384,         16384,           16384
##UNITS=     HZ,            ARBITRARY UNITS, ARBITRARY UNITS
##FACTOR=    0.220516191357247, 1,           1
##FIRST=     3102.91361682088, 0,            0
##LAST=      -509.803146184896, 0,           0
##MIN=       -509.803146184896, -533598,     0
##MAX=       3102.91361682088, 443699892,    0
$$ Real data points
##PAGE= N=1
##DATA TABLE= (X++(R..R)), XYDATA
$$ [...]
$$ plain form
6991 -92886 -49478 -26442 -1156 26425 -32961 -78013 50526 70502 46584 80878 48428 33259
6979 33259 34785 103986 105685 6851 -27836 -19382 19318 39292 6750 47137 -60589 -68660
6967 -68660 2635 -8023 -17379 -42260 75187 92589 23852 -12951 -24505 -9305 11152 -40000
6955 -40000 -41529 -58542 -15765 -33318 -59164 -64432 29 -72329 -109188 -68146 -89767 -747
6943 -747 -55612 -75086 -7637 -17653 -62640 -40882 -13061 -30187 6562 64904 33270 -43953
6931 -43953 -21253 -66161 -123992 -39487 -84119 -105914 -71297 -322 55740 22536 -45250 -104008
6919 -104008 -101241 -39467 -26003 -133139 -134178 -111208 -92808 -12452 -33887 -92295 -29065 -25534
6907 -25534 -51413 18682 20033 -9488 -53676 -99478 -103321 -40016 -61838 -78149 -39761 62298
$$ packed form
6991i2886M3408K3036K5286K7581n9386m5052J28539J9976k3918L4294l2450j5169
6979C3259J526O9201J699r8834l4687Q454L8700J9974l2542M0387j07726q071
6967f8660P1295j0658r356k4881J17447J7402o8737l6803j1554J5200K0457n1152
6955d0000j529j7013M2777j7553k5846n268O4461p2358l6859M1042k1621Q9020
6943g47n4865j9474O7449j0016m4987K1758K7821j7126L6749N8342l1634p7223
6931d3953K2700m4908n7831Q4505m4632k1795L4617P0975N6062l3204o7786n8758
6919a04008K767O1774J3464j07136j039K2970J8400Q0356k1435n8408O3230L531
6907b5534k5879P0095J351k9521m4188m5802l843O3305k1822j6311L8388J02059
$$ plain form
6895 62298 3063 -79941 -85084 -45436 -11912 12815 -45168 -19182 -32752 -91060 -128541 -75165
6883 -75165 -38226 -73422 -71757 -107546 -151554 -84469 -13305 -93993 -76686 -105069 -35336 -52234
6871 -52234 -46336 29665 48252 33238 -39576 -55852 -22493 -14267 10897 30185 -119602 -120478
6859 -120478 -77312 -111734 -62894 -107119 -69572 787 -16633 -1990 1530 -4088 11023 -46817
6847 -46817 -60173 -18649 -25594 -4541 53636 -748 -28168 -89236 -70464 -44588 -85617 -84511
6835 -84511 -25579 -53513 -110038 -99410 -49713 -1827 21985 28352 -19689 -85956 -50517 -12547
6823 -12547 -2899 2010 -7758 9881 7486 -8348 -11547 -28078 -84256 -107318 -32649 13378 -45184
6810 -45184 -68129 3749 63446 43508 30298 -3821 -55421 -95049 -64459 -35601 -8785 11019
$$ packed form
6895F2298n9235q3004n143L9648L3524K4727n7983K5986j3570n8308l7481N3376
6883g5165L6939l5196J665l5789m4008O7085P1164q0688J7307k8383O9733j6898
6871e2234N898P6001J8587j5014p2814j6276L3359Q226K5164J9288j49787q76
6859a20478M3166l4422M8840m4225L7547P0359j7420J4643L520n618J5111n7840
6847d6817j3356M1524o945K1053N8177n4384k7420o1068J8772K5876m1029J106
6835h4511N8932k7934n6525J0628M9697M7886K3812O367m8041o6267L5439L7970
6823a2547R648M909r768J7639k395j5834l199j6531n6178k3062P4669M6027n8562
6810d5184k2945P1878N9697j9938j3210l4119n1600l9628L0590K8858K6816J9804
$$ plain form
6798 11019 26144 16263 37603 -1651 -42188 -22998 -18581 35278 -9199 -72802 -24022 23525
6786 23525 21172 44616 3781 -36916 -65547 -41178 -29259 11355 34847 26900 -1859 -6768
6774 -6768 15394 26664 17366 -2513 -50276 12678 5390 19612 -18731 129 42988 -11360
6762 -11360 25291 -17635 -11771 38794 64039 -8567 -4485 -16089 20330 59300 85348 64323
6750 64323 5870 -55831 -13986 -855 -12239 -34092 2191 35562 27957 16676 -43120 -111061
6738 -111061 -140440 -144776 -71837 -8662 -73250 -111293 -42781 -14524 8146 40372 -50543 -34650
6726 -34650 -53932 -26543 -11292 -50570 -5858 14542 26561 33518 -34826 -39197 1975 -21538
6714 -21538 29697 9842 -2422 -66384 19408 72141 38965 -56757 -57896 -45842 -11836 -3033
$$ packed form
6798A1019J5125r881K1340l9254m0537J9190M417N3859m4477o3603M8780M7547
6786B3525k353K3444m0835m0697k8631K4369J1919M0614K3492p947k8759m909
6774f768K2162J1270r298j9879m7763O2954p288J4222l8343J8860M2859n4348
6762a1360L6651m2926N864N0565K5245p2606M082j1604L6419L8970K6048k1025
6750F4323n8453o1701M1845J3131j1384k1853L6283L3371p605j1281n9796o7941
6738a11061k9379m336P2939O3175o4588l8043O8512K8257K2670L2226r0915J5893
6726c4650j9282K7389J5251l9278M4712K0400J2019O957o8344m371M1172k3513
6714b1538N1235j9855j2264o3962Q5792N2733l3176r5722j139J2054L4006Q803
$$ plain form
6702 -3033 -53739 -43896 -8618 -49328 1152 28893 -14146 -8254 700 -7363 -27162 -36332 3154
6689 3154 -8849 -16659 1337 -29253 -29257 -31222 29813 9770 -17994 -79876 1449 -406 -35540
6676 -35540 17771 69272 -51871 -82897 -118598 -59098 -29145 -90929 -77907 -5912 -3268 -57623
6664 -57623 -14891 -30845 -24540 -34263 32818 60101 69077 49130 -63132 -160949 -116509 -13539
6652 -13539 25722 68349 22422 45247 24006 -4946 -74693 -66494 -29579 -22725 -2412 40297
6640 40297 70665 -80899 -53558 -48795 -29995 -7853 -80780 -71515 -16322 22739 42173 62974
6628 62974 17288 2941 74585 82195 89923 61175 -28812 -49579 -30782 16202 51361 29771
6616 29771 2590 10783 -27048 -106502 -103881 -44274 3703 31896 30038 -53030 -133219 -81345
$$ packed form
6702c033n0706R843L5278m0710N0480K7741m3039N892Q954q063j9799r170L9486
6689C154j2003p810J7996l0590mj965O1035k0043k7764o1882Q1325j855l5134
6676c5540N3311N1501j21143l1026l5701N9500K9953o1784J3022P1995K644n4355
6664e7623M2732j5954O305r723O7081K7283Q976j9947j12262r7817M4440J02970
6652a3539L9261M2627m5927K2825k1241k8952o9747Q199L6915O854K0313M2709
6640D0297L0368j51564K7341M763J8800K2142p2927R265N5193L9061J9434K0801
6628F2974m5686j4347P1644P610P728k8748q9987k0767J8797M6984L5159k1590
6616B9771k7181Q193l7831p9454K621N9607M7977K8193j858q3068q0189N1874
$$ plain form
6604 -81345 -45944 8530 -25130 -67298 -51598 -47871 -56857 10493 7907 17375 37726 73317 77280
6591 77280 3175 -11422 31445 33864 78492 90171 94803 93619 116688 173954 204460 205134 124130
6578 124130 153834 76750 43600 51597 27030 -7368 -16712 -19239 -76303 -81132 -110816 -85381
6566 -85381 15977 29639 29734 -4683 -54809 -65317 -69452 -66740 -45301 8206 -32374 -48067 26534
6553 26534 8488 43102 -5868 -56838 -47042 -88441 -105048 -92751 -53210 -8944 11765 20806
6541 20806 -11484 -109581 -106344 -69463 -53052 -42030 -71801 -83807 -44195 15644 36851 -7542
6529 -7542 11720 13633 -11952 30185 -1004 24617 -65416 -54534 20704 7407 -11365 -12251 -16044
6516 -16044 22762 50215 25706 37180 -78563 -38035 -35557 -34732 -42113 -66028 -45721 40109
$$ packed form
6604h1345L5401N4474l3660m2168J5700L727q986O7350k586R468K0351L5591L963
6591G7280p4105j4597M2867K419M4628J1679M632j184K3069N7266L0506O74q1004
6578A24130K9704p7084l3150P997k4567l4398r344k527n7064m829k9684K5435
6566h5381J01358J3662R5l4417n0126j0508m135K712K1439N3507m0580j5693P4601
6553B6534j8046L4614m8970n0970R796m1399j6607J2297L9541M4266K0709R041
6541B0806l2290r8097L237L6881J6411J1022k9771j2006L9612N9839K1207m4393
6529g542J9262J913k5585M2137l1189K5621r0033J0882P5238j3297j8772q86l793
6516a6044L8806K7453k4509J1474j15743M0528K478Q25p381k3915K0307Q5830
$$ plain form
6504 40109 36424 52157 11377 -37180 -2594 8165 -24118 -23484 -34471 -71107 53520 81194
6492 81194 27955 -9522 -49695 -63387 -15705 -5393 35564 -61898 -13154 43381 802 -8203
6480 -8203 -40329 -88926 -5904 -40932 -22033 12395 -31481 -102755 -56652 -41796 -28582 -25482
6468 -25482 -63152 -35624 -31261 29957 -13539 -51121 -86094 -34227 -32439 -30692 21347 -9924
6456 -9924 -36944 -5318 -23886 -11529 65133 67223 54873 63081 24969 -41016 -68560 -106431
6444 -106431 -6931 16907 6646 -16828 -97402 -144982 -75314 -34819 25644 40143 49144 39609
6432 39609 33604 -30942 -59427 -105130 -120392 16206 80923 68003 53138 33351 -8061 38797
6420 38797 54854 28112 -68633 -69684 -96723 -32707 -21511 -19959 4188 77668 61364 111040
$$ packed form
6504D0109l685J5733m0780m8557L4586J0759l2283O34j0987l6636J24627K7674
6492H1194n3239l7477m0173j3692M7682J0312M0957r7462M8744N6535m2579r005
6480h203l2126m8597Q3022l5028J8899L4428m3876p1274M6103J4856J3214L100
6468b5482l7670K7528M363O1218m3496l7582l4973N1867J788J747N2039l1271
6456i924k7020L1626j8568J2357P6662K090j2350Q208l8112o5985k7544l7871
6444a06431R9500K3838j0261k3474q0574m7580O9668M0495O0463J4499R001r535
6432C9609o005o4546k8485m5703j5262J36598O4717j2920j4865j9787m1412M6858
6420C8797J6057k6742r6745j051k7039O4016J1196J552K4147P3480j6304M9676
$$ plain form
6408 111040 29636 -32340 -30513 -33469 -64877 -74031 -83172 -109100 -109071 -26108 -10136 -38714 -70688
6395 -70688 -148598 -62582 -45647 -37151 -15189 -39768 -54252 -58187 4024 -54299 -33223 -74011
6383 -74011 -48778 -28363 27595 51565 2353 -15580 16809 7755 35670 7872 23130 -38773
6371 -38773 -62453 8662 -15643 53363 31830 36465 -3918 -23896 -52515 -37507 -49140 -11365
6359 -11365 34884 60066 -26202 10596 8619 21352 14170 41958 95766 109560 72806 30691
6347 30691 -9347 22116 -12973 59480 128291 81210 56644 -28817 -45178 11856 20987 -37644
6335 -37644 -74508 -68462 -51076 -38591 -54156 -148069 -36494 -79875 -23573 2735 -6620 -15118
6323 -15118 -38387 -36272 -12312 -44008 -51482 -76850 -76580 50608 6499 -9029 -33986 -46441
$$ packed form
6408A11040q1404o1976J827k956l1408r154r141k5928K9Q2963J5972k8578l1974
6395g0688p7910Q6016J6935Q496K1962k4579j4484l935O2211n8323K1076m0788
6383g4011K5233K0415N5958K3970m9212j7933L2389r054K7915k7798J5258o1903
6371c8773k3680P1115k4305O9006k1533M635m0383j9978k8619J5008j1633L7775
6359a1365M6249K5182q6268L6798j977J2733p182K7788N3808J3794l6754m2115
6347C0691m0038L1463l5089P2453O8811m7081k4566q5461j6361N7034R131n8631
6335c7644l6864O046J7386J2485j5565r3913J11575m3381N6302K6308r355q498
6323a5118k3269K115K3960l1696p474k5368K70J27188m4109j5528k4957j2455
$$ plain form
6311 -46441 -52052 16602 -29795 -47387 -69049 -51483 -65848 -139519 -174265 -179170 -102399 -13182
6299 -13182 -56192 -82278 -86498 -42243 -89343 -135769 -40965 -57111 -88462 -61301 -75162 -149477
6287 -149477 -96387 -60479 -2875 1629 -68871 -5098 23317 -9416 -61820 13039 47125 -17806
6275 -17806 -59888 -80303 -83616 -48190 -139706 -156929 -113587 -105338 -93862 -64690 -54562 -57774
6263 -57774 -119271 -114620 -106437 -65404 -58816 -62119 -10881 -32863 -53738 -61803 -90059 -156840 -115142
6250 -115142 -106303 -29350 -26864 -54859 -14388 11132 6611 -11679 -46151 -5014 34443 12221
6238 12221 -25425 -64055 -65354 -81060 -82299 -45421 -23730 -40937 -56116 -90627 -76729 -96376
6226 -96376 -91643 -68579 -94932 -29879 17570 -6579 31640 -26225 -28436 48532 95585 164554
$$ packed form
6311d6441n611O8654m6397j7592k1662J7566j4365p3671l4746m905P6771Q9217
6299a3182m3010k6086m220M4255m7100m6426R4804j6146l1351K7161j3861p4315
6287a49477N3090L5908N7604M504p0500O3773K8415l2733n2404P4859L4086o4931
6275a7806m2082k0415l313L5426r1516j7223M3342Q249J1476K9172J0128l212
6263e7774o1497M651Q183M1033O588l303N1238k1982k0875q065k8256o6781M1698
6250a15142Q839P6953K486k7995M0471K5520m521j8290l4472M1137L9457k2222
6238A2221l7646l8630j299j5706j239L6878K1691j7207j5179l4511J3898j9647
6226i6376M733K3064k6353O5053M7449k4149L8219n7865k211P6968M7053O8969
$$ plain form
6214 164554 84972 88196 85394 81427 123544 87698 53176 111267 58669 33842 16143 18353
6202 18353 47439 51789 38533 92590 78384 91745 -1529 -29505 -24093 -22292 63090 8995
6190 8995 -10340 77252 26272 20061 27266 54227 97381 62857 126246 69844 74124 83003 104434
6177 104434 101095 87649 23657 15413 60286 103322 83122 57141 88113 72993 77953 58582
6165 58582 67114 63747 9264 19126 137776 98584 30751 47780 24347 14667 125711 97789
6153 97789 46798 36236 103002 67597 55675 84330 24325 42179 52070 30532 20502 101691
6141 101691 98979 125160 68892 93756 -28787 -433 80071 31261 94324 111269 67924 50126
6129 50126 16959 40801 -5068 -2692 -21014 -21432 74355 40734 1932 -22423 -6243 -5797 39627
$$ packed form
6214A64554p9582L224k802l967M2117l5846l4522N8091n2598k4827j7699K210
6202A8353K9086M350j3256N4057j4206J3361r3274k7976N412J801Q5382n4095
6190H995j9335Q7592n0980o211P205K6961M3154l4524O3389n6402M280Q879K1431
6177A04434l339j3446o3992q244M4873M3036k0200k5981L0972j5120M960j9371
6165E8582Q532l367n4483R862J18650l9192o7833J7029k3433r680J11044k7922
6153I7789n0991j0562O6766l5405j1922K8655o0005J7854R891k1538j0030Q1189
6141A01691k712K6181n6268K4864j22543K8354Q0504m8810O3063J6945m3345j7798
6129E0126l3167K3842m5869K376j8322m18R5787l3621l8802k4355J6180M46M5424
$$ plain form
6116 39627 -22148 37421 86510 103615 101066 69249 132287 116329 48111 124778 58715 64591
6104 64591 87787 17731 -2654 -37550 -79380 -10581 18913 26755 2694 -97133 1842 -28483
6092 -28483 -75525 -108078 -129344 -89094 -54752 -34374 6066 -32097 -48169 -173428 -184416 -99595
6080 -99595 -132026 -92565 -72943 -51871 -50162 -96809 -70312 -13923 -33059 83195 80431 -3384
6068 -3384 22869 16990 -9335 -47466 -104862 -145109 -90703 -120824 -64973 -115976 -149681 -74162
6056 -74162 55193 109407 13585 -61598 19256 7931 -666 22976 22689 21010 81378 63323
6044 63323 24591 65760 36963 106752 118380 139915 111348 64470 10901 24342 -58861 -81571
6032 -81571 -8419 -106479 -80391 67748 66855 -17478 -61263 4154 54039 28647 -19614 -15816
$$ packed form
6116C9627o1775N9569M9089J7105k549l1817O3038j5958o8218P6667o6063N876
6104F4591K3196p0056k0385l4896m1830O8799K9494P842k4061r9827R8975l0325
6092b8483m7042l2553k1266M0250L4342K0378M0440l8163j6072j25259j0988Q4821
6080i9595l2431L9461J9622K1072J709m6647K6497N6389j9136J16254k764q3815
6068c384K6253n879k6325l8131n7396m0247N4406l0121N5851n1003l3705P5519
6056g4162J29355N4214r5822p5183Q0854j1325q597K3642k87j679O0368j8055
6044F3323l8732M1169k8797O9789J1628K1535k8567m6878n3569J3441q3203k2710
6032h1571P3152r8060K6088J48139q93q4333m3785O5417M9885k5392m8261L798
$$ plain form
6020 -15816 44280 80842 52481 109450 49221 -16933 1925 -70354 26950 96744 132703 84927
6008 84927 113352 132866 110361 144413 146838 161093 133473 117941 111354 125608 173872 135277
5996 135277 109936 122829 160564 174705 110740 105144 112227 126909 148606 227005 245088 247068
5984 247068 284287 314585 313985 303547 279940 325336 383881 406427 450388 435314 489049 652906
5972 652906 812538 833605 890475 957616 1017197 1019429 961764 984609 980835 1061408 1135507 1125876
5960 1125876 1113029 1093907 1019945 950676 893475 890052 839789 789545 731638 713594 566352
5949 566352 507000 439685 406095 440798 449525 404867 321172 318924 346540 307775 255361 317072
5937 317072 397152 452997 359913 352568 278830 157403 179336 151256 167575 203781 223084 206493
$$ packed form
6020a5816O0096L6562k8361N6969o0229o6154J8858p2279R7304O9794L5959m7776
6008H4927K8425J9514k2505L4052K425J4255k7620j5532o587J4254M8264l8595
5996A35277k5341J2893L7735J4141o3965n596P083J4682K1697P8399J8083J980
5984B47068L7219L0298o00j0438k3607M5396N8545K2546M3961j5074N3735J63857
5972F52906J59632K1067N6870O7141N9581K232n7665K2845l774Q0573P4099r631
5960A125876j2847j9122p3962o9269n7201l423n0263n0244n7907j8044j47242
5949E66352n9352o7315l3590L4703Q727m4658q3695k248K7616l8765n2414O1711
5937C17072Q0080N5845r3084p345p3738j21427K1933k8080J6319L6206J9303j6591
$$ plain form
5925 206493 278343 295841 329450 316821 327248 339431 383623 365915 373928 339874 280240 261781
5913 261781 204122 303880 309880 317928 270659 275260 209021 186620 198497 245686 289576 252483
5901 252483 210531 230009 121040 133608 186020 207635 177308 132236 129675 118061 105840 66100
5889 66100 68071 82944 118750 160073 150114 113872 168288 141052 151289 146833 183959 214222
5877 214222 185365 77461 73244 135421 156892 166819 167495 158497 162055 108421 91147 106338 5474
5864 5474 62767 92725 91739 118809 122205 115632 148625 166577 129708 53544 114112 184021 176282
5851 176282 156626 151052 110157 111827 84080 80572 76880 110760 152278 142651 176517 141566 105125
5838 105125 91440 178240 251179 196474 243135 246244 223071 217638 328540 324792 282014 294594
$$ packed form
5925B06493P1850J7498L3609j2629J0427J2183M4192j7708Q013l4054n9634j8459
5913B61781n7659R9758O000Q048m7269M601o6239k2401J1877M7189M3890l7093
5901B52483m1952J9478j08969J2568N2412K1615l0327m5072k561j1614j2221l9740
5889F6100J971J4873L5806M1323r959l6242N4416k7236J0237m456L7126L0263
5877B14222k8857j07904m217O2177K1471R927O76q998L558n3634j7274J5191j00864
5864E474N7293K9958r86K7070L396o573L2993J7952l6869p6164O0568O9909p739
5851A76282j9656n574m0895J670k7747l508l692L3880M1518r627L3866l4951l6441
5838A05125j3685Q6800P2939n4705M6661L109k3173n433J10902l748m2778J2580
$$ plain form
5826 294594 295873 229953 200518 204192 224070 316951 351376 333476 312769 358260 375377 361820
5814 361820 354731 372640 479081 556760 564988 581495 543543 542957 519327 563407 683967 735903
5802 735903 643298 666979 720426 750796 769441 774121 778760 831615 850759 799412 810623 781462
5790 781462 803040 810170 831870 891230 857278 908804 911474 935485 941289 960087 1026848 1078410
5778 1078410 1135351 1252030 1256658 1226727 1281772 1332241 1343813 1348177 1354289 1416877 1463011 1426253
5766 1426253 1413413 1414780 1442726 1499260 1551433 1570545 1534586 1589319 1590522 1519548 1521479 1524267
5754 1524267 1564063 1679412 1736949 1665268 1667167 1637614 1636208 1812321 1802028 1819033 1960313
5743 1960313 1987246 2002081 2058286 2055971 2088843 2134669 2232268 2367255 2448593 2474958 2470494 2540093
$$ packed form
5826B94594J279o5920k9435L674J9878R2881L4425j7900k0707M5491J7117j3557
5814C61820p089J7909J06441P7679Q228J6507l7952n86k3630M4080J20560N1936
5802G35903r2605K3681N3447L0370J8645M680M639N2855J9144n1347J1211k9161
5790G81462K1578P130K1700N9360l3952N1526K670K4011N804J8798O6761N1562
5778A078410N6941J16679M628k9931N5045N0469J1572M364O112O2588M6134l6758
5766A426253j2840J367K7946N6534N2173J9112l5959N4733J203p0974J931K788
5754A524267L9796J15349N7537p1681J899k9553j406J76113j0293J7005J41280
5743A960313K6933J4835N6205k315L2872M5826R7599J34987Q1338K6365m464O9599
$$ plain form
5731 2540093 2653948 2723463 2831953 2911299 3025499 3188313 3178109 3154422 3187242 3218553 3256907
5720 3256907 3310487 3353730 3373469 3395492 3487515 3505660 3631212 3659898 3691754 3699786 3689709
5709 3689709 3789726 3818762 3836149 3954365 4047320 4183514 4344936 4467754 4553946 4647206
5699 4647206 4807948 4933591 5009562 5102920 5200997 5363956 5518864 5677490 5857466 6044652
5689 6044652 6210195 6338792 6513290 6697983 7023703 7329150 7608285 7944097 8358696 8805127
5679 8805127 9273815 9796708 10312368 11016664 11883880 12807678 13829518 14978870 16267183
5670 16267183 17770745 19467208 21409393 23680696 26380109 29661341 33837116 39315270
5662 39315270 46592260 56387719 69631747 87013998 107533149 129012922 148091050
$$ packed form
5731B540093J13855O9515J08490P9346J14200J62814j0204k3687L2820L1311L8354
5720C256907N3580M3243J9739K2023R2023J8145J25552K8686L1856Q032j0077
5709C689709J00017K9036J7387J18216R2955J36194J61422J22818Q6192R3260
5699D647206J60742J25643P5971R3358R8077J62959J54908J58626J79976J87186
5689F044652J65543J28597J74498J84693L25720L05447K79135L35812M14599M46431
5679H805127M68688N22893N15660P04296Q67216R23798J021840J149352J288313
5670A6267183J503562J696463J942185K271303K699413L281232M175775N478154
5662C9315270P276990R795459J3244028J7382251K0519151K1479773J9078128
$$ plain form
5655 148091050 162010219 170048362 173533159 173025771 170217861 168054941 168478847 172556351
5647 172556351 179263824 185756559 189388897 188533788 182754060 173606907 161430479 146100935
5639 146100935 129473534 112871998 96921598 82328104 69321218 58181184 48903442
5632 48903442 41763593 36315480 32024499 28620787 25924205 23522729 21507551 19804133
5624 19804133 18361960 17153171 16135087 15146014 14262896 13461124 12720603 12091282 11526344
5615 11526344 11056809 10606782 10263218 9863819 9430927 9071334 8772625 8446974 8104811
5606 8104811 7766850 7528934 7266450 7003248 6779335 6591656 6379889 6152761 5928265 5812696
5596 5812696 5677549 5544179 5370622 5155559 5042405 4959018 4762202 4614773 4457670 4332069
$$ packed form
5655A48091050J3919169Q038143L484797n07388k807910k162920M23906M077504
5647A72556351O707473O492735L632338q55109n779728r147153j2176428j5329544
5639A46100935j6627401j6601536j5950400j4593494j3006886j1140034r277742
5632D8903442p139849n448113m290981l403712k696582k401476k015178j703418
5624A9804133j442173j208789j018084r89073q83118q01772p40521o29321n64938
5615A1526344m69535m50027l43564l99399m32892l59593k98709l25651l42163
5606H104811l37961k37916k62484k63202k23913j87679k11767k27128k24496j15569
5596E812696j35147j33370j73557k15063j13154q3387j96816j47429j57103j25601
$$ plain form
5586 4332069 4175196 4145905 4036047 3913163 3868607 3716665 3637194 3564656 3503894 3438672 3284010
5575 3284010 3186316 3134525 3058771 3063180 2972848 2921275 2950235 2884805 2798316 2742489 2698217 2684363
5563 2684363 2696951 2605081 2560152 2566566 2554392 2561417 2473914 2402662 2395833 2504545 2484754 2460127
5551 2460127 2420632 2269802 2334290 2306892 2301436 2266766 2202464 2172718 2093532 2109418 2152768
5540 2152768 2107379 2022407 2086404 2093598 2084796 2000701 1999213 2072817 2022950 2046726 2118610 2044537
5528 2044537 2050047 2044427 2047553 2000968 2050330 2077881 2005383 2005263 2009165 1910592 1930933 1912907 1852874
5515 1852874 1924224 1954835 1968125 1912574 1828890 1753191 1742976 1749323 1801087 1894553 1902468 1901225
5503 1901225 1954862 2052446 2020328 2059566 2113620 2185834 2319969 2444884 2683996 2977968 3381195
$$ packed form
5586D332069j56873k9291j09858j22884m4556j51942p9471p2538o0762o5222j54662
5575C284010r7694n1791p5754M409r0332n1573K8960o5430q6489n5827m4272j3854
5563B684363J2588r1870m4929O414j2174P025q7503p1252o829J08712j9791k4627
5551B460127l9495j50830O4488k7398n456l4670o4302k9746p9186J5886M3350
5540B152768m5389q4972O3997P194q802q4095j488P3604m9867K3776P1884p4073
5528B044537N510n620L126m6585M9362K7551p2498j20L902r8573K0341j8026o0033
5515A852874P1350L0611J3290n5551q3684p5699j0215O347N1764R3466P915j243
5503A901225N3637R7584l2118L9238N4054P2214J34135J24915K39112K93972M03227
$$ plain form
5492 3381195 3723062 3975803 3999948 3986052 3881034 3862322 3795959 3754353 3787926 3911039 4172314
5481 4172314 4316044 4358394 4331640 4184666 4074311 3839652 3622974 3441198 3170511 2964734
5471 2964734 2868427 2788678 2737079 2705140 2575671 2588783 2584710 2543395 2554645 2579343 2578263 2628327
5459 2628327 2633972 2630033 2629239 2620417 2656628 2786593 2902768 2885820 3015883 3165175 3181192 3313576
5447 3313576 3360473 3473629 3544912 3638896 3749342 3828346 4058629 4217445 4453197 4726146
5437 4726146 4876489 5145324 5422506 5670660 6012091 6430340 6803979 7315255 7986177 8806625
5427 8806625 9802015 10845148 12231611 13760427 15601164 17900044 21259778 26464902
5419 26464902 34792393 46020438 58301115 68885837 75664740 78056480 77973643 76368974
$$ packed form
5492C381195L41867K52741K4145j3896j05018j8712o6363m1606L3573J23113K61275
5481D172314J43730M2350k6754j46974j10355k34659k16678j81776k70687k05777
5471B964734r6307p9749n1599l1939j29469J3112m073m1315J1250K4698j080N0064
5459B628327N645l939p94q822L6211J29965J16175j6948J30063J49292J6017J32384
5447C313576M6897J13156P1283R3984J10446P9004K30283J58816K35752K72949
5437D726146J50343K68835K77182K48154L41431M18249L73639N11276O70922Q20448
5427H806625R95390J043133J386463J528816J840737K298880L359734N205124
5419B6464902Q327491J1228045J2280677J0584722O778903K391740q2837j604669
$$ plain form
5411 76368974 72568773 68224420 65036192 64859963 68637511 74829615 80895693 84519832
5403 84519832 84372419 81638182 77703951 71523201 63540638 55164258 47197632 40016601
5395 40016601 33573215 27817234 22877762 19133581 16391691 14385321 12775239 11572752
5387 11572752 10552624 9701975 8972973 8304683 7738075 7322480 6915842 6573790 6261829
5378 6261829 5894278 5657694 5424283 5164011 4965765 4727186 4609123 4462293 4235159 4020555
5368 4020555 3867498 3704222 3665943 3533248 3403070 3309705 3220368 3169859 3121556 3015308
5358 3015308 3044089 2970054 2873109 2825027 2729406 2589434 2443566 2320083 2338733 2286730 2179125
5347 2179125 2151627 2137976 2138933 2090606 2123629 2181618 2229190 2236955 2301056 2237308 2233631 2211323
$$ packed form
5411G6368974l800201m344353l188228j76229L777548O192104O066078L624139
5403H4519832j47413k734237l934231o180750p982563q376380p966626p181031
5395D0016601o443386n755981m939472l744181k741890k006370j610082j202487
5387A1572752j020128q50649p29002o68290n66608m15595m06638l42052l11961
5378F261829l67551k36584k33411k60272j98246k38579j18063j46830k27134k14604
5368D020555j53057j63276l8279j32695j30178r3365q9337n0509m8303j06248
5358C015308K8781p4035r6945m8082r5621j39972j45868j23483J8650n2003j07605
5347B179125k7498j3651R57m8327L3023N7989M7572P765O4101o3748l677k2308
$$ plain form
5335 2211323 2310565 2319979 2282040 2291986 2210350 2149220 2147884 2152030 2103631 2068422 1993923 1943869
5323 1943869 1914308 1877277 1855153 1727074 1641732 1481608 1434721 1374400 1257742 1288575 1290396
5312 1290396 1190024 1097379 1089895 1050840 959095 923118 945253 934914 936798 887885 757625
5301 757625 710641 701395 757583 744517 673900 689787 703196 726695 670816 630144 615409 583687
5289 583687 506407 504874 522217 566461 492711 532808 560988 512512 543049 477809 444436 405219
5277 405219 386313 400419 354551 323208 341718 330897 300704 243427 247051 225039 213837 257450
5265 257450 336638 313250 336067 326053 294177 285058 338041 327727 352592 330924 336360 306847
5253 306847 283350 258874 234511 356386 278273 202670 224131 205084 170714 198782 175628
$$ packed form
5335B211323R9242R414l7939R946q1636o1130j336M146m8399l5209p4499n0054
5323A943869k9561l7031k2124j28079q5342j60124m6887o0321j16658L0833J821
5312A290396j00372r2645p484l9055r1745l5977K2135j0339J884m8913j30260
5301G57625m6984r246N6188j3066p0617J5887J3409K3499n5879m0672j4735l1722
5289E83687p7280j533J7343M4244p3750M0097K8180m8476L0537o5240l3373l9217
5277D05219j8906J4106m5868l1343J8510j0821l0193n7277L624k2012j1202M3613
5265B57450P9188k3388K2817j0014l1876r119N2983j0314K4865k1668N436k9513
5253C06847k3497k4476k4363J21875p8113p5603K1461j9047l4370K8068k3154
$$ plain form
5242 175628 168967 135732 124850 104118 19447 7411 13059 73857 69658 99744 193790 263474
5230 263474 233715 211465 221004 249407 214732 176316 232700 220742 228149 271770 186877 110420
5218 110420 120837 30977 58197 110411 146970 73628 26252 23534 -40735 39852 82702 51823
5206 51823 97959 68055 119822 50201 -39337 46189 31982 -17930 54571 99872 51348 -146
5194 -146 17984 91986 95994 119466 129982 142621 173106 200023 115183 73230 22053 57094
5182 57094 34653 75619 93767 15646 58496 21095 -20174 -18581 -24977 -13058 146560 136556
5170 136556 104169 65168 86065 140880 87679 147266 168243 179049 150895 119950 116703 127642
5158 127642 166531 170629 164375 171285 181381 76390 86123 71725 110623 91338 137331 127232
$$ packed form
5242A75628o661l3235j0882k0732q4671j2036N648O0798m199L0086R4046O9684
5230B63474k9759k2250R539K8403l4675l8416N6384j1958P407M3621q4893p6457
5218A10420J0417q9860K7220N2214L6559p3342m7376k718o4269Q0587M2850l0879
5206E1823M6136k9904N1767o9621q9538Q5526j4207m9912P2501M5301m8524n1494
5194a46J8130P4002M008K3472J0516J2639L0485K6917q4840m1953n1177L5041
5182E7094k2441M0966J8148p8121M2850l7401m1269J593o396J1919J59618j0004
5170A36556l2387l9001K0897N4815n3201N9587K0977J0806k8154l0945l247J0939
5158A27642L8889M098o254O910J0096j04991R733j4398L8898j9285M5993j0099
$$ plain form
5146 127232 133462 139300 105077 30665 32425 7029 -19047 3533 -15439 7887 14208 -14842
5134 -14842 -61479 -20642 11764 51311 56089 39872 44794 110642 78316 52119 68652 61574
5122 61574 87133 107468 129363 120431 43936 58250 56770 87990 99838 28572 7472 16601
5110 16601 39591 66958 87924 72349 128338 231693 243204 276734 334287 393596 428088 403364
5098 403364 444897 486153 488459 470723 454815 407251 445733 496482 455636 453020 485862 486354
5086 486354 413060 404431 251838 221419 254982 242883 232715 177889 113833 145925 119053 79569
5074 79569 54550 90794 16252 20852 41615 21758 2971 -1920 21070 41123 45535 65007
5062 65007 104808 57850 22844 22457 15376 -58872 30590 4542 -766 45406 -27507 -32971 -49961
$$ packed form
5146A27232O230N838l4223p4412J760k5396k6076K2580j8972K3326O321k9050
5134a4842m6637M0837L2406L9547M778j6217M922O5848l2326k6197J6533p078
5122F1574K5559K0335K1895q932p6495J4314j480L1220J1848p1266k1100R129
5110A6601K2990K7367K0966j5575N5989J03355J1511L3530N7553N9309L4492k4724
5098D03364M1533M1256K306j7736j5908m7564L8482N0749m0846k616L2842M92
5086D86354p3294q629j52593l0419L3563j2099j0168n4826o4056L2092k6872l9484
5074G9569k5019L6244p4542M600K0763j9857j8787m891K2990K0053M412J9472
5062F5007L9801m6958l5006l87p081p4248Q9462k6048n308M6172p2913n464j6990
$$ plain form
5049 -49961 -28377 -6921 -35873 -28109 19974 96535 114148 50303 48894 89278 70796 68807
5037 68807 33193 31623 51475 60547 69160 164588 117857 45599 36757 1639 108214 134984
5025 134984 83852 45548 60529 78559 48852 2864 20955 5669 -1345 49389 46023 63772
5013 63772 102691 92954 78496 56778 37840 17460 33621 84730 74744 49793 48406 86082
5001 86082 70110 66043 42736 52574 20678 64349 61687 48566 43689 -16641 45199 116333 59720
4988 59720 -26495 49350 6935 -52262 -17874 -43413 8639 42890 18902 -3601 15675 47062
4976 47062 92086 12646 -35050 23512 89749 30081 72841 66113 94457 114501 51636 101713
4964 101713 70195 62627 69753 76551 34252 -26684 53159 20624 27088 65232 11035 39416
$$ packed form
5049d9961K1584K1456k8952P764M8083P6561J7613o3845j409M0384j8482j989
5037F8807l5614j570J9852R072Q613R5428m6731p2258q842l5118J06575K6770
5025A34984n1132l8304J4981J8030k9707m5988J8091j5286p014N0734l366J7749
5013F3772L8919r737j4458k1718j8938k0380J6161N1109r986k4951j387L7676
5001H6082j5972m067k3307R838l1896M3671k662j3121m877o0330O1840P1134n6613
4988E9720q6215P5845m2415n9197L4388k5539N2052L4251k3988k2503J9276L1387
4976D7062M5024p9440m7696N8562O6237n9668M2760o728K8344K0044o2865N0077
4964A01713l1518p568P126O798m2299o0936P9843l2535O464L8144n4197K8381
$$ plain form
4952 39416 109092 101382 55447 83941 19298 -66517 -106965 -51807 -44269 -71568 -80021 -99444
4940 -99444 -63746 -16156 -64555 22810 43030 17515 105086 91069 -16180 20177 5517 -64472
4928 -64472 -44220 33636 -14555 -109438 -123366 -81265 -50893 -6499 -3555 -13933 11525 72119
4916 72119 75579 -26306 -29973 -796 49763 100345 88422 50760 113731 78211 103789 138832
4904 138832 106973 43329 29080 94885 160962 184979 99479 74253 1880 30066 19959 20797
4892 20797 -37944 38195 111264 120897 153564 175051 113038 142058 275320 319992 340773 233812
4880 233812 302687 371278 445565 483960 476694 487762 561961 592092 674106 712713 649110 613334
4868 613334 635196 678361 636827 584764 599398 595936 605866 569279 596739 541558 375875 354010
$$ packed form
4952C9416O9676p710m5935K8494o4643q5815m0448N5158P538k7299q453j9423
4940i9444L5698M7590m8399Q7365K0220k5515Q7571j4017j07249L6357j4660o9989
4928f4472K0252P7856m8191r4883j3928M2101L0372M4394K944j0378K5458O0594
4916G2119L460j01885l667K9177N0559N0582j1923l7662O2971l5520K5578L5043
4904A38832l1859o3644j4249O5805O6077K4017q5500k5226p2373K8186j0107Q38
4892B0797n8741P6139P3069R633L2667K1487o2013K9020J33262M4672K0781j06961
4880B33812O8875O8591P4287L8395p266J1068P4199L0131Q2014L8607o3603l5776
4868F13334K1862M3165m1534n2063J4634l462R930l6587K7460n5181j65683k1865
$$ plain form
4856 354010 353880 394426 330076 263403 246412 222412 207541 220818 274506 213499 203163 202541
4844 202541 160415 153358 158094 115887 55017 146152 121734 74701 86771 42123 41290 9053
4832 9053 -28913 8151 11863 21947 104053 161646 125150 55191 109507 152596 129259 156106
4820 156106 133601 89658 164021 109835 99883 72196 92445 38742 59543 120618 91729 105658
4808 105658 102278 79143 100362 118422 117576 102417 72503 107871 126738 167007 94025 35708
4796 35708 71991 82674 85616 93056 102295 39346 35298 94052 71941 25525 5593 90702 82772
4783 82772 115461 78952 93313 111404 86565 121071 178959 130612 146624 107942 142602 166988
4771 166988 105186 112934 146041 132206 62786 84336 89713 69395 26626 -12343 -27056 6102
$$ packed form
4856C54010j30M0546o4350o6673j6991k4000j4871J3277N3688o1007j0336o22
4844B02541m2126p057M736m2207o0870R1135k4418m7033J2070m4648q33l2237
4832I053l7966L7064L712J0084Q2106N7593l6496o9959N4316M3089k3337K6847
4820A56106k2505m3943P4363n4186r952k7687K0249n3703K0801O1075k8889J3929
4808A05658l380k3135K1219J8060q46j5159k9914L5368J8867M0269p2982n8317
4796C5708L6283J0683K942P440R239o2949m048N8754k2111m6416j9932Q5109p930
4783H2772L2689l6509J4361J8091k4839L4506N7888m8347J6012l8682L4660K4386
4771A66988o1802P748L3107j3835o9420K1550N377k0318m2769l8969j4713L3158
$$ plain form
4759 6102 22741 -28087 58230 73417 -7740 23428 30672 -6506 -1801 40478 118753 119870 86374
4746 86374 83794 43218 80473 59955 51696 84532 159102 209196 141650 55419 13587 46488
4734 46488 91383 42470 4899 16021 45284 -9088 -70871 -154153 -123356 -96366 -38672 98315
4722 98315 42564 23664 53267 77716 118382 148938 141657 220664 212520 222285 225434 165854 192694
4709 192694 108763 105063 111407 108003 143865 146459 188586 181579 168901 150912 163263 192021 282701
4696 282701 289594 231680 189868 215153 204810 121326 148876 119689 139580 64073 115073 172851
4684 172851 189369 155752 206176 255494 223735 305030 268991 164857 196751 201375 137971 144145
4672 144145 229052 228619 208443 207973 140754 161428 205100 204277 219643 261065 246429 151623 107200
$$ packed form
4759F102J6639n0828Q6317J5187q1157L1168P244l7178M705M2279P8275J117l3496
4746H6374k580m0576L7255k0518q259L2836P4570N0094o7546q6231m1832L2901
4734D6488M4895m8913l7571J1122K9263n4372o1783q3282L0797K6990N7694J36987
4722I8315n5751j8900K9603K4449M0666L0556p281P9007q144R765L149n9580K6840
4709A92694q3931l700O344l404L5862K594M2127p007j2678j7989J2351K8758R0680
4696B82701O893n7914m1812K5285j0343q3484K7550k9187J9891p5507N1000N7778
4684A72851J6518l3617N0424M9318l1759Q1295l6039j04134L1894M624o3404O174
4672A44145Q4907m33k0176m70o7219K0674M3672q23J5366M1422j4636r4806m4423
$$ plain form
4659 107200 120520 130103 160177 130471 185565 236393 278195 291238 289955 243584 166461 185299
4647 185299 221611 228471 195991 149902 179089 156565 136319 196603 191238 177719 198485 285990
4635 285990 322301 373146 351959 301641 250011 215259 229579 266676 248510 279417 289829 280544
4623 280544 302617 168946 212946 191319 231186 198234 180289 213761 236832 283908 257037
4612 257037 247170 224040 207704 246792 336159 295444 322276 295563 282571 274544 233398 307771
4600 307771 273949 231673 261841 197199 176369 106016 134691 184463 219364 289676 311578 303021
4588 303021 290754 318974 377536 390216 330124 308683 285977 350749 317979 271435 274387 281902
4576 281902 304971 256929 265124 275803 275719 365368 339366 361082 357800 359891 398329 367152 278667
$$ packed form
4659A07200J3320R583L0074k9706N5094N0828M1802J3043j283m6371p7123J8838
4647A85299L6312O860l2480m6089K9187k2524k0246O0284n365j3519K0766Q7505
4635B85990L6311N0845k1187n0318n1630l4752J4320L7097j8166L0907J0412r285
4623B80544K2073j33671M4000k1627L9867l2952j7945L3472K3071M7076k6871
4612B57037r867k3130j6336L9088Q9367m0715K6832k6713j2992q027m1146P4373
4600C07771l3822m2276L0168o4642k0830p0353K8675M9772L4901P0312K1902q557
4588C03021j2267K8220N8562J2680o0092k1441k2706O4772l2770m6544K952P515
4576B81902K3069m8042Q195J0679q4Q9649k6002K1716l282K091L8438l1177q8485
$$ plain form
4563 278667 251281 324347 374821 344631 359116 383453 302127 343748 290946 318875 310498 366935
4551 366935 341073 342266 322236 273627 374392 355527 324458 363797 441618 423989 435525 429760
4539 429760 392676 375167 359696 380497 374604 347443 435814 522777 533451 506232 568329 591619
4527 591619 672669 719476 767819 757963 742962 766098 777555 767483 783990 752242 789388 852949
4515 852949 872779 892190 828813 821946 910288 1010537 1080217 1104655 1142679 1216124 1222028 1209024
4503 1209024 1264643 1222649 1311653 1325441 1283284 1249314 1173814 1175473 1169729 1166675 1137894 1158953
4491 1158953 1097086 1118844 1145208 1113196 1090047 1095221 1043103 1017066 1088625 1116436 1118624 1110831
4479 1110831 1050430 1054635 994375 1015694 1047619 1051447 1055000 1049454 1034104 1071394 1087771 1177563
$$ packed form
4563B78667k7386P3066N0474l0190J4485K4337q1326M1621n2802K7929q377N6437
4551C66935k5862J193k0030m8609J00765j8865l1069L9339P7821j7629J1536n765
4539D29760l7084j7509j5471K0801n893k7161Q8371Q6963J0674k7219O2097K3290
4527E91619Q1050M6807M8343r856j5001K3136J1457j0072J6507l1748L7146O3561
4515H52949J9830J9411o3377o867Q8342J00249O9680K4438L8024P3445N904j3004
4503A209024N5619m1994Q9004J3788m2157l3970p5500J659n744l054k8781K1059
4491A158953o1867K1758K6364l2012k3149N174n2118k6037P1559K7811K188p793
4479A110831o0401M205o0260K1319L1925L828L553n546j5350L7290J6377Q9792
$$ plain form
4467 1177563 1184568 1138846 1177978 1176158 1116172 1058465 1060307 1133869 1132908 1139671 1195461 1225896 1160884
4454 1160884 1135098 1077135 1057329 1082912 1099629 1066976 965681 1047249 1048848 1079993 1057999
4443 1057999 1124599 1146816 1178407 1278617 1202879 1161651 1191876 1235041 1213987 1289419 1373150
4432 1373150 1437151 1468315 1469568 1491382 1445571 1549837 1677085 1645063 1658875 1745215 1826043
4421 1826043 1916996 1924602 1938493 1958310 1998848 2032207 1970813 1874870 1831170 1852016 1909979 1975620
4409 1975620 1960075 1903885 1861245 1830851 1898261 1918941 1876740 1868962 1961544 2102651 2169417
4398 2169417 2202116 2172867 2192342 2254994 2361310 2437898 2488803 2597576 2717547 2822694 2877868
4387 2877868 2837998 2845288 2875896 2916315 3015865 3129227 3342065 3519048 3657960 3776701 3793771
$$ packed form
4467A177563P005m5722L9132j820n9986n7707J842P3562r61O763N5790L0435o5012
4454A160884k5786n7963j9806K5583J6717l2653j01295Q1568J599L1145k1994
4443A057999O6600K2217L1591J00210p5738m1228L0225M3165k1054P5432Q3731
4432A373150O4001L1164J253K1814m5811J04266J27248l2022J3812Q6340Q0828
4421A826043R0953P606J3891J9817M0538L3359o1394r5943m3700K0846N7963O5641
4409A975620j5545n6190m2640l0394O7410K0680m2201p778R2582J41107O6766
4398B169417L2699k9249J9475O2652J06316P6588N0905J08773J19971J05147N5174
4387B877868l9870P290L0608M0419R9550J13362K12838J76983J38912J18741J7070
$$ plain form
4376 3793771 3935909 3971105 3939569 4030767 4182798 4355299 4505774 4609692 4677010 4736171
4366 4736171 4770763 4745000 4691817 4635247 4606527 4511807 4467576 4515122 4572700 4537475 4497549
4355 4497549 4628259 4701470 4833471 4929389 5070056 5206014 5330336 5390297 5471374 5626157
4345 5626157 5750334 5956918 6187925 6403729 6596955 6903866 7244191 7637945 8081547 8492680
4335 8492680 8933216 9504125 10166230 10879907 11854895 13032650 14573846 16528096 18878519
4326 18878519 21900079 25619095 29981008 34996616 40326455 45312733 49466742 52951115
4318 52951115 55829755 58675698 62312750 67403364 74603681 83458714 92431982 99801012
4310 99801012 104325646 105802783 105325182 103022683 98959790 95038397 92495709 92417731 94206599
$$ packed form
4376C793771J42138L5196l1536R1198J52031J72501J50475J03918O7318N9161
4366D736171L4592k5763n3183n6570k8720r4720m4231M7546N7578l5225l9926
4355D497549J30710P3211J32001R5918J40667J35958J24322N9961Q1077J54783
4345E626157J24177K06584K31007K15804J93226L06911L40325L93754M43602M11133
4335H492680M40536N70909O62105P13677R74988J177755J541196J954250K350423
4326A8878519L021560L719016M361913N015608N329839M986278M154009L484373
4318E2951115K878640K845943L637052N090614P200317Q855033Q973268P369030
4310I9801012M524634J477137m77601k302499m062893l921393k542688p7978J788868
$$ plain form
4301 94206599 96432019 97051829 95339847 91461751 86776746 80999548 73643790 66222515
4293 66222515 59408812 53957035 49957356 46936505 44206787 41532238 38688257 35945585
4285 35945585 33457916 30599824 27710977 25032318 22581268 20538534 18734222 17242500
4277 17242500 16039102 15152403 14450731 14006846 13664329 13470476 13289336 13136602 13105118
4268 13105118 13149733 13153568 13167130 13221669 13311678 13337979 13497223 13646644 13889234 14142454 14368905
4257 14368905 14641103 14951485 15340872 15751131 16199887 16769456 17261799 17901954 18594058
4248 18594058 19408798 20207364 21208391 22221077 23314886 24517158 25813102 27241727
4240 27241727 28687295 30301680 32075185 33904820 35830738 37948411 40164636 42436791
$$ packed form
4301I4206599K225420O19810j711982l878096m685005n777198p355758p421275
4293F6222515o813703n451777l999679l020851k729718k674549k843981k742672
4285C5945585k487669k858092k888847k678659k451050k042734j804312j491722
4277A7242500j203398q86699p01672m43885l42517j93853j81140j52734l1484
4268A3105118M4615L835J3562N4539R0009K6301J59244J49421K42590K53220K26451
4257A4368905K72198L10382L89387M10259M48756N69569M92343O40155O92104
4248A8594058Q14740P98566J001027J012686J093809J202272J295944J428625
4240B7241727J445568J614385J773505J829635J925918K117673K216225K272155
$$ plain form
4232 42436791 44815746 47432312 50213561 53125527 56165067 59310447 62595761 65930128
4224 65930128 69233753 72550092 75929872 79329065 82630029 85729463 88994832 92259675
4216 92259675 95402733 98553595 101736299 104918396 108050662 111131949 113893729 116484800
4208 116484800 118791392 120773041 122497737 123921413 124914693 125841291 126594290 127102203 127344733
4199 127344733 127466560 127346208 127020233 126362508 125433711 124177063 122556020 120728900 118554269
4190 118554269 116208519 113668212 110985901 108117516 105191916 102188974 99043928 95872365
4182 95872365 92637669 89369571 86032926 82614107 79113184 75689715 72184549 68598574
4174 68598574 65242167 61926747 58682627 55606782 52582263 49706093 46893479 44205077
$$ packed form
4232D2436791K378955K616566K781249K911966L039540L145380L285314L334367
4224F5930128L303625L316339L379780L399193L300964L099434L265369L264843
4216I2259675L143058L150862L182704L182097L132266L081287K761780K591071
4208A16484800K306592J981649J724696J423676R93280R26598P52999N07913K42530
4199A27344733J21827j20352l25975o57725r28797j256648j621043j827120k174631
4190A18554269k345750k540307k682311k868385k925600l002942l145046l171563
4182I5872365l234696l268098l336645l418819l500923l423469l505166l585975
4174F8598574l356407l315420l244120l075845l024519k876170k812614k688402
$$ plain form
4166 44205077 41678959 39250934 36934733 34703116 32570494 30636733 28774194 26973981
4158 26973981 25213299 23598138 22183847 20832310 19564732 18573294 17528575 16594272
4150 16594272 15733365 14961016 14215205 13448271 12826897 12367921 11872666 11392000 10936007
4141 10936007 10493375 10123967 9794698 9501562 9332199 9067106 8767265 8523321 8317026
4132 8317026 8160622 7969128 7812159 7608544 7496889 7411421 7256332 7098503 7004140 6905491
4122 6905491 6775277 6699564 6560481 6549034 6478768 6336957 6223122 6125039 6071633 6023711 6078245
4111 6078245 6148011 6108049 6054032 6125642 6154895 6229953 6211266 6265895 6347428 6496075 6606441
4100 6606441 6670822 6806856 6896796 6863356 6870705 6971034 7040390 6947801 7021170 7034771 6966454
$$ packed form
4166D4205077k526118k428025k316201k231617k132622j933761j862539j800213
4158B6973981j760682j615161j414291j351537j267578r91438j044719r34303
4150A6594272q60907p72349p45811p66934o21374m58976m95255m80666m55993
4141A0936007m42632l69408l29269k93136j69363k65093k99841k43944k06295
4132H317026j56404j91494j56969k03615j11655q5468j55089j57829r4363r8649
4122F905491j30214p5713j39083j1447p0266j41811j13835r8083n3406m7922N4534
4111F078245O9766l9962n4017P1610K9253P5058j8687N4629Q1533J48647J10366
4100F606441O4381J36034Q9940l3440P349J00329O9356r2589P3369J3601o8317
$$ plain form
4089 6966454 6986452 7000752 7027473 7061434 7060911 7096071 7097951 7029356 7036201 6969362 6942460 6925032
4077 6925032 6810041 6802830 6707211 6598799 6582936 6535544 6432894 6375221 6295476 6281516 6264930
4066 6264930 6254178 6129734 6084369 6057562 5989673 5957187 6067961 6052622 6035485 6018971 5980968
4055 5980968 5967674 5931864 5956408 5939432 5960759 5988370 5949862 5885942 5945748 5972045 6016402
4044 6016402 6024669 6056029 6076854 6169014 6188434 6195330 6279334 6387966 6394009 6562044 6640199 6645346
4032 6645346 6880809 6964561 7044996 7157858 7331939 7483242 7654581 7841938 7967880 8095597
4022 8095597 8277743 8544019 8734839 8899844 9157132 9483474 9799369 10051055 10370457 10738678
4012 10738678 11128652 11532080 11959128 12436488 12955401 13479031 13977649 14498208 14996278
$$ packed form
4089F966454J9998J4300K6721L3961n23L5160J880o8595O845o6839k6902j7428
4077F925032j14991p211r5619j08412j5863m7392j02650n7673p9745j3960j6586
4066F264930j0752j24444m5365k6807o7889l2486J10774j5339j7137j6514l8003
4055E980968j3294l5810K4544j6976K1327K7611l8508o3920N9806K6297M4357
4044F016402Q267L1360K0825R2160J9420O896Q4004J08632O043J68035P8155N147
4032F645346K35463Q3752Q0435J12862J74081J51303J71339J87357J25942J27717
4022H095597J82146K66276J90820J65005K57288L26342L15895K51686L19402L68221
4012A0738678L89974M03428M27048M77360N18913N23630M98618N20559M98070
$$ plain form
4003 14996278 15649018 16314874 17063867 17860952 18814490 19779159 20993450 22524136 24177347
3994 24177347 26103131 28377004 30949429 33994044 37636944 41883816 46865085 52856903
3986 52856903 60215359 69360250 80629592 94329025 110277412 128089423 146850610
3979 146850610 165456086 182580385 197136497 208528181 216407936 220927565 222709633
3972 222709633 222340340 220576793 218271449 216024087 214590485 214279161 214956663 216357011
3964 216357011 217722565 218115480 216711517 212675437 205635579 195672264 183332629 169091920
3956 169091920 153763711 138101950 122878983 108539215 95387557 83718094 73580919
3949 73580919 64887892 57546360 51482338 46400616 42175604 38594251 35538883 32947709
$$ packed form
4003A4996278O52740O65856P48993P97085R53538R64669J214291J530686J653211
3994B4177347J925784K273873K572425L044615L642900M246872M981269N991818
3986E2856903P358456R144891J1269342J3699433J5948387J7812011J8761187
3979A46850610J8605476J7124299J4556112J1391684P879755M519629J782068
3972B22709633l69293j763547k305344k247362j433602l11324O77502J400348
3964B16357011J365554L92915j403963m036080p039858r963315j2339635j4240709
3956A69091920j5328209j5661761j5222967j4339768j3151658j1669463j0137175
3949G3580919q693027p341532o064022n081722m225012l581353l055368k591174
$$ plain form
3941 32947709 30739683 28973833 27443358 26003769 24780085 23890453 23076378 22351408 21670949
3932 21670949 21169311 20720513 20181722 19806737 19542991 19153828 18886390 18594354 18334909
3923 18334909 18117117 17854452 17643012 17435265 17294289 17123384 16931515 16896811 16848325 16775943
3913 16775943 16718761 16650003 16676153 16574336 16619561 16739755 16824427 16905408 16876593 16908121 16996859
3902 16996859 16995689 17049783 17074400 17123386 17253900 17298147 17435975 17563920 17802948 18106756
3892 18106756 18389394 18694229 19119785 19508331 19944374 20464730 21050427 21723898 22433964
3883 22433964 23178779 23982707 24910785 25886219 26801702 27654940 28586239 29351168 30138963
3874 30138963 30940066 31809324 32616555 33390880 34334540 35355960 36340657 37248576 38066638
$$ packed form
3941C2947709k208026j765850j530475j439589j223684q89632q14075p24970o80459
3932B1670949n01638m48798n38791l74985k63746l89163k67438k92036k59445
3923A8334909k17792k62665k11440k07747j40976j70905j91869l4704m8486p2382
3913A6775943n7182o8758K6150j01817M5225J20194Q4672Q0981k8815L1528Q8738
3902A6996859j170N4094K4617M8986J30514M4247J37828J27945K39028L03808
3892A8106756K82638L04835M25556L88546M36043N20356N85697O73471P10066
3883B2433964P44815Q03928R28078R75434R15483Q53238R31299P64929P87795
3874C0138963Q01103Q69258Q07231P74325R43660J021420R84697R07919Q18062
$$ plain form
3865 38066638 38908723 39480093 40015854 40404118 40532546 40710429 40768980 40777413 40805043 40845225
3855 40845225 40904549 40917609 40874229 40780005 40634852 40441353 40317670 40087786 39908630 39688128
3845 39688128 39561976 39486089 39474303 39706290 40007528 40473375 41186910 42012666 43063840 44306579
3835 44306579 45769564 47614737 49838458 52614275 55824832 59621907 63956906 69029819
3827 69029819 74980962 81757703 89543801 98540102 108888909 121182547 135728537 152962792
3819 152962792 173065228 195502226 219424684 243754890 267551026 289956605 310064739
3812 310064739 327250926 341543992 353066688 362282754 369939982 376672882 383172087 389869919
3804 389869919 397218478 405343394 414268094 423525231 432419549 439553195 443699892 443623808
$$ packed form
3865C8066638Q42085N71370N35761L88264J28428J77883N8551Q433K7630M0182
3855D0845225N9324J3060m3380r4224j45153j93499j23683k29884j79156k20502
3845C9688128j26152p5887j1786K31987L01238M65847P13535Q25756J051174J242739
3835D4306579J462985J845173K223721K775817L210557L797075M334999N072913
3827F9029819N951143O776741P786098Q996301J0348807J2293638J4545990J7234255
3819A52962792K0102436K2436998K3922458K4330206K3796136K2405579K0108134
3812C10064739J7186187J4293066J1522696R216066P657228O732900O499205O697832
3804C89869919P348559Q124916Q924700R257137Q894318P133646M146697p6084
$$ plain form
3796 443623808 439227194 431046584 420068337 406991101 392789646 378516819 364766871
3789 364766871 352023725 340260741 329487330 319580412 310424219 301634944 292956719 283898149
3781 283898149 274270715 264118542 253408816 242190597 230761557 219330075 208224788
3774 208224788 197608566 187467942 177840715 168694038 159892610 151386702 143063981 134788733
3766 134788733 126467433 118226298 110039559 102044697 94254688 86821307 79905148 73554863
3758 73554863 67918619 62916915 58537250 54845033 51612051 48862759 46583673 44785855
3750 44785855 43321421 42218174 41500252 40995461 40660547 40394925 40213736 39998103 39682658
3741 39682658 39379756 39023034 38630896 38306233 38075910 38048425 38127315 38360819 38542792 38776176
$$ packed form
3796D43623808m396614q180610j0978247j3077236j4201455j4272827j3749948
3789C64766871j2743146j1762984j0773411r906918r156193q789275q678225r058570
3781B83898149r627434j0152173j0709726j1218219j1429040j1431482j1105287
3774B08224788j0616222j0140624r627227r146677q801428q505908q322721q275248
3766A34788733q321300q241135q186739p994862p790009p433381o916159o350285
3758G3554863n636244n001704m379665l692217l232982k749292k279086j797818
3750D4785855j464434j103247p17922n04791l34914k65622j81189k15633l15445
3741C9682658l02902l56722l92138l24663k30323k7485P8890K33504J81973K33384
$$ plain form
3731 38776176 39087169 39393923 39445592 39304610 39090427 38632803 38009681 37134600 36225850 35193756
3721 35193756 34123479 33127705 32187701 31199689 30286417 29467450 28685560 27892235 27001205
3712 27001205 26092287 25215735 24148408 23113887 22058008 21104765 20174808 19208566 18323164
3703 18323164 17418474 16565484 15820243 15157267 14588551 14149020 13712849 13297624 12944683
3694 12944683 12709114 12427415 12170579 11998914 11780307 11564146 11320474 11156016 11048681
3685 11048681 10824006 10656913 10449601 10284986 10125112 9896300 9779542 9700474 9617150 9509013
3675 9509013 9384273 9264116 9153707 9050894 8913381 8727024 8515979 8386553 8266599 8153757
3665 8153757 8004517 7901084 7742521 7590146 7425697 7262927 7190784 7094999 7011532 6919700
$$ packed form
3731C8776176L10993L06754N1669j40982k14183m57624o23122q75081r08750j032094
3721C5193756j070277r95774r40004r88012r13272q18967p81890p93325q91030
3712B7001205r08918q76552j067327j034521j055879r53243r29957r66242q85402
3703A8323164r04690q52990p45241o62976n68716m39531m36171m15225l52941
3694A2944683k35569k81699k56836j71665k18607k16161k43672j64458j07335
3685A1048681k24675j67093k07312j64615j59874k28812j16758p9068q3324j08137
3675I509013j24740j20157j10409j02813j37513j86357k11045j29426j19954j12842
3665H153757j49240j03433j58563j52375j64449j62770p2143r5785q3467r1832
$$ plain form
3655 6919700 6853970 6736014 6715906 6769891 6748540 6685789 6586248 6473947 6411376 6394309 6307030
3644 6307030 6172999 6115244 6087681 6008944 5989938 6004188 5975371 5905555 5984392 5977024 5964696
3633 5964696 5960025 5986892 5980348 5952797 5898004 5847137 5974675 6012700 5992593 5951156 5913180 5999984
3621 5999984 5984850 5954567 5950135 5990257 6045348 6082233 6077601 6179264 6112555 6133106 6241137
3610 6241137 6247352 6268132 6218185 6220379 6182904 6155838 6197039 6213920 6229396 6306752 6313583 6353817
3598 6353817 6410870 6465003 6530927 6566104 6657314 6757529 6805145 6887243 6902419 6939793 6990545
3587 6990545 7009455 6993486 7134243 7240536 7290839 7348323 7435545 7439937 7408815 7516673 7656608
3576 7656608 7745039 7840504 7906385 7947631 8040718 8156650 8219110 8338812 8357905 8476963 8594974
$$ packed form
3655F919700o5730j17956k0108N3985k1351o2751r9541j12301o2571j7067q7279
3644F307030j34031n7755k7563p8737j9006J4250k8817o9816P8837p368j2328
3633E964696m671K6867o544k7551n4793n0867J27538L8025k0107m1437l7976Q6804
3621E999984j5134l0283m432M0122N5091L6885m632J01663o6709K0551J08031
3610F241137O215K0780m9947K194l7475k7066M1201J6881J5476P7356O831M0234
3598F353817N7053N4133O5924L5177R1210J00215M7616Q2098J5176L7374N0752
3587F990545J8910j5969J40757J06293N0303N7484Q7222M392l1122J07858J39935
3576G656608Q8431R5465O5881M1246R3087J15932O2460J19702J9093J19058J18011
$$ plain form
3565 8594974 8634808 8664377 8765357 8885948 8939437 9057138 9106051 9220107 9317249 9316543 9280286
3554 9280286 9348507 9425193 9462127 9556810 9637327 9664995 9707375 9704634 9731847 9773399 9754821 9798246
3542 9798246 9935257 9951110 9981548 10133656 10144648 10181070 10249132 10285230 10361446 10477973 10494805
3531 10494805 10519738 10633828 10739259 10786235 10903965 10995445 11074804 11168434 11223915 11345913
3521 11345913 11412084 11391803 11315498 11333709 11290372 11283686 11170823 11176140 11195739 11089601 11103753
3510 11103753 11062828 10991521 10935023 10852930 10777996 10703402 10575603 10380873 10182809 10112800 10050306
3499 10050306 9887157 9690586 9566156 9466209 9389928 9223362 9131242 9046571 8937092 8821658
3489 8821658 8814380 8739134 8609010 8526717 8355020 8300407 8247863 8157270 8125131 8085629 8059339
$$ packed form
3565H594974L9834K9569J00980J20591N3489J17701M8913J14056R7142p06l6257
3554I280286O8221P6686L6934R4683Q0517K7668M2380k741K7213M1552j8578M3425
3542I798246J37011J5853L0438J52108J0992L6422O8062L6098P6216J16527J6832
3531A0494805K4933J14090J05431M6976J17730R1480P9359R3630N5481J21998
3521A1345913O6171k0281p6305J8211m3337o686j12863N317J9599j06138J4152
3510A1103753m0925p1307n6498q2093p4934p4594j27799j94730j98064p0009o2494
3499A0050306j63149j96571j24430r9947p6281j66566r2120q4671j09479j15434
3489H821658p278p5246j30124q2293j71697n4613n2544r0593l2139l9502k6290
$$ plain form
3478 8059339 7993866 7816147 7775613 7740324 7736858 7756584 7653547 7614306 7619190 7582781 7611498
3467 7611498 7609604 7632947 7661266 7719078 7771288 7881381 8013997 8104949 8197406 8272582 8390275
3456 8390275 8473302 8614080 8762984 8806450 8820941 8773774 8684925 8542473 8358299 8107557
3446 8107557 7775582 7455398 7214539 6854320 6551261 6411331 6247489 6001328 5798492 5526781
3436 5526781 5358266 5323439 5165281 5009482 4852418 4643266 4538913 4480537 4402524 4298123
3426 4298123 4160450 4111859 4107917 3974460 3913178 3896490 3787904 3703049 3577326 3567043 3554418
3415 3554418 3467875 3377324 3398647 3360308 3337747 3246505 3205803 3108153 3116618 3134695 3056309 3024507
3403 3024507 2955351 2879923 2883108 2812808 2735213 2699974 2629509 2615911 2579442 2588067 2558938 2589490
$$ packed form
3478H059339o5473j77719m0534l5289l466J9726j03037l9241M884l6409K8717
3467G611498j894K3343K8319N7812N2210J10093J32616R0952R2457P5176J17693
3456H390275Q3027J40778J48904M3466J4491m7167q8849j42452j84174k50742
3446H107557l31975l20184k40859l60219l03059j39930j63842k46161k02836k71711
3436E526781j68515l4827j58158j55799j57064k09152j04353n8376p8013j04401
3426D298123j37673m8591l942j33457o1282j6688j08586q4855j25723j0283j2625
3415C554418q6543r0551K1323l8339k2561r1242m0702r7650Q465J8077p8386l1802
3403C024507o9156p5428L185p0300p7595l5239p0465j3598l6469Q625k9129L0552
$$ plain form
3391 2589490 2501263 2440619 2419311 2397298 2327735 2313174 2345488 2342047 2345575 2314352 2336528 2332429
3379 2332429 2323323 2335544 2300103 2242628 2224616 2184077 2214022 2186975 2110855 2066096 2043785 2071065
3367 2071065 2021251 1943809 1901008 1939813 1922427 1865844 1790887 1713238 1704361 1698555 1729756 1668146
3355 1668146 1691632 1736074 1767723 1772230 1772947 1779961 1778145 1675893 1722090 1827411 1815532 1776370
3343 1776370 1765816 1772719 1722300 1745126 1697439 1711412 1790871 1921933 2056709 2168621 2233565
3332 2233565 2163878 2135735 2194487 2150729 2040739 1894372 1781558 1709206 1629118 1514671 1497816
3321 1497816 1451136 1434574 1490720 1455377 1465365 1454760 1359987 1367216 1455730 1471984 1453606 1437605
3309 1437605 1514827 1681974 1765522 1889259 1991372 2046216 2007394 1928087 1887940 1781837 1653861
$$ packed form
3391B589490q8227o0644k1308k2013o9563j4561L2314l441L528l1223K2176m099
3379B332429r106J2221l5441n7475j8012m0539K9945k7047p6120m4759k2311K7280
3367B071065m9814p7442m2801L8805j7386n6583p4957p7649q877n806L1201o1610
3355A668146K3486M4442L1649M507P17P014j816j02252M6197J05321j1879l9162
3343A776370j0554O903n0419K2826m7687J3973P9459J31062J34776J11912O4944
3332B233565o9687k8143N8752m3758j09990j46367j12814p2352q0088j14447j6855
3321A497816m6680j6562N6146l5343R988j0605r4773P229Q8514J6254j8378j6001
3309A437605P7222J67147Q3548J23737J02113N4844l8822p9307m0147j06103j27976
$$ plain form
3298 1653861 1568096 1460272 1433678 1400932 1237671 1237220 1269190 1254649 1230865 1133862 1112276
3287 1112276 1047418 1090690 1134532 1109254 1111746 1119767 1157310 1130726 1103057 1108484 1143640 1134759
3275 1134759 1118066 977954 940785 1002257 962102 1002595 960821 954688 963924 882814 857518 920711
3263 920711 919608 966129 949335 904231 956558 1004180 976375 905461 901812 907545 923016 975399
3251 975399 1002422 983883 982345 884497 890192 905744 885050 910348 1023774 978214 970969 935094
3239 935094 858635 792707 775992 790460 740521 755506 734941 733820 684145 617280 668932 680493
3227 680493 770372 797545 788628 700163 674375 774540 863503 844522 817033 841521 835913 794847
3215 794847 771706 737595 693950 731989 821085 895708 891651 880355 840078 835879 852293 875734
$$ packed form
3298A653861q5765j07824k6594l2746j63261m51L1970j4541k3784r7003k1586
3287A112276o4858M3272M3842k5278K492Q021L7543k6584k7669N427L5156q881
3275A134759j6693j40112l7169O1472m0155M0493m1774o133R236q1110k5296O3193
3263I20711j103M6521j6794m5104N2327M7622k7805p0914l649N733J5471N2383
3251I75399K7023j8539j538r7848N695J5552k0694K5298J13426m5560p245l5875
3239I35094p6459o5928j6715J4468m9939J4985k0565j121m9675o6865N1652J1561
3227F80493Q9879K7173q917q8465k5788J00165Q8963j8981k7489K4488n608m1066
3215G94847k3141l4111m3645L8039Q9096P4623m057j1296m0277m199J6414K3441
$$ plain form
3203 875734 798970 735691 824104 863818 858208 851083 801233 754074 736777 777700 794437 794194
3191 794194 850773 876253 809451 764628 798005 845849 855464 854495 916661 932306 871104 888323
3179 888323 883230 890268 907653 902423 828730 899917 868731 821098 845608 867888 803237 910474
3167 910474 1003405 928900 893292 869541 899191 894068 946522 990222 942365 1006367 1034780 993908
3155 993908 1022890 1038520 1051477 1142289 1209245 1228722 1185233 1232919 1261097 1226075 1286855 1335933
3143 1335933 1336194 1391060 1402397 1464930 1518681 1463644 1430022 1422669 1440346 1467716 1538060 1565770
3131 1565770 1577098 1537522 1529230 1541533 1543984 1563539 1626524 1647557 1645921 1657246 1721937 1750909
3119 1750909 1807285 1975662 2107234 2266072 2397882 2453660 2533879 2516997 2440851 2428719 2397414
$$ packed form
3203H75734p6764o3279Q8413L9714n610p125m9850m7159j7297M0923J6737k43
3191G94194N6579K5480o6802m4823L3377M7844R615r69O2166J5645o1202J7219
3179H88323n093P038J7385n230p3693P1187l1186m7633K4510K2280o4651J07237
3167I10474R2931p4505l5608k3751K9650n123N2454M3700m7857O4002K8413m0872
3155I93908K8982J5630J2957R0812O6956J9477m3489M7686K8178l5022O0780M9078
3143A335933K61N4866J1337O2533N3751n5037l3622p353J7677K7370P0344K7710
3131A565770J1328l9576q292J2303K451J9555O2985K1033j636J1325O4691K8972
3119A750909N6376J68377J31572J58838J31810N5778Q0219j6882p6146j2132l1305
$$ plain form
3108 2397414 2243398 2154334 2103922 1963419 1829706 1745850 1666305 1675031 1642395 1609948 1682208
3097 1682208 1656207 1738129 1787622 1726501 1782453 1850875 1886471 1950480 1947293 1997269 2044479 1965827
3085 1965827 2005865 2028146 2066909 2092915 2056016 1980596 1966826 1932735 1861085 1781445 1709809
3074 1709809 1632746 1591363 1582393 1599596 1484791 1453283 1431036 1408548 1388345 1337418 1310355
3063 1310355 1253128 1278657 1273093 1230915 1198138 1186207 1204756 1239136 1189983 1094614 989318
3052 989318 1007445 1093338 1009669 978198 916741 846616 847763 848004 840567 763714 764163 818753 842020
3039 842020 764597 664310 652541 696274 674983 750892 773458 729769 728184 690300 671106 662093
3027 662093 617344 622652 664942 639436 644982 564381 523655 550983 551790 551698 550601 532216 474396
$$ packed form
3108B397414j54016q9064n0412j40503j33713q3856p9545Q726l2636l2447P2260
3097A682208k6001Q1922M9493o1121N5952O8422L5596O4009l187M9976M7210p8652
3085A965827M0038K2281L8763K6006l6899p5420j3770l4091p1650p9640p1636
3074A709809p7063m1383q970J7203j14805l1508k2247k2488k0203n0927k7063
3063A310355n7227K5529n564m2178l2777j1931J8549L4380m9153r5369j05296
3052I89318J8127Q5893q3669l1471o1457p0125J147K41p437p6853M49N4590K3267
3039H42020p7423j00287j1769M3733k1291P5909K2566m3689j585l7884j9194r013
3027F62093m4749N308M2290k5506N546q0601m0726K7328Q07r2j097j8385n7820
$$ plain form
3014 474396 446414 437839 458057 481084 435071 385913 421655 448520 466746 454608 382456 368517
3002 368517 401073 373484 366278 374799 363467 344172 340925 342843 339360 345792 329431 321657 381878
2989 381878 307442 377471 425034 347938 296254 320594 296849 302878 308371 349763 264930 213078
2977 213078 287908 247338 243761 303516 295262 287756 195531 118279 189515 246489 279978 252093
2965 252093 230774 274872 330661 337902 363393 272219 190361 231254 310232 296025 307829 285825
2953 285825 223250 241463 162484 154045 179420 159973 168181 231393 260625 186194 192551 199500
2941 199500 201977 181224 198208 192399 238034 294435 225300 148953 158525 146200 194324 165246
2929 165246 107140 149268 112222 113982 138979 131840 160703 91531 135099 146530 109182 150738
$$ packed form
3014D74396k7982q575K0218K3027m6013m9158L5742K6865J8226j2138p2152j3939
3002C68517L2556k7589p206Q521j1332j9295l247J918l483O432j6361p774O0221
2989C81878p4436P0029M7563p7096n1684K4340k3745O029N493M1392q4833n1852
2977B13078P4830m0570l577N9755q254p506r2225p7252P1236N6974L3489k7885
2965B52093k1319M4098N5789P241K5491r1174q1858M0893P8978j4207J1804k2004
2953B85825o2575J8213p8979q439K5375j9447Q208O3212K9232p4431O357O949
2941A99500K477k0753J6984n809M5635N6401o9135p6347R572j2325M8124k9078
2929A65246n8106M2128l7046J760K4997p139K8863o9172M3568J1431l7348M1556
$$ plain form
2917 150738 154482 146433 35634 116976 194911 156258 59678 44477 83715 58576 120091 123330
2905 123330 83428 76442 121045 158725 139473 140684 111399 153561 218046 192037 145623 69169
2893 69169 126457 134684 121227 93332 45741 22727 77127 93529 57437 17247 37017 97387
2881 97387 108013 65998 95545 87592 117709 114005 60902 120552 101182 64846 26932 117366
2869 117366 162194 123004 101240 110480 22990 -5198 64230 84037 62450 37992 63552 109136
2857 109136 143773 169792 104805 75563 136398 150901 105238 66940 80911 150562 94806 24652
2845 24652 39197 -15156 -31303 14843 95023 55390 75893 88805 144187 159189 137958 86636
2833 86636 106125 87686 87840 137852 106776 163271 90552 129486 65983 35251 73897 50327
$$ packed form
2917A50738L744q049j10799Q1342P7935l8653r6580j5201L9238k5139O1515L239
2905A23330l9902o986M4603L7680j9252J211k9285M2162O4485k6009m6414p6454
2893F9169N7288Q227j3457k7895m7591k3014N4400J6402l6092m0190J9770O0370
2881I7387J0626m2015K9547p953L0117l704n3103N9650j9370l6336l7914R0434
2869A17366M4828l9190k1764R240q7490k8188O9428J9807k1587k4458K5560M5584
2857A09136L4637K6019o4987k9242O0835J4503m5663l8298J3971O9651n5756p0154
2845B4652J4545n4353j6147M6146Q0180l9633K0503J2912N5382J5002k1231n1322
2833H6636J9489j8439J54N0012l1076N6495p2719L8934o3503l0732L8646k3570
$$ plain form
2821 50327 9785 67556 64238 123749 91666 13356 82467 32821 -31170 29113 89929 116748
2809 116748 99291 43835 67165 -9119 22241 51311 68708 72325 110435 31987 -49078 -26017
2797 -26017 71923 41687 -37051 -25056 40993 112345 49857 9434 7308 19184 -48786 -30925
2785 -30925 -4011 47240 58189 16566 -9953 26711 99322 130193 143264 117390 116198 158927
2773 158927 102525 92800 94484 93018 117103 38455 27312 98702 101459 11152 -35673 -91055
2761 -91055 -92312 -13840 26106 29113 -48933 -104496 -96578 -97104 -24352 -34676 -23839 55368 67027
2748 67027 90993 42038 3117 16611 86234 53191 54353 9161 -43540 20491 -44671 -64057
2736 -64057 -48788 -52907 42676 68392 109679 80830 -21183 -11928 29111 26242 26209 476 -86410
$$ packed form
2821E0327m0542N7771l318N9511l2083p8310O9111m9646o3991O0283O0816K6819
2809A16748j7457n5456K3330p6284L1360K9070J7397L617L8110p8448q1065K3061
2797b6017R7940l0236p8738J1995O6049P1352o2488m0423k126J1876o7970J7861
2785c0925K6914N1251J0949m1623k6519L6664P2611L0871J3071k5874j192M2729
2773A58927n6402r725J684j466K4085p8648j1143P1390K757r0307m6825n5382
2761i1055j257P8472L9946L007p8046n5563P918n26P2752j0324J0837P9207J1659
2748F7027K3966m8955l8921J3494O9623l3043J162m5192n2701O4031o5162j9386
2736f4057J5269m119R5583K5716M1287k8849j02013R255M1039k869l3k5733q6886
$$ plain form
2723 -86410 -81098 -65470 -118726 -98742 -113043 -39894 20511 -3756 33610 43904 -20861 -24067
2711 -24067 -5179 -9281 52695 31011 7104 69405 123136 85029 11990 -44241 -6445 42899
2699 42899 18037 -43196 -107202 -78208 -83967 -71170 -61941 -69845 -4324 47750 79056 54674
2687 54674 23901 -3260 -4486 -54841 -34187 20979 58618 8100 20136 33528 76107 14414
2675 14414 53903 55460 -3468 9736 106446 65387 59624 116664 72093 115013 181083 161336
2663 161336 75793 20012 55117 28350 -12043 7966 -25905 -6557 -2754 -64920 -75427 15153
2651 15153 -15501 21619 49030 21181 -848 313 27913 60785 91308 67131 105149 136018
2639 136018 141302 89714 -6607 -23331 33668 120639 82449 40526 21792 -896 -40761 -42587
$$ packed form
2723h6410N312J5628n3256J9984j4301P3149O0405k4267L7366J0294o4765l206
2711b4067J8888m102O1976k1684k3907O2301N3731l8107p3039n6231L7796M9344
2699D2899k4862o1233o4006K8994n759J2797R229p904O5521N2074L1306k4382
2687E4674l0773k7161j226n0355K0654N5166L7639n0518J2036J3392M2579o1693
2675A4414L9489J557n8928J3204R6710m1059n763N7040m4571M2920O6070j9747
2663A61336q5543n5781L5105k6767m0393K0009l3871J9348L803o2166j0507R0580
2651A5153l0654L7120K7411k7849k2029J161K7600L2872L0523k4177L8018L0869
2639A36018N284n1588r6321j6724N6999Q6971l8190m1923j8734k2688l9865j826
$$ plain form
2627 -42587 -68879 -9048 20666 -10290 53840 12074 -12184 26081 -44790 -27226 -44726 -68331
2615 -68331 18160 45411 -40705 21486 -13108 -12525 61057 53743 32524 107830 96329 37799
2603 37799 9882 39681 118362 136755 167655 172009 103412 10366 29379 37016 -18436 -44969
2591 -44969 -909 28680 90038 28140 5087 26120 16742 24735 107778 166948 201234 219815
2579 219815 262702 304742 251882 198058 127956 131249 94957 85542 66453 -47832 -72841 28295
2567 28295 85359 34142 12472 39674 91490 80136 129408 83343 65116 108187 71761 77110
2555 77110 42270 -53898 -128843 -99637 -121093 -43526 -72528 -119462 -66322 -75573 -8643 17366
2543 17366 -20717 -48505 -60290 -87169 -68322 -32356 -50778 -2000 60573 -26903 -27645 -7521
$$ packed form
2627d2587k6292N9831K9714l0956O4130m1766k4258L8265p0871J7564j7500k3605
2615f8331Q6491K7251q6116O2191l4594N83P3582p314k1219P5306j1501n8530
2603C7799k7917K9799P8681J8393L0900M354o8597r3046J9013P637n5452k6533
2591d4969M4060K9589O1358o1898k3053K1033r378P993Q3043N9170L4286J8581
2579B19815M2887M2040n2860n3824p0102L293l6292r415j9089j14285k5009J01136
2567B8295N7064n1217k1670K7202N1816j1354M9272m6065j8227M3071l6426N349
2555G7110l4840r6168p4945K9206k1456P7567k9002m6934N3140r251O6930K6009
2543A7366l8083k7788j1785k6879J8847L5966j8422M8778O2573q7476p42K0124
$$ plain form
2531 -7521 -39397 -34673 -50494 -100761 -125290 -84238 -45675 -24974 2521 -15327 -31209 -30925 -63537
2518 -63537 -115657 -113721 -101883 -63558 1186 9542 -589 -64335 -48662 25211 -29719 45780
2506 45780 54522 -48942 -39999 -3097 -114494 -86545 -143509 -97968 7748 -12173 33687 86683
2494 86683 68157 41240 -38524 7352 65159 -2370 25586 -29843 -78850 -54005 -44635 -42521
2482 -42521 30180 -46490 -79998 -34347 53333 10465 -30185 -71521 10468 43422 82826 -864
2470 -864 -44748 24373 7553 -18028 13819 3750 -8183 60038 72065 73665 52947 62676 107563
2457 107563 89959 82194 139356 75372 59754 62821 89818 99671 48395 -930 46748 76754
2445 76754 18142 47620 53445 21191 55637 51672 71816 123292 127113 155574 221553 183824
$$ packed form
2531g521l1876M724j5821n0267k4529M1052L8563K0701K7495j7848j5882K84l2612
2518f3537n2120J936J1838L8325O4744Q356j0131o3746J5673P3873n4930P5499
2506D5780Q742j03464Q943L6902j11397K7949n6964M5541J05716j9921M5860N2996
2494H6683j8526k6917p9764M5876N7807o7529K7956n5429m9007K4845R370K114
2482d2521P2701p6670l3508M5651Q7680m2868m0650m1336Q1989L2954L9404q3690
2470h64m3884O9121j6820k5581L1847j0069j1933O8221J2027J600k0718R729M4887
2457A07563j7604p765N7162o3984j5618L067K6997R853n1276m9325M7678L0006
2445G6754n8612K9478N825l2254L4446l965K0144N1476L821K8461O5979l7729
$$ plain form
2433 183824 206966 208183 199130 233767 235839 251783 203696 192618 223587 202941 220989 179263
2421 179263 198592 188639 117556 146042 119618 170273 203995 147987 80179 65756 65840 74265 170028
2408 170028 241506 234586 266168 236659 203821 155896 186492 242381 270629 238888 254286 200771
2396 200771 265347 287522 270824 325653 340983 357837 341918 256243 197555 259220 247700 258653
2384 258653 268550 330493 347968 387497 379905 343198 302009 384150 358042 312281 339188 398120
2372 398120 440042 417767 314585 317899 354766 367646 446405 446134 499471 445944 454886 563617
2360 563617 522043 451055 477343 512214 520461 534199 596123 582105 566838 649377 730047 738960
2348 738960 675244 668847 702030 764901 784018 804487 853664 882537 979963 1050934 1028342 1061817
$$ packed form
2433A83824K3142J217r053L4637K072J5944m8087j1078L0969k0646J8048m1726
2421A79263J9329r953p1083K8486k6424N0655L3722n6008o7808j4423Q4Q425R5763
2408A70028P1478o920L1582k9509l2838m7925L0596N5889K8248l1741J5398n3515
2396B00771O4576K2175j6698N4829J5330J6854j5919q5675n8688O1665j1520J0953
2384B58653R897O1943J7475L9529p592l6707m1189Q2141k6108m5761K6907N8932
2372C98120M1922k2275j03182L314L6867J2880P8759k71N3337n3527Q942J08731
2360E63617m1574p0988K6288L4871Q247J3738O1924j4018j5267Q2539Q0670Q913
2348G38960o3716o397L3183O2871J9117K0469M9177K8873R7426P0971k2592L3475
$$ plain form
2336 1061817 1160205 1291271 1462115 1622483 1847887 2100672 2459358 2829271 3167499 3467262
2326 3467262 3691274 4031131 4268703 4677489 5211398 5953267 6912869 8289891 10751774
2317 10751774 15794193 22735629 30386134 36502736 39537423 39416274 38438001 36759017
2309 36759017 32648674 28251325 23884337 19828435 16262998 13221060 10361596 8150675
2301 8150675 6798754 6052259 5537747 5088200 4528115 4066286 3689683 3371321 3029412
2292 3029412 2735917 2537434 2328857 2091304 1871393 1787760 1646950 1603228 1565717 1490951
2282 1490951 1440555 1381621 1260652 1189691 1165158 1068359 999122 938604 944468 969731 902359
2271 902359 824518 721338 707929 708814 729696 705142 651990 680057 666940 629276 615600 619373
$$ packed form
2336A061817R8388J31066J70844J60368K25404K52785L58686L69913L38228K99763
2326C467262K24012L39857K37572M08786N33909P41869R59602J377022K461883
2317A0751774N042419O941436P650505O116602L034687j21149r78273j678984
2309C6759017m110343m397349m366988m055902l565437l041938k859464k210921
2301H150675j351921p46495n14512m49547n60085m61829l76603l18362l41909
2292C029412k93495j98483k08577k37553k19911q3633j40810m3722l7511p4766
2282A490951n0396n8934j20969p0961k4533r6799o9237o0518N864K5263o7372
2271I02359p7841j03180j3409Q85K0882k4554n3152K8067j3117l7664j3676L773
$$ plain form
2259 619373 618205 662314 610711 610355 604277 584364 566845 474744 478020 539767 513368 503474 477116
2246 477116 408583 382260 363326 276370 311230 344989 366013 366252 383908 361153 325626 214173
2234 214173 164819 286548 325610 297654 317602 321894 251450 267747 290024 277209 343942 400321
2222 400321 272573 227731 312642 297595 251534 245186 254231 299199 306516 335344 277394 245416
2210 245416 222273 281846 287087 246588 205903 216791 185443 125614 113377 162808 153926 153236
2198 153236 167132 199484 177154 161477 126896 152776 118906 154850 128615 175378 240966 209427
2186 209427 203072 91115 49004 80732 167196 65115 25580 55132 26420 33134 -42088 6374
2174 6374 9925 -41913 8383 64383 42439 59536 49735 32218 110780 104036 103702 172133 136234
$$ packed form
2259F19373j168M4109n1603l56o078j9913j7519r2101L276O1747k6399r894k6358
2246D77116o8533k6323j8934q6956L4860L3759K1024K39J7656k2755l5527j11453
2234B14173m9354J21729L9062k7956J9948M292p0444J6297K2277j2815O6733N6379
2222D00321j27748m4842Q4911j5047m6061o348R045M4968P317K8828n7950l1978
2210B45416k3143N9573N241m0499m0685J0888l1348n9829j2237M9431q882o90
2198A53236J3896L2352k2330j5677l4581K5880l3870L5944k6235M6763O5588l1539
2186B09427o355j11957m2111L1728Q6464j02081l9535K9552k8712O714p5222M8462
2174F374L551n1838N0296N6000k1944J7097r801j7517P8562o744l34O8431l5899
$$ plain form
2161 136234 70981 29251 61133 50767 44143 52394 15158 32783 33953 -2802 -10738 36092
2149 36092 -35548 26849 49080 -14340 -42693 -58759 -63907 -19161 -1968 -56942 -104315 -89529
2137 -89529 -37593 -1924 -16409 5699 -39100 19742 62795 24247 -23255 49059 32201 61561
2125 61561 112740 105927 58043 -29884 -1562 35829 26344 -9288 -25270 -71015 -67788 -99236
2113 -99236 -110915 -134055 -152301 -131682 -87740 -134834 -89037 -41925 -99467 -104071 -77391 -20695
2101 -20695 -17920 -113522 -108676 -60373 -66809 -28319 -37809 -94148 -145388 -129858 -52999 -10918 -53316
2088 -53316 14957 31479 24456 -44921 -65898 -68801 -16575 -34676 41194 100149 16375 11602
2076 11602 -28715 27794 12142 58799 99882 66439 46181 49268 -27874 -72906 -9308 50475
$$ packed form
2161A36234o5253m1730L1882j0366o624Q251l7236J7625J170l6755p936M6830
2149C6092p1640O2397K2231o3420k8353j6066n148M4746J7193n4974m7373J4786
2137h9529N1936L5669j4485K2108m4799N8842M3053l8548m7502P2314j6858K9360
2125F1561N1179o813m7884q7927K8322L7391r485l5632j5982m5745L227l1448
2113i9236j1679k3140j8246K0619M3942m7094M5797M7112n7542m604K6680N6696
2101b0695K775r5602M846M8303o436L8490r490n6339n1240J5530P6859M2081m2398
2088e3316O8273J6522p023o9377k0977k903N2226j8101P5870N8955q3774m773
2076A1602m0317N6509j5652M6657M1083l3443k0258L087p7142m5032O3598N9783
$$ plain form
2064 50475 144945 139769 87921 96301 64036 48683 92411 102354 152486 75657 -6807 35479
2052 35479 78947 -55813 -9275 76777 96365 166495 147783 141701 188782 196409 149777 207102
2040 207102 213861 242203 138484 148669 175900 160415 132672 101811 73086 177746 149741
2029 149741 89313 161567 102945 78950 102615 91359 44337 4837 47199 155073 65896
2018 65896 84330 117747 68838 121368 80502 75299 32012 -12451 13399 63103 -14410 -31181
2006 -31181 -24854 -49852 -54144 -12761 6502 -36886 27872 25360 16341 -1480 -277 51679 54220
1993 54220 76293 67313 82555 44539 70314 69713 71495 45222 61055 22091 21615 62846 -48063
1980 -48063 3267 11732 -10247 -2693 36405 -33239 19517 2518 -1580 10744 -43287 -13335
$$ packed form
2064E0475R4470n176n1848Q380l2265j5353M3728R943N0132p6829q2464M2286
2052C5479M3468j34760M6538Q6052J9588P0130j8712o082M7081P627m6632N7325
2040B07102O759K8342j03719J0185K7231j5485k7743l0861k8725J04660k8005
2029A49741o0428P2254n8622k3995K3665j1256m7022l9500M2362J07874q9177
2018F5896J8434L3417m8909N2530m0866n203m3287m4463K5850M9704p7513j6771
2006c1181O327k4998m292M1383J9263m3388O4758k512r019j7821J203N1956K541
1993E4220K2073q980J5242l8016K5775o01J782k6273J5833l8964m76M1231j10909
1980d8063N1330Q465k1979P554L9098o9644N2756j6999m098J2324n4031K9952
$$ plain form
1968 -13335 -63592 -69846 -23104 -138338 -189283 -118030 -111469 -39898 -13535 -9785 -9855 -10196 -26967
1955 -26967 -66179 -99962 -36346 -56773 -96641 -87983 -139976 -118352 -166785 -146459 -53469 -33128
1943 -33128 -50862 -48547 -72134 -137852 -183092 -135370 -68806 51940 56359 -25508 -45513 -77428
1931 -77428 -47314 -88471 -70113 4124 -56046 -58330 -116837 -108234 -80464 -135072 -152517 -88407
1919 -88407 -68397 -41563 41336 -19499 -47954 -94129 -46853 7267 -28479 29962 83580 -16001
1907 -16001 -73008 -43608 -8691 -54241 -96452 -64561 -77702 8777 107476 106479 -10093 18347
1895 18347 61099 -35144 -119736 -69766 -12347 -11841 -22349 -74989 -87304 -62944 -16809 -17262 -74592
1882 -74592 -45349 -5507 -6978 -27396 -47633 25692 -38509 -32466 33038 15215 -17033 18247
$$ packed form
1968a3335n0257o254M6742j15234n0945P1253O561P1571K6363L750p0l41j6771
1955b6967l9212l3783O3616k0427l9868Q658n1993K1624m8433K0326R2990K0341
1943c3128j7734K315k3587o5718m5240M7722O6564J20746M419q1867k0005l1915
1931g7428L0114m1157J8358P4237o0170k284n8507Q603K7770n4608j7445O4110
1919h8407K0010K6834Q2899o0835k8455m6175M7276N4120l5746N8441N3618r9581
1907a6001n7007K9400L4917m5550m2211L1891j3141Q6479R8699r97j16572K8440
1895A8347M2752r6243q4592M9970N7419N06j0508n2640j2315K4360M6135m53n7330
1882g4592K9243L9842j471k0418k0237P3325o4201O043O5504j7823l2248L5280
$$ plain form
1870 18247 30656 56028 28159 -28060 -7394 -86520 -115253 -5016 18809 9335 16641 -9869
1858 -9869 -37789 -59938 -72538 -53258 -25620 36125 60074 84249 115511 102524 118726 105570
1846 105570 127688 92346 37684 56720 33012 48939 28258 -2853 -67549 -78875 -25548 9395
1834 9395 -35201 -75315 -58425 -16882 54444 46111 60103 10387 49634 18385 61236 100250
1822 100250 65526 23774 -1478 32603 39541 109438 126691 82236 32952 43110 108361 33249
1810 33249 -1111 8795 -16055 8035 44238 25284 32575 12763 69765 67174 19930 53049
1798 53049 -44382 -69696 -49219 -51418 -53753 -70754 -29222 57049 44697 39786 47728 -35001 -83188
1785 -83188 -45885 -44563 914 -46494 -60177 1046 67802 64818 8858 -13066 13140 13292 66137
$$ packed form
1870A8247J2409K5372k7869n6219K0666p9126k8733J10237K3825r474P306k6510
1858i869k7920k2149j2600J9280K7638O1745K3949K4175L1262j2987J6202j3156
1846A05570K2118l5342n4662J9036k3708J5927k0681l1111o4696j1326N3327L4943
1834I395m4596m0114J6890M1543P1326q333J3992m9716L9247l1249M2851L9014
1822A00250l4724m1752k5252L4081O938O9897J7253m4455m9284J0158O5251p5112
1810C3249l4360R906k4850K4090L6203j8954P291j9812N7002k591m7244L3119
1798E3049r7431k5314K0477k199k335j7001M1532Q6271j2352m911P942q2729m8187
1785h3188L7303J322M5477m7408j3683O1223O6756k984n5960k1924K6206J52N2845
$$ plain form
1772 66137 32357 -79712 -63327 -19096 -46759 -50015 -53808 -80441 -70317 -53433 -28853 -128855
1760 -128855 -88263 -79845 -84269 -57461 -69481 -139849 -133049 -141437 -70164 -51330 -59267 2415 -79069
1747 -79069 -125730 -108630 -26901 -52164 -43504 -27821 -29452 -72782 -54072 -21313 -38650 -83956
1735 -83956 -113044 -73324 -143623 -105248 -91306 -160586 -124450 -177795 -188420 -166496 -144236 -110645
1723 -110645 -66572 -114961 -84247 -44003 -69145 -7157 -28259 -24903 5697 60025 -35227 -60872
1711 -60872 -94772 -162556 -163624 -102346 -56883 -30537 -82552 -84877 -34994 -117849 -66209 -97632
1699 -97632 -128090 -68293 -19667 -71036 -80693 -108610 -88205 -41047 -79030 -76279 -10709 -24486
1687 -24486 -6744 63244 75892 43678 17503 57798 45938 125037 69269 31445 12932 -96211
$$ packed form
1772F6137l3780j12069J6385M4231k7663l256l793k6633J0124J6884K4580j00002
1760a28855M0592Q418m424K6808j2020p0368O800q388P1273J8834p937O1682q1484
1747g9069m6661J7100Q1729k5263Q660J5683j631m3330J8710L2759j7337m5306
1735h3956k9088L9720p0299L8375J3942o9280L6136n3345j0625K1924K2260L3591
1723a10645M4073m8389L0714M0244k5142O1988k1102L356L0600N4328r5252k5645
1711f0872l3900o7784j068O1278M5463K6346n2015k325M9883q2855N1640l1423
1699i7632l0458N9797M8626n1369r657k7917K0405M7158l7983K751O5570j3777
1687b4486J7742O9988J2648l2214k6175M0295j1860P9099n5768l7824j8513j09143
$$ plain form
1675 -96211 -76178 -97055 -119973 -112889 -88839 -93112 -109800 -126327 -88554 -57992 -66365 12620
1663 12620 6759 32462 70228 -23655 16752 5625 8041 -40461 -43894 23760 69102 39466
1651 39466 15832 5541 -40593 78366 118473 70619 26889 93219 107797 62185 107126 103197
1639 103197 97349 136847 78048 71564 6992 -12561 -29012 -74574 -61508 2519 6997 -58678
1627 -58678 -91373 -21987 3338 46329 96191 49986 103949 87314 99570 110244 78694 -9058
1615 -9058 52637 71602 114630 118192 43419 17044 8328 42121 3329 -42651 21492 42140
1603 42140 117505 156338 65416 6202 -115059 -43199 36923 63600 65023 92236 14347 60414
1591 60414 -13580 -79280 -35227 21865 40614 78745 33742 -61814 -33604 16084 23759 111220
$$ packed form
1675i6211K0033k0877k2918P084K4050m273j6688j6527L7773L0562q373P8985
1663A2620n861K5703L7766r3883M0407j1127K416m8502l433O7654M5342k9636
1651C9466k3634j0291m6134J18959M0107m7854m3730O6330J4578m5612M4941l929
1639A03197n848L9498n8799o484o4572j9553j6451m5562J3066O4027M478o5675
1627e8678l2695O9386K5325M2991M9862m6205N3963j6635J2256J0674l1550q7752
1615i058O1695J8965M3028L562p4773k6375q716L3793l8792m5980O4143K0648
1603D2140P5365L8833r0922n9214j21261P1860Q0122K6677J423K7213p7889M6067
1591F0414p3994o5700M4053N7092J8749L8131m5003r5556K8210M9688P675Q7461
$$ plain form
1579 111220 38847 -131712 -87617 -6834 42017 -8167 -50672 -69394 -23424 -23233 45489 -12201
1567 -12201 -72725 273 -29138 -24654 -24370 -74652 -115324 -126009 -113867 -60662 -49582 -54619 -54041
1554 -54041 -46666 -34100 -43049 -90070 -96382 -76782 3768 20567 27814 12456 -42198 5782 -32319
1541 -32319 -36480 -93859 -64702 -53889 -69626 -94921 -110838 -81413 -106051 -75482 -21503 -65004
1529 -65004 -116439 -125590 -70255 -26860 4866 -62412 -106645 -187042 -197765 -164722 -102345 -72215
1517 -72215 -103320 -92478 -77916 -46381 -10593 -18535 -54226 -22102 -35046 -74712 -33729 -99542
1505 -99542 -132559 -79092 -69941 -70059 -86161 -82851 -74448 -58840 28697 -39855 -98209 -50663 -19748
1492 -19748 -10117 16869 -79936 -120573 -112083 -34100 -29598 -68647 -89060 -125737 -90080 -73290
$$ packed form
1579A11220p2373j70559M4095Q0783M8851n0184m2505j8722M5970J91O8722n7690
1567a2201o0524P2998k9411M484K84n0282m0672j0685J2142N3205J1080n037N78
1554e4041P375J2566q949m7021o312J9600Q0550J6799P247j5358n4654M7980l8101
1541c2319m161n7379K9157J0813j5737k5295j5917K9425k4638L0569N3979m3501
1529f5004n1435r151N5335M3395L1726o7278m4233q0397j0723L3043O2377L0130
1517g2215l1105J0842J4562L1535L5788p942l5691L2124j2944l9666M0983o5813
1505i9542l3017N3467R151j18j6102L310Q403J5608Q7537o8552n8354M7546L0915
1492a9748R631K6986r6805m0637Q490P7983M502l9049k0413l6677L5657J6790
$$ plain form
1480 -73290 -51180 -106235 -73187 -59166 -6354 -3768 24 -12599 -4826 -19191 7820 11034 -34880
1467 -34880 -61381 -53731 -42986 10525 -21952 -36172 -7453 60139 46627 33309 -28296 -81156
1455 -81156 -59686 -87756 -46525 -6520 23763 12990 34128 21734 28915 8102 28826 32233
1443 32233 40489 55592 4799 -15479 -84113 -90474 -29174 -11883 -42116 -31223 -48828 -62526
1431 -62526 -50978 -21963 -18720 -19713 -73294 29149 59311 8914 47226 35444 66155 36778
1419 36778 20863 1051 -91943 -105365 -33298 -58164 -67210 -73710 -48421 52697 70408 75305
1407 75305 51236 34466 32881 89525 65850 82482 72133 -10062 9345 49743 9517 -27545
1395 -27545 -10804 80994 74208 31977 23212 16146 50507 56126 16118 55950 62098 10152 68043
$$ packed form
1480g3290K2110n5055L3048J4021N2812K586L792j2623P773j4365K7011L214m5914
1467c4880k6501P650J0745N3511l2477j4220K8719O7592j3512j3318o1605n2860
1455h1156K1470k8070M1231M0005L0283j0773K1138j2394P181k0813K0724L407
1443C2233Q256J5103n0793k0278o8634o361O1300J7291l0233J0893j7605j3698
1431f2526J1548K9015L243r93n3581J02443L0162n0397L8312j1782L0711k9377
1419C6778j5915j9812r2994j3422P2067k4866r046o500K5289J01118J7711M897
1407G5305k4069j6770j585N6644k3675J6632j0349q2195J9407M0398m0226l7062
1395b7545J6741R1798o786m2231q765p066L4361N619m0008L9832O148n1946N7891
$$ plain form
1382 68043 -28782 -21914 -24027 -97905 -79726 -35817 -37987 -17481 10566 -12021 784 4978 4321
1369 4321 3502 -51285 59613 102139 56852 62531 40031 -1529 11109 -49369 -47328 -53328 -46650
1356 -46650 -53308 7230 33816 -18378 -69459 -48593 -17633 -47925 8938 7226 -70205 -142552
1344 -142552 -102009 -38941 -42116 450 18551 30184 33438 34266 37342 11905 28388 7612 30893
1331 30893 30148 -6592 4236 -38493 -22472 78604 15181 11843 -29450 -76571 -18005 9688
1319 9688 -2483 -28458 -69 42028 27864 12712 -15515 -29957 -10718 -55645 -66808 -35925
1307 -35925 -14264 44918 4273 1532 -39511 -43407 -18027 -14584 12545 16863 -52053 -66274 -39967
1294 -39967 -16507 -7025 11571 19594 -38882 14236 6448 -43101 -52782 -79061 -49967 3636 -37411
$$ packed form
1382F8043r6825O868k113p3878J8179M3909k170K0506K8047k2587J2805M194o57
1369D321q19n4787J10898M2526m5287N679k2500m1560J2638o0478K041o000O678
1356d6650o658O0538K6586n2194n1081K0866L0960l0292N6863j712p7431p2347
1344a42552M0543O3068l175M2566J8101J1633L254Q28L076k5437J6483k0776K3281
1331C0893p45l6740J0828m2729J6021J01076o3423l338m1293m7121N8566K7693
1319I688j2171k5975K8389M2097j4164j5152k8227j4442J9239m4927j1163L0883
1307c5925K1661N9182m0645k741m1043l896K5380L443K7129M318o8916j4221K6307
1294c9967K3460R482J8596Q023n8476N3118p788m9549r681k6279K9094N3603m1047
$$ plain form
1281 -37411 -87994 -99887 -63670 -57201 -55746 -86159 -67905 -75829 -37043 -99695 -132356 -83300
1269 -83300 -128799 -126728 -66691 30024 30755 -36937 -95504 -55481 -15480 1326 35914 52003
1257 52003 -16979 13391 -21753 -5493 -4317 -45245 -65126 -102805 -34759 -44717 -102101 -174543
1245 -174543 -128116 -28630 -82520 -62125 -23263 -32292 -5366 -2735 53046 -70057 -21268 68368
1233 68368 45836 51366 41565 -24759 -24096 -17221 29642 7574 -38346 16692 -2996 -38530 -47904
1220 -47904 -56905 -73416 -73326 -71843 -51149 -90892 -34951 -67967 -62333 -54591 -36356 9981 -5288
1207 -5288 -41990 21928 55770 22281 57738 11413 21961 67669 68099 -1119 -5178 74151 104720
1194 104720 49469 38422 44880 -43831 -21077 36497 28379 19824 -26162 -85773 -66568 -41495
$$ packed form
1281c7411n0583j1893L6217O469J455l0413J8254p924L8786o2652l2661M9056
1269h3300m5499K071O0037R6715P31o7692n8567M0023M0001J6806L4588J6089
1257E2003o8982L0370l5144J6260J176m0928j9881l7679O8046r958n7384p2442
1245a74543M6427R9486n3890K0395L8862r029K6926K631N5781j23103M8789Q9636
1233F8368k2532N530r801o6324O63O875M6863k2068m5920N5038j9688l5534r374
1220d7904r001j6511R0J483K0694l9743N5941l3016N634P742J8235M6337j5269
1207e288l6702O3918L3842l3489L5457m6325J0548M5708M30o9218m059P9329L0569
1194A04720n5251j1047O458q8711K2754N7574q118q555m5986n9611J9205K5073
$$ plain form
1182 -41495 -94904 -133418 -108226 -92945 -13576 -5197 -36923 -14314 48684 62790 86938 39209
1170 39209 37739 33043 -23464 50860 73290 34923 36040 44961 57820 -5450 -8100 -66800 -107287
1157 -107287 -46822 -58085 -51271 -32651 -39963 12781 6893 -71843 -12710 -45762 -61933 -11831
1145 -11831 100487 57050 21366 28323 -15703 -39889 -19974 -53024 -21937 -67055 -46405 40891
1133 40891 5087 4364 12243 7021 51612 78611 6504 19053 -60231 -33568 34736 -33891 -30794
1120 -30794 -70576 -88987 -63360 -62978 -53011 -89383 -90996 -76530 -48619 -31555 34192 30855 -9436
1107 -9436 -1514 17629 37236 17062 25584 -22399 59439 62480 71499 76016 47367 57635 7164
1094 7164 6152 13733 -11876 18364 9718 -8140 95455 46290 -47674 -76858 -72692 -53238 -53870
$$ packed form
1182d1495n3409l8514K5192J5281P9369Q379l1726K2609O2998J4106K4148m7729
1170C9209j470m696n6507P4324K2430l8367J117Q921J2859o3270k650n8700m0487
1157a07287O0465j1263O814J8620p312N2744n888p8736N9133l3052j6171N0102
1145a1831J12318m3437l5684O957m4026k4186J9915l3050L1087m5118K0650Q7296
1133D0891l5804p23P879n222M4591K6999p2107J2549p9284K6663O8304o8627L097
1120c0794l9782j8411K5627L82R967l6372j613J4466K7911J7064O5747l337m0291
1107i436P922J9143J9607k0174Q522m7983Q1838L041R019M517k8649J0268n0471
1094G164j012P581k5609L0240q646j7858J03595m9165r3964k9184M166J9454o32
$$ plain form
1081 -53870 -67259 -63175 -97773 -73348 -2932 -69042 -72861 -85561 -23854 56299 -4850 38855
1069 38855 32619 44853 39767 -23969 -9986 14925 -34505 33989 84701 31081 -39628 -61255
1057 -61255 -53783 -45442 -75254 -34132 -41278 -33380 -30129 -49632 -23245 -90194 -22030 -47073 -1079
1044 -1079 52873 3353 7402 36536 5132 15107 5131 -3442 13133 -36643 7766 10124 -72312
1031 -72312 -68557 -72622 -93324 -75072 -35664 -14473 -82307 -15073 13046 12442 -17863 -76537 -88176
1018 -88176 -36595 -32273 -11476 -45841 -69241 -20241 -89086 -81462 -52822 -99433 -124144 -54914
1006 -54914 -29353 -51966 -52497 4200 -40628 -32048 -8746 1008 -26281 -74867 18070 101977 82256
993 82256 -12509 -27350 -61052 -74785 -47741 -101776 -129683 -58581 -39036 -17806 -37905 -17326
$$ packed form
1081e3870j3389M084l4598K4425P0416o6110l819j2700O1707Q0153o1149M3705
1069C8855o236J2234n086o3736J3983K4911m9430O8494N0712n3620p0709k1627
1057f1255P472Q341k9812M1122p146P898L251j9503K6387o6949O8164k5043M5994
1044a079N3952m9520M049K9134l1404R975r976q573J6575m9776M4409K358q2436
1031g2312L755m065k0702J8252L9408K1191o7834O7234K8119o04l0305n8674j1639
1018h8176N1581M322K0797l4365k3400M9000o8845P624K8640m6611k4711O9230
1006e4914K5561k2613n31N6697m4828Q580K3302R754k7289m8586R2937Q3907j9721
993H2256r4765j4841l3702j3733K7044n4035k7907P1102J9545K1230k0099K0579
$$ plain form
981 -17326 -106362 -82487 -32652 800 99170 23608 -4943 26976 -6035 5889 48687 37527
969 37527 71095 -28942 65704 14034 -91138 -61256 -35665 12204 -11213 -42187 -76 2158
957 2158 53074 48422 -3349 -10983 -10922 3227 44656 51272 35954 -41581 -139128 -96513 -52962
944 -52962 -25742 -1285 -37365 -13192 -22238 -12256 37206 -12102 -4936 55796 111612 63573 28952
931 28952 66366 -2226 29678 -32365 -61379 31345 7051 28089 21279 19974 -38004 -49788
919 -49788 -14603 70269 23213 -11050 -36194 -57089 -8151 58794 97269 123144 45071 71089
907 71089 41201 -1413 20654 2705 7356 20704 33722 23274 12628 -47582 -50866 15109
895 15109 28941 -73465 2126 93255 27523 -13261 34901 -26871 -2450 -76939 32308 49480
$$ packed form
981a7326q9036K3875M9835L3452R8370p5562k8551L1919l3011J1924M2798j1160
969C7527L3568j00037R4646n1670j05172K9882K5591M7869k3417l0974M2111K234
957B158N0916m652n1771p634O1J4149M1429O616j5318p7535r7547M2615M3551
944e2962K7220K4457l6080K4173r046R982M9462m9308P166O0732N5816m8039l4621
931B8952L7414o8592L1904o2043k9014R2724k4294K1038o810j305n7978j1784
919d9788L5185Q4872m7056l4263k5144k0895M8938O6945L8475K5875p8073K6018
907G1089k9888m2614K2067j7949M651J3348J3018j0448j0646o0210l284O5975
895A5109J3832j02406P5591R1129o5732m0784M8162o1772K4421p4489J09247J7172
$$ plain form
883 49480 -38526 -26766 -54400 -4431 28333 -32719 -8374 -17936 -24827 58041 61684 54599 602
870 602 -45114 -29671 67192 27083 22477 -37430 44872 8779 -60698 -42643 -23405 -3979 84121
857 84121 49777 64138 30554 28884 23010 58900 128950 31562 42520 -3116 -76365 -14081
845 -14081 -8872 -2664 -3184 -77687 -34680 56524 5636 -74010 -120559 -91621 -16552 -21455 -57422
832 -57422 -47163 -24128 -5721 48376 35154 -16487 -24581 -27561 7940 11130 -20522 -45284 -86089
819 -86089 -62880 4360 33858 -42304 -51423 -68870 -90058 -34207 -687 -67150 -17931 12522
807 12522 60830 75892 48137 2378 19643 -3494 3109 -1920 -56764 -93225 -42180 -62855
795 -62855 -2321 30844 -12350 -11443 12266 58914 58862 19664 48429 56360 24371 13469 20877
$$ packed form
883D9480q8006J1760k7634M9969L2764o1052K4345r562o891Q2868L643p085n3997
870F02m5716J5443R6863m0109m606n9907Q2302l6093o9477J8055J9238J9426Q8100
857H4121l4344J4361l3584j670n874L5890P0050r7388J0958m5636p3249O2284
845a4081N209O208n20p4503M3007R1204n0888p9646m6549K8938P5069m903l5967
832e7422J0259K3035J8407N4097j3222n1641q094k980L5501L190l1652k4762m0805
819h6089K3209O7240K9498p6162r119j7447k1188N5851L3520o6463M9219L0453
807A2522M8308J5062k7755m5759J7265k3137O603n029n4844l6461N1045k0675
795f2855O0534L3165m3194R07K3709M6648n2l9198K8765P931l1989j0902P408
$$ plain form
782 20877 47111 42403 41391 47459 34445 22310 -56853 -82152 13822 68748 33818 -65569 -103892
769 -103892 -3051 20153 7568 64104 -3672 -15137 16362 50199 41315 13741 -39507 -29550
757 -29550 -11030 -52205 -13718 -51092 -36734 62450 134355 122555 58739 92082 93135 84529
745 84529 90669 -23347 -37924 43746 76630 72977 -8330 -49149 -90889 -114728 -77852 -34764
733 -34764 -59314 -40482 3863 28437 -19289 -26005 -23433 -13848 30687 56293 79167 59721 -63106
720 -63106 -91283 34674 109251 88867 54262 56797 12676 7342 732 21826 21722 -3633 56488
707 56488 -13789 -9983 2331 -74913 -64627 -36598 -33772 -9400 17251 -44452 -49154 -61895 -64190
694 -64190 -98596 -44131 25141 -32586 -32238 17258 41312 64804 13151 38907 87073 78327 44871
$$ packed form
782B0877K6234m708j012O068j3014j2135p9163k5299R5974N4926l4930r9387l8323
769a03892J00841K3204j2585N6536o7776j1465L1499L3837q884k7574n3248R957
757b9550J8520m1175L8487l7374J4358R9184P1905j1800o3816L3343J053q606
745H4529O140j14016j4577Q1670L2884l653q1307m0819m1740k3839L6876M3088
733c4764k4550J8832M4345K4574m7726o716K572R585M4535K5606K2874j9446j22827
720f3106k8177J25957P4577k0384l4605K535m4121n334o610K1094j04k5355O0121
707E6488p0277L806J2314p7244J0286K8029K826K4372K6651o1703m702j2741k295
694f4190l4406N4465O9272n7727L48M9496K4054K3492n1653K5756M8166q746l3456
$$ plain form
681 44871 40327 156232 55034 3739 -59292 -32452 -9659 -56620 -38695 2532 -30829 -75182
669 -75182 -64682 -52976 -93849 -65073 -97854 -53974 49201 33310 51873 39591 45497 41466
657 41466 64019 112945 48727 -6432 9301 53750 64112 97070 46628 55732 37133 -44777
645 -44777 -70435 -69546 -28482 -85765 -60138 39200 15803 -3147 -21532 -33049 19382 29198 -24524
632 -24524 -39489 857 28812 325 -74521 -56360 -42069 31447 55689 68363 48427 53382
620 53382 98926 103798 113065 99155 91168 114643 70233 25649 14911 -70532 -66576 -8762 -27287
607 -27287 -28189 -28209 -105212 -77715 -33470 -25544 8253 64718 78613 56017 135673 128046 94400
594 94400 113152 98834 66823 111603 131520 91536 76532 69511 -1481 -25624 -26848 24163
$$ packed form
681D4871m544J15905j01198n1295o3031K6840K2793m6961J7925M1227l3361m4353
669g5182J0500J1706m0873K8776l2781M3880J03175j5891J8563j2282N906m031
657D1466K2553M8926o4218n5159J5733M4449J0362L2958n0442R104j8599q1910
645d4777k5658Q89M1064n7283K5627R9338k3397j8950j8385j1517N2431R816n3722
632b4524j4965M0346K7955k8487p4846J8161J4291P3516K4242J2674j9936M955
620E3382M5544M872R267j3910p987K3475m4410m4584j0738q5443L956N7814j8525
607b7287r02k0p7003K7497M4245P926L3797N6465J3895k2596P9656p627l3646
594I4400J8752j4318l2011M4780J9917l9984j5004p021p0992k4143j224N1011
$$ plain form
582 24163 -10199 93672 100808 65008 37997 33533 93646 168922 121084 82993 62488 98914
570 98914 67009 -14626 17751 35128 11751 39175 68275 34558 18422 29996 14203 30919
558 30919 38658 67532 159513 119227 113856 121704 99832 54195 12865 67229 152380 85790 8672
545 8672 35081 31420 13715 28865 32603 -50875 -89277 -19298 -3321 -36250 -2554 -40151 -97438
532 -97438 38713 46495 77303 117745 66507 112612 81926 8398 83314 -1699 -11640 41290
520 41290 1698 -29483 -14191 -24 16275 29922 37202 16330 28435 40133 -37496 4590
508 4590 72285 24992 -44330 -48335 -13586 -13680 -1146 -23551 -11528 -4908 56274 72892 122069
495 122069 59062 43527 35136 91126 101816 46511 40728 66816 73450 65623 62424 24050 46653
$$ packed form
582B4163l4362J03871P136l5800k7011m464O0113P5276m7838l8091k0505L6426
570I8914l1905q1635L2377J7377k3377K7424K9100l3717j6136J1574j5793J6716
558C0919P739K8874R1981m0286n371P848k1872m5637m1330N4364Q5151o6590p7118
545H672K6409l661j7705J5150L738q3478l8402O9979J5977l2929L3696l7597n7287
532i7438J36151P782L0808M0442n1238M6105l0686p3528P4916q5013r941N2930
520D1290l9592l1181J5292J4167J6299J3647P280k0872J2105J1698p7629M2086
508D590O7695m7293o9322m005L4749r4J2534k2405J2023O620O1182J6618M9177
495A22069o3007j5535q391N5990J0690n5305n783K6088O634p827l199l8374K2603
$$ plain form
482 46653 11976 40923 10088 -89203 -129402 -61041 -52790 -8941 -34020 -1201 73267 93144
470 93144 56662 23874 66231 114662 73175 93628 107719 67801 85553 57781 66937 24097
458 24097 55429 73337 33594 24713 36526 33816 -54595 -50380 -70311 13023 130049 102422
446 102422 34510 -47979 30782 59661 94065 46222 -31597 -19113 29244 27042 -4599 -57391
434 -57391 -41799 -44403 87110 48693 -28837 -20227 10472 4774 97067 127330 72704 66326 29473
421 29473 78562 86142 35182 37122 25167 2524 -27239 -19421 -45756 -49348 2529 4500 -31675
408 -31675 -37501 62134 5258 19826 28597 92716 80393 63797 26508 72604 82468 91469 -415
395 -415 -21382 -91951 6508 121399 95686 9050 -6947 43963 144487 99804 76743 52140
$$ packed form
482D6653l4677K8947l0835r9291m0199O8361Q251M3849k5079L2819P4468J9877
470I3144l6482l2788M2357M8431m1487K0453J4091l9918J7752k7772R156m2840
458B4097L1332J7908l9743q881J1813k710q8411M215j9931Q3334J17026k7627
446A02422o7912q2489P8761K8879L4404m7843p7819J2484M8357k202l1641n2792
434e7391J5592k604J31513l8417p7530Q610L0699n698R2293L0263n4626o378l6853
421B9473M9089P580n0960J940j1955k2643k9763P818k6335l592N1877J971l6175
408c1675n826R9635n6876J4568Q771O4119j2323j6596l7289M6096R864R001r1884
395d15k0967p0569R8459J14891k5713q6636j5997N0910J00524m4683k3061k4603
$$ plain form
383 52140 631 57542 44816 21768 -42136 -121498 -97665 -80548 -12474 19583 -47448 -2058
$$ packed form
383E2140n1509N6911j2726k3048o3904p9362K3833J7117O8074L2057o7031M5390
$$ [...]
##END NTUPLES=NMR SPECTRUM
##END=
