##TITLE=1H_EC-3384(6)-1
 200.13Hz, CDCl3.
 8 sc
5.8.2026
##JCAMPDX= 6.0         $$ Bruker NMR JCAMP-DX V2.0
##DATA TYPE= NMR SPECTRUM
##DATA CLASS= NTUPLES
##ORIGIN= UXNMR, Bruker Analytische Messtechnik GmbH
##OWNER= pz
$$ XWIN-NMR		Version 3.5
$$ Wed Aug  5 12:29:33 2026 Russian Standard Time (UT+4h)  she@DPX200
##.OBSERVE FREQUENCY= 200.1313
##.OBSERVE NUCLEUS= ^1H
##.ACQUISITION MODE= SIMULTANEOUS
##.ACQUISITION SCHEME= undefined
##.AVERAGES= 8
##.DIGITISER RES= 18
##SPECTROMETER/DATA SYSTEM= spect
##.PULSE SEQUENCE= zg30
##.SOLVENT NAME= CDCl3
##.SHIFT REFERENCE= (INTERNAL, CDCl3, 0, 15.51)
##AUDIT TRAIL= $$ (NUMBER, WHEN, WHO, WHERE, WHAT)
$$ ##TITLE= Audit trail, XWIN-NMR		Version 3.5
$$ ##JCAMPDX= 5.01
$$ ##ORIGIN= Bruker BioSpin GmbH
$$ ##OWNER= she
$$ F:/spectra/data/she/nmr/H-C/1/pdata/1/auditp.txt
$$ ##AUDIT TRAIL=  $$ (NUMBER, WHEN, WHO, WHERE, WHAT)
(   1,<2026-08-05 12:27:50.95 +0400>,<she>,<DPX200>,
      <created by zg, POWCHK disabled, PULCHK disabled
       configuration hash MD5:
       00 E9 B6 7A A2 85 ED C7 34 08 36 98 17 FE 4E 26
       data hash MD5: 16K
       9D C1 14 1D EB 29 51 7E 48 9D 58 8B C8 19 AA 23>)
(   2,<2026-08-05 12:27:53.26 +0400>,<she>,<DPX200>,
      <Start of raw data processing
       efp BC_mod = 2 LB = 0.25 FT_mod = 6 PKNL = 1 PHC0 = -4379.457 PHC1 = 12.7923 SI = 16K 
       data hash MD5: 16K
       D6 41 EF 4F 45 37 7F 2D 64 06 AE A9 48 3F 94 04>)
(   3,<2026-08-05 12:28:13.40 +0400>,<she>,<DPX200>,
      <pk PHC0 = 159.8411 PHC1 = -0.1999995 
       data hash MD5: 16K
       A3 B7 55 39 39 D3 98 93 AA CF 43 69 AF 9B D6 A8>)
(   4,<2026-08-05 12:28:17.18 +0400>,<she>,<DPX200>,
      <abs ABSG = 5 
       data hash MD5: 16K
       6A BB 54 A1 84 57 47 CF D9 59 FF C9 77 6C 12 4F>)
$$ ##END=
$$ 
$$ hash MD5
$$ 34 0E E9 48 5D B6 55 21 3E B0 C3 A2 50 75 05 31
##$RELAX= 
##$RELAX= 
##$RELAX= 
##$RELAX= 
##$RELAX= 
##$RELAX= 
$$ Bruker specific parameters
$$ --------------------------
##$DU= <F:/spectra>
##$EXPNO= 1
##$NAME= <H-C>
##$PROCNO= 1
##$TYPE= <nmr>
##$USER= <she>
##$AMP= (0..31)
100 100 100 100 100 100 100 100 100 100 100 100 100 100 100 100 100 100 
100 100 100 100 100 100 100 100 100 100 100 100 100 100 
##$AQSEQ= 0
##$AQ_mod= 1
##$AUNM= <au_zg>
##$AUTOPOS= <>
##$BF1= 200.13
##$BF2= 200.13
##$BF3= 200.13
##$BF4= 200.13
##$BF5= 200.13
##$BF6= 200.13
##$BF7= 200.13
##$BF8= 200.13
##$BYTORDA= 1
##$CFDGTYP= 0
##$CFRGTYP= 5
##$CHEMSTR= <none>
##$CNST= (0..31)
1 1 145 1 1 1 1 1 1 1 1 1 1 1 1 1 1 1 1 1 1 1 1 1 1 1 1 1 1 1 1 1 
##$CPDPRG= <>
##$CPDPRG1= <>
##$CPDPRG2= <>
##$CPDPRG3= <>
##$CPDPRG4= <mlev>
##$CPDPRG5= <mlev>
##$CPDPRG6= <mlev>
##$CPDPRG7= <mlev>
##$CPDPRG8= <mlev>
##$CPDPRGB= <>
##$CPDPRGT= <>
##$D= (0..31)
0 0.7 0 0 0 0 0 0 0 0 0 0.03 0 0 0 0 0 0 0 0 0 0 0 0 0 0 0 0 0 0 0 0 
##$DATE= 1785918470
##$DBL= (0..7)
120 120 120 120 120 120 120 120 
##$DBP= (0..7)
150 150 150 150 150 150 150 150 
##$DBP07= 0
##$DBPNAM0= <>
##$DBPNAM1= <>
##$DBPNAM2= <>
##$DBPNAM3= <>
##$DBPNAM4= <>
$$ [...]
##$SUBNAM3= <"">
##$SUBNAM4= <"">
##$SUBNAM5= <"">
##$SUBNAM6= <"">
##$SUBNAM7= <"">
##$SUBNAM8= <"">
##$SUBNAM9= <"">
##$SW= 18.0517328524113
##$SWIBOX= (0..15)
0 0 2 0 0 0 0 0 0 0 0 0 0 0 0 0 
##$SW_h= 3612.71676300578
##$TD= 16384
##$TD0= 1
##$TE= 0
##$TE2= 300
##$TE3= 300
##$TEG= 300
##$TL= (0..7)
0 120 120 120 120 120 120 120 
##$TP= (0..7)
150 150 150 150 150 150 150 150 
##$TP07= 0
##$TPNAME0= <>
##$TPNAME1= <>
##$TPNAME2= <>
##$TPNAME3= <>
##$TPNAME4= <>
##$TPNAME5= <>
##$TPNAME6= <>
##$TPNAME7= <>
##$TPOAL= (0..7)
0.5 0.5 0.5 0.5 0.5 0.5 0.5 0.5 
##$TPOFFS= (0..7)
0 0 0 0 0 0 0 0 
##$TUNHIN= 0
##$TUNHOUT= 0
##$TUNXOUT= 0
##$USERA1= <user>
##$USERA2= <user>
##$USERA3= <user>
##$USERA4= <user>
##$USERA5= <user>
##$V9= 5
##$VALIST= <valist>
##$VCLIST= <CCCCCCCCCCCCCCC>
##$VD= 0
##$VDLIST= <DDDDDDDDDDDDDDD>
##$VPLIST= <PPPPPPPPPPPPPPP>
##$VTLIST= <TTTTTTTTTTTTTTT>
##$WBST= 1024
##$WBSW= 4
##$XGAIN= (0..3)
0 0 0 0 
##$XL= 0
##$YL= 0
##$YMAX_a= 505840
##$YMIN_a= -534567
##$ZGOPTNS= <>
##$ZL1= 120
##$ZL2= 120
##$ZL3= 120
##$ZL4= 120
##$ABSF1= 15.51772
##$ABSF2= -2.534129
##$ABSG= 5
##$ABSL= 3
##$ALPHA= 0
##$AQORDER= 0
##$ASSFAC= 0
##$ASSFACI= 0
##$ASSFACX= 0
##$ASSWID= 0
##$AUNMP= <proc_1d>
##$AZFE= 0.1
##$AZFW= 0.1
##$BCFW= 0
##$BC_mod= 2
##$BYTORDP= 0
##$COROFFS= 0
##$CY= -3
##$DATMOD= 1
##$DC= 0
##$DFILT= <>
##$DTYPP= 0
##$F1P= 0
##$F2P= 0
##$FCOR= 1
##$FTSIZE= 16384
##$FT_mod= 6
##$GAMMA= 0
##$GB= 0
##$INTBC= 1
##$INTSCL= 3.241238e-09
##$ISEN= 128
##$LB= 0.25
##$LEV0= 0
##$LPBIN= 0
##$MAXI= 10000
##$MC2= 0
##$MEAN= 0
##$ME_mod= 0
##$MI= 1.114404
##$NCOEF= 0
##$NC_proc= -5
##$NLEV= 6
##$NOISF1= 3.799351
##$NOISF2= 2.8
##$NSP= 0
##$NTH_PI= 0
##$NZP= 0
##$OFFSET= 15.51
##$PC= 1
##$PHC0= -4219.616
##$PHC1= 12.5923
##$PH_mod= 1
##$PKNL= yes
##$PPARMOD= 0
##$PSCAL= 0
##$PSIGN= 0
##$REVERSE= no
##$SF= 200.1300023413
##$SI= 16384
##$SIGF1= 3
##$SIGF2= 2
##$SINO= 0.751879
##$SIOLD= 32768
##$SREGLST= <19F.Aceton>
##$SSB= 0
##$STSI= 16384
##$STSR= 0
##$SW_p= 3612.71676300578
##$SYMM= 0
##$S_DEV= 0
##$TDeff= 16384
##$TDoff= 0
##$TI= <>
##$TILT= no
##$TM1= 0
##$TM2= 0
##$TOPLEV= 0
##$USERP1= <user>
##$USERP2= <user>
##$USERP3= <user>
##$USERP4= <user>
##$USERP5= <user>
##$WDW= 1
##$XDIM= 16384
##$YMAX_p= 316182216
##$YMIN_p= -254512
$$ End of Bruker specific parameters
$$ ---------------------------------
##NTUPLES= NMR SPECTRUM
##VAR_NAME=  FREQUENCY,     SPECTRUM/REAL,   SPECTRUM/IMAG
##SYMBOL=    X,             R,               I
##VAR_TYPE=  INDEPENDENT,   DEPENDENT,       DEPENDENT
##VAR_FORM=  AFFN,          ASDF,            ASDF
##VAR_DIM=   16384,         16384,           16384
##UNITS=     HZ,            ARBITRARY UNITS, ARBITRARY UNITS
##FACTOR=    0.220516191357247, 1,           1
##FIRST=     3104.01638211969, 0,            0
##LAST=      -508.700380886095, 0,           0
##MIN=       -508.700380886095, -254512,     0
##MAX=       3104.01638211969, 316182216,    0
$$ Real data points
##PAGE= N=1
##DATA TABLE= (X++(R..R)), XYDATA
$$ [...]
7059e9366l2081l3557N5805L7731P958j6974j9673M2172k3569L611M5716k309
7047E464j9038m0365M8166j2411K7922J2142l7670L55k0134M6571J11919L2287
7035A55208m0520j04738p5932J6601J2448R364R9704j5296m3163l7686K200j6558
7023c8368K8552M4331j1962P185N98L3951L6909l7143p2095k9295L4318R4772
7011I1753l5829K569l709k4574q821N829j2122l3292o8287P1162J903N607l198
6998a1009O8603j3194M1974j2604m330q993p3738K1482P4112O3911m1033k4739
6986H0442l3576J3947J32k9879o6643P3511M8894k7681m2973Q157J6005k300o8156
6973c0120J888L8955K0293j1528r105M4281q037n2862J3599j8786p3786M1184
$$ y = [-59366, -91447, -125004, -69199, -31468, -23510, -40484, -60157, -17985, -41554, -37943, 7773, 5464, -13574, -53939, -5773, -18184, 9738, 21880, -15790, -15435, -35569, 11002, 122921, 155208, 114688, 9950, -65982, -49381, -36933, -27569, 72135, 56839, 13676, -24010, -21810, -38368, -9816, 34515, 22553, 29738, 30336, 64287, 101196, 64053, -8042, -37337, -3019, 91753, 55924, 58493, 54784, 30210, 21389, 27218, 15096, -18196, -86483, -15321, -13418, -7811, -11009, 57594, 44400, 86374, 73770, 69440, 60447, -13291, 8191, 82303, 146214, 105181, 80442, 46866, 60813, 60945, 31066, -35577, 37934, 86828, 59147, 16174, 24331, 40336, 38036, -30120, -28232, 10723, 31016, 19488, 10383, 54664, 46627, -6235, 7364, -11422, -85208, -44024]
6961d4024L9703L0208L9123j6234q030n4226J7039K7896k1163L4194p7146r371
6949d2031L5500Q836n7843J5681K6262j1161P121K4219M726K4733M206j4460L5228
6936F1017j9449l0656o639r000j7936Q936L9829l3164j7411K9291n4709o3844
6924a13735Q3997J3501r467M0422l183l6510n6507N6855M891L111J2110o0832
6912f5347k9644M8850J01761q2236L9643L5193l6041l6297l8072K0002N5457m6488
6900c3219J4176L6792K1965l7519k3855K7409j6192J7756l0140M9241l905m8400
6888b5891p5668N7507J3840M7057M9823m3499k854m558n791R801k8573m4021N956
6875d6871R2249j3781Q461L8884n1656j3097L3620m2919L5063M4237j3974k6419
$$ y = [-44024, -4321, 25887, 65010, 48776, 40746, -13480, 3559, 31455, 10292, 44486, -32660, -42031, -6531, 2305, -55538, -39857, -13595, -24756, -17635, 6584, 11310, 36043, 40249, 25789, 61017, 41568, 10912, 4273, -4727, -22663, -13727, 26102, -7062, -24473, 4818, -49891, -113735, -29738, -16237, -25704, 14718, 11535, -24975, -81482, -24627, -19736, -16625, -4515, -65347, -94991, -46141, 55620, -26616, 13027, 48220, 12179, -24118, -62190, -42188, 13269, -33219, -19043, 17749, 39714, 2195, -21660, 5749, -10443, 7313, -22827, 26414, 22509, -25891, -101559, -44052, -30212, 16845, 66668, 23169, 20315, 15757, 9966, 19767, -8806, -52827, -46871, 45378, 31597, 40058, 78942, 27286, 14189, 47809, 4890, 39953, 84190, 70216, 43797]
6863D3797o1259L2840l3207j2958N440L6620M6746j5068J3645l7423O743q2264
6851e6348K3529N3314n248J0403n7532j3166L5663k7824J2931J3894J8183j9393
6839a1594J8440N9610m184K9718n7466J2910J4143q2667J8734m4857N824O7106
6827B5717N8130l3327m7957o0780N5206M4236n634l39l3785K6859O0371k7970
6815F0727m7929K0988K1376k2969o4756K8818K1185J14457l8232n9308J4745J4411
6803F3513J7371Q766k178O106o9838L2959J0909O338K4220l226j7277m1054L9045
6790G5654r789o664Q1927n9954q9539L5622k4030J6243N7231j8360k5149M5394
6778G8586o192o5635j521R073P246n051K3820j7710k0529j1073k5743M4906J0253
$$ y = [43797, -17462, 15378, -17829, -30787, -25347, 11273, 58019, 42951, 56596, 19173, 25916, -56348, -32819, 20495, 15247, 25650, -31882, -45048, -9385, -37209, -24278, -10384, 7799, -11594, 6846, 66456, 62272, 91990, 34524, 47434, 61577, -21090, -2356, -47213, -41389, 25717, 83847, 50520, 2563, -58217, -3011, 41225, 35591, 35252, 1467, 28326, 88697, 60727, 12798, 33786, 55162, 32193, -32563, -3745, 17440, 131897, 93665, 34357, 49102, 63513, 80884, 89650, 87472, 93578, 23740, 56699, 67608, 73946, 98166, 94940, 77663, 36609, 75654, 65865, 59201, 141128, 81174, -8365, 27257, 3227, 19470, 76701, 58341, 33192, 78586, 72394, 6759, 5238, 14311, 21557, 16506, 40326, 22616, 2087, -8986, -34729, 10177, 20430]
6765B0430l5569m859n0994O7447L7550j0992M0095p109r2132N6545N883k77j0871
6752A5147r785j7777M6674K2882n0649P173l410p030k0812K3575m805j070o997
6739f884o982k4236K6301J1725J8847j4448O403j3251O7002M8466J1005l8124
6727H5824p8413j396J8062J7625k8377l3101K7226m3888K1587j775N4414k4167
6715A3621l4295O431k1561J3973L4549J6304o400R473n9984L5489o71M04K9729
6702C7062j21024K5128J4874R158O9579P261M358n901l9422l0384N3739q947l5242
6689a9761l182j3444n8127j8852N6071K6133K0750J6354M0635m8315P8609J2608
6677H9479q8609J9603K5843J2461o6258M80l1329J098j5898l1332P0586M678N6312
$$ y = [20430, -15139, -19998, -70992, -3545, 34005, 23013, 63108, 55999, -36133, 20412, 26295, 26018, 15147, 5362, -12415, 34259, 57141, 6492, 13665, 10255, 3225, -17587, 5988, 1183, 113, -6884, -13866, -38102, -11801, -76, 18771, 4323, 10726, -2525, 64477, 112943, 123948, 85824, 7411, 6015, 24077, 41702, 13325, -19776, 7450, -36438, -14851, -16626, 37788, 13621, -20674, -14243, -35804, -21831, 12718, 29022, 22622, 32095, -27889, 7600, 6929, 7333, 37062, -83962, -58834, -43960, -34802, 34777, 42038, 46396, 40495, 1073, -29311, 24428, 15481, -19761, -22943, -36387, -94514, -113366, -57295, -31162, -10412, 5942, 46577, -1738, 76871, 89479, 870, 20473, 46316, 58777, -7481, -7001, -38330, -37232, -53130, -84462, -13876, -9198, 47114]
6664D7114N1289m0022n8212j8258l26K2775j6561r829J9980J3202M5559K2259
6652G8970l5398l2798J0482l5476K6691K6732O8536j04386l3741N0315K78k6269
6640f064l631n141J9029J5137k1657j8036J9277r872L2048k197L0145L0570j4206
6627F5402n2268n46l6709K3408K6725j8396K479J0964M949M1909L0497o0717J3548
6614E1245k7375m309M8459n347o9747M5076L1367L6260m5681m0030M0913n445
6602E5386l7436M1712k6484K1901j6236l4290j6664M2122K4666n0744K9171l9914
6590f810m3747K1482j5317O1306K1495N7210N2223n9393J4047N5090j7970q5296
6578E4320J5219j9964J4926O1128J5692K7364J7682o4380j9072Q355r116J660
$$ y = [47114, 98403, 58381, 169, -18089, -18415, 4360, -12201, -22030, -2050, 11152, 56711, 78970, 43572, 10774, 21256, -14220, 12471, 39203, 107739, 3353, -30388, 19927, 20205, -6064, -9695, -14836, 4193, 19330, -2327, -20363, -1086, -10958, 21090, 18893, 49038, 79608, 65402, 13134, 12588, -24121, -713, 26012, 7616, 10095, 21059, 26008, 67917, 98414, 37697, 51245, 23870, 19561, 68020, 62673, -7074, 38002, 69369, 105629, 59948, 19918, 60831, 55386, 17950, 59662, 33178, 55079, 38843, 4553, -12111, 30011, 54677, 3933, 33104, -6810, -50557, -29075, -44392, 16914, 38409, 95619, 147842, 88449, 102496, 157586, 139616, 54320, 69539, 49575, 64501, 125629, 141321, 168685, 186367, 121987, 102915, 111270, 102154, 103814]
6566A03814m6215N4495O6355o7058j11041k625k7047O8321K0668J0339O143o9611
6554F538J1364m277K5358L1781l6079K1806m6545l8203L8208j3894J4609p000
6542C666o5023r453J5128j6158j0388m1189L4985N0267L2921j677L4099L8463
6530F5641K1022J2113o2254j8827k3043m9412K8779m0671M7618K6532j5994q841
6518a7337j0542L727L8200J2597m1927M1189o3583j7416L7337L6153J460j3752
6506F106l7030R731K0845L8118M4324l7441n7468J851L9049n2934K8641j7909
6494a4117j520k8390P0244L5920k7360J179K9208l4364j0426M9699o3205O444
6482A3312j8920m258j2251K819k8211k0542L5601L127J09818K7638j1739r595
$$ y = [103814, 57599, 112094, 178449, 111391, 350, -2275, -29322, 38999, 59667, 70006, 76149, 6538, 17902, 13625, 38983, 70764, 34685, 56491, 9946, -28257, 9951, -3943, 10666, 3666, -61357, -70810, -55682, -71840, -82228, -123417, -88432, -38165, -5244, -6921, 27178, 65641, 86663, 98776, 36522, 17695, -5348, -54760, -25981, -66652, -19034, 7498, -8496, -17337, -27879, -24152, 14048, 26645, -15282, 25907, -37676, -55092, -17755, 18398, 19858, 6106, -30924, -21193, -348, 37770, 82094, 44653, -12815, -10964, 28085, -24849, 3792, -14117, -15637, -44027, 26217, 62137, 34777, 35956, 65164, 30800, 20374, 70073, 6868, 13312, -5608, -9866, -22117, -19298, -47509, -68051, -32450, -29323, 80495, 108133, 96394, 86799]
6470H6799k4936M9873j01682n9302Q219L2742K9465K5174k2134L464k1547k0405
6458a4270o1230p550P9516L1417o3407j2081K2317K2730J2464P5650J2366j6445
6446H1477k3851k0570M6921k9120K879l8720O728o115L5597j4368j3097k628j5409
6433I724J2258L6485k080l2053m4985L1420L8962O8382p9857k6149O3360m5774
6421B9693j9460j1634J1513l704j3865P3320j23877K1963R1169l1570R096l8580
6409e936m9564L3984M2508J7283O491J1943Q392o3922N0122p979n699Q2316O296
6396A26235m3704R978p124k5790k0140Q766k7477o493j13051K5277o889o509R6623
6383I702m7461j3148m4419P9846N3024p338o083k6874Q562k4270N659M8931M392
$$ y = [86799, 61863, 111736, 10054, -49248, -41029, -8287, 21178, 46352, 24218, 27682, 6135, -14270, -75500, -83050, -3534, 27883, -35524, -47605, -25288, -2558, 9906, 85556, 97922, 81477, 57626, 37056, 83977, 54857, 57736, 19016, 25744, 19629, 55226, 40858, 27761, 25133, 9724, 21982, 58467, 56387, 24334, -20651, 10769, 49731, 118113, 38256, 12107, 75467, 29693, 10233, -1401, 10112, 6408, -7457, 65863, -58014, -36051, 55118, 23548, 32644, -5936, -55500, -21516, 20992, 38275, 44766, 56709, 65101, 1179, 51301, 43322, 37623, 119939, 126235, 82531, 92509, 85385, 59595, 39455, 48221, 20744, 14251, -98800, -73523, -80412, -86921, 9702, -37759, -50907, -95326, -15480, 37544, 30206, 24123, -2751, 5811, -18459, -12800, 36131, 40523]
6370D0523L7124o5090j1071M6098m3317N0546N1930j4291n063j4827J3286M870
6358I0718n2230O147l4897N6345J1915k69j746J1863J5257k6920k2393j3131L9374
6345H0033M1306n9583r956q8527l707J18168K9838o2945o386n5981p02N483k8500
6332d1459N8478L563m830M9070m1521o1479L3535O6231Q642J051k494k9043j4039
6319B5705P526j9323k5969O692L8938J7885j6319J6981l4279o666K6600R410R086
6306E6267l6802l3158M2071M7444K901o696j2219j0458N835n5530K5317M0357
6294F5329L5266o2283j5597j0798J2547N3836j5612L3154j6525n4365j3134J879
6282A3697K8694m5999R336K7520M2478m747j9899k1050J5740k1888j1804K4826
$$ y = [40523, 77647, 12557, 1486, 47584, 4267, 54813, 106743, 92452, 87389, 72562, 85848, 90718, 38488, 44635, 9738, 66083, 77998, 77729, 75983, 87846, 103103, 76183, 53790, 40659, 80033, 121339, 61756, 51800, -36727, -40434, 77734, 107572, 44627, 38241, -17740, -18442, -12959, -41459, 17019, 20582, 15752, 64822, 23301, -38178, -4643, 61588, 70230, 71281, 68787, 39744, 25705, 33231, 13908, -12061, -5369, 33569, 51454, 35135, 52116, 17837, 11171, 37771, 47181, 56267, 19465, -13693, 28378, 75822, 78723, 72027, 59808, 49350, 55185, -345, 24972, 65329, 100595, 38312, 22715, 11917, 24464, 78300, 62688, 95842, 79317, 24952, 11818, 13697, 42391, -3608, 5728, 33248, 75726, 70979, 51080, 30030, 45770, 23882, 12078, 36904]
6270C6904L3541J4688J1542N7197o8934j18367N3301K2287L552O866J3410m6597
6258A9390j2198N5747M265o2633q064k7805K9588K3689K2582P8089n9237m3845
6246A9568n3120J7706Q5997k5338m5625Q0957L4853j5426j02407l7825J9895j8743
6234c9508M3971L7442k8266K3019Q109J2378J8031J4284O2350m1219L7876l5780
6222A12687p8353l2459n981l9858L2442J07069l4218k8457J5269Q9630m2390J1413
6210A06794o2177R465k0180n588k0832L9022N5723k7443M3975l942m6448m7193
6198B1176L1837J3147O52M0438p0981L4090L3148l9728J0131J9327l0536l209
6186E9492O3202j4251q727M5789J28499R6723L8848N8232L8141k2179j7567M9058
$$ y = [36904, 70445, 85133, 96675, 153872, 84938, -33429, 19872, 42159, 45711, 52577, 65987, 19390, 7192, 62939, 67204, 4571, -3493, -31298, -1710, 21979, 44561, 122650, 63413, 19568, -33552, -15846, 70151, 44813, -812, 80145, 114998, 99572, -2835, -40660, -20765, -39508, 4463, 41905, 13639, 36658, 44767, 57145, 75176, 89460, 151810, 110591, 148467, 112687, 34334, 1875, -4106, -43964, -11522, 95547, 61329, 32872, 48141, 137771, 95381, 106794, 44617, 54082, 33902, 28314, 7482, 46504, 102227, 74784, 118759, 114817, 68369, 21176, 53013, 66160, 66812, 107250, 36269, 70359, 103507, 63779, 73910, 93237, 62701, 59492, 122694, 108443, 99716, 145505, 274004, 370727, 409575, 467807, 505948, 483769, 466202, 515260]
6174E15260M821j12593m0471K1492M6464N7237J36667o0983j3781n1623o3521
6163D38969J9050p5164o7326l1955p6415p5394j1978j6441M8714l5043j1506q808
6151I6703J9291Q6339l0597o9313K6930o028k8489J8150K2609p6059j445m205
6139E3886k036l4549L6094R4019p6864l6761J0406L7085m706P97K8230p283j8227
6126H0091q5737M2215P0574L459o703L5436j8442m7051L6012J3105O6163n4753
6114A34369n0136L1257o9032r626j4057L1870k2317q7946J18862l9209k8228M8097
6102D3904J8714o85j9990k6673K3975K9314j574L9076l3390o728L3621M4069o4177
6089G9456Q069L6427o2292P500K3833J16342m2472j13857M8922K9322K4963j3355
$$ y = [515260, 520081, 407488, 367017, 388509, 434973, 492210, 628877, 567894, 554113, 502490, 438969, 458019, 382855, 315529, 283574, 207159, 131765, 119787, 103346, 152060, 117017, 105511, 96703, 115994, 202333, 171736, 102423, 129353, 123325, 94836, 112986, 135595, 59536, 58091, 53886, 51850, 17301, 53395, 147414, 70550, 33789, 44195, 81280, 76574, 77371, 105601, 98318, 80091, -5646, 36569, 107143, 110602, 103899, 139335, 120893, 73842, 109854, 122959, 189122, 134369, 84233, 115490, 46458, 36832, 22775, 54645, 32328, -55618, 63244, 24035, -4193, 43904, 62618, 61933, 41943, 15270, 39245, 68559, 66985, 106061, 72671, 65943, 99564, 143633, 79456, 87525, 123952, 61660, 69160, 92993, 209335, 166863, 53006, 101928, 131250, 156213, 142858]
6077A42858k1231o573j831L519p296K0321K1219k5472l0421k854L1520j224R112
6064A31647J538k3759l4006k1074P835N119K5893k3169m9510N1711N6989k3427
6052A05787Q337l2128k4294M4832Q2851K6797K8718l9310q5307n9610k3360P4608
6040A07921N8296o2211k073j3745j1810J8302J6634M4361j7677m9474Q3600r710
6028A62414r127l0069j3778K2662N590M2928J8647R373j3423K8220N3760k3676
6016B53521o3668R862l5688K2878o7048K3371K5296j5561K5150k9464O389M874
6004A59912k76K9143k1856n834L3229N2298K4372n618J7228q394m2704K041O2287
5991B95828K2881L330k1540J8473L3850j5392J4458L3355m4267m7017l0724l5500
$$ y = [142858, 121627, 115054, 113223, 116742, 109446, 129767, 150986, 125514, 95093, 92239, 123759, 122535, 131647, 133185, 109426, 75420, 54346, 62181, 67300, 93193, 70024, 20514, 72225, 129214, 105787, 114124, 81996, 57702, 102534, 185385, 212182, 240900, 201590, 116283, 56673, 33313, 107921, 166217, 104006, 101933, 88188, 76378, 94680, 111314, 155675, 137998, 88524, 172124, 162414, 153287, 123218, 109440, 132102, 137692, 180620, 199267, 208640, 195217, 223437, 277197, 253521, 189853, 199715, 164027, 186905, 119857, 143228, 168524, 152963, 178113, 148649, 155038, 159912, 159636, 188779, 166923, 161089, 194318, 246616, 270988, 265370, 282598, 274204, 231500, 233541, 295828, 318709, 322039, 300499, 318972, 352822, 337430, 351888, 385243, 340976, 293959, 263235, 227735]
5979B27735m9779L8049r004K0867M1769j679K6175L8437J13106M7719K9258K6422
5967E49075R1660R9042R6553J19534K3294r6038O6067K6441m3813K6226m8912
5956I09129n4138O7004k5302N093q7756o298j2729k9075r258o1235o1142q4446
5944E49847j30254m1798n4006l88k4943L1241M3050K2520K6980j8051K6410n1113
5932C79495p0364j3163L7304q2808L5612o782l8252m0979n836k5525N4381M5020
5920B68103J4160n873K8323l5943K0301L2574k9625k8941R297J4787J491n171
5908B83483O6604K5005p6315J0606K9511L920m418j4273j7900n614J3526k1500
5896B92635j5663j9985k2052K8608q369J3234O1841n9635N751j8276p358L2726
$$ y = [227735, 177956, 216005, 207001, 227868, 269637, 267958, 294133, 332570, 445676, 493395, 522653, 549075, 640735, 739777, 836330, 955864, 979158, 883120, 949187, 975628, 931815, 958041, 909129, 854991, 921995, 896693, 901786, 814030, 807732, 795003, 765928, 756670, 695435, 634293, 549847, 419593, 377795, 323789, 323401, 298458, 329699, 372749, 395269, 422249, 404198, 430608, 379495, 309131, 295968, 333272, 250464, 286076, 279294, 241042, 200063, 194227, 168702, 223083, 268103, 282263, 276390, 304713, 268770, 289071, 321645, 292020, 263079, 272376, 287163, 288654, 283483, 350087, 375092, 298777, 309383, 338894, 342814, 338396, 324123, 306223, 300609, 314135, 292635, 276972, 256987, 234935, 263543, 255174, 268408, 330249, 270614, 276365, 258089, 250731, 283457]
5884B83457N5828N0905J7913p4128k6504j7531K9634M3302K1422j0576m095o5969
5872C03658m2339K65J5108M44j5926K8051k3576P9187L675j7187k9405O7080L7182
5859D06217K2274p672P758l0077l5099M9732l2171M4499o2767j5362J0018j2018
5847C45332Q1486j2983J01764K516m5376l5439j4646j957Q2833q8088k5933Q8195
5835D77704n083n112j0618N988J1054k5031O3991J1035J00461m678o8155J1837
5823E63393M9326O5043j0886l6334j1394K7547J5795L9647n5784R7O4981L425
5811G14856K5726J3320q5726L6073J873l8028N442q117L2175l782o7743N691Q602
5798F40362k2158l5403N6798Q196o6646P1788k6415q8648K8629R0254N7825k1622
$$ y = [283457, 339285, 390190, 408103, 333975, 307471, 289940, 319574, 362876, 384298, 373722, 369627, 303658, 261319, 261584, 276692, 277136, 261210, 289261, 265685, 344872, 348547, 331360, 301955, 369035, 406217, 428491, 420819, 428577, 398500, 363401, 413133, 380962, 425461, 362694, 347332, 357350, 345332, 426818, 413835, 515599, 518115, 472739, 437300, 422654, 420697, 503530, 415442, 389509, 477704, 472621, 467509, 456891, 462879, 473933, 448902, 512893, 523928, 624389, 619711, 551556, 563393, 612719, 677762, 666876, 630542, 619148, 646695, 662490, 702137, 646353, 646450, 711431, 714856, 740582, 753902, 668176, 704249, 706122, 668094, 673536, 665419, 697594, 693812, 626069, 631760, 640362, 618204, 582801, 639599, 647795, 581149, 652937, 626522, 537874, 566503, 656757, 714582, 692960]
5786F92960k2178J5333M7973j2225K323p261K7191J5692m0573N9909M6155K4581
5774H49880K7834k0442Q6835R1069m0637l9044j8422k2916M540N0942R4923J7145
5762A081707k7993K1868Q960m6071M4002R5939M6670J4912k7097m3344J5935l6772
5750A148716Q879l0675K5652L5542k3187M3828Q1653k2936l3920J04572q513J8829
5738A348440J5057J12500J4919o3593L5498R3306M7509p921P9182O4756J8327
5727A757980L6101P2142Q5282J08895K1565R6672Q2285K6753K5397L4861K2947
5716B370880K6516O4351j5093J2692Q5725J05830M8896N6768K7847k0529o225
5705B757658m029R4391K5381J0318L5886Q7013j5646J5853J28390Q0355K2219
$$ y = [692960, 670782, 686115, 734088, 721863, 724186, 716925, 744116, 759808, 719235, 779144, 825299, 849880, 877714, 857272, 944107, 1035176, 994539, 955495, 937073, 914157, 918697, 969639, 1064562, 1081707, 1053714, 1075582, 1084542, 1038471, 1082473, 1178412, 1225082, 1239994, 1212897, 1169553, 1185488, 1148716, 1157595, 1126920, 1152572, 1188114, 1164927, 1208755, 1290408, 1267472, 1233552, 1338124, 1329611, 1348440, 1363497, 1475997, 1490916, 1427323, 1462821, 1556127, 1603636, 1595715, 1674897, 1739653, 1757980, 1794081, 1866223, 1951505, 2060400, 2081965, 2178637, 2260922, 2287675, 2313072, 2347933, 2370880, 2397396, 2461747, 2446654, 2459346, 2545071, 2650901, 2699797, 2756565, 2784412, 2763883, 2757658, 2753629, 2848020, 2873401, 2883719, 2919605, 3006618, 2990972, 3006825, 3135215, 3215570, 3237789]
5694C237789J89739J40663P9223J93023Q5017R3512R0862Q6160J78808K02041
5684D576837J56544J76043J90966L25646K06606K02677L10518K39755K82685L75034
5674G043311L00413M53207M84654N69668N49266N14852P02760P47117Q46952J029983
5664A3242183J093727J371576J625341J879373K282224K898864L861359N219126
5656C3473773P304024R786758J3273243J6771900J8799735J8400772J3905347
5649A31715552O887162J249800k519848m404144m215322k165807J652234N437759
5641A33637386P439329O523373K456357l925174q445131j1074494j3431853j4859271
5633I8320522j5200594j4221044j2504316j0170343p860081o096820m731336l791941
$$ y = [3237789, 3427528, 3568191, 3647414, 3840437, 3925454, 4018966, 4109828, 4195988, 4374796, 4576837, 4733381, 4909424, 5100390, 5426036, 5632642, 5835319, 6145837, 6385592, 6668277, 7043311, 7343724, 7796931, 8281585, 8851253, 9400519, 9915371, 10618131, 11365248, 12212200, 13242183, 14335910, 15707486, 17332827, 19212200, 21494424, 24393288, 28254647, 33473773, 40777797, 50564555, 63837798, 80609698, 99409433, 117810205, 131715552, 138602714, 139852514, 137332666, 132928522, 128713200, 126547393, 128199627, 133637386, 141076715, 147600088, 150056445, 146131271, 137686140, 126611646, 113179793, 98320522, 83119928, 68898884, 56394568, 46224225, 38364144, 32267324, 27535988, 23744047]
5625B3744047l009427k409544j981539j509351j223926j117874j041318p65005
5617A0686063o86466o22609m88202m62486m79294l63435m00935l91379k59463
5608F531794k26914k05443j52494j68801j74946j12399j95220j91712j89407k13678
5598D700780j65567j58592n4182j33933j01255o4820j21122j04268m3159q3693
5588C670189k05261r6071m2793q2434j69394q2796l4940j21385p4911o5866j32524
5577B561814m0151n9261j27838j2088l1302p8569o5761l1857l6832k6086m7623
5566B004446o2751q4831l0591k0878n1696k9135M0777m6855l0610L0083n6167
5555A661792K3720j4582r7046o0303q719j0656L0810l0438K974m9242p4289M37
$$ y = [23744047, 20734620, 18325076, 16343537, 14834186, 13610260, 12492386, 11451068, 10686063, 9999597, 9376988, 8888786, 8426300, 7947006, 7583571, 7182636, 6791257, 6531794, 6304880, 6099437, 5946943, 5778142, 5603196, 5490797, 5295577, 5103865, 4914458, 4700780, 4535213, 4376621, 4322439, 4188506, 4087251, 4022431, 3901309, 3797041, 3753882, 3670189, 3464928, 3368857, 3326064, 3243630, 3074236, 2991440, 2956500, 2835115, 2760204, 2694338, 2561814, 2521663, 2462402, 2334564, 2322476, 2291174, 2212605, 2146844, 2114987, 2078155, 2052069, 2004446, 1941695, 1856864, 1826273, 1805395, 1753699, 1724564, 1765341, 1718486, 1687876, 1717959, 1661792, 1685512, 1670930, 1573884, 1513581, 1504862, 1494206, 1525016, 1494578, 1497552, 1448310, 1374021, 1374458]
5543A374458o5965j8716L7491K3449R070j7580k2643l0993n8810k6437l1236N974
5531A178062l145m3521p250M6853N4735N745K6781J20765r384q5489K4260j7770
5519A290642K5585k5153n2306P2848M8491m0359M8242l2660q588j7189l9873j3976
5507A255704j226p181p2692m9563k2505r563L7695M1551j4692L4720l0583l3409
5495A128256K1602N4381Q0813Q0617K1086J32949K71082L26402K60378K07348
5485B584914N5472k2315p2921j70922j24563k2987p8216K9944K13089K25498J57167
5474B774160J3247n4366j80642j55922j83714k05469j72831j41022j29201q5191
5464A479049j7387n5667J7476J1162p2289l6664j5629l1536L3469R4138N6576
$$ y = [1374458, 1308493, 1289777, 1327268, 1350717, 1359787, 1342207, 1319564, 1288571, 1229761, 1203324, 1172088, 1178062, 1174917, 1131396, 1124146, 1170999, 1225734, 1231479, 1258260, 1379025, 1369641, 1284152, 1308412, 1290642, 1316227, 1291074, 1238768, 1311616, 1360107, 1319748, 1367990, 1335330, 1326742, 1309553, 1269680, 1255704, 1254478, 1247297, 1174605, 1125042, 1102537, 1092974, 1130669, 1172220, 1157528, 1192248, 1161665, 1128256, 1149858, 1204239, 1285052, 1365669, 1386755, 1519704, 1790786, 2117188, 2377566, 2584914, 2640386, 2618071, 2545150, 2374228, 2249665, 2226678, 2148462, 2178406, 2391495, 2616993, 2774160, 2787407, 2733041, 2552399, 2396477, 2212763, 2007294, 1834463, 1693441, 1564240, 1479049, 1461662, 1405995, 1423471, 1434633, 1362344, 1325680, 1310051, 1278515, 1311984, 1406122, 1462698]
5453A462698J48898L8627P9059K1901M3222M1664n4032j6991R1171N7371Q9253
5442B002841Q8810M1368R5487J04548J35469O8662Q0927J11151J07768J48415
5432B985446K61241J43573J01718J56995J58421K02836K70051K54309K98833M47453
5422E280876N47908N89331P73624R76682J103301J527829K104477L228290N452389
5413B1584707Q264776R902567R415850N744439K60940k250329k987367l403945
5405D6531638l693176l401197j270281K160529N628995P214088N495696L45289
5397E9011581l543190m659899n277548n854711o517189o250485n632972m544346
5389A6731241l218755k182515j581179j397144j114583q07035p46964n80697m46673
$$ y = [1462698, 1611596, 1650223, 1729282, 1751183, 1794405, 1836069, 1782037, 1765046, 1856217, 1913588, 2002841, 2091651, 2133019, 2228506, 2333054, 2468523, 2537185, 2618112, 2729263, 2837031, 2985446, 3246687, 3390260, 3491978, 3648973, 3807394, 4010230, 4280281, 4534590, 4833423, 5280876, 5828784, 6418115, 7191739, 8168421, 9271722, 10799551, 12904028, 16132318, 21584707, 29849483, 39752050, 49167900, 54912339, 55173279, 52922950, 49935583, 46531638, 42838462, 39437265, 38166984, 40327513, 45956508, 53170596, 58666292, 59011581, 55468391, 50808492, 45530944, 39676233, 33159044, 26908559, 21275587, 16731241, 13512486, 11329971, 9748792, 8351648, 7237065, 6430030, 5683066, 5102369, 4655696]
5380D655696l33010k25895k34620k27209k43034j67261j60965q5043k32128j39560
5370B606971q7054r2347r8521p8823o0517p4103m6562M286o3154q4116o1666r9895
5358A764499j09768j1522o5967j06481M4850l093m262q8180k9748O242p9629r2622
5346A224319l0603j6792J1015M0193l2037n5674K7789J3500O374P7977j1110j4675
5334A240276q756N3827P6151L4370l766J2999n0144n0958M1723n4529l0041N9335
5322A320487Q585R167j0034q806n4957j19770o3686o2633r5785n1587r1530n1126
5310G28325l5465p270l6601p1763k6961J4740k0602k9773J220l9680k1969o2356
5298C91845m525n9584J0960L3560M0186j3593n4190J056M8268K056l4581k3346
$$ y = [4655696, 4322686, 4096791, 3862171, 3634962, 3391928, 3224667, 3063702, 2978659, 2746531, 2606971, 2519917, 2427570, 2329049, 2250226, 2189709, 2115606, 2069044, 2073330, 2010176, 1926060, 1864394, 1764499, 1654731, 1643209, 1577242, 1470761, 1515611, 1512518, 1508256, 1420076, 1390328, 1396570, 1316941, 1224319, 1193716, 1176924, 1187939, 1228132, 1196095, 1140421, 1168210, 1181710, 1188084, 1266061, 1254951, 1240276, 1231520, 1285347, 1361498, 1395868, 1392102, 1405101, 1354957, 1303999, 1345722, 1291193, 1261152, 1320487, 1329072, 1338239, 1328205, 1319399, 1264442, 1144672, 1080986, 1018353, 922568, 870981, 779451, 728325, 692860, 685590, 648989, 577226, 550265, 565005, 544403, 514630, 515850, 476170, 454201, 391845, 387320, 327736, 338696, 372256, 412442, 398849, 344659, 345715, 393983, 396039, 361458, 338112]
5286C38112K5462l9086o3446M8304p2034K225O3165m692M2128o2108n280J1945
5274B84695L1692m6592k7427K5627k5716L3309n3602q411K9059l0540n8641J14610
5262B68063K092o6614K0704m0282n667O1140q1793n5797Q5729j0880l2629r022
5250A35044Q3144l2551j3580O3247p860j9914K8410M4180q6163j5243k101o0694
5238A15919M496M8432L2844K206l2961R63j7763K3101j6680J8564J957M9352j4764
5225B15666k7543n7752p009K3815o5927K7096J2165n644N032r657P3559L5Q207
5212A92043M0994j0134l8714l8981Q817Q6067m8189n6878K5731K3203P5891k7099
5200B32751l5343m7441j3519L5646N1867o0446J1224J5333l3409o9379L4615K5236
$$ y = [338112, 363574, 324488, 261042, 309346, 237312, 239537, 302702, 298010, 340138, 278030, 272750, 284695, 316387, 269795, 242368, 267995, 242279, 275588, 221986, 213575, 242634, 212094, 153453, 268063, 270155, 203541, 224245, 183963, 178296, 239436, 157643, 101846, 187575, 176695, 144066, 135044, 218188, 185637, 172057, 235304, 227444, 207530, 235940, 280120, 193957, 178714, 176613, 115919, 120415, 168847, 201691, 203897, 170936, 171899, 154136, 177237, 160557, 179121, 181078, 230430, 215666, 188123, 130371, 123362, 147177, 81250, 108346, 120511, 114867, 119899, 110242, 183801, 183836, 192043, 233037, 222903, 184189, 145208, 154025, 240092, 191903, 135025, 160756, 183959, 259850, 232751, 197408, 149967, 136448, 172094, 223961, 163515, 174739, 190072, 156663, 87284, 121899, 147135]
5188A47135M8597n6877J4755j1157J0379J9909J9079J1470m6409j9191J3230n9840
5176I1080j5837L8471J0227q200M4898m481k1450K6954R810j9882L0120L4925
5164B16635j04991o032k1806m6298m45L2725K9467N5676L1805k3459k3055o841
5152A33381n7176N2330L0869l9337r1259N5870l0955J1080K2911M1721o0698o426
5140F2311N0911n2557L253k886r313R8332l1921k9557O7029k0156p0145k0789
5128D4512N1103k2108N8717k1054l6271K5328L9121o5022O805J1514L6060K8024
5116A56729k6106m1714P240J3495K5996n398j1059k5501l249k516J8551L0247
5104A36715j6057o604K6847j5690J7494M8601N7943J5184K9153Q1848p1946n5900
$$ y = [147135, 195732, 138855, 153610, 142453, 152832, 172741, 191820, 203290, 156881, 137690, 150920, 91080, 75243, 113714, 123941, 115741, 160639, 156158, 134708, 161662, 171472, 151590, 181710, 216635, 111644, 105612, 83806, 37508, 37063, 69788, 99255, 154931, 186736, 163277, 140222, 133381, 76205, 128535, 159404, 120067, 28808, 84678, 53723, 64803, 87714, 129435, 68737, 62311, 113222, 60665, 63918, 61032, 51719, 150051, 118130, 88573, 155602, 135446, 65301, 44512, 95615, 73507, 132224, 111170, 74899, 100227, 139348, 74326, 81131, 92645, 128705, 156729, 130623, 88909, 96149, 109644, 135640, 130242, 119183, 93682, 90433, 87917, 106468, 136715, 120658, 114054, 140901, 125211, 142705, 191306, 249249, 264433, 293586, 375434, 303488, 247588]
5092B47588j0002M1346J1755k1552o558J3207l2645p310R9152M3535m4911K1613
5080C55218l1467j7670k9452m4864l3824k8251m7451J4227l641K2505K6466j4747
5068A67049j9632j7500l6909L2146K8196p1633L0629Q724Q84L0128p8327r187
5056F4568M8466m7199K2833l5413m3104K5398N4405L0516o8531j5096L2697Q51
5044G0391L1960K2564L639j0658j8949p099Q25l1319j2937K3004m3037K6111J3807
5031F8302k6958N1323l7473J1673k2120j9478L8351m37N3061J0312j9368j6126
5019I1062r035k7117l5402M1692K0317M50J7852J3454K8190l9457j6784k6669
5007E8553K8227j0412P4641k6821m7719n0524K8381O9176l6217J0535n4478M1650
$$ y = [247588, 237586, 278932, 290687, 269135, 262577, 275784, 243139, 235829, 334981, 378516, 333605, 355218, 323751, 306081, 276629, 231765, 197941, 169690, 122239, 136466, 132825, 155330, 181796, 167049, 147417, 129917, 93008, 125154, 153350, 81717, 112346, 121070, 121954, 152082, 73755, 64568, 113034, 65835, 88668, 53255, 10151, 35549, 89954, 120470, 51939, 36843, 69540, 70391, 102351, 124915, 128554, 117896, 98947, 91848, 92673, 61354, 48417, 71421, 28384, 54495, 68302, 41344, 92667, 55194, 66867, 44747, 25269, 63620, 63183, 116244, 126556, 107188, 91062, 82027, 54910, 19508, 61200, 81517, 81967, 99819, 113273, 141463, 102006, 85222, 58553, 86780, 76368, 151009, 124188, 76469, 25945, 54326, 123502, 87285, 97820, 43342, 84992]
4995H4992M9410n9999K4588R946P013O322J354m5227k6447P58m2985Q5916M0684
4982A36325j1595j1239K3052l2111j4676m2804j759n0542P1010L6718L2997l0928
4970A04448o913K3949k3313L5506o898n0173M238M9679o132l4580L6442l3284
4958I2969k1742O919K9278k0218J759r061P3209j7794m340K5270J1571n992m3914
4945A17914P0623P1093o2258j6118j8364l1869J733O5502n2753j9843Q2997j0317
4933A98340k2685J0159o1367K5750P7718p1622K0548k3384j034r676J0269m5705
4921A07311L0315j2793K6772M147J8797k2141L6020O4577j5010n8453Q5577L0011
4909B95130J0871q6294j6241j2119O206q8223N1888N3424L6547n60q4016j8413
$$ y = [84992, 134402, 74403, 98991, 108937, 115950, 122272, 123626, 78399, 51952, 52710, 9725, 95641, 136325, 124730, 113491, 136543, 104432, 89756, 46952, 45193, -5349, 65661, 102379, 135376, 104448, 97535, 121484, 98171, 133677, 126779, 76606, 80844, 130523, 124391, 89811, 126253, 92969, 71227, 78146, 107424, 87206, 88965, 79904, 153113, 135319, 130979, 156249, 167820, 161828, 117914, 188537, 259630, 197372, 181254, 162890, 131021, 132754, 198256, 145503, 125660, 208657, 198340, 175655, 185814, 124447, 150197, 227915, 156293, 176841, 153457, 152423, 142747, 153016, 107311, 137626, 124833, 151605, 155752, 174549, 152408, 188428, 253005, 237995, 179542, 265119, 295130, 306001, 219707, 203466, 191347, 197553, 109330, 161218, 214642, 251189, 250629, 166613, 148200]
4897A48200o753j8466J8229M6509L1223j9135j4532k8211J1297m3150M1136L9562
4885B05909l0831j0005j7088L6827M4934L8419n3859N1400Q2338K8759n2640j775
4873C22388r765K2972P0068M6591M9325L6621K7041N7688m3701N884o5200m1383
4861D78529k0043L4137K2785M6051l8764m0248J9128K8411n8035j7153j5199n1011
4849C88588J1502n8371j6253m4483K5473j3071n5888l3105J3045J5721j8393N6747
4837B71512j8682l1916k6528N980L1998j7199l279k5673j1873L5843o065n5151
4825A48967J7493K9808N2533k2276l0012L2726m547N3007l6253l2293l457j5539
4813A90157o2759P1354N660N3953j1089r486J5934M7094m675j04105N9652O4859
$$ y = [148200, 141447, 122981, 141210, 187719, 218942, 199807, 185275, 157064, 168361, 125211, 166347, 205909, 175078, 165073, 147985, 184812, 229746, 268165, 214306, 265706, 348044, 376803, 324163, 322388, 312623, 335595, 405663, 452254, 501579, 538200, 565241, 622929, 579228, 585112, 519912, 478529, 458486, 492623, 515408, 561459, 522695, 482447, 501575, 529986, 471951, 454798, 439599, 388588, 400090, 341719, 325466, 280983, 306456, 293385, 237497, 204392, 217437, 233158, 214765, 271512, 252830, 220914, 194386, 200366, 232364, 215165, 211886, 186213, 174340, 210183, 204118, 148967, 166460, 196268, 248801, 226525, 196513, 229239, 224692, 277699, 241446, 209153, 205696, 190157, 127398, 198752, 204412, 258365, 247276, 237790, 253724, 300818, 296143, 192038, 251690, 316549]
4801C16549K8554J619n1050M5877J8340o1561p628l7951o8354k6845J4475O0082
4789B32107L4872n2754J4468l121l1385m6177Q045O0690J941m3950M1460o8644
4777A47552j5589N1579J4402J8248o770j814o7852l7039M0173O4462j8172j6025
4765A73155M8599j0261K4488M1792m5056q3213k6039L1765Q222J9109m2172K004
4753A42393k3607j3197L3647O5558P0471m9282O788o7333j6302l9325k4906M2409
4741A27314m6235M2691K4320k9523N5928K7375o3219O000j1538K6672K5484j0911
4729A74358J3097j8628L870m2026J5926L8610k555j9302R9765N54l0849l2425
4717B00395l8689J9990N2578J7730R750m6530K1283Q246N3020M577l5088M1625
$$ y = [316549, 345103, 346722, 295672, 341549, 359889, 298328, 290700, 252749, 184395, 157550, 172025, 232107, 266979, 214225, 228693, 225572, 194187, 148010, 156055, 216745, 218686, 174736, 216196, 147552, 131963, 183542, 197944, 216192, 209422, 207608, 139756, 102717, 142890, 207352, 189180, 173155, 221754, 211493, 235981, 277773, 232717, 149504, 123465, 155230, 163452, 182561, 140389, 142393, 118786, 105589, 139236, 204794, 275265, 225983, 232771, 165438, 149136, 109811, 84905, 127314, 81079, 123770, 148090, 118567, 174495, 201870, 138651, 144651, 133113, 159785, 185269, 174358, 187455, 168827, 172697, 130671, 146597, 185207, 182652, 163350, 263115, 263669, 232820, 200395, 161706, 181696, 234274, 252004, 261754, 215224, 236507, 244753, 297773, 302350, 267262, 308887]
4705C08887O8108J4769J1912k4967Q17l6885l2469M7912j7189m7048J9841N4909
4693C68597L0160l640K1471J8014q971j6764j21858q2826J8557N9281q2654R552
4681B08919J6351j3917n565L5336L7143J2944P745o3376m1183M8818l1901K3190
4669B34504k399m458n0467J005J2706O1733J23594k8037m3749K6282n6719p1263
4657B02732k0105R6991P75J156o9667m6139K5964O1659P03p8548M6810j0222L7192
4644B49301j0196j8563n8268P0480j1538l8119J08195M0561n9678k3572j5209
4633B33394J4340j0325K0498l2074k797N6040j5115Q23k629l0483P079L2127k0976
4620B49902L6387K899k7866l2958M3479J1439k2932j6848O0834k8128k0787N8820
$$ y = [308887, 376995, 391764, 403676, 378709, 379526, 342641, 310172, 358084, 340895, 293847, 313688, 368597, 398757, 395117, 416588, 434602, 425631, 408867, 287009, 204183, 222740, 282021, 199367, 208919, 225270, 211353, 205788, 241124, 278267, 291211, 298956, 235580, 194397, 243215, 211314, 234504, 232105, 227647, 177180, 178185, 190891, 252624, 376218, 348181, 304432, 330714, 273995, 202732, 182627, 279618, 280393, 281549, 211882, 165743, 191707, 253366, 254069, 175521, 222331, 212109, 249301, 239105, 220542, 162274, 232754, 221216, 183097, 291292, 331853, 272175, 248603, 233394, 247734, 237409, 257907, 225833, 223036, 279076, 263961, 264784, 262155, 231672, 238751, 270878, 249902, 286289, 289188, 261322, 228364, 271843, 283282, 260350, 243502, 304336, 276208, 255421, 314241]
4608C14241J812m6869k2792J01931L6650J8915l7211N942m4233o3807L1410L0106
4596C26095L7632K0395L774L7869l3699l6431j1028Q5659M7937m1627k7054q822
4584D00700P914m7941J5883N9425j4834j2350Q532n4170J9800N8798J812M439
4572D48008j6587P9147K2213m1565j5876o2946L7433N4675j2044N7266L5591m4796
4560E40519j9164k5006Q6433M7952L1287k0199J2347K7316O2329K8049J0371N8571
4548H40805k527j6080K6034K7843N9315M3606L5698J3888j61l9945n0068N3067
4536I91475l2116L318J9427k593K1365j9984o207n7045K0011P2157J2497k8713
4524I93592k9432J2374L1301N3312l8403p713l019P7411Q9238j3718m579n376
$$ y = [314241, 316053, 269184, 246392, 348323, 384973, 403888, 366677, 372619, 328386, 264579, 295989, 326095, 363727, 384122, 387896, 425765, 392066, 355635, 344607, 430266, 478203, 436576, 409522, 400700, 408614, 360673, 376556, 435981, 421147, 408797, 417329, 363159, 382959, 441757, 443569, 448008, 431421, 510568, 532781, 491216, 475340, 412394, 449827, 504502, 492458, 549724, 585315, 540519, 521355, 496349, 582782, 630734, 662021, 641822, 654169, 681485, 743814, 771863, 782234, 840805, 838278, 822198, 848232, 876075, 935390, 978996, 1014694, 1028582, 1028421, 988476, 938408, 991475, 959359, 962677, 982104, 979511, 1000876, 980892, 974685, 917640, 937651, 1009808, 1022305, 993592, 964160, 976534, 1007835, 1061147, 1022744, 1015031, 1012012, 1089423, 1178661, 1164943, 1160364, 1154988]
4512A154988N4841N0053O4681N834p1712j0563M1703J0585o7409L4442R1N4070
4500A321604M4697l4370N5895l9603o5149J6377J4669l7478m6119l8584J7082
4489A209021L574O527K4595k9861k2568k3874l20N621l1470K2033J1661R331L9788
4476A224058n9182K7188k9574m2662J3211M582J6241l773l8173K3467K7075M3886
4464A206344k213M7666j8155n1356k2146L995p374j6944O9043o9100p4282N4993
4452A120471J2628M2932R754K5489k5203k2450j5278l0760L9803k1562m5129l4968
4440A055727K3357k1651M742K590j0399n8922m52J7001M8981k044M2305J7366
4428A118601O3135N6268K3679L7968N1428o915N2006m6931j6645Q5840N3193Q4052
$$ y = [1154988, 1209829, 1259882, 1324563, 1330397, 1258685, 1248122, 1289825, 1300410, 1233001, 1267443, 1267534, 1321604, 1366301, 1331931, 1387826, 1348223, 1283074, 1299451, 1314120, 1276642, 1230523, 1191939, 1209021, 1212595, 1219122, 1243717, 1213856, 1191288, 1167414, 1167094, 1172715, 1141245, 1163278, 1174939, 1184270, 1224058, 1164876, 1192064, 1162490, 1119828, 1133039, 1137621, 1153862, 1150089, 1111916, 1135383, 1162458, 1206344, 1204131, 1251797, 1233642, 1182286, 1160140, 1164135, 1156761, 1139817, 1208860, 1139760, 1065478, 1120471, 1133099, 1176031, 1185785, 1211274, 1186071, 1163621, 1148343, 1117583, 1157386, 1135824, 1090695, 1055727, 1079084, 1057433, 1062175, 1064765, 1054366, 995444, 994992, 1011993, 1060974, 1058930, 1101235, 1118601, 1181736, 1238004, 1261683, 1299651, 1351079, 1344164, 1396170, 1349239, 1332594, 1418434, 1471627, 1555679]
4416A555679J03446L7872R139L4825j0485n7521o8921Q9005L6177r686j9942Q5480
4404A785068M1682N6874k787p7878k1594p9178o4289O6289O5380J6686O8012J6205
4392A870470M6765N867P1854N8003N797Q5856O0947J17046J01220j1265K7926
4381B440486J3366L0510R9882M2023J26979J47859O6562M9096L7930k1705k0076
4370C012912m8661M7196J7618P0394L5917P9680N3170M9873o3514k5608R8044
4359C327021R741K7322N5246M129L7837r710L1364P9886P3244Q9573J21598J14639
4347C961890O1758J76735J15172N6381O4634R6803J17239J43950J15813K25628
4337E136003K19983J99874J97978K18602K04959K71293L51724L39489L95892M92561
$$ y = [1555679, 1659125, 1696997, 1706136, 1740961, 1730476, 1672955, 1604034, 1693039, 1729216, 1719530, 1699588, 1785068, 1826750, 1883624, 1880837, 1802959, 1781365, 1702187, 1637898, 1704187, 1769567, 1786253, 1854265, 1870470, 1917235, 1923102, 1994956, 2052959, 2058756, 2144612, 2205559, 2322605, 2423825, 2412560, 2440486, 2453852, 2484362, 2584244, 2626267, 2753246, 2901105, 2967667, 3016763, 3054693, 3032988, 3012912, 2964251, 3011447, 3029065, 3099459, 3135376, 3215056, 3268226, 3318099, 3254585, 3228977, 3327021, 3336762, 3364084, 3419330, 3423459, 3461296, 3451586, 3482950, 3562836, 3636080, 3725653, 3847251, 3961890, 4023648, 4200383, 4315555, 4371936, 4436570, 4533373, 4650612, 4794562, 4910375, 5136003, 5355986, 5555860, 5753838, 5972440, 6177399, 6448692, 6800416, 7139905, 7535797, 8028358]
4327H028358N89101Q10196Q89652J216177J550049K221258K608993L257024L842329
4318B5013137M344031M448626L869842K985191J970560J334619J574164K615337
4310D8155507M334617O376561P815653P590502N473558K115332p66501k665438
4302G8429791l829619m436782l971204j990628O53692K738347K768756O61717
4294G1024070k512986m379462n123555n335736n824651n640967m421165k122673
4286C5662875L07698J757806J532160q81777k903300l104956l078470l046914
4278B6245122l385823l193459k785902k144358j462947j012011p28044m90238
4270A1042340l58088k97404k36856j86144r2307J5357m1455k0958N1249l9764
$$ y = [8028358, 8617459, 9427655, 10317307, 11533484, 13083533, 15304791, 17913784, 21170808, 25013137, 29357168, 33805794, 37675636, 40660827, 42631387, 43966006, 45540170, 48155507, 52490124, 58866685, 66682338, 74272840, 79746398, 81861730, 81095229, 78429791, 74600172, 70163390, 66192186, 64201558, 64855250, 67593597, 70362353, 71024070, 68511084, 64131622, 59008067, 53672331, 47847680, 42206713, 37785548, 35662875, 35970573, 37728379, 39260539, 38378762, 35475462, 32370506, 29292036, 26245122, 22859299, 19665840, 16879938, 14735580, 13272633, 12260622, 11532578, 11042340, 10684252, 10386848, 10149992, 9963848, 9871541, 9886898, 9845443, 9824485, 9875734, 9835970]
4260I835970J07366J28334K06084J20936J51925J34094J71313K85412L10981L17808
4250A1770223L54773L37201M37465L47962L91121N34699O16678O34907O75819
4241A6100848O35504P24091Q74379Q83494R16626J022028J127378J260560J290377
4232B4835285J335227J404452J522040J646904J668884J754862J907586K027358
4224C8102598K112968K228832K348950K372940K408286K437713K442110K464770
4216E6919167K427608K351965K271077K263674K190490K242492K258085K229808
4208G5154366K268997K246107K152842K044380J879451J628858J424102J060606
4200H9859709Q46516O95857N00131M44116K77523J29951R6493p0776k58161l71932
$$ y = [9835970, 9943336, 10071670, 10277754, 10398690, 10550615, 10684709, 10856022, 11141434, 11452415, 11770223, 12124996, 12462197, 12899662, 13247624, 13638745, 14173444, 14790122, 15425029, 16100848, 16736352, 17460443, 18334822, 19218316, 20134942, 21156970, 22284348, 23544908, 24835285, 26170512, 27574964, 29097004, 30743908, 32412792, 34167654, 36075240, 38102598, 40215566, 42444398, 44793348, 47166288, 49574574, 52012287, 54454397, 56919167, 59346775, 61698740, 63969817, 66233491, 68423981, 70666473, 72924558, 75154366, 77423363, 79669470, 81822312, 83866692, 85746143, 87375001, 88799103, 89859709, 90706225, 91402082, 91902213, 92346329, 92623852, 92753803, 92850296, 92779520, 92521359, 92149427]
4190I2149427o22541q55230j105691j282004j442247j677908j771272j974221
4182H1418313k008359k002389k114653k211010k189982k127995k231061k312058
4174F4220806k263355k292461k426773k372887k458866k377980k321497k298793
4166D5408194k188327k078545j989595j881255j870785j744529j712550j633004
4158C0309604j630654j558245j455131j420005j330491j310827j233456j158611
4150A9212184j052737r91766r25960p72315p68987p74978o16634n83760n81233
4141A2143814n97536n31566m76888m61660m16079l78839m07018m08742k95322
4132H170164k13413k66128k33652k77296k37894k12172k58746j74583q1925j40389
$$ y = [92149427, 91526886, 90671656, 89565965, 88283961, 86841714, 85163806, 83392534, 81418313, 79409954, 77407565, 75292912, 73081902, 70891920, 68763925, 66532864, 64220806, 61957451, 59664990, 57238217, 54865330, 52406464, 50028484, 47706987, 45408194, 43219867, 41141322, 39151727, 37270472, 35399687, 33655158, 31942608, 30309604, 28678950, 27120705, 25665574, 24245569, 22915078, 21604251, 20370795, 19212184, 18159447, 17167681, 16241721, 15469406, 14700419, 13925441, 13308807, 12725047, 12143814, 11546278, 11014712, 10537824, 10076164, 9660085, 9281246, 8874228, 8465486, 8170164, 7956751, 7690623, 7456971, 7179675, 6941781, 6729609, 6470863, 6296280, 6214355, 6073966]
4122F073966j57690r8537j38039j33216q0607k4477r0332r3140r8819o0159k2674
4111E076276n3254j6020n6884l3658n1098j6997m722K765l9481q99K815L1240
4099D840083J8130Q6937K4829j1830Q7377J5002n30N409L2556O3826p7690m3286
4087E040813P2825R556M740K6798J2475m2809k2158R6361l3234J6369m3805m5453
4075E092478m1955N624n5799o2306j060p1726p8831L8526Q337p3244J159n150
4063D756053k6745o6722K8732m687l3733m8085j3111l1759k575O317K1498j6731
4051D568452j6931p190L2256J7946O9019R6874J1288q7930N9989K7849J2076M9060
4039D832758R0634N8223n5078M07P5338j673P6976Q7634Q629M1909O6665P9168
$$ y = [6073966, 5916276, 5817739, 5679700, 5546484, 5465877, 5441400, 5351068, 5257928, 5159109, 5098950, 5076276, 5023022, 5007002, 4950118, 4916460, 4865362, 4848365, 4843643, 4846408, 4806927, 4806028, 4808843, 4840083, 4858213, 4945150, 4969979, 4958149, 5045526, 5060528, 5059998, 5065407, 5097963, 5161789, 5084099, 5040813, 5113638, 5123194, 5127934, 5154732, 5167207, 5124398, 5102240, 5198601, 5165367, 5181736, 5137931, 5092478, 5050523, 5056147, 5000348, 4938042, 4936982, 4865256, 4786425, 4824951, 4833288, 4760044, 4761203, 4756053, 4729308, 4662586, 4691318, 4686631, 4652898, 4604813, 4591702, 4559943, 4557368, 4563685, 4585183, 4568452, 4551521, 4544331, 4576587, 4594533, 4663552, 4760426, 4771714, 4683784, 4743773, 4771622, 4783698, 4832758, 4923392, 4981615, 4926537, 4926944, 5002282, 5000609, 5077585, 5165219, 5173848, 5215757, 5282422, 5361590]
4027E361590J47693J30478J3665N2169J11360J44455Q0977K34714J81161J28235
4017F586497J62584J31669K32385K22533K10657K17012J77582K20868K79378K87304
4007H728469L76248M07777L79798L80381M06009M57734M83652M08689M67626N34303
3997A3030686N82708O01183O47483P60340Q03908R04033J011670J257796J532652
3988B1132459J753116J966932K366227K831016L287647L937032M786747N988369
3980D8049545P462222R451575J1593029J3668145J5279586J5947083J5418112
3973A36869297J3823243J1086402P853814M586035J632438p15758k282223l148232
3965A69705016l030109k248388j170057J36590J364974K008122J858460Q82723
$$ y = [5361590, 5509283, 5639761, 5653426, 5705595, 5816955, 5961410, 6042387, 6277101, 6458262, 6586497, 6749081, 6880750, 7113135, 7335668, 7546325, 7763337, 7940919, 8161787, 8441165, 8728469, 9104717, 9512494, 9892292, 10272673, 10678682, 11136416, 11620068, 12028757, 12496383, 13030686, 13613394, 14214577, 14862060, 15622400, 16426308, 17330341, 18342011, 19599807, 21132459, 22885575, 24852507, 27218734, 30049750, 33337397, 37274429, 42061176, 48049545, 55511767, 64963342, 76556371, 90224516, 105504102, 121451185, 136869297, 150692540, 161778942, 169632756, 174218791, 175851229, 175135471, 172853248, 169705016, 166674907, 164426519, 163256462, 163393052, 164758026, 166766148, 168624608, 169507331]
3957A69507331j144731l801556o709398r359892j1418431j2798955j3441597j3236111
3949I7596660j2379728j1189951r851227q413307p069108n837890m741897m022196
3941C4091356l356426k832214k424457j978891j724099j416844j224020r49579
3933A8184826r18434p05372n65833n16923m80773m17913l40995k46898j88897
3924A3802788j71357k29370j90786q4320j59089j71879j02203j08168j10791r8421
3914A2376404r3915r4854p0515q4262M0189k6169J4067J2373J10095P0659j7589
3903A2236483N7333Q2520M4365N7759J05550O6180J8386m5153j9826N1905J37700
3892A2793202J00672R0414J65080J97814K83490K78548L21595L79631L80879M13040
$$ y = [169507331, 168362600, 164561044, 157851646, 148491754, 137073323, 124274368, 110832771, 97596660, 85216932, 74026981, 64175754, 55762447, 48693339, 42855449, 38113552, 34091356, 30734930, 27902716, 25478259, 23499368, 21775269, 20358425, 19134405, 18184826, 17266392, 16561020, 15995187, 15478264, 14997491, 14579578, 14238583, 13991685, 13802788, 13631431, 13402061, 13211275, 13126955, 12967866, 12795987, 12693784, 12585616, 12474825, 12376404, 12282489, 12187635, 12117120, 12032858, 12073047, 12046878, 12060945, 12073318, 12183413, 12254072, 12236483, 12293816, 12376336, 12420701, 12478460, 12584010, 12650190, 12668576, 12623423, 12603597, 12655502, 12793202, 12893874, 12984288, 13149368, 13347182, 13630672, 13909220, 14230815, 14610446, 14991325, 15404365]
3882A5404365M60661M46600M76551N70855O44116P24885P24946O92911Q16008
3873B0961898P57710P19375O23724O67068N86037O23043O45392O63788Q01709
3864B7049744P06479Q27367P97980O79921N90992N29351L57280K84816J45131
3855C1969061J29772J22335K0851J2910J70971J71811K05026J37240P3063J0767
3845C3023807L2350o6684j32072j04570p1758m4466M1007l903J24369K35607L27416
3834C3361103M57472O17319P42504P32418R54146J252771J453420J789529K070371
3825D3431053K453882K930842L429555L973846M589422N300951O228264P279599
3817G9617414Q750671J0631358J2743171J4890042J6512200J7250824J7122961
$$ y = [15404365, 15865026, 16311626, 16788177, 17359032, 18003148, 18728033, 19452979, 20145890, 20961898, 21719608, 22438983, 23062707, 23729775, 24315812, 24938855, 25584247, 26248035, 27049744, 27756223, 28583590, 29381570, 30061491, 30652483, 31181834, 31539114, 31823930, 31969061, 32098833, 32221168, 32242019, 32254929, 32425900, 32597711, 32802737, 32939977, 33013040, 33023807, 33056157, 32989473, 32857401, 32752831, 32681073, 32636607, 32677614, 32673711, 32798080, 33033687, 33361103, 33818575, 34435894, 35178398, 35910816, 36864962, 38117733, 39571153, 41360682, 43431053, 45884935, 48815777, 52245332, 56219178, 60808600, 66109551, 72337815, 79617414, 88368085, 98999443, 111742614, 126632656, 143144856, 160395680, 177518641]
3810A77518641J6151315J4676045J2687666J0472715Q286183O495772N217680
3803B51506017M593148M519941M924510N739269O511565P173076P667320P732650
3795C00367496P244074N726391K844255p41931m330394p024567q693209r419620
3787B85972495r547706r165398q387002p348642o330770n608744n122459m879956
3779B29581818n098441n429283n837914o296001o762776p189990p208883o984998
3771A78773532o611509n981778n455373m873281m576966m517791m732948n001502
3763A37022384n329467n847229o332721o639264o684835o405283o074025n492653
3755H8216907m751371m110341l578724l249032l087525l002329l072727l219614
$$ y = [177518641, 193669956, 208346001, 221033667, 231506382, 239792565, 246288337, 251506017, 256099165, 260619106, 265543616, 271282885, 277794450, 284967526, 292634846, 300367496, 307611570, 313337961, 316182216, 315440285, 311109891, 304085324, 295392115, 285972495, 276424789, 267259391, 258872389, 251523747, 245192977, 239584233, 234461774, 229581818, 224483377, 219054094, 213216180, 206920179, 200157403, 192967413, 185758530, 178773532, 172162023, 166180245, 160724872, 155851591, 151274625, 146756834, 142023886, 137022384, 131692917, 125845688, 119512967, 112873703, 106188868, 99783585, 93709560, 88216907, 83465536, 79355195, 75776471, 72527439, 69439914, 66437585, 63364858, 60145244]
3747F0145244l246751l260588l114041k864919k521880k135779j800479j537430
3739C9663377j258037j070621r96878q01498p00119o20205m52418k22097j60553
3730C3380951N5242K15261K79473K43368L34352K12876O1715o2290k32188l06649
3720C4182111n53219o09343o50604o08519o57942o23459n88112n80277n05395
3711B8805241m14698m29245n19381n63288o54233o79125p10490p66638p12856
3702B3355287q16142p86722o20666o56352o19282n00079n24928m69882m11755
3693A7949479l61209l73226l60676k89324k17539k10970k84306j28794k04155
3684A5519280k52688j71340k22239j74915k01252k29702k13670j92720j80294
$$ y = [60145244, 56898493, 53637905, 50523864, 47658945, 45137065, 43001286, 41200807, 39663377, 38405340, 37334719, 36337841, 35536343, 34836224, 34216019, 33763601, 33541504, 33380951, 33436193, 33651454, 33930927, 34174295, 34508647, 34721523, 34783238, 34720948, 34488760, 34182111, 33628892, 33019549, 32368945, 31760426, 31102484, 30479025, 29890913, 29310636, 28805241, 28390543, 27961298, 27441917, 26878629, 26224396, 25545271, 24834781, 24068143, 23355287, 22539145, 21752423, 21131757, 20475405, 19856123, 19356044, 18831116, 18361234, 17949479, 17588270, 17215044, 16854368, 16565044, 16347505, 16136535, 15852229, 15723435, 15519280, 15266592, 15095252, 14873013, 14698098, 14496846, 14267144, 14053474, 13860754, 13680460]
3675A3680460j65239k83795j90781j17594j47196k36677k08027k00030k23774
3666A1907347j82620k44460j63157k42633k30691k04518j64496k69725k67835
3657I937212k14864k47785k15103j79525j28356k43342k54397j86650j77041j19720
3647G970429j67181j11769j97479k07602j34579k05694j49797r6170j32646j81004
3637F386508j65513j08530p7522j07140j36510j55222q3821j20897m8321j80915
3627E202117j62185m3305j28882o0429n7061j89601r4304q9899j20648j21973
3617D133830j29352m5204n6201j05099o683M3636j52978m9126l9104j11996o4705
3606C417018o3164j02209m9097m2449m1952k4809p1352q4099k5463p117k8177
$$ y = [13680460, 13515221, 13231426, 13040645, 12923051, 12775855, 12539178, 12331151, 12131121, 11907347, 11724727, 11480267, 11317110, 11074477, 10843786, 10639268, 10474772, 10205047, 9937212, 9722348, 9474563, 9259460, 9079935, 8951579, 8708237, 8453840, 8267190, 8090149, 7970429, 7803248, 7691479, 7494000, 7286398, 7151819, 6946125, 6796328, 6700158, 6567512, 6386508, 6220995, 6112465, 6034943, 5927803, 5791293, 5636071, 5552250, 5431353, 5383032, 5202117, 5039932, 4996627, 4867745, 4807316, 4750255, 4560654, 4466350, 4376451, 4255803, 4133830, 4004478, 3959274, 3903073, 3797974, 3791291, 3834927, 3681949, 3632823, 3593719, 3481723, 3417018, 3353854, 3251645, 3202548, 3160099, 3118147, 3093338, 3021986, 2937887, 2912424, 2905307, 2877130]
3595B877130k2526o4413p108p8036M0794m649o2514m5119J5847O971q3474r4075
3583B478828k5853k9576L8609m5340m1192J5054q6721n6215m341J8371l542l2422
3571B225660p6700m7905j761K9498p138J3527J9817k2432j09397l5065N598K3716
3559B017418l2383m0141l5249n459L8611q585j1383K5857j1243o7360O032l499
3547A872616r2524j71k7774l2756P7684j1359o116l8592O522O3638n1191k5846
3535A734131K9266J9726Q506L6787J15793L1368k1985M5190J8733O1174L8678
3524B117367Q4239Q6319L4839Q2157P2617M8787Q3332m648L6993M1685k939K8163
3512B708911Q8651p381q2915k0475M5298R78L0387K7257q909P3620K4710k1993
$$ y = [2877130, 2854604, 2790191, 2783083, 2705047, 2745841, 2741192, 2678678, 2633559, 2649406, 2656377, 2572903, 2478828, 2452975, 2423399, 2462008, 2416668, 2375476, 2390530, 2303809, 2247594, 2243253, 2261624, 2258082, 2225660, 2148960, 2101055, 2099294, 2128792, 2121654, 2135181, 2154998, 2132566, 2023169, 1988104, 1993702, 2017418, 1985035, 1944894, 1909645, 1904186, 1942797, 1934212, 1922829, 1948686, 1937443, 1870083, 1876115, 1872616, 1780092, 1779921, 1752147, 1719391, 1797075, 1785716, 1779600, 1741008, 1747530, 1811168, 1759977, 1734131, 1763397, 1783123, 1791629, 1828416, 1944209, 1975577, 1953592, 1998782, 2017515, 2078689, 2117367, 2201606, 2287925, 2322764, 2404921, 2477538, 2526325, 2609657, 2605009, 2642002, 2683687, 2680748, 2708911, 2797562, 2790181, 2707266, 2686791, 2732089, 2733067, 2763454, 2790711, 2781802, 2855422, 2880132, 2858139]
3500B858139j07990j5816k2007l0952n9786o9588K0811m8126k1005Q080n7868
3489B453892m9910J9439M600l0417r7387K3826J6594l6354o0548j8822m7399l8388
3477B139126L1547J523J1760K3298j9408m4290j3377p0560n1946N0251P1276m9943
3465B079257M3119N4515k8293k1027K9476N3249J28448R3471j1859P2936J59783
3454B653075R7283J72920J62166K91329K99684J55010J58326J31398J6800O1051
3444D199042p9240j16786j21496k54895j27156j36859k90113j83740j48251j96231
3434B544275j82404j47462j44655q6240o0295n8459l4944j56802n8244L7081L5748
3423A687599O1221J93732L53365M04745L96318J47862j53054j92233k91400j82379
$$ y = [2858139, 2750149, 2734333, 2712326, 2681374, 2621588, 2552000, 2572811, 2524685, 2503680, 2511760, 2453892, 2403982, 2423421, 2428021, 2397604, 2300217, 2324043, 2340637, 2304283, 2243735, 2224913, 2177514, 2139126, 2170673, 2172196, 2183956, 2207254, 2187846, 2143556, 2130179, 2059619, 2007673, 2057924, 2129200, 2079257, 2122376, 2176891, 2148598, 2127571, 2157047, 2210296, 2338744, 2432215, 2420356, 2493292, 2653075, 2750358, 2923278, 3085444, 3376773, 3676457, 3831467, 3989793, 4121191, 4137991, 4199042, 4119802, 4003016, 3881520, 3626625, 3499469, 3362610, 3072497, 2888757, 2740506, 2544275, 2361871, 2214409, 2069754, 1983514, 1923219, 1864760, 1829816, 1673014, 1614770, 1651851, 1687599, 1748820, 1942552, 2295917, 2700662, 3096980, 3244842, 3091788, 2899555, 2608155, 2425776]
3413B425776k57929k14905k25622j55870j47482j39273o3727k8949l1081o7804
3403A093134l8227k0070n0106m3564R0956M4650L8889N0915M4252K92095M54579
3392A957503L53248K75521O8709o1673j25926j95581k20201k49672j63610k26175
3382A412143k08001j18523j07286l1532k7375L416l8689q7382k5420l0005o7925
3371F73421M0784o199J9617n946l053M9388L4107j5824p4136m9199L1005l2562
3359F61403l5100J3951m6983J8785m0758l485K1841K4689k8004k2777m3592K5384
3347E45354L8044m8120n9571j8966J04310m0932o797J22324N8385m5025R8433
3336G47439k1857k7266k955j8310O5551M6920J44412P0715Q4341Q1217p0994o7974
$$ y = [2425776, 2167847, 1952942, 1727320, 1571450, 1423968, 1284695, 1220968, 1192019, 1160938, 1093134, 1054907, 1034837, 984731, 941167, 1032123, 1076773, 1115662, 1166577, 1210829, 1502924, 1957503, 2310751, 2586272, 2654981, 2593308, 2467382, 2271801, 2051600, 1801928, 1638318, 1412143, 1204142, 1085619, 978333, 946801, 919426, 922842, 884153, 796771, 771351, 741346, 673421, 714205, 708006, 727623, 721677, 718624, 768012, 802119, 786295, 712159, 662960, 693965, 661403, 626303, 640254, 593271, 612056, 571298, 567813, 589654, 614343, 586339, 563562, 519970, 545354, 583398, 535278, 475707, 456741, 561051, 520119, 513322, 635646, 694031, 649006, 747439, 725582, 698316, 695361, 677051, 742602, 789522, 933934, 1004649, 1088990, 1170207, 1099213, 1031239]
3324A031239j01128q7469m4820k0611p1063m9683p821m5557k6421m6760j717L2766
3312E60955p3511J9194j0641l5257L2318k2860k4090R1843R6843L5715N9632J52482
3300H82623J18832l9132n1038k3916n1243r4106j21968n9919m431o0793k8191
3289D66718j10885K6397k7339m0105N404n4884K4978M9931K3704n3330j4222O6688
3277C63055N4740o7383l9658L930j259j6452J863N5675p2522m1445J5433j1728
3265B44249J4265J6882j8433J4155o4362q543L2370J651j4656j6367O3181j2436
3253B51956p6048N5508J040L0774P4488j22414l740L7016O680j9406N4246m1554
3241B48546L311Q228k6569J6838m2772m817k0670k3814J8861J5887J6865K9646
$$ y = [1031239, 930111, 842642, 797822, 777211, 706148, 656465, 648644, 603087, 576666, 529906, 528189, 560955, 487444, 506638, 495997, 460740, 493058, 470198, 446108, 537951, 634794, 670509, 730141, 882623, 1001455, 962323, 911285, 887369, 836126, 742020, 620052, 560133, 555702, 494909, 466718, 355833, 382230, 354891, 314786, 320190, 265306, 290284, 340215, 363919, 310589, 296367, 363055, 417795, 350412, 310754, 314684, 313425, 296973, 298836, 354511, 281989, 240544, 255977, 244249, 258514, 275396, 256963, 271118, 206756, 198213, 230583, 232234, 217578, 201211, 264392, 251956, 175908, 231416, 232456, 263230, 337718, 215304, 211564, 248580, 255260, 235854, 290100, 248546, 251857, 260085, 233516, 250354, 207582, 202765, 182095, 158281, 177142, 193029, 209894, 239540]
3229B39540M3719j8842o3161P3707n8960K3557j2765j8045k1178M5019n2622M0988
3217B20957O7418k0046l9049k5345L7170J9441m2871M869K318k6492p2756p021
3205A18593Q3819l1932m953M000N0468j2839j0608p2677k6794O6552P4776j7739
3193B20666O4407K9375o9985n7404P046O207O7666j7475k5965J4788n2694P091
3181A93723L1466m4721K5208K3350j526K4987J9107J0679m6577N7037m6656o1420
3169A84657L9915j0958N564L6476N0718j9182l5793N6372J4597p0043P5807O6606
3157C94736n3140q4868k8704Q0752n045M2422L2687J236l6933m7835pM503M6737
3144C46541l2552P1685L4359N837K7062o3139m129M9130q271M0557k8548j434
$$ y = [239540, 283259, 264417, 201256, 274963, 216003, 239560, 226795, 208750, 187572, 232591, 179969, 220957, 288375, 268329, 229280, 203935, 241105, 260546, 217675, 222544, 224862, 198370, 125614, 118593, 202412, 170480, 165527, 169527, 219995, 207156, 196548, 123871, 97077, 163629, 238405, 220666, 285073, 314448, 244463, 187059, 194105, 200312, 267978, 250503, 224538, 239326, 186632, 193723, 225189, 180468, 205676, 229026, 227500, 252487, 271594, 282273, 235696, 292733, 246077, 184657, 224572, 213614, 219178, 255654, 306372, 287190, 251397, 307769, 322366, 252323, 328130, 394736, 341596, 256728, 228024, 308776, 303731, 346153, 378840, 380076, 343143, 295308, 295301, 299804, 346541, 313989, 385674, 420033, 425870, 452932, 389793, 385664, 434794, 426523, 467080, 438532, 437098]
3132D37098l5540m1551O4360K9778p714J6864K7624J514l3516k928M4298K1528
3120E21815o9651k5140O1388l9985J9509O5222R663r543K9331K8693M9384Q6274
3108G26960K5265Q5448L0226p1161j2595o5107J9318p7140q0440p305n7880j6624
3096D98965L0312l9992K4650N4384J8308l6365n7965O659K7376J4550j3724L7300
3084E64458M7428k7228k9578K9360R326j5798M9859M2478k4988j9746Q189J8108
3072F51868n2289l5011j6642j8268j9611n1027j2431M1400R058p6129K7881J4675
3060D63474K6764o7846o8335L3820L0064N5199p0673n620J8276k6335j2203o0489
3048C16096M7022p294o0030j1444L4345K9239k2782k1120K114j4633k2362k3378
$$ y = [437098, 401558, 360007, 424367, 454145, 446431, 463295, 490919, 492433, 458917, 455989, 500287, 521815, 452164, 427024, 488412, 448427, 467936, 533158, 542821, 533278, 562609, 591302, 640686, 726960, 752225, 837673, 867899, 796738, 784143, 719036, 738354, 661214, 580774, 573469, 515589, 498965, 529277, 489285, 513935, 568319, 586627, 550262, 492297, 498956, 526332, 540882, 527158, 564458, 611886, 584658, 555080, 584440, 593766, 577968, 627827, 670305, 645317, 625571, 633760, 651868, 599579, 564568, 547926, 529658, 510047, 459020, 446589, 487989, 497047, 420918, 448799, 463474, 490238, 422392, 354057, 387877, 417941, 473140, 402467, 396847, 415123, 388788, 376585, 316096, 363118, 355824, 295794, 284350, 318695, 347934, 325152, 304032, 306146, 291513, 269151, 245773]
3036B45773j05720l2904R0572M5657p5237N1878J3001k9985j8653K2608Q017o329
3024B08678m9536R5086K2992l9265k7380k874j1541o4920p5685M169M9903L5807
3012A45434J2835J8977N846P631l8890o6594K0089n454L6826K035n4375R081o0928
2999C2513j6664Q0755J4375L5380j0957k157q5062M9899k8595M0952l2715j3366
2987F4358j6396J6217J6531j2687n0533k0578L5639q634L1232n1198J1341O3250
2975G8542q6251J0778J2925K0855M8635j4706K199L4905j1386m7198m1586M1389
2963D9101J2344k853K5844l1948j3530M5048k3562J9510m6663k9600J2056N912
2951B1659R340k3866L3514p3742P3413p4254Q1501L2106o7570p6763J7425K5564
$$ y = [245773, 140053, 107149, 197721, 243378, 168141, 220019, 233020, 203035, 184382, 206990, 215007, 208678, 159142, 254228, 277220, 237955, 210575, 207701, 196160, 131240, 55555, 59724, 109627, 145434, 158269, 177246, 183092, 190723, 151833, 85239, 105328, 99874, 136700, 138735, 84360, 93441, 32513, 15849, 96604, 110979, 146359, 135402, 133245, 48183, 98082, 69487, 110439, 77724, 64358, 47962, 64179, 80710, 68023, 17490, -3088, 32551, 23917, 55149, 3951, 15292, 78542, -7709, 3069, 15994, 36849, 85484, 70778, 72977, 107882, 96496, 49298, 7712, 49101, 61445, 58592, 84436, 52488, 38958, 84006, 60444, 79954, 33291, 3691, 15747, 21659, 30999, 7133, 40647, -33095, 40318, -33936, 47565, 79671, 12101, -64662, -47237, -21673]
2939b1673L3208j89o8208j376O4947J7632J5015l6691j9247r021L4695Q482M5290
2926F2864j1816k0584k6046J3840R3729j7686N184q7621l9219K8888J9750Q044
2914B9327K9749l1516l0039K0441O336p752m3891m2736K3223J0002L4362l8185
2902d0679j6632N62j9200M5110M3488l2927l7564J0510o997k6253M0989p824J9363
2889b8054k627O5611o376M409L3201m2752j6033k8845L286m2033J56O4616m84
2876D075l9156K9661J1989J9934r421M429l3273m0353K4103P9269j1290m2301
2864b334l986j1006K6399L0913J4554q9301Q03K9682j335K3684k6097J5530O999
2851A4505k7896k809L7291J0674L3133p7452J1822K3301o3899J7796J4156l2289
$$ y = [-21673, 11535, 11346, -56862, -58238, 6709, 24341, 39356, 2665, -16582, -25603, 9092, 17574, 62864, 51048, 30464, 4418, 18258, 111987, 94301, 99485, 11864, -27355, 1533, 21283, 29327, 59076, 27560, -2479, 17962, 24298, 16546, -27345, -70081, -46858, -36856, -2494, -40679, -57311, -56749, -75949, -30839, 12649, -20278, -57842, -47332, -54329, -80582, -39593, -47417, -28054, -30681, 34930, 28554, 32963, 66164, 23412, 7379, -21466, -18180, -60213, -60057, 4559, 4075, -35081, -5420, 6569, 26503, 17082, 21511, -11762, -52115, -28012, 51257, 39967, -2334, -6320, -17326, 9073, 39986, 54540, -34761, -33958, -4276, -5611, 18073, -8024, 7506, 14505, -13391, -16200, 21091, 31765, 64898, -12554, -732, 22569, -41330, -23534, -9378, -41667]
2839d1667j2932J2453j7337K8321O5609M0017q7514l8791K0520J0834L905M6657
2827C0075L3721j1859q7686j7655P3424j48k1178K5512K0530N0173l0981o7317
2815c389k5584O2903M0l7927K4839j4073m3895l5908m061K8490N1498k1025K9295
2802A1203l1788J0403K988r215o6661j4100L6928K8045M5830j0008K4024o274
2790B1375p7993n3143M7048L0829J6452k7461P3420J3817n0388O056o0534K4730
2778c5792M4764k5734m2746J5818K828N2034K5787m9072k4127M605J1275M8839
2766B8479j9374n5224l1293M9424K4589m1462K5411L879j4883N995m7n9587R0995
2753F902o046o1668j9850K7562N100M0821M1717M2989O7m0330m6613p7737j6222
$$ y = [-41667, -54599, -42146, -59483, -31162, 34447, 74464, -13050, -51841, -31321, -20487, -16582, 30075, 63796, 51937, -35749, -53404, 20020, 19872, -1306, 24206, 44736, 94909, 63928, -3389, -28973, 33930, 33970, -3957, 20882, 6809, -37086, -72994, -77055, -48565, 2933, -18092, 11203, -20585, -10182, -7194, -16409, -83070, -97170, -60242, -32197, 13633, 3625, 27649, 21375, -56618, -109761, -62713, -31884, -15432, -42893, 30527, 44344, -6044, 12, -60522, -35792, 8972, -16762, -59508, -43690, -40862, 11172, 36959, -12113, -36240, -31635, -20360, 28479, 9105, -46119, -77412, -27988, -3399, -44861, -19450, -15571, -30454, -24459, -24506, -84093, 6902, 856, -60812, -80662, -53100, -48000, -7179, 34538, 77527, 77594, 37264, -9349, -87086, -103308]
2740a03308j2538P2068K9603k608L783j7737J3354m934L0770n3082k4845P2342
2728B868K647n1452K0633M2510J3069q947L9427m6545m0148J6865o2496L4621
2716c6948m770m987P205Q39J1758k4236K8853m007k9974j8173o717K3913K5073
2703c2171o7719m2057O5405K826K2717O9510J0956m2535L2095K1920o6387j4967
2691d0407J2168o0217O2552M556k3350J3060k4282L1430L9096L5332m2453J875
2679I360M8603o3017J5713J2717J7115M6583l2164k1772o744n0554M7273l0386
2667g273n3349j8236K9818N4238j6313K6472M8030k2278q2723k4041J5075j952
2655e2532j831J897K4797J1220l6153j4985L2696o874p7357O0238Q0520L5615
$$ y = [-103308, -115846, -43778, -14175, -16783, -13000, -30737, -17383, -22317, 8453, -44629, -69474, 2868, 5515, -45937, -25304, 17206, 30275, 21328, 60755, 14210, -25938, -9073, -71569, -36948, -41718, -46705, -39500, -38661, -26903, -51139, -22286, -26293, -56267, -74440, -81157, -57244, -32171, -99890, -141947, -76542, -73716, -50999, 18511, 29467, -13068, 19027, 40947, -25440, -40407, -28239, -88456, -25904, -21348, -44698, -31638, -55920, -24490, 14606, 49938, 7485, 9360, 57963, -5054, 10659, 23376, 40491, 87074, 54910, 33138, 26394, -24160, 23113, -7273, -60622, -78858, -49040, 5198, -11115, 15357, 63387, 41109, -41614, -65655, -50580, -52532, -54363, -52466, -27669, -16449, -52602, -67587, -34891, -41765, -119122, -58884, 21636, 57251]
2643E7251Q338o7004J2939l6515K5202L2852m1948j1345J4797M991l4743l342
2631c8527M2849p4799m5530K2088P1129N880k1970k385j336j5150K4856L7011
2619D116O6794J0928j22043N658L4474l1181o4716O4379k1399L5998J7277N177
2607E462k556M62J5571k6227j2014J2384m2925L5233K2588n6498L1382p3784L535
2594h7387M8486L0168N0015K361O926l5800O4109p5621k4553O9999k2193J4238
2582D0748N437K2239l5116o577J01510l408j0500K7176m2784M4568k3039M1114
2570A61368k3444j16746N7729n5591j00818K6477J9530L07l8303m3396P3187O5353
2558B5653o376l731k3306q689L0554K6773J8253k8500p2485k5457M3815q499k4254
$$ y = [57251, 65589, -1415, 11524, -24991, 211, 33063, -8885, -20230, -5433, -442, -35185, -38527, 4322, -70477, -116007, -93919, -22790, -16910, -38880, -41265, -42601, -57751, -32895, 4116, 70910, 81838, -40205, -34547, -73, -31254, -95970, -31591, -52990, -16992, 285, 5462, 2906, 3368, 18939, -7288, -19302, -6918, -49843, -14610, 7978, -48520, -17138, -90922, -87387, -38901, -8733, 41282, 43643, 50569, 14769, 78878, 3257, -21296, 48703, 26510, 40748, 46185, 68424, 33308, 26731, 128241, 124833, 114333, 141509, 98725, 143293, 120254, 161368, 137924, 21178, 78907, 23316, -77502, -51025, -31495, -31188, -69491, -112887, -39700, 25653, 19277, 15546, -7760, -16449, 14105, 40878, 59131, 30631, -41854, -67311, -23496, -31995, -56249]
2545e6249J920M7893k7587l3132N1052j3960k4139j7956J7236P5977L0630m8603
2533C082k2539o65N701L090n5786J7114P4977K7760r458n700m0252O9279N486
2520G2089m9131l3854J1153j593J7593l2007K5048L010j5772K3251j606J0941
2508B9122k8079P1488l1418M3430j3492n5649K4678L4742n6910Q416K6912q3606
2496c0366n139J8400l5577L1700j6745M3825L8707K5164r704k5022O046J7843
2484E9132n3732j4059l6533m47N453k031M1087j6603N5261M7058n9022m4336P80
2471a7992K3564K784l8131N5449J2290l7159K8824N5647m8722n0785K9673N5274
2459G0716K3626L131p5071m3202r72M7801K7095L6381Q9894j5834m9591n1044
$$ y = [-56249, -54329, -6436, -34023, -67155, -16103, -30063, -54202, -72158, -54922, 21055, 51685, 3082, -19457, -20122, -14421, -11331, -67117, -50003, 24974, 52734, 43276, 37576, -2676, 66603, 72089, 22958, -10896, 257, -1336, 16257, -15750, 9298, 12308, -3464, 19787, 18181, 29122, 1043, 72531, 41113, 84543, 71051, 15402, 40080, 74822, 17912, 26328, 53240, -30366, -35505, -17105, -52682, -20982, -37727, 6098, 44805, 69969, 60265, 35243, 41289, 59132, 5400, -8659, -45192, -45639, -40186, -42217, -1130, -17733, 37528, 84586, 25564, -18772, -17992, 5572, 8356, -29775, 25674, 37964, 805, 29629, 85276, 36554, -14231, 15442, 70716, 94342, 97473, 22402, -20800, -21772, 26029, 53124, 89505, 179399, 163565, 113974, 62930]
2447F2930m9342N0720l7141O9613j4662p9268j1475N2690L3307m8712k4560l6706
2435c2606N8805k1715L2425K1104L3092J136o337k8614K0440P2279k8383K2843
2423A44469o8390k0773K7900k0324j8098N5772m7193j1376K8094k405K9378n5212
2411D1842k5908O4221k8369m180N3709k2834M6588K0274R214o330l1726j7397
2399I9104j390j7295K9893n1480J1171J837J0721J4667J0768L6492O1146N46o5874
2386A40306J549K1998j437K0244j6368R564k2954m6500N8218L5654m3511l0925
2374A25838K9789J1606N4666q6982l2914J59614J1726n0438k5156L3279J4221
2363B45249K3915M4123o6720l8563m491M7764m5264K8082L0085m0335N261K6234
$$ y = [62930, 13588, 64308, 27167, 96780, 82118, 2850, -8625, 44065, 77372, 28660, 4100, -32606, 26199, 4484, 36909, 58013, 91105, 92241, 85904, 57290, 77730, 150009, 121626, 144469, 76079, 55306, 83206, 62882, 44784, 100556, 53363, 41987, 70081, 67676, 97054, 41842, 15934, 80155, 51786, 47606, 101315, 78481, 125069, 145343, 154557, 148227, 116501, 99104, 97714, 80419, 110312, 58832, 70003, 71840, 82561, 97228, 107996, 144488, 205634, 206180, 140306, 141855, 163853, 162416, 182660, 166292, 175856, 152902, 106402, 164620, 200274, 156763, 125838, 155627, 167233, 221899, 134917, 102003, 261617, 273343, 222905, 197749, 231028, 245249, 269164, 313287, 246567, 208004, 203513, 251277, 206013, 234095, 264180, 223845, 229106, 255340]
2351B55340Q3464M462q92K4329K2644q765M8322j9242k224K8789K7239M2635K4768
2338E30869N6848k7225L7504O7945Q68m930J34584K1019O1186J28659J23828J56626
2326A287781Q7895K08291K29015K73467J32685J58878J19483J57141J92949L76318
2316C223903N54062P85081J156478J932383L753554N722873O493087N594747J920841
2307C1137009j712972k461329k734743k894175l692564l742766l189189k674035
2299H035236j796902j066853p71942m87618l84654k50862k50136l27100l38155
2290B361014k23471k57866k45908j74828j19648q2165q4273p8855m7105n4742
2280I92153n0448m5581n8468P422p8125r942Q274q3348p1546L7166P468k2840
$$ y = [255340, 338804, 343266, 342374, 366703, 389347, 380582, 428904, 409662, 407438, 436227, 463466, 506101, 530869, 587717, 560492, 597996, 665941, 666809, 661879, 796463, 817482, 878668, 1007327, 1131155, 1287781, 1375676, 1583967, 1812982, 2086449, 2219134, 2378012, 2497495, 2654636, 2847585, 3223903, 3777965, 4563046, 5719524, 7651907, 11405461, 17128334, 23621421, 29216168, 31137009, 29424037, 26962708, 24227965, 21333790, 17641226, 13898460, 10709271, 8035236, 6238334, 5171481, 4399539, 3911921, 3527267, 3276405, 3026269, 2699169, 2361014, 2137543, 1879677, 1633769, 1458941, 1339293, 1257128, 1172855, 1094000, 1046895, 992153, 941705, 896124, 837656, 845078, 766953, 757011, 765285, 681937, 610391, 647557, 655025, 632185]
2268F32185j8029l4968J980l1873k0299l2640k6055J1041k1963j4817j3832N0292
2256D81022K2867l7921m8583m2753m8754N438L2344k4102j6192j0761l2684R477
2244B89398o7014P8013O822r778J475J4771j8166n5398m5893K8143j7821M4631
2232B49183j9936q2403L1960J4409j456k4526m5832J1793j635L0450o9342L1770
2220A24435M9969K5150l0267l707M5984m5759m3981J8809K0560l7860J5788J705
2208A40826l2068j0140j9806R1580J872J140n8486j8131L6367l5814k0158j9485
2196E7697l2822m751k8770o5451L3796Q9478O7494j0908J6414l3141Q281q375
2184H8942J721J5988l6848n4866K8437K3017k6168j2632K4465k5567m226O9251
$$ y = [632185, 614156, 579188, 581168, 549295, 528996, 496356, 470301, 481342, 459379, 444562, 430730, 481022, 503889, 465968, 417385, 374632, 325878, 331316, 363660, 339558, 323366, 312605, 279921, 289398, 222384, 300397, 307219, 297441, 298916, 313687, 295521, 240123, 194230, 222373, 204552, 249183, 229247, 146844, 178804, 193213, 191757, 167231, 121399, 133192, 131557, 162007, 92665, 124435, 174404, 199554, 169287, 165580, 211564, 165805, 121824, 140633, 161193, 123333, 139121, 140826, 108758, 98618, 78812, 170392, 172264, 173404, 114918, 96787, 133154, 97340, 77182, 57697, 24875, 20124, -8646, -74097, -40301, 49177, 116671, 105763, 122177, 89036, 97317, 88942, 90663, 106651, 69803, 14937, 43374, 66391, 40223, 27591, 52056, 26489, 22263, 91514]
2172I1514j7238o704M971J1393j4988o6416N6152L8231K1434n5450n832k2240
2160C4827k0396J609j9220O4744J966o0731J6236j5962P866l2237J8351K7489
2148B4542k1153j6122L8321L1739m3660j0027L6894l7885L2602K9937o7886j02785
2136a05483K6981P4530K1689k630J0930q197j6888L152N610J2242p208k114j443
2123A1171n896n5385N80J04105J4780o4668m1450N456L8072K7089N5149m9003
2111D0000m3522m9093O7615J1034K4071J2705q3918M1991p3598J9012N5021J8528
2099C9846M9034L7370k0400n9346n6104L9289N0781j8854p8471m0964l8868j7864
2087a14551J28448Q114k8372O2443m8359p3584j6359N0080J3933O731J7610M9295
$$ y = [91514, 74276, 67572, 72543, 83936, 68948, 2532, 58684, 96915, 118349, 62899, 57067, 34827, 14431, 16040, -3180, 61564, 63530, 2799, 19035, 3073, 10939, -21298, -2947, 24542, 3389, -12733, 25588, 57327, 13667, 3640, 40534, 2649, 35251, 65188, -2698, -105483, -78502, -3972, 17717, 15087, 26017, 17820, 932, 4084, 9694, 21936, 14728, 12614, 11171, 5275, -50110, -49530, 54575, 69355, 4687, -36763, -31307, 6765, 33854, 89003, 40000, -3522, -52615, 15000, 26034, 50105, 62810, -21108, 20883, -52715, -33703, 21318, 39846, 88880, 126250, 105850, 46504, -9600, 29689, 80470, 61616, -16855, -57819, -96687, -114551, 13897, 22011, -6361, 56082, 7723, -65861, -82220, -32140, -18207, -11476, 6134, 55429]
2075E5429j1682J9288m0645K360J8487l8632O6726l8413j955n2647J8491m2043
2063d5236l8076N7597P3075R843j2992J3346k7244r1761P134P9905n1071O1994
2051C6514R230k4460M1670J4379j6566n9772K7024O4178o8727m0575R7117l1575
2039D8437K8405L9682P141m781J5767n5663m0711P5433n7477r4455N2217O844
2027B0839n233K4839J9117m052l2221o6234R396P6819r928l9941J7035P5345q9417
2014c636j1386O2481o190k5037j5905N1632j7426p6219m2877P0638L0592K2214
2002C8881J2038j9120L0352j8277m7413M9327l6722j318p5287L1196L8193j0113
1990h263k468J7068j4832K089O620o5005M1788m632j9448j4459J9165K7017J4889
$$ y = [55429, 43747, 63035, 22390, 24750, 43237, 4605, 71331, 32918, 30963, -21684, -3193, -45236, -83312, -25715, 47360, 57203, 44211, 57557, 30313, -61448, -54314, 25591, -25480, 36514, 45744, 21284, 62954, 77333, 60767, 995, 28019, 92197, 23470, -17105, 80012, 48437, 76842, 116524, 123665, 118884, 134651, 78988, 38277, 113710, 56233, -38222, 13995, 20839, 15606, 40445, 59562, 55510, 23289, -42945, -33549, 43270, 33342, -6599, 10436, 85781, -3636, -15022, 47459, 41269, 16232, 327, 51959, 34533, -41686, -84563, -13925, 16667, 38881, 50919, 31799, 62151, 43874, -3539, 45788, 9066, 7748, -67539, -36343, 1850, -8263, -10731, 6337, -8495, -6406, 214, -64791, -23003, -27635, -47083, -61542, -42377, -15360, -471]
1977d71Q1174o8235j29463K0128R7474M6938m8436q017k5986k8313O168k1768
1965g8807K5245N6879N7551L4258j08172k4888O9326o1179j8186R3769o4432j9421
1953c8057k6517J5938L5169j5766J319l8990M0238K0347n882j1833M3601O4813
1941H4380k1829o0679m1888M900M5622O5317p5240j1272j9719l279m0823M9856
1929b4654K9031J8321r799M4483k0929n2544l6021k5244M2113L0660J3701l6512
1917b7394l0641p350J8353K5519K509L7084n1991n140N6000J6568k4121l1653
1905b2257k6237r954p480O6692K9587n4014N0721l1542l0345j5325J4396P362
1893b8396J7244J8035M2588j9451k4658k4567K1950r8k9440l9649K5027M0697
$$ y = [-471, 80703, 12468, -116995, -96867, 607, 47545, -891, -8908, -34894, -63207, -57039, -78807, -53562, 3317, 60868, 95126, -13046, -37934, 31392, -29787, -47973, 45796, -18636, -38057, -64574, -48636, -13467, -29233, -27914, -66904, -26666, -6319, -12201, -24034, 19567, 84380, 62551, 1872, -40016, -35116, 10506, 75823, 583, -10689, -30408, -33687, -74510, -24654, 4377, 22698, 12899, 57382, 36453, -16091, -52112, -77356, -35243, -4583, 9118, -27394, -58035, -65385, -47032, -21513, -19004, 18080, -33911, -39051, 16949, 33517, 9396, -22257, -48494, -58448, -65928, 764, 30351, -23663, 27058, -4484, -34829, -50154, -35758, -28396, -11152, 6883, 49471, 30020, 5362, -19205, 2745, 2647, -26793, -66442, -41415, -718]
1881g18l9787p6O1391k3047r18M140q389m2232l1550Q1529M5109p540p8360K0924
1867a9524K4416k6560m1727q578J9428M0916K2257k6331J0096Q38k2696J6227
1855a1238N809o647j4105M3619M284o6125l9741O7323M2543l052L9679r2489n0332
1842h0472q779L1816K7254J7643r11q672K4460J4047n566K6560m944M570q237
1829B8769o991o6171K3012n126n5095K2940k6243L1791P298j4356J5562L2802
1817a1808L2854k7259N4500j7582l4416M7054M6722p72L634j9441j7559m5840
1805A0087j5367l6017o3687L1038m39j7790K0949M4309K3006Q4373J2292l3708
1793E9046N829m5412o65k9424j00023M4865M776P8976K2275J5591M640m1587K0865
$$ y = [-718, -40505, -40581, 20810, -2237, -3155, 985, -7404, -49636, -81186, 343, 45452, 37912, -40448, -19524, 4892, -21668, -63395, -71973, -52545, -11629, 10628, -15703, -5607, -4769, -27465, -11238, -5429, -12076, -26181, 17438, 21722, -44403, -84144, -16821, 25722, 22670, 62349, -30140, -80472, -89251, -57435, -30181, -12538, -13449, -22121, 2339, 16386, 10820, 37380, 32436, 37006, 28769, 21778, -44393, -21381, -26507, -81602, -58662, -84905, -53114, -45816, -60172, -44610, -11808, 21046, -6213, 48287, 30705, -3711, 43343, 90065, 89293, 92927, 73486, 55927, 10087, -5280, -41297, -104984, -73946, -74385, -92175, -71226, -26917, -3911, 80462, 92754, 59046, 64875, 19463, 18798, -10626, -110649, -65784, -61008, 17968, 40243, 55834, 60474, 18887, 39752]
1780C9752m2255n6396J9980K0632l3497J3950j5862n3174o44P107L3359M1473
1768b5575P065j166L3447k0159n8848J0274k7837O6878K7476L9959p1932m4265
1756f4683L9595L8121K1511n9179j045L6015L2933l0907n4099L9558M0799M0867
1744G9486p7925R24J6951p1072N4255M5071n0851J7750N8255K9496o5551l6335
1732D54M4924k9946K4551j0434k1548J1435J9662k3615P169K896k6308J0033k0072
1719a0799J8654J9563l5811J9784p21l490l4109N5206M3367j5423q4751M0411
1707A1881m3190J9377O2576J624o5558n105J9671j8631l0304j3415N189L6869
1695a9016J9413l6480J7412K6772j896o3785l4656J3730M1026M8076m9194L2559
$$ y = [39752, -2503, -58899, -38919, -18287, -51784, -37834, -53696, -106870, -107514, -100407, -67048, -25575, -18510, -19676, 13771, -6388, -65236, -54962, -82799, -15921, 11555, 51514, -20418, -64683, -25088, 13033, 34544, -24635, -25680, 10335, 43268, 12361, -41738, -2180, 38619, 79486, 1561, 2485, 19436, -51636, 2619, 47690, -3161, 14589, 72844, 102340, 36789, 454, 45378, 15432, 39983, 29549, 8001, 19436, 39098, 15483, 22652, 25548, -760, 9273, -10799, 7855, 27418, -8393, 11391, 10670, 7180, -26929, 28277, 71644, 56221, -28530, 11881, -31309, -11932, 50644, 52268, -13290, -18395, 1276, -17355, -47659, -61074, -55885, -19016, 397, -36083, -18671, 8101, 6205, -57580, -92236, -78506, -37480, 10596, -38598, -6039]
1683f039k2585M4065l618j03914k8326J12365P1255p1120o0251l139L2975P256
1671c1076O1487l2698O4298m3595m1844j1085M0764j7967p264l5207l9161M3980
1659d9368Q3416n5607O241K5861n4807Q0162N101j3751p6300l5425M8828p900
1647d3549J08049l1001r7389N700K1791n329J2434L1762J9436M9077m1402o3697
1635c4118J031L9884j8917k0629l9147J7543O8068P784r676p467k25j7914j7425
1622c1208O876K4222J667M8730J5453l5016m9205R173n1445m7369L341L4165n5508
1609a26124N476M3384P6789M6832l187n474k5720J1656o8879J631L0166m2028
1597e5478L0366k505J8726N553k9817J4668J655l598J1482p0957K4672J4597j8874
$$ y = [-6039, -28624, 15441, 11823, -92091, -120417, -8052, 63203, -7917, -68168, -71307, -38332, -31076, 30411, -2287, 62011, 18416, -23428, -34513, 6251, -11716, -18980, -54187, -93348, -49368, 34048, -21559, -15318, 10543, -44264, 35898, 40999, 27248, -49052, -84477, -35649, -43549, 64500, 33499, -63890, -58190, -36399, -41728, -29294, 2468, 21904, 70981, 29579, -34118, -33087, 6797, -12120, -32749, -71896, -54353, 13715, 21499, 11823, 4356, 4131, -13783, -31208, -24332, -110, 1557, 50287, 65740, 30724, -18481, -9308, -60753, -108122, -104781, -70616, -126124, -120648, -77264, -475, 46357, 43170, 37696, 11976, 23632, -45247, -43616, -13450, -55478, -25112, -27617, -8891, -3338, -33155, -18487, -16832, -20430, -8948, -79905, -55233, -40636, -59510]
1584e9510O3251m6470K3043O2117j8528m9617L9477K1537q4025k4201P4571n0835
1572d9190M8385n375n5717j5152K2833k6556Q1527M4444k523m5670K7366J3505
1560C7877J0054K0262L626l7932j1048K6390k5408L1907n2243j8386K5442O635
1548A7176M9365n8553k3171L0808k9253R894j5943R538L2965j379j9787o2634
1536f0974Q493N9522j260p5779j7582M3133j6828Q510o1618L9937Q8714P472J7031
1523C8771Q841p4511K4024k600N355K8523j2906n5344J2982O1164k0380k7558
1511a3639K1997m8238K2890n125L9512p0673O1939J9544p6350k177L7158N6508
1499D3346L3386K4087r3676M888K2715P999k0307P6236q2878j08681k5195L5212
$$ y = [-59510, 3741, -42729, -19686, 42431, 23903, -25714, 13763, 35300, -48725, -72926, 1645, -49190, -805, -6180, -61897, -77049, -54216, -80772, 755, 45199, 42676, -2994, 24372, 37877, 47931, 68193, 71819, 33887, 22839, 49229, 23821, 55728, 3485, -14901, 10541, 17176, 66541, 7988, -15183, 15625, -13628, -3734, -19677, -10139, 22826, 21447, 1660, -60974, -52481, 7041, 5781, -69998, -87580, -44447, -61275, -52765, -114383, -74446, 14268, 21740, 38771, 47612, -26899, -2875, -5475, -120, 28403, 15497, -39847, -26865, 34299, 13919, -13639, 8358, -39880, -16990, -22115, 17397, -53276, 8663, 28207, -48143, -50320, -13162, 43346, 76732, 100819, 7143, 12031, 34746, 42745, 22438, 98674, 15796, -92885, -118080, -82868]
1487h2868Q4251P979l9685l5881L4321K1326l9637P6744L876l6289L5453j954
1475B7636o7011K9321L2068k5842l4770R456L3128j4831l0763R535P1821k2929
1463A6819n5025j6846K5892j6141M4746K2085m7272K4857l7698L5751K0730J9124
1451C7022J4240k9685K4263l6562q058L4075M002j1337Q2177l7954q8527k869
1439a9213M4984l0733o6545J5078O423J5160K2742J9021l5018L5792P1146Q149
1427H6986m3258O1292o8930o4602P9425j4948l5249j3671k4630J7088L205J2600
1415d692L9354J799n3045n1125L6201l1074L9599N9054L8232j722q3543j5042
1403b6004K378P6485J4081m279l3990N159j1631K536p826L778j5572O6524O628
$$ y = [-82868, 1383, 9362, -30323, -66204, -31883, -10557, -50194, 26550, 30426, -5863, 29590, 27636, -39375, -10054, 22014, -3828, -38598, -29142, 3986, -10845, -41608, -32073, 39748, 16819, -38206, -55052, -29160, -45301, -555, 21530, -25742, -885, -38583, -2832, 17898, 37022, 51262, 21577, 45840, 9278, 1220, 35295, 39297, 27960, 110137, 72183, -16344, -19213, 25771, -4962, -71507, -56429, -50006, -34846, -12104, 6917, -28101, 7691, 78837, 86986, 43728, 105020, 36090, -28512, 50913, 35965, 716, -12955, -37585, -20497, -17292, -4692, 34662, 36461, -16584, -67709, -31508, -62582, -22983, 36071, 74303, 72581, -10962, -26004, -23626, 52859, 66940, 62661, 28671, 33830, 22199, 24735, 16909, 20687, 5115, 71639, 78267]
1390G8267m4954n866k0535q140j4790J5636k4357Q3537P5545o3837o9769j5512
1378a4775j0439N9276p763j2956O488J5114m4937m0479K1550j097o7190L8182
1366e9026P348p162j341J4191l646K5561k8905L173j5297O4012L6477K1977q7775
1353c0413k9712O6361O752J5942N5924K4205p5234l0787j7017L9257m1739k048
1341a8509N6654K7317l5941k0749L2400M987l0198l653J3303m7626M830K3552
1329F367r774q789O758K4065L4099o4450j6735P2439l5487K1000L1721k0275q5612
1316d4673k1391J9707K4132r931n0250K6482N0860J4618l21l4256J1614L7330
1304B3921R371K2481K8678r10r9140l6764M838j2327J4152K4849K7721m6230o684
$$ y = [78267, 33313, 27447, 6912, -1228, -16018, -382, -24739, 58798, 134343, 70506, 737, -14775, -25214, 34062, 26299, 13343, 19831, 34945, -9992, -50471, -28921, -30018, -97208, -59026, -51678, -58840, -60181, -45990, -49636, -24075, -52980, -49807, -65104, -1092, 35385, 57362, -30413, -60125, 6236, 12988, 28930, 84854, 109059, 33825, 3038, -13979, 25278, -16461, -18509, 38145, 65462, 29521, 8772, 41172, 46159, 15961, 12308, 25611, -22015, -17185, 6367, -3407, -12196, -5438, 18627, 52726, -11724, -28459, 43980, 8493, 29493, 61214, 40939, -44673, -66064, -46357, -22225, -32156, -82406, -55924, -5064, 9554, 9233, -25023, -13409, 23921, 33292, 55773, 84451, 83541, -15599, -52363, -47525, -59852, -45700, -20851, 6870, -39360, -46044]
1291d6044Q047O5615o4k905p368j3193L5642m9393j0118L0820k3694m0890J1321
1278d2224p739j9653J6769M952L7426j8578k9179O4370J2697l9752J4069l2767
1266c9609J2908K5125L69p975K7311l9043n013J8681L9211o5739j4297M6232L8153
1253C6314m6080j7136K0987l471K8093K8991j0663l4569J2147J5519j4457l257
1241A2418j3295r220J8199L9293n8216k2967k906n258K2935m4304J10M3829R750
1228i632k626L4087l2382m808k7150J5321j8055l4596J9562K6228J4900q390j5343
1215d2884Q1859k3817l3080K6055l6430k8518m597M738O8681L0818L4924j4950
1203F2799K0784p5246R775r90q0120r0625N6898N1688J4205L2653Q206J1612M2518
$$ y = [-46044, -37997, 27618, 27554, 24649, 17281, 4088, 39730, -9663, -19781, 11039, -12655, -53545, -42224, -49963, -69616, -52847, -47895, -10469, -29047, -58226, 6144, 18841, -20911, -6842, -39609, -26701, -1576, -1207, -9182, 18129, -20914, -25927, -7246, 31965, -33774, -48071, -1839, 36314, -9766, -26902, -5915, -9386, 18707, 47698, 37035, 2466, 14613, 30132, 15675, 12418, -877, -10097, 8102, 47395, -10821, -33788, -36694, -41952, -19017, -63321, -63211, -19382, -9632, -12258, 21829, -10553, -15361, -42511, -27190, -45245, -79841, -60279, -34051, -19151, -27541, -42884, 38975, 15158, -17922, 8133, -28297, -56815, -61412, -56674, 12007, 42825, 77749, 62799, 83583, 8337, 18112, 17122, -62998, -153623, -96725, -45037, -30832, 1821, 10027, 21639, 64157]
1190F4157k0940m3108n003K8082j5614j1259o3617K1514P4133j4339l2583k9741
1178d8318m636p580L8086O2946p252n4450N2269o718k0677k3317J0518o4191j7436
1165i0756N1051O0009m1599j660L3390j5213j3287L4976L3919n944j0398m9688
1153a5200L5690j9404l7413J1419L7442n4198J8254N788M711J8218k0012m9076
1141f3781n3657P5283L0548m100J4129N661p2082P5770n786m223j3795R717k0748
1128b7064j6205J397K370k8456o332N1707J7644n840N644n3244l78L9226P0321
1115E0790M6401p0578l9572J7803L2296m158j1554K6466n1153J044N4946q1126
1103b8395l1187j5203Q1242k9006o5732m511j3021M1133N6426L1505J9689M579
$$ y = [64157, 43217, 109, -4894, 23188, 7574, -3685, -67302, -45788, 28345, 14006, -18577, -48318, -52954, -60534, -22448, 40498, 33246, -21204, 31065, 24347, 3670, -19647, -9129, -73320, -90756, -39705, 20304, -21295, -22955, 10435, -4778, -18065, 16911, 50830, 44886, 34488, -15200, 20490, 1086, -36327, -24908, 12534, -41664, -23410, -17622, -12911, 5307, -14705, -63781, -117438, -42155, -11607, -15707, -1578, 4083, -67999, 7771, 1985, -2238, -16033, -6316, -27064, -43269, -41872, -39502, -67958, -74290, -22583, -4939, -10779, -5135, -58379, -58757, -19531, 50790, 97191, 26613, -12959, 4844, 37140, 32982, 21428, 47894, -3259, -2215, 52731, -28395, -59582, -74785, 6457, -22549, -88281, -92792, -105813, -64680, -8254, 23251, 42940, 47519]
1091D7519m390k1665l261K0175j5476p3594m901K6886o6134j1968L0775M1983
1079c4051l826L732k8046l7015N0367L9863N4083p4017q487k8359R403L9309l0330
1066d7374K8472L4022L0128k3052M7926l3853J1252k3432o7932O3129O3085n5580
1054B6791j9704K1738n5303J8441K2322K4151k747N311L2659J3016k3495n206
1042E7974j0815m2571P146k1603J2596j977l8176K5125Q0596m8058j3025m4886
1030c7674k1549J5744L7224R183q79j8262Q74K9j4947M2965j2033J1444L7641
1017D9760k5443j6065k8813L5510l3842J6468L0203m4123k6781j7860M3454L9946
1005B2414r8265R690L4592J028L6994p5316N1437K843M2312o391Q108n1645L2648
$$ y = [47519, 43129, 21464, 18203, 38378, 22902, -50692, -55593, -28707, -94841, -106809, -76034, -34051, -37877, -34145, -62191, -99206, -48839, -8976, 45107, -28910, -37397, -65756, -56353, -17044, -47374, -18902, 15120, 45248, 22196, 70122, 36269, 47521, 24089, -43843, 19286, 82371, 26791, 7087, 28825, -26478, -8037, 14285, 38436, 35689, 41000, 73659, 86675, 63180, 57974, 47159, 4588, 11734, -9869, 2727, 750, -37426, -12301, 68295, 20237, 7212, -37674, -59223, -43479, -6255, 2928, 2049, -16213, -15339, -15310, -30257, 12708, 675, 12119, 49760, 24317, 8252, -20561, 14949, -18893, -2425, 27778, -16345, -43126, -60986, -17532, 22414, -75851, -66161, -31569, -30541, 6453, -68863, -17426, -14583, 27729, 21338, 29446, -22199, 10449]
992A0449K716M4646K345n3416K7679n539j5787Q130n0927O8468n774m091n7086
979b8187k5257j1922K6378L3371M6683k7723o9229O9130p3448M2320R081J7511
967H708M5023n3180j8595m8704R446M8079L983J3965l4933o2485j1686M7098J15181
954F1900j3600l3209n1446N3648n1480L4619Q0316n8301j7405j0469K732k3427
942b6122J7929O1272n6578j5162N5895o6050K04R1872J1351n9793P955m7145J5982
929h390Q128n735L3922J4186o9558M6262O284J2889o321J524J2115J4520m2061
916A7765L6712J7393m1031o7567J3078k3264j3558O7049P619L879L1247l4657
904A4665q638K073L7220k3062k0863N427j7446J0777O88p828P587O8106n0595
$$ y = [10449, 13165, 57811, 60156, 6740, 34419, 28880, 13093, 21223, -29704, 38764, 32990, 28899, -28187, -53444, -65366, -38988, -5617, 41066, 13343, -55886, 13244, -60204, -17884, -8803, 8708, 53731, 551, -18044, -66748, -57302, -9223, -5240, 8725, -26208, -88693, -100379, -53281, 61900, 48300, 15091, -36355, 17293, -34187, 432, 80748, 22447, 5042, -5427, -2695, -26122, -8193, 53079, -3499, -18661, 37234, -28816, -28612, 63260, 74611, 14818, 22773, -24372, -8390, -262, -5997, 27925, 42111, -27447, 18815, 25099, 37988, 31667, 33191, 45306, 59826, 17765, 54477, 71870, 30839, -36728, -23650, -46914, -60472, 6577, 14196, 18075, 49322, 14665, 6027, 8100, 45320, 22258, 1395, 6822, -10624, 153, 841, -6987, 600, 68706, 18111]
891A8111k505L3648k376j1407l292k3496k3386K4019N2172M417k7728n4820j8901
878c5544O2271j4970l6775m2631J0093k5100P7418N9851N8102j9378o335k5331
866F1671O11q342n6220j6822j9401K1951O1564K2526n1278j9908o7383J1116M3097
853a6818K3936J1195m5904J2037J0333q35K186K628J1662N3416M138J8817q963
840G7828p7486k6146j9952L2022k4539M2177j0899K3537j1413J9165L3165M685
828F2144l8364l5609j6115j8034N0328O1212m2828J9223N6197L372k6715j20754
816d5943m0095O3293o8466l186O2917k2566j305J3960o3232P1161P8359k2030
804B2867O730M2744r7767M4331J9488m1489J1478L2607m8040N3041j4062Q4K1811
$$ y = [18111, 15606, 49254, 46878, 35471, 32179, 8683, -14703, 9316, 61488, 65905, 38177, -16643, -35544, 26727, 11757, -25018, -67649, -57556, -82656, -5238, 54613, 112715, 93337, 87002, 61671, 62282, 53940, -2280, -19102, -38503, -16552, 45012, 67538, 16260, -3648, -71031, -59915, -16818, 7118, 18313, -27591, -15554, -5221, -6056, -3870, -1242, 10420, 63836, 67974, 86791, 77828, 342, -25804, -45756, -13734, -38273, 3904, -6995, 16542, 5129, 24294, 57459, 62144, 23780, -11829, -27944, -45978, 4350, 65562, 22734, 41957, 98154, 101526, 74811, -45943, -86038, -22745, -91211, -94397, -31480, -54046, -55351, -41391, -104623, -33462, 44897, 22867, 29597, 72341, -25426, 18905, 38393, -3096, 8382, 40989, -7051, 45990, 31928, 32012, 53823]
791E3823J207J7046j8779m8241m0799K0218j7010J6902l1854J2161N0916O8672
779H4262m7462L122j9759m0266k1340O3152R176l0178k3977K0138M9521r7306
767e0917L0395J7354K9695M9297r630Q603j7735j1647L1137n1335l5235M47K8365
754A8794j2361l938P212M4761K2017k9465J29662j22903m3099j865K1750j9897
742A0668n8346L3702L9359L429k5374k0767l0319l934P3171Q541k9012N138K2304
729B8560j151k8952J8093l1192K8206l2184J1913P0787q3698O091M300K2586j0851
716B508n645Q865J0360K4981j008m1086k3528k1768L3187J898m0807L6168j0906
703b6781q933L5238J4649j1781m1455N5085J2864j869j9673L4622n725o5759k6292
$$ y = [53823, 55030, 72076, 53297, 5056, -35743, -15525, -32535, -15633, -47487, -35326, 15590, 84262, 36800, 39922, 20163, -20103, -41443, 21709, 30885, 707, -23270, -3132, 46389, -50917, -20522, -3168, 26527, 75824, 66194, 74797, 57062, 45415, 76552, 25217, -10018, -9571, 18794, 6433, 2495, 9707, 54468, 76485, 47020, 176682, 53779, 10680, 8815, 30565, 10668, -47678, -13976, 25383, 28812, 3438, -17329, -47648, -51582, 21589, 30130, 1118, 6256, 28560, 27409, -1543, 16550, -14642, 13564, -18620, -6707, 64080, -19618, -13527, -9227, 13359, 2508, -3137, 5728, 16088, 41069, 40061, -1025, -24553, -46321, -13134, -11236, -52043, -15875, -26781, -35714, -476, 14173, 2392, -39063, 16022, 28886, 27017, 7344, 41966, 36241, -29518, -55810]
690e5810n906j1326R2454L048j8946j5583J940J431j7403N3832m5933N410K9734
677A6942L0918j1482L3890k5387l6543n1485J780K7708L3307k9878L5529K3046
665D8345Q528M6095m5989m2856J8665m7943K8210l4555L1545J4687o3377M1698
653C053O6028K8227p8763l1252J4984j0976m9085M669k781M8461M0817m3143J5073
640E312j9370k0894L2547l0198L0217K0824M0241j496m5293l5708J2754P707L2604
627B9247J263o5717O5413K6446o1969K8194K1325k0145k4016K9960M5866o4788
615A1079J5369l4814k6347K170M5968Q000J9689l0980J3593M3660l4198j6472
603A6717L8146o9766M479O688n062l3854j9854O2233k4464P6809n0722l4642K4185
$$ y = [-55810, -61716, -73042, 19412, 22460, 3514, -12069, -10129, -8698, -26101, 27731, -18202, -12792, 16942, 47860, 36378, 70268, 44881, 8338, -43147, -41367, -13659, 19648, -10230, 25299, 48345, 56873, 102968, 56979, 14123, 32788, -15155, 13055, -21500, 10045, 24732, -38645, 3053, 69081, 97308, 18545, -12707, 2277, -8699, -57784, -53115, -55896, -7435, 33382, -9761, 5312, -14058, -34952, -2405, -32603, -2386, 18438, 58679, 57183, 11890, -23818, -11064, -3357, 29247, 30510, -35207, 30206, 56652, -5317, 22877, 44202, 24057, 41, 30001, 75867, 11079, 26448, -8366, -34713, -32543, 13425, 21425, 41114, 10134, 23727, 67387, 33189, 16717, 54863, -14903, -10424, -3736, -8798, -42652, -62506, -273, -24737, 52072, 1350, -33292, -9107]
590i107M1542J3762n1772k9096L9313L0560j84k2528n2907l2801J2595m3108N6287
577d7444j4646N4847J09008n6243j2699k1275N8169L3830K5542n8224m5940J1745
565C6670j5910N9089j1266n9166O770n5640K4876K7376k9867J817R967L0281q185
552A6812o288k1121K5677K4431L4358l892k6435J3207j4987n7584n250M9429l3824
539e467L229J709J9467N1672n7150j4145J5858o8113m0754Q1067J1025o0795P1917
526I520M626k5850O6252Q899m5064l6870J9344k8918j4729k6262l1374Q1787j928
513b0567q649q8318J3959P729K6419j2979K3682L8688k2045K2805m1521M2841
501a7956M5781L1297o1374k5360Q2382N762n7476P4861j8018j11298Q7860L1130
$$ y = [-9107, 32435, 46197, -5575, -34671, 4642, 35202, 35018, 12490, -40417, -73218, -60623, -103731, -47444, -62090, -7243, 101765, 45522, 32823, 11548, 69717, 103547, 129089, 70865, 24925, 36670, 20760, 79849, 68583, 9417, 16187, -39453, -14577, 12799, -17068, -15251, -5284, 24997, 16812, 10524, -10597, 15080, 39511, 73869, 69977, 43542, 56749, 41762, -15822, -21072, 28357, -5467, -2238, -529, 18938, 70610, 13460, -685, 15173, -52940, -93694, -12627, -1602, -62397, 9520, 14146, -11704, 54548, 63447, 18383, -18487, 857, -28061, -42790, -69052, -100426, -18639, -20567, -29216, -117534, -103575, -95846, -69427, -82406, -58724, -20036, -42081, -19276, -60797, -17956, 27825, 59122, -2252, -27612, 54770, 60532, 3056, 77917, 59899, -51399, 36461, 67591]
489F7591r11m0473j6089L0196m6791j1476j092K8144J7495j3264M8188L214p2694
476g962K4498j3898K7660l4328j1674J4141J1608m888l0265M276L9906j3660J963
463G377K4026n7567n417L5267k0366m8494n819O2882q905J4459L5615M4976l3438
450D4596J2099p1223q2298L83J00183N0894k3777p415r673k9550J2041j0338n493
437a9571j2894l1451K9376L1228k9210K4604M4494k6387n0298O6714K3614l4039
425A6180O2241j1874k5739o4266K4376N410k7901m2304N369M6951m0612L267L3282
412a5620L7650R0913p4417l7304p340N3754J6162n3905m950O692p1019o050K9332
399c6102N8882k7557o7934O1531K3052k777k8359J7745m9517J1985J4824j3742
$$ y = [67591, 66680, 26207, 10118, 40314, -6477, -17953, -19045, 9099, 26594, 13330, 61518, 64732, -7962, 16536, 2638, 30298, -4030, -15704, -1563, 10045, 5157, -25108, -20832, 19074, 5414, 7377, 31403, -26164, -31581, 3686, -16680, -65174, -70993, -8111, -17016, -2557, 33058, 78034, 44596, 56695, -14528, -96826, -96443, 3740, 54634, 30857, 23442, 13769, -15781, -3740, -14078, -19571, -32465, -63916, -34540, -3312, -32522, -7918, 36576, 10189, -40109, 26605, 50219, 16180, 78421, 66547, 40808, -23458, 918, 6328, -21573, -63877, -58508, -11557, -52169, -48902, -15620, 22030, 112943, 38526, 1222, -6118, 47636, 63798, 9893, 4943, 11635, -59384, -65434, -36102, 22780, -4777, -72711, -11180, 11872, 9095, -19264, -1519, -51036, -39051, -24227, -37969]
387c7969L2666j9782K8000n163k7830k1712K2313n7577P1798K5040L3857q0061
375c6420M216M7307l3909J9896J8689K0941K640m8122j8608K5910K2725K185K5885
362E3335m6003l995J3793l0833J0464n4197L457R58p431K3728j0659l8339K3464
349f2258N1360L61R692O056n95K010J9532k0966O628M619j7467J6094q8563l9898
335a13395P5538K9600N4841L4898m4483k232m0949m3819l7434j9292r079j0281
$$ y = [-37969, -5303, -25085, 2915, -2248, -30078, -51790, -29477, -87054, -15256, 9784, 43641, -36420, -32204, 15103, -18806, 1090, 19779, 40720, 43360, -4762, -23370, 2540, 25265, 27450, 53335, 7332, 3337, 17130, -13703, -3239, -57436, -53979, -53021, -60452, -36724, -47383, -85722, -62258, -10898, -10537, -845, 5211, 4616, 6626, 26158, 5192, 11820, 16439, -1028, 15066, -73497, -113395, -37857, -8257, 46584, 81482, 36999, 34767, -6182, -50001, -87435, -106727, -115806, -126087]
$$ [...]
##END NTUPLES=NMR SPECTRUM
##END=
