##TITLE=1H_EC-3384(5)f
 200.13Hz, CDCl3.
 8 sc
4.8.2026
##JCAMPDX= 6.0         $$ Bruker NMR JCAMP-DX V2.0
##DATA TYPE= NMR SPECTRUM
##DATA CLASS= NTUPLES
##ORIGIN= UXNMR, Bruker Analytische Messtechnik GmbH
##OWNER= pz
$$ XWIN-NMR		Version 3.5
$$ Tue Aug  4 13:32:31 2026 Russian Standard Time (UT+4h)  she@DPX200
##.OBSERVE FREQUENCY= 200.1313
##.OBSERVE NUCLEUS= ^1H
##.ACQUISITION MODE= SIMULTANEOUS
##.ACQUISITION SCHEME= undefined
##.AVERAGES= 8
##.DIGITISER RES= 18
##SPECTROMETER/DATA SYSTEM= spect
##.PULSE SEQUENCE= zg30
##.SOLVENT NAME= CDCl3
##.SHIFT REFERENCE= (INTERNAL, CDCl3, 0, 15.5089)
##AUDIT TRAIL= $$ (NUMBER, WHEN, WHO, WHERE, WHAT)
$$ ##TITLE= Audit trail, XWIN-NMR		Version 3.5
$$ ##JCAMPDX= 5.01
$$ ##ORIGIN= Bruker BioSpin GmbH
$$ ##OWNER= she
$$ F:/spectra/data/she/nmr/H-C/1/pdata/1/auditp.txt
$$ ##AUDIT TRAIL=  $$ (NUMBER, WHEN, WHO, WHERE, WHAT)
(   1,<2026-08-04 13:31:06.87 +0400>,<she>,<DPX200>,
      <created by zg, POWCHK disabled, PULCHK disabled
       configuration hash MD5:
       00 E9 B6 7A A2 85 ED C7 34 08 36 98 17 FE 4E 26
       data hash MD5: 16K
       77 D3 B1 E9 85 37 1D 5B 3D 6F 97 7A 91 ED 5A AB>)
(   2,<2026-08-04 13:31:09.40 +0400>,<she>,<DPX200>,
      <Start of raw data processing
       efp BC_mod = 2 LB = 0.25 FT_mod = 6 PKNL = 1 PHC0 = -4219.667 PHC1 = 9.792301 SI = 16K 
       data hash MD5: 16K
       A9 BD 45 52 C5 DA A2 C1 D0 FA A4 18 55 FE 9D B7>)
(   3,<2026-08-04 13:31:30.62 +0400>,<she>,<DPX200>,
      <pk PHC0 = 0.893737 PHC1 = 0 
       data hash MD5: 16K
       44 C6 72 93 20 1E 53 3A 6D 1E 71 79 FB D6 A7 54>)
(   4,<2026-08-04 13:31:34.37 +0400>,<she>,<DPX200>,
      <abs ABSG = 5 
       data hash MD5: 16K
       EA 4E 47 CB A7 41 76 04 10 8A 44 1D 84 0F 22 C2>)
$$ ##END=
$$ 
$$ hash MD5
$$ 51 96 79 9F DB 77 49 BE 14 DB 57 5E 10 63 74 F8
##$RELAX= 
##$RELAX= 
##$RELAX= 
##$RELAX= 
##$RELAX= 
##$RELAX= 
$$ Bruker specific parameters
$$ --------------------------
##$DU= <F:/spectra>
##$EXPNO= 1
##$NAME= <H-C>
##$PROCNO= 1
##$TYPE= <nmr>
##$USER= <she>
##$AMP= (0..31)
100 100 100 100 100 100 100 100 100 100 100 100 100 100 100 100 100 100 
100 100 100 100 100 100 100 100 100 100 100 100 100 100 
##$AQSEQ= 0
##$AQ_mod= 1
##$AUNM= <au_zg>
##$AUTOPOS= <>
##$BF1= 200.13
##$BF2= 200.13
##$BF3= 200.13
##$BF4= 200.13
##$BF5= 200.13
##$BF6= 200.13
##$BF7= 200.13
##$BF8= 200.13
##$BYTORDA= 1
##$CFDGTYP= 0
##$CFRGTYP= 5
##$CHEMSTR= <none>
##$CNST= (0..31)
1 1 145 1 1 1 1 1 1 1 1 1 1 1 1 1 1 1 1 1 1 1 1 1 1 1 1 1 1 1 1 1 
##$CPDPRG= <>
##$CPDPRG1= <>
##$CPDPRG2= <>
##$CPDPRG3= <>
##$CPDPRG4= <mlev>
##$CPDPRG5= <mlev>
##$CPDPRG6= <mlev>
##$CPDPRG7= <mlev>
##$CPDPRG8= <mlev>
##$CPDPRGB= <>
##$CPDPRGT= <>
##$D= (0..31)
0 0.7 0 0 0 0 0 0 0 0 0 0.03 0 0 0 0 0 0 0 0 0 0 0 0 0 0 0 0 0 0 0 0 
##$DATE= 1785835866
##$DBL= (0..7)
120 120 120 120 120 120 120 120 
##$DBP= (0..7)
150 150 150 150 150 150 150 150 
##$DBP07= 0
##$DBPNAM0= <>
##$DBPNAM1= <>
##$DBPNAM2= <>
##$DBPNAM3= <>
##$DBPNAM4= <>
##$DBPNAM5= <>
$$ [...]
##$SUBNAM3= <"">
##$SUBNAM4= <"">
##$SUBNAM5= <"">
##$SUBNAM6= <"">
##$SUBNAM7= <"">
##$SUBNAM8= <"">
##$SUBNAM9= <"">
##$SW= 18.0517328524113
##$SWIBOX= (0..15)
0 0 2 0 0 0 0 0 0 0 0 0 0 0 0 0 
##$SW_h= 3612.71676300578
##$TD= 16384
##$TD0= 1
##$TE= 0
##$TE2= 300
##$TE3= 300
##$TEG= 300
##$TL= (0..7)
0 120 120 120 120 120 120 120 
##$TP= (0..7)
150 150 150 150 150 150 150 150 
##$TP07= 0
##$TPNAME0= <>
##$TPNAME1= <>
##$TPNAME2= <>
##$TPNAME3= <>
##$TPNAME4= <>
##$TPNAME5= <>
##$TPNAME6= <>
##$TPNAME7= <>
##$TPOAL= (0..7)
0.5 0.5 0.5 0.5 0.5 0.5 0.5 0.5 
##$TPOFFS= (0..7)
0 0 0 0 0 0 0 0 
##$TUNHIN= 0
##$TUNHOUT= 0
##$TUNXOUT= 0
##$USERA1= <user>
##$USERA2= <user>
##$USERA3= <user>
##$USERA4= <user>
##$USERA5= <user>
##$V9= 5
##$VALIST= <valist>
##$VCLIST= <CCCCCCCCCCCCCCC>
##$VD= 0
##$VDLIST= <DDDDDDDDDDDDDDD>
##$VPLIST= <PPPPPPPPPPPPPPP>
##$VTLIST= <TTTTTTTTTTTTTTT>
##$WBST= 1024
##$WBSW= 4
##$XGAIN= (0..3)
0 0 0 0 
##$XL= 0
##$YL= 0
##$YMAX_a= 789290
##$YMIN_a= -840916
##$ZGOPTNS= <>
##$ZL1= 120
##$ZL2= 120
##$ZL3= 120
##$ZL4= 120
##$ABSF1= 15.49899
##$ABSF2= -2.552859
##$ABSG= 5
##$ABSL= 3
##$ALPHA= 0
##$AQORDER= 0
##$ASSFAC= 0
##$ASSFACI= 0
##$ASSFACX= 0
##$ASSWID= 0
##$AUNMP= <proc_1d>
##$AZFE= 0.1
##$AZFW= 0.1
##$BCFW= 0
##$BC_mod= 2
##$BYTORDP= 0
##$COROFFS= 0
##$CY= -3
##$DATMOD= 1
##$DC= 0
##$DFILT= <>
##$DTYPP= 0
##$F1P= 0
##$F2P= 0
##$FCOR= 1
##$FTSIZE= 16384
##$FT_mod= 6
##$GAMMA= 0
##$GB= 0
##$INTBC= 1
##$INTSCL= 3.241238e-09
##$ISEN= 128
##$LB= 0.25
##$LEV0= 0
##$LPBIN= 0
##$MAXI= 10000
##$MC2= 0
##$MEAN= 0
##$ME_mod= 0
##$MI= 1.114404
##$NCOEF= 0
##$NC_proc= -5
##$NLEV= 6
##$NOISF1= 3.799351
##$NOISF2= 2.8
##$NSP= 0
##$NTH_PI= 0
##$NZP= 0
##$OFFSET= 15.5089
##$PC= 1
##$PHC0= -4218.773
##$PHC1= 9.792301
##$PH_mod= 1
##$PKNL= yes
##$PPARMOD= 0
##$PSCAL= 0
##$PSIGN= 0
##$REVERSE= no
##$SF= 200.130002562652
##$SI= 16384
##$SIGF1= 3
##$SIGF2= 2
##$SINO= 0.751879
##$SIOLD= 32768
##$SREGLST= <19F.Aceton>
##$SSB= 0
##$STSI= 16384
##$STSR= 0
##$SW_p= 3612.71676300578
##$SYMM= 0
##$S_DEV= 0
##$TDeff= 16384
##$TDoff= 0
##$TI= <>
##$TILT= no
##$TM1= 0
##$TM2= 0
##$TOPLEV= 0
##$USERP1= <user>
##$USERP2= <user>
##$USERP3= <user>
##$USERP4= <user>
##$USERP5= <user>
##$WDW= 1
##$XDIM= 16384
##$YMAX_p= 338601437
##$YMIN_p= -206507
$$ End of Bruker specific parameters
$$ ---------------------------------
##NTUPLES= NMR SPECTRUM
##VAR_NAME=  FREQUENCY,     SPECTRUM/REAL,   SPECTRUM/IMAG
##SYMBOL=    X,             R,               I
##VAR_TYPE=  INDEPENDENT,   DEPENDENT,       DEPENDENT
##VAR_FORM=  AFFN,          ASDF,            ASDF
##VAR_DIM=   16384,         16384,           16384
##UNITS=     HZ,            ARBITRARY UNITS, ARBITRARY UNITS
##FACTOR=    0.220516191357247, 1,           1
##FIRST=     3103.79613444759, 0,            0
##LAST=      -508.920628558193, 0,           0
##MIN=       -508.920628558193, -206507,     0
##MAX=       3103.79613444759, 338601437,    0
$$ Real data points
##PAGE= N=1
##DATA TABLE= (X++(R..R)), XYDATA
$$ [...]
9512 -8182 -6609 10738 2721 16043 -10585 -24147 -4636 -35414 -82932 -87818 -31364 -31234 -23901
9499 -23901 21478 5281 -72113 -24747 3561 54823 51571 -48036 -34878 8760 -15005 28843
9487 28843 52593 50640 105288 133315 41667 25243 20473 -7546 -27911 -33505 4039 22159
9475 22159 -11255 26623 66056 60547 55386 65118 78508 63886 5593 -21566 1010 6765 -2399
9462 -2399 33702 15539 37736 -32227 -33499 21973 -995 -45156 -66357 -83624 -24207 -9693
9450 -9693 2177 3232 88516 51850 -6827 7140 46629 21713 -40205 6137 11490 1529 -22855
9437 -22855 22701 60500 75475 -5525 19016 18979 -175 -47175 -48029 43877 33505 -10417 17788
9424 17788 -14811 -61730 -64279 10574 22339 66729 83435 48266 8310 70021 69502 64155 39505
9411 39505 77036 69954 35213 31154 24338 33262 47587 52661 19684 10565 41616 61787 71766
9398 71766 45385 20682 32513 58415 98464 142017 107701 46080 56257 49356 21386 8420
9386 8420 13045 1040 -51359 -25292 36058 21040 56932 102439 116993 101534 6945 -64706
9374 -64706 -63984 18 -16127 11670 49635 11386 34286 11591 52715 1598 34961 108713
9362 108713 142445 127192 95527 50765 92151 123935 161602 162844 147264 177069 167714 128065
9350 128065 64540 38743 57110 89916 86258 60952 86217 60745 91124 97209 70731 80608
9338 80608 96428 119531 89017 67076 66912 26025 38529 89696 107509 95679 60970 46936
9326 46936 7921 58100 36066 26145 108833 103530 108681 128829 142262 37795 1657 44791
9314 44791 107083 59110 56948 134904 90027 -10289 -2682 32515 52043 61857 -2287 -41996
9302 -41996 -3245 -21240 -7877 29551 20768 79485 33156 -16625 -15138 27363 26512 34763 63984
9289 63984 48351 34637 -1642 -22151 8970 22417 38450 59981 37765 18276 22239 13414
9277 13414 60351 65111 68402 35006 42204 74210 42373 33718 8394 -29209 -16112 -37062 24182
9264 24182 40553 7912 -24390 -33754 -49844 -17996 -15383 -15513 39206 69563 51544 23471 12944
9251 12944 3597 32956 -32648 -9178 55944 17097 -7206 -99769 -63507 21207 61754 20281
9239 20281 15202 -14921 38334 62379 4604 44975 30752 5146 5554 25695 -24528 14012
9227 14012 51493 103572 109565 58217 27399 14066 -24203 -31690 -31166 -6347 -29846 -24096 -32613
9214 -32613 -25601 8210 -9651 -68618 -37056 15910 -42948 -21627 -1334 32155 61615 3275
9202 3275 -33968 -26109 -7867 23377 49950 46495 12585 42886 57719 14342 72270 114644
9190 114644 85570 54729 5244 21449 17962 -6055 -43840 -31444 -15758 86038 52689 5966
9178 5966 29711 40454 71334 30159 25520 42134 22511 21153 521 -25841 27285 59148
9166 59148 35374 13720 70931 80457 71362 8903 30168 23299 38841 32914 65744 57261 80425
9153 80425 99390 86046 67190 14787 -26397 -65031 14403 30023 24906 32516 38446 72592
9141 72592 50333 20052 13134 56102 85880 74375 36052 -33114 5578 38914 48798 21507
9129 21507 -24285 -23940 40631 55315 84457 126421 104721 83384 26395 47979 5612 7407
9117 7407 51981 23470 19707 30959 66896 71232 98478 130798 138206 82490 54441 28946 56706
9104 56706 26434 68716 111351 80174 89961 75592 37130 39036 58643 11532 -1144 12049
9092 12049 16129 -16140 13904 24440 31900 106091 132434 6590 5656 80563 115136 126274
9080 126274 107669 90523 67870 127039 64591 70637 71586 56941 134998 90285 80719 78617 76282
9067 76282 63380 91660 105395 69060 48010 28514 31574 77980 61539 62325 95971 106886
9055 106886 76093 67012 92547 112838 154134 154465 54013 64906 81449 48802 99257 85952
9043 85952 51269 94850 62049 109390 212608 178845 191810 161420 123736 77950 159348 192373
9031 192373 170641 176319 238614 238839 213521 211304 185128 206003 193210 171211 150664 165125
9019 165125 246471 290726 283499 285175 275664 239378 263805 312437 287964 230414 237941 250033
9007 250033 262865 283268 209285 121037 238253 298400 230844 232267 216314 219930 208399 245025
8995 245025 182777 167019 180465 138321 215070 233615 260008 196781 163440 264926 291022
8984 291022 227816 225867 225469 172157 155562 179481 195503 200524 209612 253040 248146 272004 265746
8971 265746 172191 184798 174980 262318 308853 318387 320987 300433 277756 353669 408125 358082
8959 358082 426081 414369 356709 340136 405070 461906 491402 537421 560641 513870 513389 574972
8947 574972 569345 641509 737517 708816 792829 813301 903664 983959 1095388 1287548 1466164
8936 1466164 1653485 1856543 2105137 2380179 2738413 3359330 4468024 6640458 9610314
8927 9610314 12344016 14419438 15200604 14830683 13736534 12119281 10323526 8568882 7063533
8918 7063533 5773181 4604673 3694848 2811195 2143991 1784363 1593000 1397373 1255354
8909 1255354 1113446 1047705 1013948 991118 972391 963388 999756 957204 979476 1033818 991151
8898 991151 991541 939197 903861 873500 866297 830342 790587 811768 820010 768465 649968 623889
8886 623889 631947 609366 597406 555596 524428 551873 522499 468615 465078 475695 476076 550343
8874 550343 584361 578146 589276 706677 784550 893660 973734 981745 1002803 942485 908448 827117
8862 827117 745816 704188 637019 580677 563884 528632 504945 466312 414612 411652 458018 379850
8850 379850 354432 439096 432412 461726 511390 546686 622021 696644 795581 870802 1025029 1144007
8838 1144007 1218028 1312655 1327091 1359506 1390907 1344943 1294697 1221082 1117518 992065 903448
8827 903448 823027 760053 633859 544998 493691 416515 395704 442388 453607 422209 431424 454168
8815 454168 502891 493504 518360 451380 453311 517245 537635 535197 533176 607929 604069 619530 662514
8802 662514 640762 599152 572020 633431 560873 520786 426729 373482 386534 371579 320664 357974
8790 357974 312232 322294 293621 268610 245691 195015 236453 229592 177447 199446 251457 230652
8778 230652 229782 260045 288716 277619 348059 368236 350976 392672 378004 416764 398105 382762
8766 382762 379751 363728 358623 402918 427813 430276 376972 374358 365885 233960 229738 271960 239459
8753 239459 187640 177578 186704 167405 111515 141208 139034 185726 181859 78530 56210 94353
8741 94353 97513 58124 51787 14803 -16718 16792 449 15705 -9471 32577 89627 48848
8729 48848 58597 53088 17746 24749 32914 -14331 21394 88552 149615 148747 58265 -15047 -10354
8716 -10354 74307 82798 83216 81745 42447 37332 82906 75044 55527 31648 38641 52122 49994
8703 49994 7185 22222 81788 82713 109047 44111 -48184 -12603 -32426 372 -24089 -30910
8691 -30910 -4630 4187 51329 -18954 -50181 -27962 -39635 26321 67761 84210 18040 -31676
8679 -31676 -63157 -46307 13966 38720 82904 33004 22641 41343 40378 90147 9714 -3914
8667 -3914 -10090 13188 13212 -33454 -30817 37737 26667 -10969 -60572 -57501 -83614 -41062 11197
8654 11197 -32043 -33846 -19415 10852 24370 21582 -37342 -57210 -38791 -29967 -66837 -50319
8642 -50319 40488 7280 4519 -21661 47219 48758 -37376 -25274 -49650 -14134 3382 63364
8630 63364 43690 69009 62931 -19880 -29219 -1848 2501 48731 43468 22023 -4562 -4972 -95067
8617 -95067 -83789 -27620 28380 18730 9371 11585 57720 30123 10599 3582 -51017 -22356 -13012
8604 -13012 -44855 -80287 -40352 -56011 -57285 -974 20213 -1997 -52063 450 6125 -4659
8592 -4659 -22167 -7277 3393 -21151 -44741 19017 15340 -51183 11686 99344 89130 102542
8580 102542 32849 6848 -14728 5290 88356 157500 71691 -14249 -14035 -22692 -70633 -69069
8568 -69069 -41226 20603 27354 -5698 87357 42896 60439 69098 30854 49708 60428 2010
8556 2010 18885 -46681 28739 27506 -30717 -25932 6527 16581 -6869 -10088 33459 909 17844
8543 17844 57846 41273 37735 987 -24387 -38859 -19226 -65540 -29868 19897 -22860 -9284
8531 -9284 52250 -25219 -32945 -36695 -31652 -18766 -2845 12211 23305 15427 -18064 -23854 -59827
8518 -59827 -47215 -45496 -15535 -7477 3091 15658 13353 -30817 1165 -2430 -33041 16247 -28709
8505 -28709 -32266 11262 -50390 -34401 -19963 29137 81903 14566 -26284 -37715 -68939 -76978
8493 -76978 -34514 -39600 -12898 -20283 -61572 -129578 -94783 -42518 -55788 -1437 -24101 -6547
8481 -6547 -12810 -8161 -8791 -28173 2522 32993 -4590 6229 -52629 -16120 -13595 -23588 -10675
8468 -10675 -18698 10819 -2815 8849 -23829 -25377 -72822 -86832 -126900 -76753 -24994 -70990
8456 -70990 -36334 18520 74500 44129 -13213 10754 27262 86111 49776 38837 80056 113030
8444 113030 43086 29659 34196 -10814 32742 -30174 -13303 -22120 -9264 -32129 8249 -19963
8432 -19963 -34338 7147 -49786 -9174 -12024 -39094 -25495 40462 9344 -13540 -6208 -70840
8420 -70840 -127643 -108078 -26346 18837 -36419 -123529 -74391 -66385 -41948 6519 3491 15834
8408 15834 44719 3861 -42489 -46989 -24845 25392 54336 48874 42403 16944 19911 61386 54334
8395 54334 26202 -42470 -94573 -62967 -43664 -17902 -8520 -32979 -77664 -38952 16486 -12207
8383 -12207 20101 -2881 -43494 -32249 -88967 -100407 -26862 -43352 -42029 -70160 -616 -2997
8371 -2997 -19008 -30249 -64190 -96273 -84047 -40369 39152 -1946 -24159 14684 -2848 9702
8359 9702 -51911 -66052 -58043 -30592 -4185 -28199 16945 39908 -15714 -37499 -31509 -9194
8347 -9194 13179 -9123 -46573 -64216 -37502 -49793 -60657 -79258 -146268 -131529 -124997 -151007
8335 -151007 -84912 -58083 -28024 -61714 -12929 -50093 -98845 -16987 10585 17923 -34179 -87714
8323 -87714 -63541 -93973 -74445 -21717 -15041 -48330 -53549 -23591 38056 7363 -1399 24782
8311 24782 -18718 -24631 -55123 -30798 24510 -1206 -32141 -20083 -25033 13566 41177 32048
8299 32048 31020 -3332 -44576 -9959 -15359 -18635 8422 34307 -49979 -86856 -71477 -9450
8287 -9450 -10138 10235 -37096 -50740 -71007 -85925 -101194 -46617 -84152 -82365 -51228 -85069 -9892
8274 -9892 -608 -19951 -64038 -31177 -13628 -49856 -77065 -62070 2219 17610 -27808 5202
8262 5202 -20850 11951 45253 -34447 -45747 -65095 -39827 -26546 -35613 -101093 -24568 -75759
8250 -75759 -38154 29154 -37764 -41128 -27840 -19052 -13099 -2306 -13331 -5552 12943 5794 26044
8237 26044 54643 44733 -22381 -27565 -33239 7374 -8385 -4648 32134 56072 45325 -40855 -42436
8224 -42436 -35307 -44051 -43366 -32957 -75145 20302 6924 -2984 -46486 -13831 -37541 -92782 -108098
8211 -108098 -58417 -11350 -4030 -8689 -8188 -11680 -12071 11417 48573 16048 25006 19822 78667
8198 78667 85731 175201 91625 174862 205609 470064 432202 -206507 -170964 -171266 -143601 -96937
8186 -96937 -82848 -100591 -95080 -103415 -114333 -159950 -188648 -190591 -125839 -100079 -81513 -116018
8174 -116018 -45739 -48078 -20990 -71249 -62403 -21879 -16409 -52566 -21123 -69787 -33646 32306
8162 32306 52343 73865 -5768 2995 -57918 -43868 1851 9652 -38925 12606 9967 58736
8150 58736 21049 -2847 65833 69969 -22972 -19159 -10056 -37850 -77212 -84598 -55616 -37131 -78650
8137 -78650 -74905 -50328 -57676 -66432 -55360 -62821 -104907 -106094 -62272 -85749 -82921 -85827 -36517
8124 -36517 -40548 -34695 -22488 -14381 2246 -1290 14556 -7879 -107540 -120352 -99767 -89799 -93861
8111 -93861 -78741 -67145 -76864 -82063 -75586 -81436 -103041 -98126 -39366 4118 -20950 -45105 -82319
8098 -82319 -92857 -79881 -50589 -66690 -99378 -43958 -7337 15848 5285 -55370 -75836 -44707
8086 -44707 -20540 49906 46772 -12171 -36663 -42298 6557 -66440 -22592 -14052 -39936 -68697
8074 -68697 -35296 -4493 -50935 -5623 -34278 -34419 -37191 -13528 -22987 -24325 -31619 -19715 30062
8061 30062 -6693 -25801 -46031 -46042 -54142 -42948 -45729 -25119 -35998 -44753 1376 -58956 -142298
8048 -142298 -28831 -14668 -52572 -52714 -10185 -14967 -7864 -77432 -91749 -45210 -6925 -55405
8036 -55405 -43163 -55506 -25256 -23909 -79217 -99910 -90984 -63501 -67332 -110272 -54578 22465
8024 22465 -49179 -31997 -24845 -53264 -125208 -180787 -76034 -39288 -10022 -36561 3279 53807
8012 53807 -41441 -31639 -47028 -7425 8200 -47014 -20230 57399 20874 5293 -25821 7542
8000 7542 3392 -44101 -41069 -70353 -55248 -75505 -45174 -48783 3952 69835 -153 -75440 -46883
7987 -46883 -86124 -105177 -24340 -54433 -87056 -55209 -42942 -72123 -63934 -70650 -109309 -80598
7975 -80598 -36722 -46314 -50933 -79939 -51023 -16475 -1687 22458 -39894 -9171 -61762 -132546
7963 -132546 -119702 -91135 -73202 -102297 -90033 -70964 -17801 -71720 -37310 -17358 -177 47003
7951 47003 45092 -1645 6849 48798 46208 69221 65367 29330 20506 -46755 -32301 43481 -3333
7938 -3333 -42668 -50325 -28346 28257 -42666 -80709 -73642 4006 -57065 -95500 -126539 -92799
7926 -92799 -68811 -62331 -53181 -19373 -47135 -88489 -30015 -19766 -56302 -86834 -93906 -59265
7914 -59265 -50250 29124 105952 27131 -26482 4622 10056 36772 86976 67715 57341 -24813
7902 -24813 -13101 -5716 -13688 -35954 -39841 -69418 -48744 -59050 -15471 -21786 62619 54391 4500
7889 4500 44477 1993 22445 -43220 -73632 16128 -3535 -36881 -101606 -100360 -74793 -100665
7877 -100665 -92145 -68394 -60560 -91846 -3320 36931 29430 -51959 -49550 18025 45226 39807 78295
7864 78295 40233 11473 43042 75194 19807 -9005 -51238 9444 11262 -48212 -17697 -1236
7852 -1236 -12185 -26873 -21875 -118973 -97034 -82503 -100999 -82870 -52465 -22441 -20163 -7864
7840 -7864 6761 -35421 2428 -23051 9951 -27409 -59089 -50073 -37198 -72713 -102273 -88361
7828 -88361 -49477 -1521 -43791 -89959 -37766 -21946 19451 -21643 -92425 -42379 -34566 -11464
7816 -11464 -5129 -48497 11797 22350 16530 -31798 -65525 -26019 -30403 -37111 -4484 -66218 -94840
7803 -94840 -86426 -67657 -11626 -3955 -2846 27247 -3630 -12471 -36140 -42069 -38006 -84445 -56629
7790 -56629 746 3197 -27501 -82502 -64344 -62895 -46386 18959 -1810 -23760 -28207 49439
7778 49439 -9249 -5243 -20667 -33676 -116373 -83371 -52892 -64363 -96342 -92004 -21206 -50711
7766 -50711 -116698 -78617 22795 -11926 -77636 -32683 -16071 -1416 -42942 -45444 11311 11136
7754 11136 -5266 -53434 -16160 14711 22772 -48095 -22179 -12191 -60823 -5096 34977 56854
7742 56854 -12337 -49018 -69890 -72648 -36886 -31150 -20496 14578 -24155 -83119 -118848 -85178
7730 -85178 -29701 -5996 -30177 -65522 -61065 -64258 -52513 -16488 7063 -18734 -19779 -62857
7718 -62857 -29562 794 -15990 30215 30608 64326 -2643 -90085 -92312 -27901 -43026 -68198
7706 -68198 -27749 -44032 -14353 -30816 -71204 -51020 -1851 -3938 -66744 -118171 -53262 32402
7694 32402 47854 -7613 328 1205 31241 62184 37460 738 4714 -197 -17213 -56147 -25129
7681 -25129 -29627 -71875 -51174 -62450 -21548 -66883 -55490 -21797 8949 20038 28319 124705
7669 124705 173463 94446 73991 74664 22896 -6705 38114 26113 32386 20122 30249 1997
7657 1997 7352 34188 8750 25708 -6261 13816 2700 -46811 -63282 -3860 -53417 -20840
7645 -20840 20796 29034 -43637 -27326 20984 -14018 -15700 16230 36868 -14368 -29218 -24445
7633 -24445 -26130 -18290 36284 77295 25237 -33863 -44622 -60834 5182 21629 37305 51909
7621 51909 35966 16097 -733 -58195 -53120 -12446 -32155 -85350 -73717 -45983 -72017 -94162
7609 -94162 -57609 -15779 7807 626 -31599 -44003 -19884 -17818 -3771 3507 1358 35589 51764
7596 51764 -10800 -53064 -55212 -5350 43378 -14087 -30037 -36316 -16449 -21734 -9523 -57254
7584 -57254 -46959 -62868 18125 -17612 -76158 -122449 -99399 -34073 -11335 5 23033 10732
7572 10732 15723 -13390 -90183 -63915 -75053 -35861 -74175 -50723 -23479 -3985 29752 -16772
7560 -16772 921 -23063 -59866 -85020 -17415 -40390 -55290 -28672 -32138 -732 -4660 32581
7548 32581 33563 22836 -505 -24205 -28635 -98849 -99103 -37695 -10730 28075 31016 8623 14687
7535 14687 36764 17559 20358 -48430 -35429 -39299 -18316 26818 -9902 -65529 -62086 -12486
7523 -12486 14384 -30931 -98084 -127289 -58880 -55656 -57879 -66805 -41963 -20554 -41190 -7354
7511 -7354 -46732 -52194 -25561 15421 47016 59540 4337 -91934 -49782 21742 8832 55415
7499 55415 49219 -27739 -49006 -11581 -40387 -18364 -28556 -63823 -70712 -77177 4995 -22244
7487 -22244 21254 42826 68165 -13297 -37458 -9116 5616 27568 23236 -8873 -11643 -15967
7475 -15967 -84275 -80845 -49693 -19936 11883 51668 42140 31334 -9899 -22036 -26102 -28791 40376
7462 40376 -4217 10051 -6344 -35993 -41060 27624 5386 -19260 -71529 -73248 -55770 -30535
7450 -30535 -1381 41913 2624 -59712 -15302 -67652 -76269 -132175 -163837 -121602 -4858 -39278
7438 -39278 -64295 -70145 -36267 -81506 -72636 -64126 -76970 -65641 -43468 -37063 -74631 -112651 -22469
7425 -22469 -9222 43926 11195 -6776 -5448 -23244 -5736 17253 15727 -88988 -73268 -64022
7413 -64022 -46126 -4669 34075 69378 39537 -26442 -59283 -47604 -81556 -35513 -32278 -38086
7401 -38086 54250 41910 -17171 -4806 -4430 -6699 -4147 20157 19035 9353 -10431 23931 850
7388 850 -85516 -100837 -31108 61873 77903 19946 -1708 45793 38034 -16726 -48449 -43077 -7505
7375 -7505 74607 64228 33147 -14783 -44133 -44935 34084 -15673 -49007 -43478 -35461 -1918 42569
7362 42569 44785 37648 27552 27152 66910 35319 -21600 -42469 8324 34250 73991 37485 29420
7349 29420 -7706 -539 -11887 -8919 -22640 -121222 -82589 -8771 18251 -41943 -66442 -83026
7337 -83026 -120302 -74868 -17290 -23915 -41009 -33370 4563 -6201 -6229 -14686 -18731 -40837 49401
7324 49401 131360 52039 -17322 -21529 -33986 -10775 -56846 -72066 -71344 -9391 3493 7301 -5184
7311 -5184 5979 -14505 -3891 29747 -14838 -20618 -3719 -46017 -62693 -36844 38547 90240
7299 90240 96437 20569 -64717 -7737 47568 112940 92615 49882 -1409 12980 13337 22136 18647
7286 18647 67418 89629 3343 -64890 -36264 18567 27560 1339 5263 -70289 -103580 7369
7274 7369 44498 37304 -35845 -3861 83156 48105 35772 -46331 -71726 14448 95045 66043
7262 66043 52962 18046 -2949 -40379 -66848 -62453 -66096 -12356 10714 3766 -17217 -46768
7250 -46768 -2450 -30603 -33303 -32845 -8505 -9795 -11790 -3472 -475 35218 30346 42855 42490 20435
7236 20435 -1430 -7952 -8127 7722 -14688 -8322 3892 -65630 -68759 -15580 19380 47830 39123
7223 39123 364 -41094 -95302 -83732 17546 -21224 -42538 -10807 -13884 -116568 -84249 -86649
7211 -86649 -49053 -58192 -57318 -91719 -83757 -36314 11479 -25755 -69673 -33258 1542 16591 32397
7198 32397 70250 -15899 -43132 -55844 -69865 12744 139647 74475 47644 30427 29645 -30571
7186 -30571 -13419 -1926 34000 17164 -10395 -15158 2947 25858 34199 37510 48470 -15274
7174 -15274 -43510 19058 -25226 -3651 -22157 -11687 7404 -19041 6269 15190 -50796 -43337
7162 -43337 -27496 -86323 -98093 -95909 -81015 -100786 -93649 -38983 -20089 -23711 -4030 15953
7150 15953 19497 -44692 -78568 -34577 27357 92240 64866 5993 -48665 -51025 -57118 -27089
7138 -27089 -27027 63234 38997 768 -2013 917 -35328 -27207 33777 12275 -11849 -29174 -26323
7125 -26323 -36568 -9415 -50189 34890 38952 24262 -27273 -31571 12693 15317 4927 21008
7113 21008 -15983 -50567 -44545 -53117 -45773 -26072 -15288 6765 -5694 -19019 -13167 -28761 51963
7100 51963 27669 78696 33894 1817 -19764 510 -4153 -8652 -52614 -63125 7318 24872
7088 24872 38326 -4696 -28180 19329 -50994 -55711 -62923 -69206 16804 20800 -2182 -2651 -163
7075 -163 19397 -42843 -10983 -64131 -19866 -36660 -82339 -93003 -82411 -33233 -103992 -74805
7063 -74805 -52732 33406 28487 -30077 -67885 -69818 4734 -252 -38942 10718 8986 -51382 -116676
7050 -116676 -51253 -28328 483 -48109 -20439 -60685 -25323 17499 -23101 -93410 -49930 -662
7038 -662 -23629 -14358 2902 -21060 23897 -2417 -50014 -13339 3980 -12523 8654 36443
7026 36443 10271 18529 10216 -53351 -1305 -10157 -44858 -36689 11095 28940 -56105 -41493 -22759
7013 -22759 -39355 -22331 -29100 -68615 -61964 -39692 -66681 -10731 34690 -48775 -74541 -12468
7001 -12468 54203 23480 35250 -18854 -45609 -30210 -15619 32310 20652 81411 27668 14512
6989 14512 57974 31563 37557 9305 5595 -32332 -25067 218 42705 33254 17885 -27095 -15409
6976 -15409 53039 57550 83103 52955 39463 57396 52655 86238 907 -50745 -52663 -37243
6964 -37243 -36535 -9477 -26486 -37677 -64346 -50966 -58342 -19407 -41109 -39419 -72695 -94198 -56364
6951 -56364 -10386 22540 -18779 8898 -18205 -41547 -21228 -19897 -38355 -33462 -60833 -53209
6939 -53209 -52796 -96657 -41398 -1653 -64108 -86345 -48976 674 42193 52008 45533 23112 -24636
6926 -24636 5268 6516 -18706 -4232 -13862 14355 -21676 35348 -11700 -9022 35602 115258
6914 115258 99791 25215 -17239 -17577 7616 17214 52962 -29133 -29540 -56338 -49163 -7968 57801
6901 57801 -15855 -14255 -22153 -28009 -20086 50470 64706 37754 36111 86261 81443 34519 20785
6888 20785 27881 -6120 26028 28009 -13276 -19738 33882 38117 -3171 64858 52407 40112 19136
6875 19136 -30456 -43677 -47398 -82847 27257 43726 -4639 17449 -27122 -96418 -81101 -67783
6863 -67783 -54708 -35221 -58535 -40382 -36055 3203 -2098 21261 13328 -68665 -77992 -43101 -46434
6850 -46434 8154 45118 19515 34230 2488 -3280 -3813 -49241 -29584 -34999 -29654 62792 14860
6837 14860 -21762 -15276 -62016 -6944 -8539 -44244 -67721 -68705 -67537 -7411 -22127 -90942 -30323
6824 -30323 10399 -15557 -22753 24481 44598 53015 5182 5410 10792 -488 -14387 1344 -13242
6811 -13242 -1754 17844 -263 -38782 -29756 -18747 -26813 -27229 36428 21892 -76525 -89300 -102385
6798 -102385 -95535 -70174 3519 56852 8577 -65933 -27324 21185 33483 -1948 -50675 -10849
6786 -10849 30361 14093 -33026 -17001 7804 -16150 -29715 7210 -3297 -79161 -57299 -31517
6774 -31517 -32158 -70841 -72017 -43492 -74455 -74716 -34518 -19310 -15067 8276 -511 -26232 -42667
6761 -42667 -15843 -44353 8268 35861 -51837 -52682 13982 36783 -21762 -58270 -28007 -54047
6749 -54047 8436 -5989 -45244 10678 -27117 7318 -2362 -13520 -42341 -36637 -55609 -43887
6737 -43887 -983 26094 39346 8356 -79499 -57761 -19479 3118 -22121 -37988 -25452 -16415
6725 -16415 -12728 -42082 -25460 -76861 -76976 -40506 29530 64966 29335 -52209 -91824 -77353
6713 -77353 -24187 -40031 -32522 11772 11958 4625 -17965 -51054 -24911 -30577 -31329 -28330 -21175 30844
6699 30844 50745 3177 47739 -11011 -64357 -28304 4237 20833 -2850 -30034 -13058 27909
6687 27909 38857 24921 59177 6668 -15476 -74639 -23881 -3523 -64870 -90360 -70576 -51603
6675 -51603 5896 2081 -23797 61157 11837 -27100 -24124 5470 -37136 -55229 -96019 -76865
6663 -76865 -76676 -58506 23558 61779 -7256 -32559 7260 77037 57666 4780 -72905 -2381
6651 -2381 -38086 -34039 -36071 -33971 -25818 -50387 -53565 -68771 -113751 -85395 -41534 -50078 -41653
6638 -41653 -27708 -26671 30529 70702 127508 56448 45561 43370 89112 89567 -47049 -26341
6626 -26341 -8448 -42916 -63735 -32542 14960 127554 77566 21780 -9672 3476 -54364 8821
6614 8821 22865 71069 -30949 -43287 -53404 -68158 -39695 -11579 63386 -15352 -45445 -19151
6602 -19151 -8787 2582 40137 58016 61520 58926 63435 25900 64647 45737 13019 7157 -17426
6589 -17426 25643 -9814 -12108 1567 52206 6691 -76246 -74154 -12896 12384 -8018 34554
6577 34554 11854 -33863 -52659 -14591 -18538 -22095 -107587 -92216 -40717 -69796 -30684 -60055
6565 -60055 -65564 -23684 -34696 12577 1723 -59971 21787 6009 -47280 -48734 -58281 -63144 -36720
6552 -36720 -7304 -69555 -55917 -48646 -26820 -8243 26094 -21777 -41952 9291 8857 4260 32567
6539 32567 24544 30822 -35393 -21244 6296 7944 -5402 -13486 -65863 -31812 24772 -30857 -44761
6526 -44761 -74286 -39372 -57031 -69802 -49541 -11220 -40498 -93400 -58690 -73017 -87920 -93093
6514 -93093 -46361 -32554 -13466 51626 44352 34788 727 18239 -2237 3077 32779 -33515
6502 -33515 555 -5232 -42913 -17814 -41552 11 3528 21979 17103 28837 18986 -45626 -98628
6489 -98628 -61326 -21281 -21235 4962 35634 32941 12823 -6893 20372 14855 -7711 -44747 23650
6476 23650 62055 -6515 -4353 9625 -20632 -10709 -8643 -55160 -76457 -815 53964 55980 1155
6463 1155 -53477 -69978 -57188 -23182 -1790 -7018 23557 5321 -6983 35943 48977 -5421
6451 -5421 -7498 -21195 -28837 3790 20809 17785 24770 81003 81027 77356 108018 55136 21555 -32413
6437 -32413 -64760 -59896 3470 25243 -34580 -41691 -6665 -39756 -48393 4811 16083 -15031
6425 -15031 9192 -333 -57118 -30519 23887 -2044 -35510 17177 11629 30717 -52961 -31857
6413 -31857 -9172 4135 -63841 -104979 -178962 -148075 -91723 -81830 -50154 -5287 19539 10247
6401 10247 39556 46856 -22202 -66206 -11987 44173 30532 17901 16617 70937 -10295 -25025
6389 -25025 -50103 -40262 27551 -1344 13026 516 -28637 -13348 18944 -4077 19190 54735
6377 54735 -47856 -76566 14365 68193 2755 -25613 -55437 -37928 4161 43320 -102 21385
6365 21385 34991 51563 76555 25683 40381 25081 10082 -6552 26881 44413 13073 -29371
6353 -29371 -42613 10756 78065 63924 36065 27742 89497 106411 1154 -2580 -5657 12876
6341 12876 17309 33896 19301 2761 778 27548 84237 69347 64603 28181 33682 -21062 68226
6328 68226 52600 37958 -22680 -1355 25895 2642 -70012 -68722 -3237 31012 -11193 -1806
6316 -1806 -13981 -12082 44238 33726 21787 58010 -34322 -39749 -718 -20547 69735 20184
6304 20184 -22088 18946 6551 -26126 35314 71358 13889 18186 12661 -48880 -44469 -14839
6292 -14839 19471 4842 -5134 -41046 28078 29108 -4213 25807 24233 -20758 -32877 -18082
6280 -18082 -45271 2958 66231 24221 -27275 38778 44178 38274 7794 47717 41501 8224
6268 8224 -47862 -24576 -35605 21527 -21926 -8822 21226 -30631 -54129 -45257 39100 -20679
6256 -20679 -43990 -21229 -58458 -58495 10317 4999 -13875 -19928 -2945 1603 9841 -29362 -1056
6243 -1056 16460 31145 63758 13845 10184 52386 35912 65578 25257 -9437 -4343 -42903
6231 -42903 -20422 -31615 -44849 693 -15796 -35043 -13166 -14644 43926 26965 12574 86646
6219 86646 64207 84654 37577 -29621 -15829 -34274 -88576 8701 19596 18457 11908 15848
6207 15848 25618 35199 9330 40785 101679 75828 27382 31129 3977 -6552 -16928 46956
6195 46956 80778 58840 -27595 -17494 55940 -5225 18592 -12049 38149 106602 44957 64322
6183 64322 13348 65214 75601 23422 19472 36683 55733 48332 102872 129535 148306 148906 84043
6170 84043 23635 79040 56535 14655 21705 82796 126598 47463 13552 113946 115111 69036
6158 69036 99910 103597 47824 92801 102492 89773 114151 90046 88380 97660 85822 68281 33232
6145 33232 19589 -2110 17803 -22524 41085 32425 -26478 35241 2811 -45808 -35884 -1177
6133 -1177 32586 57091 71517 122878 54252 18375 17823 19838 59275 42804 20869 109764 83236
6120 83236 46120 77561 59060 38597 8129 14720 -5687 4955 34790 32100 28124 71121
6108 71121 47624 80030 78902 102197 98361 100711 135516 60758 86410 80281 56157 56673 73890
6095 73890 122286 54701 45828 57054 115957 141212 126121 67703 89187 58560 102019 88985
6083 88985 90638 147674 141302 95480 74411 80233 36998 45280 74902 112312 113744 102042 49476
6070 49476 38658 33668 37960 39082 15890 22436 23883 17365 50737 46568 57527 51025 16696
6057 16696 -55828 -5394 34004 32378 17265 32759 86320 65635 103427 64634 64594 71337 75577
6044 75577 85337 91337 81007 42770 122158 152532 97253 93827 133130 105625 98297 96964 70091
6031 70091 89269 51067 108923 113264 76290 96279 94524 143975 139851 97416 111340 138155
6019 138155 134156 131632 125608 145733 142446 76537 71614 170124 121373 128925 104946 87626 101458
6006 101458 102311 166272 160352 168372 188440 187600 223699 212958 269472 261842 204383 223252 236550
5993 236550 242100 147591 157679 219160 178298 225394 174315 228754 241138 219147 176801 257924
5981 257924 311158 284447 344994 350474 318341 332908 340062 364324 489637 562092 676029 734667
5969 734667 829127 938826 988587 1065213 1106690 1172333 1159661 1094760 1026069 1056585 1130069
5958 1130069 1149728 1218666 1174133 1168161 1176544 1171347 1119070 1025823 971103 889472 776898 682734
5946 682734 587306 499970 492821 469176 472846 419988 340137 296234 262737 285751 249178 298645
5934 298645 300539 273377 309820 280443 298597 313569 231901 287961 266416 243538 276603 266644
5922 266644 286292 321556 315659 308616 300837 299423 281962 260558 263750 286372 310869 274742 344463
5909 344463 392319 376137 345093 305182 336763 319671 255062 215628 222217 223096 288676 323914
5897 323914 293260 294442 374192 327331 287767 310902 262726 243939 263829 239044 231141 272505
5885 272505 351532 423483 465310 405674 401252 362279 326366 357329 439436 446882 449380 406209
5873 406209 418544 471713 421490 454493 439625 477381 456213 437120 454585 460676 408569 428273
5861 428273 402138 428171 441847 501923 512720 473216 511945 551264 502102 543542 546300 529066
5849 529066 559665 493876 430139 457913 486845 443911 449172 478088 467824 503562 562415 517259
5837 517259 558099 642459 687521 746903 739805 736248 826578 760508 738892 768100 742058 814058
5825 814058 874813 846956 797468 850885 845842 825437 890154 876405 828707 758240 745013 797380
5813 797380 684971 676177 768191 749943 767808 718073 694794 748195 793930 769152 867287 857381
5801 857381 889182 914164 928278 927170 940341 966841 954366 990647 1006677 1039757 1020916 1037857
5789 1037857 1075419 1185318 1237264 1168460 1158951 1168744 1142877 1269325 1314586 1302413 1273407
5778 1273407 1310901 1341051 1307425 1324773 1386987 1343115 1384511 1461030 1463795 1491461 1540230 1553538
5766 1553538 1535386 1538115 1521477 1547449 1667437 1690643 1714946 1717724 1741165 1805971 1725590 1758804
5754 1758804 1817081 1787211 1814872 1844119 1898639 1949941 2019673 2028880 2009084 2134455 2194849
5743 2194849 2201331 2218818 2222275 2247108 2264319 2297200 2344740 2363282 2409879 2438161 2426018 2459954
5731 2459954 2530468 2602355 2654691 2643475 2708606 2802910 2869895 2918478 2950973 3020955 3098707
5720 3098707 3149035 3229187 3271391 3341438 3393566 3476882 3581765 3717075 3815180 3879236 3950198
5709 3950198 4030658 4087919 4141539 4204277 4351537 4450522 4500991 4646895 4736097 4887927 4991877
5698 4991877 5198071 5408748 5599690 5756859 5978283 6147991 6288278 6508792 6708778 6929970
5688 6929970 7172134 7410200 7699050 8006947 8300242 8687229 8940481 9234788 9546855 9895998
5678 9895998 10369337 10859981 11396186 12081026 12842644 13669796 14540932 15577097 16762393
5669 16762393 18055733 19599956 21315872 23217753 25463141 28127883 31192567 34754813
5661 34754813 39154078 44723171 52040566 61811024 75053829 92644419 114622874 139514277
5653 139514277 164251084 184834463 197627627 202106837 201171955 197334362 193072341 191264996
5645 191264996 193518849 200279877 209140377 216440947 218790303 214416150 203430089 188618327
5637 188618327 171853636 153287111 134051641 115354515 98072300 82619288 69087312
5630 69087312 57610343 48454788 41504356 36217184 32048679 28718896 26000023 23723854
5622 23723854 21812190 20211092 18816727 17554082 16446085 15502829 14557083 13737441 12996217
5613 12996217 12294996 11640623 11002972 10376745 9905462 9484988 9112332 8713551 8391434
5604 8391434 8131938 7817937 7547572 7381195 7172204 6861432 6635038 6427245 6228211 6049348
5594 6049348 5911470 5757884 5616345 5489540 5338204 5207495 5094551 5002957 4852283 4739490
5584 4739490 4549364 4394477 4244186 4062163 4002383 3884699 3816447 3688946 3556772 3491055
5574 3491055 3409859 3363524 3305596 3230705 3135897 3061267 3001481 2899758 2852340 2778925 2750701
5563 2750701 2628548 2563224 2540635 2458176 2408936 2358041 2340224 2309515 2228268 2178126 2166380
5552 2166380 2098813 1982015 1956584 1910852 1909360 1890430 1859835 1805428 1700633 1696423 1633767
5541 1633767 1586541 1601142 1565698 1543646 1582645 1465857 1441618 1416100 1483061 1484248 1409740
5530 1409740 1391203 1401255 1396586 1352955 1318117 1245499 1270316 1319552 1334529 1264731 1214396 1145123
5518 1145123 1167132 1235693 1209509 1174704 1186286 1181401 1118027 1082149 1063673 1110363 1136182 1134935
5506 1134935 1091978 1073245 1114445 1053837 1038773 1063791 1075835 1051530 1039291 1055247 1085819
5495 1085819 1054628 1029605 1072186 1095682 1054668 1125737 1138721 1170084 1249806 1165539 1141549
5484 1141549 1240192 1212102 1183671 1184816 1183277 1168615 1189241 1269778 1248358 1274305 1299780 1227640
5472 1227640 1192505 1157847 998854 1026913 1015600 957291 968295 994305 1072226 1042451 1031834
5461 1031834 1057332 1071888 1066306 1170589 1253484 1206259 1177094 1282386 1329189 1291624 1341441
5450 1341441 1371260 1377281 1482690 1576285 1574722 1644378 1685590 1706945 1702935 1784787 1780679 1806863
5438 1806863 1878973 2012114 2109371 2167801 2280359 2426309 2509585 2616242 2907278 3095880
5428 3095880 3285353 3498450 3711335 3955608 4326980 4861763 5341132 5966439 6740526 7676386
5418 7676386 8866853 10320542 12278149 14768545 17425730 20059360 22265195 23702414
5410 23702414 24263379 24222164 23823839 23235426 22847185 22778842 23137351 23890858 24894790 25682679
5400 25682679 25959872 25485121 24400449 22843431 20977888 18982240 16867003 14797646
5392 14797646 12861553 11053284 9547534 8272265 7230028 6318438 5538292 5010689 4568523
5383 4568523 4073875 3750410 3534712 3275234 3063110 2843271 2695922 2566825 2398992 2262429
5373 2262429 2146514 2096981 1968634 1905055 1856777 1723127 1589773 1512307 1527267 1462382 1350810
5362 1350810 1295334 1279635 1231362 1211284 1150152 1148104 1128948 1120641 1141930 1128437 1078353 1030063
5350 1030063 1035260 1040067 1068395 1028312 1035016 1029777 1065880 1030749 991937 1009951 1078660 1148408
5338 1148408 1170587 1326586 1423917 1463476 1513787 1576748 1597091 1642522 1548395 1507468 1512656
5327 1512656 1492039 1477732 1495119 1476623 1524120 1527252 1487842 1389430 1275570 1196900 1130728
5316 1130728 1057140 988574 896705 799382 763951 692087 643450 607181 628123 558171 505534
5305 505534 488685 496560 490114 474726 453619 405366 407779 388467 354432 378710 345895 322981
5293 322981 366490 341421 292412 335945 394074 390382 326401 282254 292828 343833 291525 212079
5281 212079 188036 229156 268804 252376 238061 270764 275945 188984 253391 202942 171912 204210
5269 204210 189338 190799 166444 171381 131532 136203 139204 117751 138468 174558 147715 135348
5257 135348 129925 126854 209380 169975 87660 133846 198932 212873 146704 166197 125236 117402
5245 117402 167599 241154 207401 242839 197255 140554 215814 202970 165479 191237 138285 127501
5233 127501 113735 168425 183714 114151 81607 57275 40047 74240 181410 178632 132159 96132
5221 96132 121218 128277 119106 108735 88476 59758 86407 91360 111005 139881 142144 143311 151589
5208 151589 126750 100148 130892 104108 80720 136585 90668 137692 133767 116075 103525 76603
5196 76603 106665 142415 91480 107913 114469 99553 93708 130800 118968 100576 99063 61750
5184 61750 -8679 21766 75702 93839 105675 88753 117441 126045 74896 84362 77321 67466 101829
5171 101829 128247 162090 130769 92420 93996 146949 96771 144556 145940 67337 53673 45004
5159 45004 74301 79656 62897 41630 37977 30423 33369 64369 80513 113117 153114 121630 88398
5146 88398 70953 70724 87794 44852 31404 104394 116299 91974 84323 75127 43990 15620 43570
5133 43570 36359 89027 88249 60031 85233 32940 70752 27500 48171 65015 -18583 62903
5121 62903 130868 106051 127560 184202 140824 142396 97634 143314 150272 187525 187988 136260 137037
5108 137037 178332 134404 72287 67039 65665 63874 74351 94529 145720 150923 182286 176379 195894
5095 195894 229908 206386 195728 163843 176844 195309 165186 193093 205536 182961 194337 149009
5083 149009 264134 257283 173152 150735 167074 196930 209516 223790 198309 156004 114005 161774
5071 161774 169869 136023 136953 124615 188700 144018 99922 73388 99052 109153 59692 36845
5059 36845 55155 114868 79803 111554 122593 42749 36441 42550 46424 35507 -10038 52409
5047 52409 97484 188452 225486 161985 169557 131274 108374 184408 163382 116715 114935 115491 125991
5034 125991 43892 53538 73340 73780 73171 72180 59032 98096 111903 109424 85643 43557 105406
5021 105406 169633 152819 140087 87896 119121 145717 104704 97552 173801 134320 67784 113701
5009 113701 117956 118023 90250 111288 157649 152387 119244 149182 131689 178246 148982 115042 118683
4996 118683 87606 139072 102693 134082 151211 168954 177642 140458 78331 93044 155037 109627
4984 109627 101847 140810 81370 90898 165182 136317 89297 84556 83697 96842 131609 52859 65870
4971 65870 42947 117874 186430 221148 175959 215047 150374 153128 152180 142610 175380 109796 170231
4958 170231 155312 136420 108533 124279 166210 170939 177534 151391 96020 75328 69216 106769
4946 106769 137066 164527 167486 163224 151769 133591 116767 168642 150332 161679 227605 163931
4934 163931 126741 92691 121473 181654 182845 146094 139323 116972 107555 73183 54000 88093
4922 88093 110246 125175 197285 154822 97790 150214 203028 164572 191042 170846 115306 185604
4910 185604 204309 228226 251336 272872 296004 268656 217713 189051 155694 157428 129077 149612
4898 149612 173275 232586 212464 182175 186449 200022 211784 258129 265717 285443 283127 278974
4886 278974 244661 262818 253219 314208 351639 412155 437166 468692 487847 490198 531368 562612
4874 562612 577233 642215 596974 684030 806495 771220 827424 871117 904526 807761 712287
4863 712287 711785 687396 679599 659089 650922 688178 652582 651038 552131 544940 531238 472342 482024
4850 482024 419170 359892 296801 313155 311140 251151 285736 273493 234188 289264 337986 326496
4838 326496 357168 328686 302117 250212 240333 254658 298323 314413 248915 225371 233353 196864
4826 196864 149893 202597 258275 220902 235504 234848 232669 227829 294953 235870 176405 176698 217068
4813 217068 235892 185085 246025 298941 274108 326839 341774 336447 339552 347395 291843 282041
4801 282041 275447 302988 263177 209356 222820 256135 252117 291115 286689 262290 218816 217264
4789 217264 196226 199708 265767 207178 164632 174606 205448 221927 213238 192304 259550 269887
4777 269887 255810 266166 203286 179647 248739 274019 303343 263572 232725 243116 280173 259575
4765 259575 275411 302853 359528 348799 303878 299489 308961 325380 272324 214595 268402 283364
4753 283364 262804 204863 211757 247299 280668 302848 267288 181666 179453 204335 197909 221899
4741 221899 283147 279275 290389 280717 292161 288553 267988 260021 244044 288682 288593 296870 319203
4728 319203 263752 262074 211671 238980 232165 217627 289737 311788 270248 277121 279015 264788
4716 264788 289160 293320 241342 296882 343921 329735 358497 311230 303584 305196 338380 405769
4704 405769 419274 371571 332520 359969 335404 324828 401887 325182 344139 374736 435428 472362
4692 472362 390935 328068 309181 347325 414323 390617 388418 290923 298680 349438 331193 349908
4680 349908 360850 405729 386622 349060 365389 356787 352348 331647 283662 278538 326661 327254 362282
4667 362282 385289 319001 253293 284174 303722 290033 334267 369956 402170 332015 321918 361680
4655 361680 384736 481479 446814 438198 402836 324814 338236 370946 360231 381996 425867 426590
4643 426590 422196 391134 379615 375762 419147 440452 457967 486231 454546 380290 405060 348386
4631 348386 389387 423624 409549 478544 462514 458372 497495 527633 490798 456106 429366 466352
4619 466352 476894 446700 494997 455174 469295 489713 457176 466538 484768 537512 533962 486495
4607 486495 528902 544999 543016 465757 477884 485891 440554 506827 503070 531926 534737 570653
4595 570653 550275 499257 479780 497512 536098 507005 532318 566435 555662 567403 542886 527625
4583 527625 548579 593797 627834 637496 613788 632752 621096 648335 664892 646450 593471 635758
4571 635758 612918 557805 588704 598979 607198 686992 705148 678820 626483 613839 620832 581561
4559 581561 653619 606994 644739 698055 682113 681186 679150 648870 708637 738144 782092 780706
4547 780706 726774 705186 797674 847754 856988 808756 823277 812982 876288 895555 950001 943813
4535 943813 928307 910553 927166 999974 942439 971841 981199 1023237 1037007 1034665 1057983 1044358
4523 1044358 1035806 1140017 1114132 1195017 1214433 1174233 1120513 1154678 1218416 1258047 1201524
4512 1201524 1248846 1312360 1297686 1318205 1375836 1469702 1495504 1465085 1498778 1516208 1501970
4501 1501970 1536785 1544234 1656822 1674067 1586856 1530081 1580329 1666676 1601801 1635069 1726970
4490 1726970 1722593 1709249 1657757 1735213 1786547 1771118 1775103 1698169 1702339 1724905 1787174 1802650
4478 1802650 1800037 1831745 1797555 1791498 1792469 1767928 1736849 1798173 1787592 1766448 1752194 1804495
4466 1804495 1870436 1812872 1793055 1827357 1902912 1980764 2069110 2068077 2046664 2090153 2213812
4455 2213812 2491610 2659253 2963223 3311848 3622441 3929730 4147430 4305204 4293342 4221223
4445 4221223 4031763 3811843 3576239 3265030 3023686 2779201 2623594 2443372 2286447 2190995
4435 2190995 2182552 2082160 2029744 2022559 2042607 2122369 2148067 2192507 2257990 2284937 2291620 2296191
4423 2296191 2238017 2331729 2357538 2355206 2398761 2476614 2571835 2666375 2753901 2707218 2675564 2681805
4411 2681805 2704911 2635747 2589953 2539119 2616461 2635363 2657733 2663533 2699388 2639905 2540707 2594591
4399 2594591 2645869 2682839 2688033 2652531 2628613 2690861 2700929 2821177 2832616 2805827 2835799
4388 2835799 2867008 2895634 2952900 2983461 2989196 3015639 3104096 3117284 3114003 3093780 3214594 3290827
4376 3290827 3362470 3496874 3602311 3619187 3681522 3764327 3878023 4046550 4255100 4532292
4366 4532292 4818938 4958246 5056060 5092408 5097796 5070789 5081062 5013019 4981751 4996556 4992830
4355 4992830 4974153 5061989 5102483 5180245 5284074 5426507 5535671 5559983 5658366 5780165 5934283
4344 5934283 6118656 6356725 6525126 6703381 6872428 7094356 7346833 7653301 7922881 8204253
4334 8204253 8524711 8923610 9378182 9881828 10493938 11223495 12047994 13015413 14094029
4325 14094029 15608486 17548155 20051646 23140106 27064973 31810431 37248583 43208418
4317 43208418 49193949 54425851 58492072 61397567 63566300 65996282 69420709 74462295
4309 74462295 81465968 89752411 97710036 103800868 106675840 105900279 102896847 98586966
4301 98586966 93568064 88951041 85591350 83836301 83046741 82141783 80019239 76331292
4293 76331292 71305268 65579402 59629585 53491276 47508786 42068923 37549059 33916184
4285 33916184 30984803 28449923 26228481 24162704 22196785 20497326 18960485 17603408
4277 17603408 16370569 15382989 14475473 13734067 13191756 12778025 12482955 12205139 12091673
4268 12091673 12013968 11944468 11901751 11958042 12000497 12043825 12209137 12408676 12557208 12698072
4258 12698072 12916481 13210138 13509757 13900542 14271156 14627516 15023357 15485244 16056367
4249 16056367 16646958 17269572 17945229 18682315 19532634 20415061 21312393 22342196 23408497
4240 23408497 24580887 25890514 27303217 28704517 30253789 31908826 33670048 35491432
4232 35491432 37417209 39432255 41466853 43635543 45908415 48353165 50883282 53542597
4224 53542597 56289787 59175184 62040223 64939519 67914524 70879770 73773773 76615475
4216 76615475 79354562 81950102 84565866 87067225 89541768 92021037 94550532 97089104
4208 97089104 99605481 102039125 104360067 106481403 108359888 109968305 111242253 112289315
4200 112289315 113172629 113826119 114386022 114822789 115206315 115537859 115722329 115713629 115596034 115362911
4190 115362911 114967769 114418053 113610041 112648565 111537341 110272073 108962372 107509542 105818408
4181 105818408 104105590 102458638 100723865 98965307 97276470 95462396 93685112 91982099
4173 91982099 90182553 88397957 86500967 84574943 82517366 80360023 78190756 75957172
4165 75957172 73675048 71444484 69298386 67220105 65252346 63329937 61380818 59463337
4157 59463337 57636767 55812236 53859553 51850853 49780917 47806818 45791658 43750474
4149 43750474 41733486 39836129 38017805 36302826 34630447 33022755 31544142 30143868
4141 30143868 28766597 27397566 26027876 24681582 23462013 22187437 20986801 19843298
4133 19843298 18750644 17737855 16848845 15926615 15106189 14394614 13753960 13143972 12607854
4124 12607854 12086913 11487353 10973907 10541883 10133473 9822282 9429980 9045239 8794174
4115 8794174 8623969 8398006 8195720 8038481 7961624 7829657 7705890 7602807 7414623 7311983
4105 7311983 7297688 7281008 7206567 7141197 7055517 7042231 7038648 7036659 7072188 7063107 7105544 7108564
4093 7108564 7138421 7201596 7259165 7239861 7291677 7340477 7390450 7421098 7467050 7498552 7573357
4082 7573357 7601878 7611559 7628008 7651302 7702177 7724243 7742634 7725507 7755194 7757281 7752138 7699026
4070 7699026 7736231 7733902 7714404 7655900 7641774 7688904 7649638 7628052 7596917 7530863 7461060 7372813
4058 7372813 7428417 7428364 7344206 7361928 7399831 7382992 7439270 7403990 7443591 7496966 7534611 7571756
4046 7571756 7532178 7611777 7610536 7684487 7760092 7832830 7966945 8018107 8184774 8299900 8440356
4035 8440356 8653227 8781288 8930719 9057890 9259309 9479076 9598940 9761714 9939908 10118103
4025 10118103 10248722 10395114 10665002 10871049 11044089 11278713 11552535 11780054 12077520
4016 12077520 12364515 12576646 12886684 13103556 13375977 13742793 14065436 14448937 14875165
4007 14875165 15301964 15688115 16153620 16621387 17126478 17721738 18365860 19059723 19875702
3998 19875702 20751354 21773144 22877433 24110090 25606267 27254084 29154086 31484280
3990 31484280 34168404 37280058 40931756 45116511 50028713 55820596 62630063 70802866
3982 70802866 80864279 93215259 108317090 126143217 146418584 168260091 190116437
3975 190116437 210465370 227989053 241605438 251085934 256509517 258428033 257743000 255349230
3967 255349230 252223450 249213861 246892704 245787806 246011206 247352754 248886119 249700313
3959 249700313 248617890 244558814 237081377 226014071 211764867 195261183 177405474
3952 177405474 159142868 141379787 124656449 109310238 95551938 83596230 73333045
3945 73333045 64722884 57450522 51482925 46521381 42335653 38878393 36003674 33540525
3937 33540525 31405310 29599348 28012494 26600961 25482042 24549457 23661211 22801086 22041275
3928 22041275 21393716 20843072 20402167 20003414 19611926 19270631 18988105 18794036 18557182
3919 18557182 18270863 18000273 17846295 17742079 17546508 17399003 17248208 17130358 17053759 16938156
3909 16938156 16875327 16852465 16826351 16781756 16777589 16743067 16786517 16752372 16700840 16689395 16617697
3898 16617697 16604023 16557079 16563059 16545015 16505868 16565146 16611697 16618777 16664890 16797772 16982029
3887 16982029 17132399 17236310 17379822 17520593 17811054 18122584 18386576 18704674 19049005
3878 19049005 19449098 19869439 20321715 20809030 21295276 21774880 22400879 22992785 23686535
3869 23686535 24505515 25343317 26214658 27152993 28185444 29267530 30350623 31330518 32296258
3860 32296258 33218481 34021856 34870961 35660546 36380347 37053467 37849178 38669750 39370326
3851 39370326 40079666 40799902 41438758 42008252 42498338 42895165 43198518 43325807 43363226 43317941
3841 43317941 43212833 43135021 43035069 42859523 42776151 42810594 42889759 43065948 43362190 43719097
3831 43719097 44221331 44882719 45714401 46772449 48036853 49627338 51563241 53834325 56488043
3822 56488043 59591181 63281173 67666787 72796770 78943007 86240038 94816386 104930761
3814 104930761 116279776 128551541 141248723 154030117 166539701 178523071 189947984
3807 189947984 200602037 210716206 220433733 229928660 239452682 249106536 259196803 269632711
3799 269632711 280262157 290973397 301578680 311685955 320704855 328146759 333541695
3792 333541695 336852960 338359526 338601437 337904591 336525365 334748228 332758481 330569695
3784 330569695 328216261 325646031 322646156 319075296 314820002 309668520 303437329 296281161
3776 296281161 288332472 279700228 270547341 261131013 251920581 243009908 234387627 226123321
3768 226123321 218118917 210330743 202677182 195187150 187723000 180318972 173083385 165914702
3760 165914702 158946103 152378439 146498700 141648027 138177702 136377210 136499739 138602511
3752 138602511 142611477 148396914 155593033 163509598 171485360 178750171 184635853 188608283
3744 188608283 190542654 190732154 189409391 187002454 184186920 181396174 179066252 177529898
3736 177529898 176696570 176451470 176309738 175660704 173883006 170639440 165674858 159152847 151135591
3727 151135591 141795734 131616517 121146565 110768292 100951383 91836617 83619515 76294730
3719 76294730 69881124 64379396 59850103 56098225 52966042 50465442 48328251 46562980
3711 46562980 44876365 43308234 41851739 40413230 38921337 37352560 35755002 34227792
3703 34227792 32718511 31222373 29813309 28492178 27291314 26189972 25131386 24305728
3695 24305728 23515476 22628901 21848102 21060545 20260703 19553731 18847682 18176978 17525160
3686 17525160 16956198 16355920 15875245 15370926 14826887 14436638 13977307 13575663 13232753
3677 13232753 12858722 12506449 12222646 11994552 11733337 11429369 11192510 10972706 10774436
3668 10774436 10571209 10370617 10127407 9823320 9632482 9411033 9220983 8983368 8779844
3659 8779844 8542085 8292743 8158383 7986080 7752084 7528526 7397802 7267842 7201013 7074169
3649 7074169 6991909 6814138 6737267 6672217 6572312 6489770 6364643 6301148 6137880 6071763 6018365
3638 6018365 5933276 5875065 5802881 5673695 5570881 5574746 5483167 5395957 5286250 5242799 5236397
3627 5236397 5173307 5202627 5123291 5027518 4882829 4822489 4838149 4853191 4801264 4718175 4677731
3616 4677731 4672552 4655860 4627667 4576377 4528037 4491414 4408743 4438678 4435807 4434675 4432874 4432393 4427816
3603 4427816 4419608 4414611 4352408 4322563 4351907 4308399 4354599 4399764 4353349 4364469 4395088 4416325
3591 4416325 4365006 4408845 4412376 4447826 4452637 4464783 4472493 4450762 4441381 4496838 4489626 4527167
3579 4527167 4568130 4542021 4597001 4640661 4647925 4642822 4658617 4686080 4746615 4723398 4763560 4788821
3567 4788821 4857348 4878601 4952591 4971159 4996735 5060441 5070813 5169023 5186735 5255696 5406590
3556 5406590 5485470 5535349 5551897 5604358 5664585 5749868 5760348 5798769 5915802 6046494 6079940
3545 6079940 6140740 6192760 6299954 6534304 6710301 6823099 6954610 7115945 7347096 7464477
3535 7464477 7600616 7787255 7964639 8067350 8119097 8207583 8276962 8372904 8420980 8503318 8661102
3524 8661102 8750671 8830659 8930488 9069688 9269269 9474663 9723283 9953913 10243540 10498777
3514 10498777 10773956 11082495 11398319 11765656 12189962 12569462 12951735 13362327 13728355
3505 13728355 14151228 14532018 14836669 15140940 15485076 15779996 16084546 16364127 16550837
3496 16550837 16693744 16859182 17047276 17204978 17479941 17767941 17994499 18233608 18596592
3487 18596592 19045942 19577950 20110754 20755260 21423176 22069644 22692429 23384253 24077840
3478 24077840 24764967 25361296 26053693 26754374 27599552 28561088 29705545 31124172 32808681
3469 32808681 34930017 37349793 40115851 43163525 46472678 49874358 53253446 56470173
3461 56470173 59261531 61447958 62847052 63357539 63023952 61958872 60189275 58026523
3453 58026523 55674412 53140892 50668670 48223930 45880449 43706266 41606083 39593514
3445 39593514 37669380 35849057 34108508 32520574 30927748 29336546 27871917 26452067
3437 26452067 25060217 23748729 22463619 21285490 20144201 19112796 18233309 17370051
3429 17370051 16549660 15774199 15088063 14493890 13981956 13591879 13167644 12842311 12577215
3420 12577215 12213665 11891728 11634024 11428076 11218772 10935107 10732991 10500769 10119017
3411 10119017 9921671 9766518 9632384 9527385 9377427 9167613 9019084 8870550 8784316 8703181
3401 8703181 8577521 8500824 8372419 8207934 8126706 7999587 7962323 7968862 7909350 7842694 7757076
3390 7757076 7667620 7674071 7597478 7495798 7364580 7307842 7214006 7120635 7030404 7012516 6998645
3379 6998645 6900710 6777306 6784625 6741295 6627814 6619205 6606276 6678031 6657811 6576170 6470126
3368 6470126 6435243 6388237 6344547 6370077 6399385 6280079 6246346 6301040 6215733 6166568 6201206
3357 6201206 6159475 6084398 6093388 6008655 6020636 6065849 6097840 6087415 6042931 5973764 5908890 5836977
3345 5836977 5866224 5890426 5890038 5933877 5899655 5857875 5787169 5780524 5808732 5766969 5713142 5729190
3333 5729190 5771344 5845205 5943289 6005532 6050854 5995528 5944607 5900997 5797839 5758983 5688387
3322 5688387 5623235 5561677 5500860 5476297 5509890 5471842 5431856 5403987 5355674 5272125 5246221
3311 5246221 5216211 5259562 5236392 5221530 5178688 5206771 5218197 5278059 5313714 5408096 5495241
3300 5495241 5452213 5341696 5297162 5312739 5197450 5134584 5022903 4958419 4950869 4912847 4832603
3289 4832603 4788338 4716632 4683240 4623338 4609079 4606267 4575601 4559130 4511196 4453929 4441600 4421556
3277 4421556 4424017 4407533 4310649 4260818 4278527 4329227 4270075 4245367 4221926 4218188 4171771 4192077
3265 4192077 4172468 4101506 4106065 4150234 4112053 4076072 4066574 3985188 3933641 3972160 3939054 3887389
3253 3887389 3860588 3863078 3820684 3788519 3786493 3740138 3783514 3801617 3756089 3701717 3665756 3626164
3241 3626164 3664694 3632233 3624909 3625092 3619790 3590991 3555094 3575602 3576850 3606917 3569903 3577323 3520597
3228 3520597 3498663 3543232 3506486 3491030 3493246 3471237 3483644 3496149 3428044 3388422 3338013 3375432
3216 3375432 3429625 3439346 3459484 3512061 3489825 3443561 3360535 3408328 3414799 3340497 3314426 3401865
3204 3401865 3498398 3508096 3584658 3589009 3567798 3586614 3561837 3591708 3596202 3579352 3522693 3508731
3192 3508731 3547269 3568901 3522079 3577906 3691988 3670182 3684813 3727624 3758386 3811962 3771566
3181 3771566 3809471 3831962 3822965 3847260 3919520 3935776 4059764 4134617 4122672 4225978 4252178
3170 4252178 4283243 4383968 4425568 4480312 4612715 4770012 4901420 4967266 5086211 5274081
3160 5274081 5460341 5646752 5884175 6102807 6355724 6700614 7065632 7500575 7991418 8484734
3150 8484734 9051907 9683527 10449557 11315206 12271871 13326000 14459330 15674690 16854752
3141 16854752 17941793 18875562 19535781 19912828 20098971 20222603 20244792 20266827 20190523 20061380
3131 20061380 19965413 19906418 19813164 19804792 19739523 19771958 19905254 20069095 20234803 20468364 20786327
3120 20786327 21233722 21905864 22833456 24249808 26453928 29625264 33796736 38278760 42100275
3111 42100275 44385097 44655992 43422520 41445368 38754437 35661144 32450748 29305755
3103 29305755 26487287 24003163 21780259 19870863 18366163 17173245 16248731 15471897
3095 15471897 14919834 14536671 14234007 14053355 14017954 13974115 14066043 14286756 14667330 15143476
3085 15143476 15737816 16400728 17154207 17831628 18337184 18421743 18173248 17592134 16755064 15817251
3075 15817251 14706961 13594718 12526634 11455708 10386362 9473809 8736913 8049801 7429643
3066 7429643 6937810 6411209 5969890 5601006 5281522 4962591 4691107 4423887 4226432 4001201
3056 4001201 3819270 3691658 3543175 3359913 3203483 3087955 2964934 2805736 2664694 2607291
3046 2607291 2574238 2460163 2390394 2316671 2216685 2194623 2111369 2090797 2007417 1924362 1850454
3035 1850454 1804344 1826709 1759506 1726213 1753521 1672935 1603427 1598335 1558861 1554876 1582861 1496708
3023 1496708 1416687 1329328 1378348 1326033 1263969 1245575 1196265 1194080 1137802 1083105 1059733 1141557
3011 1141557 1113212 1045363 1030942 976347 938759 961758 971647 917148 928167 963638 961796 900101
2999 900101 888021 894200 808632 815389 801766 736372 786079 787401 782539 739807 709656 737245
2987 737245 754868 685124 643384 621952 605987 643382 685724 645040 583654 617863 644272 607474
2975 607474 480312 480320 531926 504957 511359 514938 546737 532601 530565 530647 497883 506348 487035 512748
2961 512748 509407 477416 474896 452217 389874 444560 485985 469529 415689 375978 407997 445562
2949 445562 364235 361318 368529 378437 353338 339938 375338 373744 354123 310307 314674 303802 304267
2936 304267 267675 259622 252735 239287 323208 237659 263687 299257 231502 269504 287901 226715
2924 226715 196715 269932 258594 194849 235753 269568 260515 217316 287230 269204 213743 247894
2912 247894 228443 258385 242915 243538 255047 246281 177122 181632 199971 254976 203969 203708 202952
2899 202952 157971 181062 157412 112644 118075 140899 155756 150340 169207 155844 123401 181997
2887 181997 236284 242141 218142 230213 141289 123053 153242 164833 219557 167173 175797 195781
2875 195781 184698 119720 129326 191976 164672 134717 125095 132361 148721 160247 188788 219127
2863 219127 238481 205139 250386 293471 287981 240089 140231 150197 186086 165949 203976 237902
2851 237902 196313 164611 219172 272688 242303 170942 97557 162484 156731 158328 200449 217368
2839 217368 221037 194555 188774 188789 208657 155305 198894 222507 206307 273414 300890 324671 325562
2826 325562 368794 330030 309901 296943 265655 260223 226675 215893 242272 255193 156853 113193
2814 113193 161463 187383 152503 129507 124385 167601 209975 148388 92695 46013 66062 102859
2802 102859 98630 78058 105618 128953 176988 114578 63954 113977 172331 207430 160943 154726
2790 154726 122933 109936 100992 119437 100509 57876 49088 17005 53925 119165 117707 97566
2778 97566 82008 46499 43668 13835 -70557 -82338 -12300 -16858 7392 -23117 -30205 -9587
2766 -9587 60596 41271 26344 4902 13765 41186 26230 65587 46251 66257 39838 -67206
2754 -67206 -73680 -38875 30330 31021 -41871 23441 49541 23722 47175 10030 -13675 35981
2742 35981 -19865 -57194 -45293 -60701 2933 40768 -9915 28346 38946 -23312 -45785 41654
2730 41654 59683 2667 -32607 -684 33509 25459 -23262 -30411 13671 32651 20714 -22759
2718 -22759 -37584 -85674 -85437 25241 -6570 -52165 -38840 -25827 25164 87476 58380 13448
2706 13448 -1023 -13089 -44160 -11545 -15290 22899 21403 -15728 -53319 17509 56813 99400
2694 99400 66083 41718 53728 -25435 -32422 -30276 -20722 -15363 -62876 -70246 14465 62458 86047
2681 86047 -14645 -64129 -13339 -44995 2871 49312 28552 20592 -52194 -72978 -42956 -15401
2669 -15401 -17680 17668 43963 32132 25557 -34349 19040 23695 -61657 -94135 -60087 -31254
2657 -31254 -54737 -112646 -76596 -35953 -55609 -39706 -49490 -43926 -112867 -61862 -45831 -55825
2645 -55825 -12648 10343 -65631 -37634 -8418 -64900 -58746 -11652 -34064 -61293 -59046 -17308
2633 -17308 -76715 -74987 -79202 -18661 -54039 -70107 -30730 -38350 -11276 -35370 -38921 -24985 6830
2620 6830 56225 26642 -21611 5519 -5088 6122 15308 46195 44135 5441 -2191 -59670 -110251
2607 -110251 -69194 -8482 8383 -47556 -45624 -21996 -47617 -102926 -20934 1108 -58372 -25214
2595 -25214 -3979 4361 6241 -32484 -12482 12875 297 16533 30060 1859 -68143 -98981
2583 -98981 -55328 7391 21096 46060 135513 160244 153074 182146 148253 159342 138782 76685
2571 76685 35821 13505 29716 -22109 -2221 -77917 -133745 -60944 -84632 -79742 -76024 -52026
2559 -52026 -25738 -56917 -85257 12268 10645 -24354 -49953 -71694 -37976 -20773 -49572 -81850
2547 -81850 -36779 -8536 60258 -43554 -28223 -3226 -2650 -58649 -17375 -21776 -104869 -3633
2535 -3633 -18794 -22617 48514 66136 48512 -39625 -73006 -45587 -22058 -20925 64850 94100
2523 94100 9833 -21663 -12155 9369 -2872 32933 7798 -25553 -58905 -13733 -3114 -6786
2511 -6786 30579 32054 27534 20265 -48707 -122103 -81446 -29838 -40301 -85588 -54025 -77061 -33862
2498 -33862 -6699 -81901 -70368 21880 31525 50354 23254 -23631 -7613 -11559 -3397 -5100 63449
2485 63449 73547 95495 90986 87560 27157 -25379 20123 37210 15716 -16408 41859 71650
2473 71650 34701 37857 28065 -5464 -27927 -11964 -486 10022 22352 15552 10352 41794 58268
2460 58268 62184 56450 81982 120786 71622 21401 26798 55484 58872 60217 36098 28701 55203
2447 55203 44802 68522 31103 -32828 -29728 1135 73190 54746 30964 30520 70881 60675
2435 60675 57637 70817 87792 124515 96709 44215 100553 128501 119000 108229 95197 124530
2423 124530 92868 111954 78556 95395 116172 92998 85372 91536 110174 107010 133121 91394
2411 91394 102693 132416 99544 101870 144695 136006 129428 106440 46804 61024 89618 158540
2399 158540 216162 127845 97335 117429 63422 128131 118066 89597 161407 173570 113440 72326
2387 72326 96202 117992 187749 165582 121696 170849 124543 192461 188726 222597 225876 258516
2375 258516 246038 276094 229044 231429 280416 277294 277788 314147 327274 302032 384045 402767
2363 402767 405965 441842 425762 413703 403177 431011 485415 484675 537533 602949 666540 667552
2351 667552 639146 655344 696427 688725 709586 761463 782911 791762 799641 839292 887043 933736
2339 933736 976250 987925 1016951 1054693 1131892 1222309 1293846 1368216 1491309 1678768 1900559
2328 1900559 2175980 2518851 2903462 3305403 3562455 3888255 4214383 4639041 4972141 5467451
2318 5467451 6132758 6934951 8054611 9999381 13611718 19473025 27056300 34877131 40664589
2309 40664589 42621069 40306375 36895235 33586225 29402127 25015044 20687583 16959666
2301 16959666 13791947 10965377 8388864 6635816 5672134 5127307 4716567 4349166 3912748
2292 3912748 3474109 3106852 2812773 2622050 2405622 2258113 2074262 1831618 1777377 1593145
2282 1593145 1444923 1400033 1300188 1245891 1127802 1128721 1099346 1050783 1013353 917741 914419 875034
2270 875034 795717 801186 832833 779945 718710 679054 654533 616646 601058 631773 675464 612693
2258 612693 572659 585207 554292 502401 464862 471213 445569 450454 413840 442769 436264 363993
2246 363993 337517 393066 456471 467989 422750 362509 336083 349507 288515 252537 276651 259044
2234 259044 231733 229717 240405 200693 198459 174833 161186 187948 249032 208167 188093 141258
2222 141258 98260 76031 135646 130139 145279 132342 125801 143920 126360 123457 140283 104832
2210 104832 87605 76006 103834 138048 132662 128415 143650 145389 159169 167578 156957 123815
2198 123815 105733 35421 18099 41612 45227 71966 91070 54560 22137 43686 2475 31148
2186 31148 67000 95207 76455 45033 64598 45380 -15561 -71194 -40542 -28876 -7335 38909
2174 38909 60115 -55063 -65406 -8663 -17193 -9228 -486 5769 -29742 -34569 -49747 20647 86333
2161 86333 56071 -26658 -13332 -97173 -73585 -39383 -64987 -22485 -27724 -54307 -48284 -63885
2149 -63885 -44933 -52591 -9665 27017 98328 66206 13687 62436 21649 -8324 -4580 -40544
2137 -40544 -84781 -83576 -58440 -47698 25476 1741 -36084 -79267 -91591 -106717 -79645 -106044
2125 -106044 -14622 -32647 -48812 20987 -58010 -69120 -48168 -27340 -43212 -99462 -146457 -125487
2113 -125487 -137195 -88758 -51743 -11564 19136 -36461 -75329 -45902 -9537 -15023 812 -6821
2101 -6821 -49035 -120178 -91843 -34885 -124268 -125634 -127516 -99492 -65787 -59880 -55440 -12386 -21424
2088 -21424 -37681 4074 32667 15969 -14708 -72694 -62121 -24053 -40 -60424 -74269 9785
2076 9785 47456 -16447 -31720 -18603 -44798 5347 -29389 -95481 -125383 -82996 -51963 -22133
2064 -22133 -39607 -13680 -25599 -41851 -58301 -83470 -84645 -52818 -66471 -86994 -48971 -18659
2052 -18659 -11729 -43950 -12189 -23038 -22843 -30779 2569 -15380 60861 58916 45985 86782 82293
2039 82293 106988 167537 131613 116913 65052 45227 56541 9172 41802 35814 -8925 -769
2027 -769 8365 -78252 -69080 -88000 -119814 -57794 -26807 -69860 -64317 -67668 -120269 -166967 -130564
2014 -130564 -90206 -113952 -40905 -70079 -105973 -125420 -120811 -31842 -1768 -33602 -81318 -83521
2002 -83521 -100306 -52673 -64260 -94740 -72094 -72995 -89545 -139513 -100116 -98819 -66355 -76437
1990 -76437 -96374 -122524 -136769 -153490 -120893 -117808 -168784 -148204 -62762 -116509 -179614 -74427
1978 -74427 -28074 -5511 -71877 -74229 -58704 -1868 18694 -25043 -74801 -101770 -58864 -81247
1966 -81247 -59934 -56455 -99621 -122783 -125942 -36075 -103636 -96987 -47536 -88368 -53257 -89096
1954 -89096 -91317 -39002 8703 24436 -35228 -29857 -22877 -56139 -75445 -84835 -84014 6546 -57752
1941 -57752 -110326 -49592 -41109 -30732 -11581 -90370 -75422 -54275 -41322 -24621 -67550 -78335
1929 -78335 -22273 -26472 -53579 18286 -7795 -42663 -21923 4856 -8605 -26452 -66033 -51722
1917 -51722 -42955 -64147 -49282 -92631 -37603 -49471 -27590 -44716 -78051 -115850 -109734 -60734
1905 -60734 -88538 -60502 -84535 -10055 -8179 -42857 1764 14215 -32641 -42046 -43170 -107996
1893 -107996 -54883 -68564 -16858 5987 -9051 32059 -23930 -62858 -34340 -28221 -22923 -43617
1881 -43617 -62227 -58045 -105644 -121154 -78956 -40551 -61352 -61762 -413 -48397 -103003 -112764 -166613
1868 -166613 -125937 -74746 -64183 -95356 -76595 -46156 -41516 -33346 -12487 -78989 -68067 -50894
1856 -50894 -60765 -69647 8298 -57775 -27572 -35893 -105528 -96961 -88528 -102445 -45386 -10524 -26938
1843 -26938 -5356 -41610 -34946 -33972 -51157 -118311 -106992 -29619 -74264 -99186 -62232 -55807 -15870
1830 -15870 34242 -35251 -42066 -99585 8693 -31438 -79932 -60777 -71502 -41317 -83026 -45332
1818 -45332 -66073 -33589 -13162 -28897 -17113 -45452 -162790 -95858 -13322 -68699 -104805 -52416
1806 -52416 -57390 -89036 -61429 -9159 -33403 -48814 -26369 -32549 -31949 12316 -65852 -60076 -13398
1793 -13398 -20729 -24020 -6537 -53038 -82036 -65191 -81637 -76562 -96674 -143575 -79094 -22157
1781 -22157 -46653 -91160 -72653 -44694 -22458 -13137 -23368 -47239 -92608 -81691 -69452 -63791
1769 -63791 -72601 -36579 -34926 -105773 -75242 -33809 -35769 -67957 -63816 -55400 -43663 -64368 -36332
1756 -36332 -45934 -63488 -89057 -77000 -107261 -80190 -84771 -147483 -93875 -71302 -67902 -62897 -87193
1743 -87193 -92123 -65067 -109303 -116019 -59551 -46720 -56547 -70180 -151959 -95599 -114609 -95493
1731 -95493 -5890 -41534 -102303 -111070 -74230 -31049 -82585 -48673 15373 -16610 -7004 -60709
1719 -60709 -131250 -88601 -42094 -31451 -68151 -54410 -48247 -98036 -102595 -54975 -78419 -87912
1707 -87912 -66429 -44321 -6185 -61270 -88201 -29917 26182 -30341 -31457 -59338 -86497 -81379
1695 -81379 -80116 -54053 18556 20992 -41783 -41675 6588 -1721 -35440 -54483 -73182 -85108 -78088
1682 -78088 -67949 -18105 -77917 -100131 -145770 -153487 -82946 -27144 70683 -33769 16482 26299
1670 26299 -4934 -23405 -114155 -125479 -65039 -21461 -26005 -122628 -79927 -74527 -45789 -52224
1658 -52224 -95105 -131112 -94440 4769 -45474 -80419 -43834 -47129 -39838 -40419 -54627 -76407 -17520
1645 -17520 -17041 -3818 4135 -8299 -110379 -148491 -81355 -48308 -49013 -36242 -20655 -19127 -9153
1632 -9153 -40956 17711 -38879 -25128 2997 -31547 -20386 -2307 -11232 -25128 -2711 17309
1620 17309 -42951 -33656 -44582 -8076 -75503 -32527 10593 -26654 -14755 -49908 -85756 -50034
1608 -50034 9445 39805 -32901 -12334 -30655 -36133 -19539 -137883 -153712 -148936 -76314 -109934
1596 -109934 -93704 -72817 -124834 -87638 -49331 -68509 -35310 -14867 -16792 -68199 -54344 -64306
1584 -64306 -91348 -37699 -11786 -24151 -44156 -37698 19325 44932 -46392 -33893 -67301 -62753
1572 -62753 -53628 -22128 -54471 -84739 -112323 -84283 -41501 -34545 -2860 -21828 -11097 -90916
1560 -90916 -105626 -65516 -32947 66237 85938 15509 -54702 10621 1991 -42099 -34333 -29268
1548 -29268 -29419 -37584 -28154 3867 14271 -77071 -60043 -80723 -19851 90978 26206 -26588
1536 -26588 -3545 24181 15280 23974 11695 -43948 -50979 12023 -19436 15890 82329 41781
1524 41781 -2910 -4852 7085 -58914 -52493 -27382 -80972 -48514 -32756 -76114 -12399 -57948
1512 -57948 -104754 -40251 -71703 -67480 -75312 -97221 -34464 -57929 -29634 3338 11863 -37507
1500 -37507 -50709 -84890 -37717 -29584 -52279 -68731 -34031 -52302 -62116 -72641 -93051 -32077
1488 -32077 -9853 -18898 -6703 -14538 -63352 -60836 -26191 -13698 -12458 1145 -330 30717 9104
1475 9104 -27761 -47312 -34352 -53517 -30506 -42630 14864 -2764 -10667 12573 -8506 -38664
1463 -38664 -47150 18162 -261 -75827 -60647 -58138 -114767 -88181 -91880 -89504 -81767 -112047 -121243
1450 -121243 -129296 -104712 -94498 -96480 -60580 -49792 -16394 35206 37450 -9171 -34135 -45199
1438 -45199 -43033 -56276 -39609 7473 -15283 25384 22591 37304 22936 -27668 -64441 -35643
1426 -35643 4373 -1839 -30097 -38251 -34000 -29063 -21208 -40750 46483 -8576 -46756 -2592 -36562
1413 -36562 -51471 -60192 -53167 -58880 38051 58314 31627 -22263 -37043 18245 -28140 -10025
1401 -10025 -19867 -46754 -44879 1079 41098 44732 66367 48227 33257 9309 -59764 -68933 3732
1388 3732 -7274 -869 -14104 -29818 6059 -21425 -60146 -75643 -64954 -82910 -59660 -59177 -3926
1375 -3926 5812 22855 -9730 -27384 -10953 -9589 -55925 -67884 -42748 -25947 -72657 -87229
1363 -87229 -72890 -37705 -49113 -62106 -85740 -71918 -20938 -5856 6557 -25943 -64466 -46354
1351 -46354 -63591 -34993 -38210 -28059 37052 -2191 17100 -16321 -11798 -1619 -19970 -37694
1339 -37694 -65411 -68160 11049 32392 60365 -38008 -81187 -56607 -6446 -13648 -68626 -44527
1327 -44527 -37489 -24016 16348 -22315 856 -5851 26535 57877 33308 4098 38904 34568
1315 34568 -41909 -59025 -62281 -70970 -66715 -93983 -68083 -36660 -10383 67497 85492 -52346
1303 -52346 -95896 23808 -34771 -58386 -92369 -74002 -31433 -29482 -8849 32315 30890 -260
1291 -260 6940 -18417 -35438 -52507 -53865 -49069 -48240 -66275 -85071 -70619 -100580 -96483 -115400
1278 -115400 -112141 -88158 -62956 -29920 -31816 44403 44631 -10006 -40895 3095 38377 7284
1266 7284 -31309 -39705 -12497 -10821 -9076 60700 39373 9050 10544 -82141 -116903 -132862 -140040
1253 -140040 -67891 -68992 -34308 -37195 -90960 -39523 -96211 -59873 -32133 -9469 -72971 -93996
1241 -93996 -69582 -55721 298 14583 17915 -14449 -58110 -52320 -32628 -46017 -22302 10236
1229 10236 18630 36697 -14066 -39935 16004 70216 30976 -33478 -11811 -9390 -37633 -17065
1217 -17065 -41801 -37378 -3908 -35924 -36810 -14521 -47530 -8020 9010 26228 39204 23338
1205 23338 32459 26334 55189 82628 18403 -6765 53659 72773 59573 36820 50365 4634
1193 4634 -76311 -100082 -66671 -24919 -58104 -48574 -25681 -42570 -85933 -92413 -3653 -4803 25719
1180 25719 12316 5338 -18961 -11672 6210 60049 44370 22166 -57953 -11517 36904 -5497
1168 -5497 53485 -25337 -20965 -28135 -31105 10044 -63395 -30392 15554 36698 -7488 -10445 -4704
1155 -4704 -24967 -14549 8006 8078 -9740 30518 991 -10827 -30718 -47823 -37897 -18222 -2691
1142 -2691 -26037 -129099 -60753 -33147 -13835 -27987 -69400 -51345 9040 -12368 -22983 28881
1130 28881 54471 39471 -492 -66697 -42288 -21403 37679 47538 17849 44576 29357 6476
1118 6476 -22369 -3800 43672 15504 -37149 -25809 -27219 40312 -30209 5070 36328 24624
1106 24624 16815 -7139 54114 -24039 -10272 9999 -1523 44763 75399 38627 46460 46321 56304
1093 56304 73897 7665 -19511 -40750 3730 -3783 21284 -16704 181 -26584 -15751 -23894
1081 -23894 -34218 -10479 -53933 -2732 3881 758 41501 -39384 -95592 -62450 -5822 -58768
1069 -58768 -36959 -66969 -2308 15387 -2119 -4525 -33125 -50187 -47958 -19935 -74861 -54664
1057 -54664 -5670 43188 47687 21124 82076 75963 48757 27911 -14538 -40481 4005 21235
1045 21235 28648 34327 86071 37776 45917 32868 2094 41102 28140 28655 -17521 62881 37938
1032 37938 49600 64058 100815 34358 11813 46372 53791 47954 56539 46979 -3888 -30544 4074
1019 4074 10179 28750 17176 27387 21853 61524 43580 -21135 -63582 -44005 27697 77379
1007 77379 41146 -26780 -4274 -4479 -51429 -49928 -97477 -93297 -55434 -5557 23364 -30041 5042
994 5042 42546 -16000 5584 -22628 13842 -8629 40928 11742 3679 -6981 -95634 -48047
982 -48047 734 -1082 -27420 -5043 2003 29559 -8023 -52512 -76025 -38331 46165 -8772
970 -8772 17574 48368 44137 49534 36653 20922 9305 18158 -34152 -45391 -88043 -38701 1225
957 1225 -9368 -36267 2368 669 -7426 -32592 -101044 -49254 18605 9435 47096 57276 -12380
944 -12380 -84385 -45592 -20578 -12837 18769 46231 54166 85697 98682 51081 37156 61058
932 61058 41135 46366 65470 56074 -10509 6216 2570 -9154 -24168 4264 57345 -11899 35958
919 35958 42821 14844 34626 26722 14884 -1435 8095 14834 27700 -12275 -8513 3696 10297
906 10297 10306 -13375 -29594 39185 30347 23669 13825 35163 34868 218 8558 20893 28215 54375
892 54375 64465 -15344 -45846 -61913 -31944 34635 20770 13091 76 64698 34161 -24513
880 -24513 5102 18863 -41351 -82741 -50260 -9609 25479 12744 9991 87684 55536 64974
868 64974 102628 46723 -7367 26200 73666 22880 7546 -4574 -13849 24394 29500 -36117
856 -36117 -36666 54118 30389 -2256 92177 32874 1444 -38827 -51774 -61293 11359 53285 -535
843 -535 5534 26995 42621 18508 40983 48533 -11612 99044 140651 116542 22793 -1157 25944
830 25944 39773 5470 15725 47309 42255 40602 -14338 -65483 11486 25321 -4018 34914
818 34914 62815 44049 1145 26292 25708 -7501 -17955 6712 34347 70846 10363 -30867
806 -30867 -11455 -23252 27562 60043 132757 98887 33060 60478 73587 117490 119777 68021
794 68021 -22376 -33453 -15803 17935 -481 -39514 -9107 25545 -17328 -52188 -3311 -30701
782 -30701 17761 3913 22677 32857 26360 68514 42254 54583 82687 54475 19825 19682 67679
769 67679 47013 6553 50168 8457 31733 57329 34199 -37305 -6697 78252 43446 23611
757 23611 32999 54778 32841 30252 8986 -28314 23889 38677 91395 10600 -421 42787
745 42787 -307 14493 11263 30717 58072 44132 23307 13555 7489 51578 98183 84523 7656
732 7656 -935 -9998 -57102 -29089 -46443 -77059 -64563 -56982 -56795 -41965 -44143 47590 43645 -14291
718 -14291 -46991 7821 32689 37769 51223 29597 27567 -49748 -20762 -23819 -6346 18534 -10609
705 -10609 27439 25950 37713 40621 32312 35727 29373 26759 25097 56479 36585 32062 27108 -33111
691 -33111 -64201 -52812 3082 78067 88467 43804 45871 55295 58649 88855 65144 32486 80034
678 80034 71860 57816 102247 122405 140498 103139 63708 63047 52690 77221 87939 94218 34198
665 34198 68161 76776 62583 20455 -9162 33842 33660 -1315 7289 23268 4211 -19357 16779
652 16779 -40732 20195 109534 130761 103813 109784 118832 31545 44140 35583 -219 -81425 -23935
639 -23935 -35073 -22816 -7579 4640 30022 57900 43262 24628 83111 72059 73486 27467
627 27467 33248 2854 8650 50625 75024 53193 111265 106684 49436 58873 56244 39523 16865
614 16865 2946 9348 140897 169258 165498 110600 104413 65113 58309 72508 53571 77232 76825
601 76825 82644 121586 30078 -9991 -89565 -51023 -16477 68353 78041 75747 46892 28354 13722
588 13722 -16336 68486 1960 -13110 31519 44153 86445 60934 -3375 21910 92464 67253
576 67253 129361 138942 57137 12323 59816 88414 61154 80658 4201 -8168 -13728 -50310
564 -50310 16033 94599 77393 48666 52852 36309 31733 82112 83118 73193 104476 52065 52375
551 52375 74911 22200 11354 -5761 -2558 29165 95584 60766 56183 97797 107314 122703 128832
538 128832 111549 105543 71427 127215 53983 -6319 37814 61532 26360 39874 78588 113797
526 113797 164740 105621 48773 110074 69672 55258 90842 59453 119655 98855 47960 36617
514 36617 32273 104257 99830 57514 94618 129878 61515 -6669 -6697 27116 -64537 -73107 -1351
501 -1351 34121 52937 35849 13083 8186 53879 90401 37871 36911 21853 41524 8418 -9528
488 -9528 65765 107820 86050 58697 -30369 -44304 25783 13242 4060 33401 58439 11633
476 11633 29337 -30390 6147 98814 169681 152891 101503 81477 52509 96889 93856 85002
464 85002 87953 110966 131815 97835 72618 70095 92068 92025 -803 -23687 400 -43866 -39512
451 -39512 105640 86459 -34796 38358 86937 82660 69164 64655 60061 88306 64493 76063
439 76063 95615 66606 -72655 -95279 -39919 -1475 31710 92273 84932 27774 -9428 12706
427 12706 33644 35139 93047 94451 98117 71211 -30660 -970 24801 -25951 -10954 51766
415 51766 29131 57985 99927 111515 51693 637 75646 147245 186192 157183 50507 98053
403 98053 71010 56010 98186 100706 126252 135672 111675 71447 100537 110750 61847 41054
391 41054 123528 116196 124329 97266 51692 42017 128231 130575 140501 87385 77003 73011 63320
378 63320 31686 -31497 -16475 49607 117255 91782 88694 92612 74842 110375 150311 143047 110567
365 110567 135316 102751 43179 43368 39825 91393 61608 88037 79412 73894 33151 34702 114679
352 114679 98551 52883 66270 118304 122838 129811 78336 107063 111493 129089 136037 119890 157857
339 157857 136753 98774 177051 93227 53861 80403 130534 106453 37589 17557 -33139 -25746
327 -25746 79500 101954 89394 120392 131927 134162 153940 108075 49092 118609 82438 172730
315 172730 189309 183968 122919 72542 73093 159481 129775 157690 141960 136108 109905 102628 114834
302 114834 46334 56062 81822 90228 43309 3946 64132 131573 76240 101835 114857 94549
290 94549 42975 43977 57894 90729 139834 93209 47209 105110 169314 203247 174925 140013
278 140013 123703 116166 43806 114632 134191 116652 113336 117201 97088 75855 35799 61111
266 61111 111324 123143 54077 21793 -25917 23411 85334 27755 57888 86766 152678 145564
254 145564 64476 149557 160566 109443 159415 146734 53073 46124 131478 83971 54322 68468
242 68468 111252 110644 89370 56646 37968 57148 98790 42619 55365 16664 30083 29233 84427
229 84427 138352 127770 74195 101170 72375 85364 67279 18281 19570 47324 81984 108864
217 108864 129654 126484 69532 17686 102896 120625 152780 131376 110356 125016 118364 70134
205 70134 89471 115602 94961 90530 124094 148508 90933 84854 81636 74952 132364 74314 86117
192 86117 123168 145366 156232 147378 148348 172741 96740 60523 124753 118881 151844 166950 143762
179 143762 95443 92563 144357 70237 88247 145193 128405 112475 122617 51339 79968 82373
167 82373 110635 106656 105450 61652 57615 88791 101420 79623 33220 52350 66277 98128 72771
154 72771 37737 49831 17424 -12590 45946 69534 136203 129909 156183 143717 115009 20360
142 20360 18523 53622 46939 76879 81154 107940 103274 93340 118520 68449 64391 107296 100562
129 100562 170151 156205 107856 118630 75596 74363 101817 101527 119828 84624 118718 150598
117 150598 91212 47275 50292 71270 77635 128602 90653 139494 140033 165210 155819 99375 53965
104 53965 74907 97658 97300 125346 133344 111226 84944 112050 67710 71820 124104 103046 102502
91 102502 98552 16859 16405 86356 133344 117620 80718 69743 92506 102995 95491 138369 100212
78 100212 84082 108946 91570 86719 44796 34016 35789 52828 81549 101211 109803 121441 124899
65 124899 112366 50349 31241 79216 104053 73608 65305 54462 52694 70219 124168 109855
53 109855 70285 98437 106228 100521 119692 138611 142023 90997 102430 127278 94219 112679 88027
40 88027 80601 112225 105478 80100 124774 132156 92626 106720 91592 117722 116803 133069 154672
27 154672 73165 90664 65088 54449 91717 100584 95010 105043 94283 70169 100777 114611
15 114611 117823 109788 87570 132951 118065 66367 64668 50326 56631 65537 125352 135655 102505
2 102505 49124 66132
0 66132
$$ Imaginary data points
##PAGE= N=2
##DATA TABLE= (X++(I..I)), XYDATA
16383 -1523203 -1529260 -1545520 -1520497 -1476850 -1429100 -1414041 -1434424 -1431324 -1384854 -1348761 -1330649 -1319805
16371 -1319805 -1287360 -1256477 -1239440 -1219596 -1162672 -1165477 -1188226 -1140830 -1112582 -1098045 -1087695
16360 -1087695 -1075384 -1047880 -1045148 -984034 -999951 -952420 -943732 -947943 -885621 -861398 -899935 -897208
16348 -897208 -847142 -776284 -761049 -765006 -742822 -737071 -744623 -728359 -687510 -614346 -572178 -565826
16336 -565826 -544350 -540211 -543046 -533953 -491065 -481054 -446071 -454309 -468669 -426567 -382812 -364796
16324 -364796 -415840 -370255 -333654 -311028 -284656 -266493 -242643 -257722 -224780 -178115 -188184
16313 -188184 -199498 -133595 -81494 -59788 -49285 -68210 -39631 -24200 -9639 -35296 -40005 10996
16301 10996 56558 94638 109059 66937 33426 139470 221653 227139 214887 218922 235291 250001
16289 250001 250988 276997 257170 251412 342766 312427 319445 390270 345791 376657 335783 313508
16277 313508 365583 404812 400323 429280 455227 434415 469869 483360 522374 545131 495013 526732
16265 526732 534889 575680 614849 614261 631175 602044 613269 635896 658432 707466 679112 719139
16253 719139 690903 693692 746976 728240 720834 747566 720963 756475 830241 810760 835587 856311
16241 856311 883591 859202 873738 897722 916887 975186 959483 975796 1030253 1094581 1051777
16230 1051777 1009176 1039603 1090904 1084550 1021765 1029486 1112752 1162816 1122035 1074677 1044184 1065234
16218 1065234 1093559 1117020 1127158 1119105 1153678 1194912 1159119 1170331 1138567 1149888 1211212
16207 1211212 1197936 1181060 1187989 1165880 1235238 1240103 1236396 1238025 1323708 1296024 1277171 1269664
16195 1269664 1297907 1260506 1214968 1294660 1233050 1304826 1314491 1381783 1479758 1385609 1357791
16184 1357791 1412303 1407956 1380317 1344912 1344731 1370632 1420598 1392204 1362538 1359914 1362909 1380534
16172 1380534 1462734 1489099 1478472 1481265 1480775 1475872 1456585 1446624 1410442 1436975 1476258 1538464
16160 1538464 1517620 1514344 1498778 1488794 1511613 1525754 1529556 1521731 1555304 1514598 1530508 1520179
16148 1520179 1519785 1573950 1557579 1549867 1579013 1538720 1515661 1500240 1502153 1477268 1504472 1532147
16136 1532147 1550081 1572663 1605084 1619094 1576606 1551797 1534995 1604744 1589741 1617115 1627295
16125 1627295 1627403 1622922 1640943 1611238 1606521 1599236 1604323 1676405 1619168 1557798 1544835 1520048
16113 1520048 1501691 1530526 1589065 1602500 1590988 1610468 1605268 1609982 1596703 1634370 1612589 1568532
16101 1568532 1569603 1621174 1711265 1660381 1672242 1648048 1631665 1636605 1644621 1666698 1668268 1627720
16089 1627720 1629244 1668814 1643905 1639828 1623245 1631799 1660098 1736385 1669143 1624527 1634210 1671760
16077 1671760 1656458 1671272 1686295 1703845 1767742 1713227 1689540 1712170 1674084 1639196 1653097
16066 1653097 1668154 1626276 1648252 1686957 1676750 1711584 1684696 1689295 1664083 1711732 1776840
16055 1776840 1756171 1750936 1734989 1769384 1753287 1704995 1721489 1744371 1724887 1736673 1746699
16044 1746699 1724554 1748755 1730460 1717506 1741277 1718640 1702672 1689329 1716856 1710334 1690980
16033 1690980 1633237 1698041 1727651 1686016 1728092 1628079 1632044 1625348 1650812 1706110 1757613
16022 1757613 1756987 1690638 1648985 1670967 1705535 1673930 1677170 1689031 1693940 1670050 1688231 1722377
16010 1722377 1707213 1695858 1751874 1722477 1727566 1746904 1697033 1698802 1714850 1698190 1710282 1702061
15998 1702061 1696762 1686355 1697896 1701881 1697296 1711506 1697081 1697743 1790346 1805525 1713557 1660870
15986 1660870 1627725 1646734 1675456 1676551 1690790 1789646 1657139 1633983 1659884 1685204 1715196
15975 1715196 1667125 1706618 1718035 1715776 1706872 1702478 1710870 1686925 1748452 1780406 1786073 1782674
15963 1782674 1726217 1755151 1690721 1661146 1713716 1707301 1689060 1657956 1639057 1650882 1783351
15952 1783351 1787706 1766109 1741191 1703470 1747302 1757345 1761833 1750751 1765507 1792075 1697347 1644287
15940 1644287 1661325 1673570 1758289 1851412 1797612 1677549 1714992 1726512 1687535 1697465 1757289
15929 1757289 1731339 1728027 1715838 1720608 1666135 1642632 1701964 1676692 1705928 1739093 1747710 1799973
15917 1799973 1719958 1735617 1750033 1761289 1778819 1744142 1700055 1699116 1702267 1779044 1791060 1756945
15905 1756945 1743499 1808500 1740834 1747048 1782770 1748239 1709821 1684733 1757305 1772754 1766793 1708978
15893 1708978 1723648 1705752 1755707 1738913 1700506 1666944 1665856 1713675 1762932 1730126 1760761
15882 1760761 1738676 1716626 1699233 1734876 1804147 1775813 1670238 1698560 1661081 1652290 1687279
15871 1687279 1669352 1717075 1715541 1771152 1787711 1776903 1682975 1735566 1773664 1762437 1739320
15860 1739320 1698878 1749187 1769708 1738302 1751722 1775570 1751360 1756389 1799005 1784045 1745894
15849 1745894 1717957 1734200 1745746 1785083 1833440 1800872 1760455 1710762 1720983 1689885 1711850
15838 1711850 1724100 1733679 1776990 1764461 1744343 1722908 1730274 1683387 1686162 1624749 1631848 1715937
15826 1715937 1652199 1659991 1690830 1684457 1675302 1745440 1737289 1760607 1782322 1757361 1804223 1791324
15814 1791324 1715118 1691518 1736243 1774343 1715777 1709053 1713488 1692129 1706505 1729373 1714184 1708388
15802 1708388 1718813 1743170 1727031 1722151 1723593 1688922 1724521 1709854 1716904 1738533 1804443 1771309
15790 1771309 1704589 1793288 1768195 1804047 1813986 1753467 1743792 1730073 1726727 1754677 1799515 1780096
15778 1780096 1750981 1812177 1848027 1842729 1808141 1784906 1767184 1746350 1831641 1846445 1782713
15767 1782713 1725445 1743804 1752391 1730370 1769085 1794556 1789400 1825119 1787983 1724908 1710738 1781024
15755 1781024 1766537 1799694 1803919 1787566 1752032 1687056 1739888 1770236 1682376 1710132 1705454 1711714
15743 1711714 1710222 1693831 1694637 1749730 1740709 1708041 1758442 1783570 1759582 1756696 1796099 1749645
15731 1749645 1757931 1760528 1782266 1772888 1729658 1746115 1699774 1696488 1719991 1722940 1786437 1766463
15719 1766463 1739864 1691370 1666963 1770472 1758954 1769475 1802291 1715477 1769445 1752190 1707928
15708 1707928 1658899 1663283 1768348 1761545 1781603 1783867 1786925 1872735 1839123 1757859 1722428 1677146
15696 1677146 1749669 1812760 1789022 1785180 1799803 1803405 1817424 1824120 1765924 1720002 1667359 1682379
15684 1682379 1692225 1717917 1725726 1753912 1719810 1779970 1735385 1789978 1720290 1653434 1770901
15673 1770901 1724490 1744190 1758158 1744607 1696133 1746205 1741155 1762301 1714706 1702005 1786415
15662 1786415 1784105 1756875 1786991 1726918 1709064 1712001 1722972 1762590 1763278 1803045 1792832 1788823
15650 1788823 1783366 1796383 1765930 1768238 1758865 1785746 1815349 1796694 1764385 1771185 1772130 1757726
15638 1757726 1757036 1754062 1743184 1715739 1748183 1769764 1821948 1738376 1694193 1768159 1776606 1731501
15626 1731501 1728184 1775424 1768450 1789256 1840957 1807780 1793794 1867597 1843142 1833230 1808467 1764756
15614 1764756 1742405 1816103 1831485 1745084 1759417 1810835 1822886 1829844 1853394 1830604 1910160
15603 1910160 1922323 1805190 1801004 1765873 1763304 1763427 1763566 1828059 1794482 1764558 1751772 1767201
15591 1767201 1825854 1858424 1812070 1810257 1851674 1833256 1788776 1750407 1746057 1759052 1845020 1835849
15579 1835849 1711693 1706239 1730321 1804894 1763757 1762406 1791931 1759677 1738231 1736119 1715880 1743002
15567 1743002 1775537 1820047 1856762 1784324 1690756 1744303 1766410 1773608 1727199 1783025 1804504
15556 1804504 1778608 1815569 1791741 1809109 1761832 1795504 1804390 1776047 1693755 1706968 1793908
15545 1793908 1801799 1771497 1741600 1705596 1697401 1674163 1719388 1779194 1786977 1740958 1779052 1788972
15533 1788972 1763125 1771061 1792605 1768787 1741301 1757173 1784380 1734609 1792559 1771660 1721288
15522 1721288 1752360 1745321 1721119 1771769 1778208 1766292 1733248 1722770 1793490 1763026 1831788 1848402
15510 1848402 1848717 1798445 1797788 1834169 1794677 1790847 1789405 1761208 1820136 1760686 1709478 1725783
15498 1725783 1788337 1813280 1776366 1732199 1762818 1787108 1748412 1746332 1810247 1758061 1776709
15487 1776709 1785209 1780886 1868244 1880308 1860035 1782922 1814509 1805056 1794900 1838550 1841175 1854880
15475 1854880 1822236 1770401 1785812 1715294 1705823 1743224 1775345 1801264 1803492 1768578 1782225 1820030
15463 1820030 1743102 1778588 1821421 1822010 1834519 1864030 1863669 1790540 1781230 1767064 1772329 1801292
15451 1801292 1811095 1834791 1919610 1804349 1735339 1773877 1849554 1819658 1784002 1787182 1763289
15440 1763289 1792451 1803584 1791116 1738685 1736236 1751098 1740593 1808956 1864377 1828306 1760898
15429 1760898 1757057 1774180 1781329 1852660 1857356 1872679 1851595 1836861 1865190 1839440 1799586 1854569
15417 1854569 1852141 1779099 1769761 1780520 1809749 1809937 1789095 1757453 1723530 1772695 1786269 1721813
15405 1721813 1717142 1818075 1837303 1816342 1799525 1807806 1813750 1908965 1908878 1857785 1834963 1812806
15393 1812806 1808060 1865368 1862999 1804230 1765880 1782971 1833504 1829169 1780531 1764192 1791513 1743883
15381 1743883 1752507 1764668 1817653 1843024 1825271 1791657 1723261 1793270 1803046 1846123 1801420 1778607
15369 1778607 1796999 1745337 1767917 1823106 1805506 1793896 1794247 1826302 1829417 1813220 1834355 1810453
15357 1810453 1791351 1776968 1803498 1766493 1756380 1764886 1776161 1795877 1801646 1733555 1694956 1711486
15345 1711486 1770400 1722885 1748900 1817342 1819252 1796589 1757407 1789532 1820622 1748025 1773881
15334 1773881 1816306 1758077 1737266 1831274 1833721 1830375 1812789 1817848 1859608 1852130 1799933 1816524
15322 1816524 1799561 1803481 1788701 1829332 1832629 1863102 1843331 1827392 1900010 1876570 1827740 1824351
15310 1824351 1835455 1797628 1828379 1834809 1803759 1831547 1794461 1852412 1896929 1773597 1813107
15299 1813107 1826180 1789185 1788557 1814332 1776311 1754503 1784450 1828850 1864259 1826263 1855103 1863826
15287 1863826 1804285 1801312 1828818 1865967 1825741 1822337 1783654 1782556 1761657 1804584 1811821 1808620
15275 1808620 1852050 1884310 1873077 1818687 1773232 1808232 1829638 1878040 1841636 1814310 1800870
15264 1800870 1804127 1782233 1785692 1794926 1889288 1895393 1869458 1848617 1778848 1835642 1850850 1875260
15252 1875260 1860458 1833637 1802028 1793432 1781098 1815793 1819805 1792441 1811813 1840057 1857414 1855358
15240 1855358 1897258 1860331 1832969 1864337 1841044 1838881 1801320 1848386 1859100 1845441 1794812
15229 1794812 1848531 1823321 1797961 1812198 1812097 1780030 1767799 1781218 1789896 1786206 1746746 1735940
15217 1735940 1816676 1870425 1846608 1883515 1826352 1846691 1853335 1805733 1822240 1814403 1782219 1771268
15205 1771268 1809296 1830912 1878003 1886447 1871510 1791755 1786769 1819411 1757139 1767211 1768196 1836997
15193 1836997 1830113 1799690 1768095 1854728 1840079 1807096 1857852 1838629 1861125 1883199 1836066
15182 1836066 1781964 1774818 1867527 1878639 1915246 1888203 1839400 1832576 1846788 1904054 1901551 1869657
15170 1869657 1851558 1829561 1867178 1856286 1816088 1838908 1855573 1902872 1915471 1860066 1874931
15159 1874931 1897705 1851209 1867158 1831752 1811900 1855635 1888379 1880533 1877855 1868148 1898062 1851755
15147 1851755 1814566 1788344 1805403 1802177 1824161 1821870 1854743 1861204 1897818 1885996 1842915 1835972
15135 1835972 1889820 1865348 1890300 1889839 1863847 1841961 1824877 1836825 1771310 1886438 1948436
15124 1948436 1842738 1825146 1852514 1898079 1859366 1808401 1845723 1874096 1874565 1867364 1806387 1773025
15112 1773025 1827948 1831697 1784887 1791599 1799355 1836292 1839088 1834199 1810922 1820923 1892566 1882982
15100 1882982 1833827 1853187 1874505 1871057 1831520 1886553 1848966 1856588 1898157 1797479 1811967
15089 1811967 1817776 1804774 1804714 1840603 1838511 1860854 1904519 1879905 1872607 1846601 1776791 1839039
15077 1839039 1872078 1889634 1869665 1874787 1814572 1837772 1861424 1886979 1853462 1868074 1799235
15066 1799235 1777417 1803604 1772814 1794178 1878810 1878435 1828714 1886388 1917532 1902803 1819937 1809931
15054 1809931 1903455 1864250 1890428 1883947 1930610 1925451 1863481 1843756 1883558 1838816 1773081 1826271
15042 1826271 1827339 1902744 1935859 1959468 1941558 1908628 1890077 1917685 1900040 1814698 1815493 1857579
15030 1857579 1801268 1829359 1934421 1897350 1864100 1876282 1843011 1837023 1848277 1872338 1887680
15019 1887680 1899120 1951577 1949892 1892024 1972373 2002369 1972636 1943407 1929746 1928060 1931596 1932209
15007 1932209 1909070 1918363 1884168 1920753 1909667 1881229 1921382 1933500 1947612 1854940 1833508
14996 1833508 1863681 1866918 1920185 1959863 1971654 1972604 1910005 1920934 1949693 1905880 1871423 1907595
14984 1907595 1895803 1875132 1863702 1865359 1880443 1897758 1939385 1907962 1874668 1899569 1914255
14973 1914255 1902154 1897706 1940315 1922809 1970737 1893244 1880575 1882954 1936283 1890357 1790980 1839043
14961 1839043 1838900 1860443 1886443 1829293 1867708 1923698 1883248 1931590 1926956 1912496 1895950 1878887
14949 1878887 1830385 1841299 1911865 1928789 1886472 1933087 1968403 1986898 2010445 1931041 1873198
14938 1873198 1911201 1947676 1918495 1886067 1899848 1866133 1910945 1897359 1843057 1804116 1836776
14927 1836776 1806620 1809773 1853723 1891263 1901241 1824825 1860912 1859691 1851652 1890670 1901814 1866786
14915 1866786 1862288 1904951 1931684 1936707 1933840 1897238 1901257 1911674 1912433 1898151 1899340 1913173 1932149
14902 1932149 1904454 1921887 1867467 1868986 1818464 1749525 1849497 1798636 1802891 1850942 1905424 1884527
14890 1884527 1864620 1858248 1832404 1887533 1923255 1862339 1918128 1948987 1907073 1863001 1822483
14879 1822483 1830021 1898505 1903373 1921160 1977315 1957709 1909815 1912163 1821257 1840008 1909287 1885344
14867 1885344 1879768 1814224 1849283 1847035 1901037 1861427 1890739 1923526 1845787 1915691 1953691 1929580
14855 1929580 1891205 1898836 1904535 1906865 1917782 1964812 1963767 1968511 1969970 1903621 1892192 1899484 1889326
14842 1889326 1868951 1846938 1817177 1860486 1931596 1935166 1886770 1886623 1874001 1895633 1946255 1956430
14830 1956430 1946375 1953687 1921436 1978771 1970005 1938209 1930353 1959249 1930459 1935079 1889709 1869662
14818 1869662 1873992 1858071 1846193 1875018 1827507 1853111 1828286 1796269 1855042 1843819 1853153 1802474
14806 1802474 1868935 1862513 1847815 1909457 1949506 1922201 1880631 1881186 1874652 1879827 1929646 1907678
14794 1907678 1937370 1928873 1920844 1871823 1910102 1871215 1912629 1933529 1907789 1875785 1903335 1938825
14782 1938825 1925460 1900778 1893359 1917623 1892104 1837936 1832012 1915328 1954216 1941134 1945500 1942843
14770 1942843 1884343 1892204 1858025 1886272 1942484 1881034 1859678 1886688 1937028 1865824 1884649
14759 1884649 1923290 1960112 1977525 1919337 1924785 1960326 1942728 1911756 1916890 1847047 1882956 1916403
14747 1916403 1936531 1930375 1927645 1856150 1858896 1920773 1930497 1902303 1928251 1949970 1913581 1884589
14735 1884589 1883184 1892012 1892202 1909733 1965284 1916458 1853997 1881768 1876631 1869354 1860147 1901128 1919260
14722 1919260 1954044 1978151 1998787 1926183 1961806 1996382 1897503 1864235 1878171 1881939 1921393
14711 1921393 1945796 1903399 1920984 1879994 1938294 1959327 1943290 1905640 1934907 1970833 1947967
14700 1947967 1878324 1891887 1933175 1924694 1918981 1920227 1906856 1892358 1983173 1998927 1979995 1934142
14688 1934142 1946994 1932116 1882316 1881823 1904218 1939107 1865077 1806680 1847277 1885825 1875827 1897782
14676 1897782 1931075 1928322 1928972 1901778 1894468 1935657 1951798 1938479 1941950 1936425 1965908 2003058
14664 2003058 2004430 1983245 1979233 1992868 1984347 1988162 1983275 1990753 1982285 1979727 1979370 1941158 1897402
14651 1897402 1926791 1877959 1937828 1936257 1921437 1959231 1929607 1925815 1926774 1980769 1967290 1920489
14639 1920489 1876669 1829238 1808013 1891752 1898177 1931593 1962136 1944092 1902448 1858296 1861886 1917126
14627 1917126 1920349 1893593 1881322 1893421 1931733 1944829 1912613 1920074 2011695 2016371 1951652 1915084
14615 1915084 1946363 1945857 1871985 1880574 1926301 1913233 1911834 1953444 1992247 1945520 1867913 1861241
14603 1861241 1898197 1897956 1858837 1847845 1882517 1903433 1891045 1857081 1846189 1892333 1943837 1912301
14591 1912301 1912049 1943179 1940978 1899637 1920316 1918196 1918938 1901357 1870153 1853850 1866507 1855493
14579 1855493 1920879 1988452 1921535 1906811 1962048 1968785 2003273 2026222 1968363 1938455 1981173
14568 1981173 1950907 1904609 1913247 1893354 1868509 1863063 1908960 1880784 1949208 1946331 1891372 1889536
14556 1889536 1957173 1956429 2012566 2001666 2036265 1973019 1949674 1965453 2028821 2068432 2076488 2082767
14544 2082767 2014228 1972661 1957138 1895142 1988908 1982482 1979096 2018684 1979137 2003047 1988969 1901536
14532 1901536 1883227 1935483 2011793 2041260 2029452 1957912 1875403 1972862 1959799 1921402 1959390
14521 1959390 1999751 1990748 2003634 2016532 2026789 2000432 1945485 1939416 1977086 1941706 1972256 1947420
14509 1947420 1897686 1885298 1936521 1935412 1911938 1925992 1929198 1870157 1899937 1913472 1902661 1883271
14497 1883271 1921976 1901623 1943961 1919916 1852088 1877338 1888659 1863991 1866838 1909041 1952107
14486 1952107 1908326 1906924 1953530 1890031 1871986 1941162 1976769 1976933 1973962 1979443 2004297 2046277
14474 2046277 2032261 2010339 1892326 1862352 1889320 1939568 1932230 1893902 1904678 1895990 1916245
14463 1916245 1923590 1963598 1968521 1926355 1902396 1929919 1923380 1977768 2000823 1935658 1953446 1962232
$$ [...]
##END NTUPLES=NMR SPECTRUM
##END=
