##TITLE=1H_EC-3384(5)-6
 200.13Hz, CDCl3.
 8 sc
 13.8.2026
##JCAMPDX= 6.0         $$ Bruker NMR JCAMP-DX V2.0
##DATA TYPE= NMR SPECTRUM
##DATA CLASS= NTUPLES
##ORIGIN= UXNMR, Bruker Analytische Messtechnik GmbH
##OWNER= pz
$$ XWIN-NMR		Version 3.5
$$ Thu Aug 13 11:23:20 2026 Russian Standard Time (UT+4h)  she@DPX200
##.OBSERVE FREQUENCY= 200.1313
##.OBSERVE NUCLEUS= ^1H
##.ACQUISITION MODE= SIMULTANEOUS
##.ACQUISITION SCHEME= undefined
##.AVERAGES= 8
##.DIGITISER RES= 18
##SPECTROMETER/DATA SYSTEM= spect
##.PULSE SEQUENCE= zg30
##.SOLVENT NAME= CDCl3
##.SHIFT REFERENCE= (INTERNAL, CDCl3, 0, 15.5067)
##AUDIT TRAIL= $$ (NUMBER, WHEN, WHO, WHERE, WHAT)
$$ ##TITLE= Audit trail, XWIN-NMR		Version 3.5
$$ ##JCAMPDX= 5.01
$$ ##ORIGIN= Bruker BioSpin GmbH
$$ ##OWNER= she
$$ F:/spectra/data/she/nmr/H-C/1/pdata/1/auditp.txt
$$ ##AUDIT TRAIL=  $$ (NUMBER, WHEN, WHO, WHERE, WHAT)
(   1,<2026-08-13 11:21:39.56 +0400>,<she>,<DPX200>,
      <created by zg, POWCHK disabled, PULCHK disabled
       configuration hash MD5:
       00 E9 B6 7A A2 85 ED C7 34 08 36 98 17 FE 4E 26
       data hash MD5: 16K
       5E 76 1A D0 85 75 44 82 66 C8 A5 32 E4 15 19 49>)
(   2,<2026-08-13 11:21:42.12 +0400>,<she>,<DPX200>,
      <Start of raw data processing
       efp BC_mod = 2 LB = 0.25 FT_mod = 6 PKNL = 1 PHC0 = -4223.68 PHC1 = 15.3923 SI = 16K 
       data hash MD5: 16K
       ED E9 B1 4A BC 49 D7 37 D2 05 A6 BA 33 B8 36 58>)
(   3,<2026-08-13 11:22:08.35 +0400>,<she>,<DPX200>,
      <pk PHC0 = 3.045043 PHC1 = -1.8 
       data hash MD5: 16K
       5E 01 DB 41 92 2E 81 D7 1A 5C 66 61 DE 77 77 D8>)
(   4,<2026-08-13 11:22:14.75 +0400>,<she>,<DPX200>,
      <abs ABSG = 5 
       data hash MD5: 16K
       FA D7 5E 15 1B 97 04 FB 85 0C E6 E7 C2 61 E9 43>)
$$ ##END=
$$ 
$$ hash MD5
$$ 13 DF 09 E7 B1 B1 08 FC CC 7E 8B 4C EA DB 85 45
##$RELAX= 
##$RELAX= 
##$RELAX= 
##$RELAX= 
##$RELAX= 
##$RELAX= 
$$ Bruker specific parameters
$$ --------------------------
##$DU= <F:/spectra>
##$EXPNO= 1
##$NAME= <H-C>
##$PROCNO= 1
##$TYPE= <nmr>
##$USER= <she>
##$AMP= (0..31)
100 100 100 100 100 100 100 100 100 100 100 100 100 100 100 100 100 100 
100 100 100 100 100 100 100 100 100 100 100 100 100 100 
##$AQSEQ= 0
##$AQ_mod= 1
##$AUNM= <au_zg>
##$AUTOPOS= <>
##$BF1= 200.13
##$BF2= 200.13
##$BF3= 200.13
##$BF4= 200.13
##$BF5= 200.13
##$BF6= 200.13
##$BF7= 200.13
##$BF8= 200.13
##$BYTORDA= 1
##$CFDGTYP= 0
##$CFRGTYP= 5
##$CHEMSTR= <none>
##$CNST= (0..31)
1 1 145 1 1 1 1 1 1 1 1 1 1 1 1 1 1 1 1 1 1 1 1 1 1 1 1 1 1 1 1 1 
##$CPDPRG= <>
##$CPDPRG1= <>
##$CPDPRG2= <>
##$CPDPRG3= <>
##$CPDPRG4= <mlev>
##$CPDPRG5= <mlev>
##$CPDPRG6= <mlev>
##$CPDPRG7= <mlev>
##$CPDPRG8= <mlev>
##$CPDPRGB= <>
##$CPDPRGT= <>
##$D= (0..31)
0 0.7 0 0 0 0 0 0 0 0 0 0.03 0 0 0 0 0 0 0 0 0 0 0 0 0 0 0 0 0 0 0 0 
##$DATE= 1786605698
##$DBL= (0..7)
120 120 120 120 120 120 120 120 
##$DBP= (0..7)
150 150 150 150 150 150 150 150 
##$DBP07= 0
##$DBPNAM0= <>
##$DBPNAM1= <>
##$DBPNAM2= <>
##$DBPNAM3= <>
##$DBPNAM4= <>
$$ [...]
##$SUBNAM3= <"">
##$SUBNAM4= <"">
##$SUBNAM5= <"">
##$SUBNAM6= <"">
##$SUBNAM7= <"">
##$SUBNAM8= <"">
##$SUBNAM9= <"">
##$SW= 18.0517328524113
##$SWIBOX= (0..15)
0 0 2 0 0 0 0 0 0 0 0 0 0 0 0 0 
##$SW_h= 3612.71676300578
##$TD= 16384
##$TD0= 1
##$TE= 0
##$TE2= 300
##$TE3= 300
##$TEG= 300
##$TL= (0..7)
0 120 120 120 120 120 120 120 
##$TP= (0..7)
150 150 150 150 150 150 150 150 
##$TP07= 0
##$TPNAME0= <>
##$TPNAME1= <>
##$TPNAME2= <>
##$TPNAME3= <>
##$TPNAME4= <>
##$TPNAME5= <>
##$TPNAME6= <>
##$TPNAME7= <>
##$TPOAL= (0..7)
0.5 0.5 0.5 0.5 0.5 0.5 0.5 0.5 
##$TPOFFS= (0..7)
0 0 0 0 0 0 0 0 
##$TUNHIN= 0
##$TUNHOUT= 0
##$TUNXOUT= 0
##$USERA1= <user>
##$USERA2= <user>
##$USERA3= <user>
##$USERA4= <user>
##$USERA5= <user>
##$V9= 5
##$VALIST= <valist>
##$VCLIST= <CCCCCCCCCCCCCCC>
##$VD= 0
##$VDLIST= <DDDDDDDDDDDDDDD>
##$VPLIST= <PPPPPPPPPPPPPPP>
##$VTLIST= <TTTTTTTTTTTTTTT>
##$WBST= 1024
##$WBSW= 4
##$XGAIN= (0..3)
0 0 0 0 
##$XL= 0
##$YL= 0
##$YMAX_a= 557931
##$YMIN_a= -610366
##$ZGOPTNS= <>
##$ZL1= 120
##$ZL2= 120
##$ZL3= 120
##$ZL4= 120
##$ABSF1= 24.50574
##$ABSF2= 6.453728
##$ABSG= 5
##$ABSL= 3
##$ALPHA= 0
##$AQORDER= 0
##$ASSFAC= 0
##$ASSFACI= 0
##$ASSFACX= 0
##$ASSWID= 0
##$AUNMP= <proc_1d>
##$AZFE= 0.1
##$AZFW= 0.1
##$BCFW= 0
##$BC_mod= 2
##$BYTORDP= 0
##$COROFFS= 0
##$CY= -3
##$DATMOD= 1
##$DC= 0
##$DFILT= <>
##$DTYPP= 0
##$F1P= 0
##$F2P= 0
##$FCOR= 1
##$FTSIZE= 16384
##$FT_mod= 6
##$GAMMA= 0
##$GB= 0
##$INTBC= 1
##$INTSCL= 3.241238e-09
##$ISEN= 128
##$LB= 0.25
##$LEV0= 0
##$LPBIN= 0
##$MAXI= 10000
##$MC2= 0
##$MEAN= 0
##$ME_mod= 0
##$MI= 1.114404
##$NCOEF= 0
##$NC_proc= -4
##$NLEV= 6
##$NOISF1= 3.799351
##$NOISF2= 2.8
##$NSP= 0
##$NTH_PI= 0
##$NZP= 0
##$OFFSET= 15.5067
##$PC= 1
##$PHC0= -4220.635
##$PHC1= 13.5923
##$PH_mod= 1
##$PKNL= yes
##$PPARMOD= 0
##$PSCAL= 0
##$PSIGN= 0
##$REVERSE= no
##$SF= 200.13000300365
##$SI= 16384
##$SIGF1= 3
##$SIGF2= 2
##$SINO= 0.751879
##$SIOLD= 32768
##$SREGLST= <19F.Aceton>
##$SSB= 0
##$STSI= 16384
##$STSR= 0
##$SW_p= 3612.71676300578
##$SYMM= 0
##$S_DEV= 0
##$TDeff= 16384
##$TDoff= 0
##$TI= <>
##$TILT= no
##$TM1= 0
##$TM2= 0
##$TOPLEV= 0
##$USERP1= <user>
##$USERP2= <user>
##$USERP3= <user>
##$USERP4= <user>
##$USERP5= <user>
##$WDW= 1
##$XDIM= 16384
##$YMAX_p= 274317076
##$YMIN_p= -98067
$$ End of Bruker specific parameters
$$ ---------------------------------
##NTUPLES= NMR SPECTRUM
##VAR_NAME=  FREQUENCY,     SPECTRUM/REAL,   SPECTRUM/IMAG
##SYMBOL=    X,             R,               I
##VAR_TYPE=  INDEPENDENT,   DEPENDENT,       DEPENDENT
##VAR_FORM=  AFFN,          ASDF,            ASDF
##VAR_DIM=   16384,         16384,           16384
##UNITS=     HZ,            ARBITRARY UNITS, ARBITRARY UNITS
##FACTOR=    0.220516191357247, 1,           1
##FIRST=     3103.35582993432, 0,            0
##LAST=      -509.360933071462, 0,           0
##MIN=       -509.360933071462, -98067,      0
##MAX=       3103.35582993432, 274317076,    0
$$ Real data points
##PAGE= N=1
##DATA TABLE= (X++(R..R)), XYDATA
$$ [...]
$$ plain form
7316 -2488 -4849 -38428 -36222 -22592 -34188 -25452 -7949 -17849 11990 7640 -5079 -6235 32811
7303 32811 21750 19534 1855 -714 -9463 -12882 11274 -6332 -3187 12273 25960 2988 8653
7290 8653 17715 -28246 -16726 -2109 -33970 -39292 -24043 -13656 6068 -164 -12856 -26066 22385
7277 22385 50094 4063 -6819 -27342 -62951 -51162 -25428 -16990 1011 -24636 -48671 -36256
7265 -36256 1462 -3537 -23956 -20871 -15356 -24942 -37319 -49345 -47776 -26435 7847 -15113 9841
7252 9841 -3013 -30368 -37685 -47754 -50545 -37524 -3318 31557 -3478 -49419 -50058 -30951 -9728
7239 -9728 -8072 17157 893 13844 -1470 -16155 -25679 -31307 -6587 -6654 -20133 -14855 -14531 -18104
7225 -18104 -11290 1741 6082 37045 3206 -33386 -57650 -20916 21416 16310 -10631 -4621 -19120
$$ packed form
7316b488k361l3579K206J3630j1596Q736J7503r900K9839m350j2719j156L9046
7303C2811j1061k216j7679k569q749l419K4156j7606L145J5460J3687k2972N665
7290H653R062m5961J1520J4617l1861n322J5249J0387J9724o232j2692j3210M8451
7277B2385K7709m6031j0882k0523l5609J1789K5734Q438J8001k5647k4035J2415
7265c6256L7718m999k0419L085N515r586j2377j2026J569K1341L4282k2960K4954
7252I841j2854k7355p317j0069k791J3021L4206L4875l5035m5941o39J9107K1223
7239i728J656K5229j6264J2951j5314j4685r524n628K4720o7j3479N278L24l573
7225a8104O814J3031M341L0963l3839l6592k4264L6734M2332n106k6941O010j4499
$$ plain form
7212 -19120 -25186 -2250 26080 43744 31255 844 6841 15114 -3171 -16458 -18653 304 13785
7199 13785 -21830 -14245 5454 23463 15663 5809 16734 -5156 -13139 -13838 -11530 -25703 -10366
7186 -10366 21446 -16601 -9577 17895 -1814 -17021 -32132 -12975 883 12379 17975 -4780
7174 -4780 -4718 13031 758 -36927 -10357 17223 20883 -2308 -5327 -34211 -36948 -894 -5413
7161 -5413 -22192 -34356 -25666 -23858 9256 17927 -5814 -34213 1244 -2486 -15601 -7253 1015
7148 1015 5607 11802 -17846 1822 13748 -4374 -20627 -13350 2215 9895 -9722 -11651 4040
7135 4040 10360 3878 7303 569 -18958 -8285 -10026 -12330 -20024 -27571 -12227 -10380 17428 11404
7121 11404 -8925 -6668 -19526 -13118 -11941 -19299 -14776 1439 21731 19048 -5760 -25258 -19685
$$ packed form
7212a9120o066K2936K8330J7664j2489l0411N997Q273j8285j3287k195J8957J3481
7199A3785l5615P585J9699J8009p800r854J0925k1890p983o99K308j4173J5337
7186a0366L1812l8047P024K7472j9709j5207j5111J9157J3858J1496N596k2755
7174d780O2J7749j2273l7685K6570K7580L660k3191l019k8884k737L6054m519
7161e413j6779j2164Q690J808L3114Q671k3741k8399L5457l730j3115Q348Q268
7148A015M592O195k9648J9668J1926j8122j6253P277J5565P680j9617j929J5691
7135D040O320o482L425o734j9527J0673j741k304p694p547J5344J847K7808o024
7121A1404k0329K257j2858O408J177p358M523J6215K0292k683k4808j9498N573
$$ plain form
7108 -19685 -45806 -17166 -2732 13006 -967 -4078 7622 7986 8482 4544 1095 -20650 -6961
7095 -6961 17027 30064 34802 15881 -2132 11038 145 -8471 21460 10061 12611 10560 -1255
7082 -1255 -396 13733 6546 -3064 4243 -3131 -2549 -19854 16149 24988 31531 24110 -10709 -8794
7068 -8794 -5489 -15363 -4285 -7974 -20133 -28811 2802 2532 8948 -659 -21376 -52534 -66743 -33446
7054 -33446 -15375 -20140 -11488 -7832 19494 11366 27944 -14336 -27791 -22901 -29111 -22123 -44644
7041 -44644 -22991 -4120 -20473 -3502 16484 10040 -18648 -4828 9702 -11996 -11088 -43668
7029 -43668 -35129 -36965 -26282 -15130 2202 22325 -5516 -9583 2413 2473 -9982 -9746 32829
7016 32829 42318 16325 21821 9825 35852 15446 -4362 40301 55269 42980 41062 20176
$$ packed form
7108a9685k6121K8640J4434J5738j3973l111J1700L64M96l938l449k1745J3689
7095f961K3988J3037M738j8921j8013J3170j0893q616K9931j1399K550k051j1815
7082a255Q59J4129p187r610P307p374N82j7305L6003Q839O543p421l4819J915
7068h794L305r874J1078l689j2159q678L1613k70O416r607k0717l1158j4209L3297
7054c3446J8071m765Q652L656K7326q128J6578m2280j3455M890o210O988k2521
7041d4644K1653J8871j6353J6971J9986o444k8688J3820J4530k1698R08l2580
7029d3668Q539j836J0683J1152J7332K0123k7841m067J1996O0j2455K36M2575
7016C2829R489k5993N496j1996K6027k0406j9808M4663J4968j2289j918k0886
$$ plain form
7004 20176 16869 5578 4533 12262 8202 4515 15135 -202 -19934 -9289 -3316 3696 -31713
6991 -31713 -32106 -41607 -51195 -40 20506 5877 -3916 -1140 -332 14506 35044 34959 21610 16415
6977 16415 22878 -13736 -7729 -4326 -2010 7524 14257 2608 15851 -10126 -14357 16359 29941
6964 29941 33509 24544 24729 -19988 -14905 -22302 -57355 -35187 -8989 11670 4472 6514 25443
6951 25443 31632 9213 11490 9082 15352 -25562 -30844 -705 4005 2751 -9333 -32891 -31924 -11404
6937 -11404 3272 -21378 -14296 8168 8984 10002 22479 22713 -3899 16537 11699 -643 30098
6924 30098 36573 26943 -301 1532 -3010 -21521 -36311 -21847 2088 11066 -10 5577 18008
6911 18008 16139 36545 18246 4696 6544 4643 25734 -6511 -43321 -29109 -9841 -12594 13907
$$ packed form
7004B0176l307j1291j045P729m060l687J0620j5337j9732J0645N973P012l5409
6991c1713l93r501r588N1155K0546j4629r793K776Q08J4838K0538q5j3349n195
6977A6415O463l6614O007L403K316R534O733j1649J3243k5977m231L0716J3582
6964B9941L568q965J85m4717N083p397l5053K2168K6198K0659p198K042J8929
6951B5443O189k2419K277k408O270m0914n282L0139M710j254j2084k3558R67K0520
6937a1404J4676k4650P082K2464Q16J018J2477K34k6612K0436m838j2342L0741
6924C0098O475r630k7244J833m542j8511j4790J4464K3935Q978j1076N587J2431
6911A8008j869K0406j8299j3550J848j901K1091l2245l6810J4212J9268k753K6501
$$ plain form
6898 13907 12948 -11531 -33603 -13681 7098 5228 10624 2206 -304 -15458 -27062 -22113 15743
6885 15743 -4483 -513 -48375 -40070 -27442 -9455 8278 8093 -16452 -13259 -1292 6706 -10129
6872 -10129 -12235 -10617 -17228 -8348 31654 9495 -12114 -31271 -32980 -19860 -15413 11333 23397
6859 23397 48418 10964 12358 20834 137 -8526 -8457 -2562 -18237 -3564 -2560 -24021 -2346
6846 -2346 -30493 -24366 -20859 -13672 -17014 -26792 -20125 7066 -10361 -28362 5635 -9334 -45962
6833 -45962 -45763 -33111 -5248 -3825 -34880 5649 16076 -18528 -17964 -24549 -31743 -19939 311
6820 311 21748 -12834 -5450 17448 -8165 -41748 -42540 -39997 -19959 174 -29 -18141 20417
6807 20417 28767 17499 1563 7799 -9911 -35968 -533 -16962 -10352 -20969 -23647 -26771 -25476
$$ packed form
6898A3907r59k4479k2072J9922K0779j870N396q418k510j5154j1604M949L7856
6885A5743k0226L970m7862Q305J2628J7987J7733j85k4545L193J1967P998j6835
6872a0129k106J618o611Q880M0002k2159k1609j9157j709J3120M447K6746J2064
6859B3397K5021l7454J394Q476k0697q663O9N895j5675J4673J004k1461K1675
6846b346k8147O127L507P187l342r778O667K7191j7427j8001L3997j4969l6628
6833d5962J99J2652K7863J423l1055M0529J0427l4604N64o585p194J1804K0250
6820C11K1437l4582P384K2898k5613l3583p92K543K0038K0133k03j8112L8558
6807B0417Q350j1268j5936O236j7710k6057L5435j6429O610j0617k678l124J295
$$ plain form
6794 -25476 -24964 -24980 -16277 -8658 -26826 -15779 -45312 -77579 -48065 -35793 -34613 -29322 -28422 9320
6780 9320 20762 -12061 -31811 -17743 -13304 -19007 -23280 -36610 -53117 -24439 -6140 -20925 -4280
6767 -4280 7277 27491 10362 30777 12919 -4157 -605 -4891 3199 -25771 7581 13221 23385
6754 23385 1355 7210 4859 -17600 652 19915 29355 43301 51586 32032 21051 12186 -8722
6741 -8722 -11294 11779 -6025 15117 22112 35353 28531 26043 -2316 19140 51664 22160 23854
6728 23854 21307 42585 33825 5344 -17234 19499 33029 9698 22334 -23269 -39910 -7238
6716 -7238 15877 47097 21032 -3489 -1288 2369 -26240 2902 6349 -3225 -5288 2269 8655
6703 8655 23829 32649 33952 2590 -391 -25865 -29202 6868 -253 -9211 -373 44168 33896
$$ packed form
6794b5476N12j6Q703P619j8168J1047k9533l2267K9514J2272J180N291R00L7742
6780I320J1442l2823j9750J4068M439n703m273j3330j6507K8678J8299j4785J6645
6767d280J1557K0214j7129K0415j7858j7076L552m286Q090k8970L3352N640J0164
6754B3385k2030N855k351k2459J8252J9263R440J3946Q285j9554j0981q865k0908
6741h722k572K3073j7804K1142O995J3241o822k488k8359K1456L2524k9504J694
6728B3854k547K1278q760k8481k2578L6733J3530k3331J2636m5603j6641L2672
6716g238K3115L1220k6065k4521K201L657k8609K9142L447r574k063P557O386
6703H655J5174Q820J303l1362k981k5474l337L6070p121q958Q838M4541j0272
$$ plain form
6690 33896 46806 5889 5595 -5278 14826 18612 29323 35039 23913 49765 15209 10760 30204
6677 30204 27188 17319 -5531 -1375 -8884 -7647 -19199 -18520 2012 -20647 -35513 -11776 -18906
6664 -18906 -6442 12026 927 -3026 14040 21462 -6573 2179 12933 14850 17509 32651 9167
6651 9167 14693 27276 39251 43923 3664 -10174 -9862 2776 13640 7191 -18165 -10924 4501
6638 4501 -12743 6106 -19964 -32826 -34868 -30184 596 -11893 7183 7562 -10711 -14245 4676
6625 4676 14144 9235 18451 14389 -6990 -7389 -14343 -30561 3514 23091 30366 8492 -6831 -13433
6611 -13433 22843 31718 43712 16483 5120 21028 25621 17060 -6874 6123 -1993 -4602 -40095
6598 -40095 -9944 -22954 -9558 -17155 -28111 -21247 4349 20771 -9700 -18720 28196 46001
$$ packed form
6690C3896J2910m0917k94j0873K0104L786J0711N716j1126K5852l4556m449J9444
6677C0204l016r869k2850M156p509J237j1552O79K0532k2659j4866K3737p130
6664a8906J2464J8468j1099l953J7066P422k8035Q752J0754J917K659J5142k3484
6651I167N526J2583J1975M672m0259j3838L12J2638J0864o449k5356P241J5425
6638D501j7244J8849k6070j2862k042M684L0780j2489J9076L79j8273l534J8921
6625D676R468m909R216m062k1379l99o954j6218L4075J9577P275k1874j5323o602
6611a3433L6276Q875J1994k7229j1363J5908M593q561k3934J2997q116k609l5493
6598d0095L0151j3010J3396p597j0956O864K5596J6422l0471r020M6916J7805
$$ plain form
6586 46001 55049 50672 40304 6057 -18306 -30189 -49187 -44600 -79883 -95116 -47581 -20432
6574 -20432 -9755 -22262 -14727 36434 13311 -13280 3462 26796 -8322 -24582 -15678 2008
6562 2008 6056 -39281 -23300 -5033 -20435 222 -12517 -12310 35745 19724 -30042 -9530 -8019
6549 -8019 -9846 -20295 16619 -22068 -11897 18868 3953 -29273 -18058 -31203 -17380 7886
6537 7886 -26530 -1266 3460 -8259 -5158 21215 44536 12485 7908 10170 13524 -1332 -15313
6524 -15313 29531 12694 3437 -8249 -19147 -12119 -20205 -30491 -35039 -17379 9343 14180 23193
6511 23193 -10852 -39171 -34244 -20438 -5552 4925 12630 14467 -15382 18073 5954 8933 34233
6498 34233 1082 -7277 -7941 -30828 -24493 -22892 5903 5411 15658 27428 15539 36442 20423
$$ packed form
6586D6001R048m377j0368l4247k4363j1883j8998M587l5283j5233M7535K7149
6574b0432J0677j2507P535N1161k3123k6591J6742K3334l5118j6260Q904J7686
6562B008M048m5337J5981J8267j5402K0657j2739K07M8055j6021m9766K0512J511
6549h019j827j0449L6914l8687J0171L0765j4915l3226J1215j3145J3823K5266
6537G886l4416K5264M726j1719L101K6373K3321l2051m577K262L354j4856j3981
6524a5313M4844j6837r257j1686j0898P028q086j0286m548J7660K6722M837R013
6511B3193l4045k8319M927J3806J4886J0477P705J837k9849L3455j2119K979K5300
6498C4233l3151q359o64k2887O335J601K8795m92J0247J1770j1889K0903j6019
$$ plain form
6485 20423 3607 -6459 -32248 -32903 -2194 -10630 23020 28345 -1102 1388 28049 -1170 850
6472 850 14935 -4090 -10401 6143 -11337 -11776 4506 15359 60313 46346 16000 -21354 -43533
6459 -43533 -34761 -17205 3355 10846 21069 18717 28105 20946 11450 -16461 -7189 -3530 7964
6446 7964 43217 37864 45474 10022 -20194 -16000 -5698 -2010 -3406 -18898 -18980 -2277 -13382 -13667
6432 -13667 2642 15170 24394 20579 -1983 15355 -3672 -9030 19042 40456 48814 9924 9856
6419 9856 37428 21199 -455 4359 -12197 17442 9118 -16811 -2874 8026 -5389 -9028 4591
6406 4591 13692 5879 -15473 -19927 10462 -4743 7536 31061 18188 3901 28048 12554 -14644
6393 -14644 11517 27416 34171 10842 18396 35403 24376 7033 -3635 -6087 -5213 -6747 4333
$$ packed form
6485B0423j6816j0066k5789o55L0709q436L3650N325k9447K490K6661k9219K020
6472H50J4085j9025o311J6544j7480m39J6282J0853M4954j3967l0346l7354k2179
6459d3533Q772J7556K0560P491J0223k352R388p159r496k7911R272L659J1494
6446G964L5253n353P610l5452l0216M194J0302L688j396j5492q2J6703j1105k85
6432a3667J6309J2528R224l815k2562J7338j9027n358K8072K1414Q358l8890o8
6419I856K7572j6229k1654M814j6556K9639q324k5929J3937J0900j3415l639J3619
6406D591R101p813k1352m454L0389j5205J2279K3525j2873j4287K4147j5494k7198
6393a4644K6161J5899O755k3329P554J7007j1027j7343j0668k452Q74j534J1080
$$ plain form
6380 4333 12882 3246 4644 19080 6577 24911 33704 53583 36801 -3288 -18165 13805 27629
6367 27629 400 25440 42906 50213 18582 24009 69245 66726 49751 27077 15323 24160 4054
6354 4054 28304 16818 -8634 10754 19623 21382 7028 44436 17230 12215 41178 41247 11921
6341 11921 -8051 24508 37341 25534 22147 39435 11065 16388 28894 6376 -8864 -7408
6329 -7408 931 6058 -17676 -45097 -41424 5657 -1015 -15211 -12095 31727 38789 526 15845
6316 15845 8025 1295 20219 -4026 1286 24952 20901 23298 6282 -20916 -20797 5649 25635
6303 25635 2678 8656 2327 10598 16458 21329 42148 -8007 -6500 6361 22040 31498 2795
6290 2795 9413 7662 24059 13164 -8798 9537 17789 22142 39260 26053 13008 25112 18610
$$ packed form
6380D333Q549r636J398J4436j2503J8334Q793J9879j6782m0089j4877L1970J3824
6367B7629k7229K5040J7466P307l1631N427M5236k519j6975k2674j1754Q837k0106
6354D054K4250j1486k5452J9388Q869J759j4354L7408k7206n015K8963O9k9326
6341A1921j9972L2559J2833j1807l387J7288k8370N323J2506k2518j5240J456
6329g408Q339N127k3734k7421L673M7081o672j4196L116M3822P062l8263J5319
6316A5845p820o730J8924k4245N312K3666m051K397j7016k7198J19K6446J9986
6303B5635k2957N978o329Q271N860M871K0819n0155J507J2861J5679R458k8703
6290B795O618j751J6397j0895k1962J8335Q252M353J7118j3207j3045J2104o502
$$ plain form
6277 18610 9871 15360 13160 23785 34675 5755 12018 5591 7935 -21685 -23942 -833 -12751
6264 -12751 -22458 4092 29895 28492 18666 22579 -7902 -9479 -34388 -7185 776 14823 2913
6251 2913 17914 22306 11869 823 -19717 -42478 -15251 -16929 -21464 69 28266 30885 22852
6238 22852 14632 1081 33556 38136 7078 -20871 -4300 4285 20236 18992 -5849 -13007 -1498
6225 -1498 1717 2209 22791 47041 32214 2682 9468 26127 -6568 -6384 -10884 -2097 14625 45296
6211 45296 12087 11316 42261 29980 31837 12918 8098 21450 9109 27231 -159 -8696 -22022
6198 -22022 -22345 -316 -3503 5207 669 13241 20068 10949 22460 1698 -21373 -6020 17586
6185 17586 14035 25333 20857 16626 -17345 -52312 -16776 -6894 -20491 9068 9907 -1813 8809
$$ packed form
6277A8610q739N489k200J0625J0890k8920O263o427K344k9620k257K3109j1918
6264a2751r707K6550K5803j403r826L913l0481j577k4909K7203P961J4047j1910
6251B913J5001M392j0437j1046k0540k2761K7227j678m535K1533K8197K619q033
6238B2852q220j3551L2475M580l1058k7949J6571Q585J5951j244k4841p158J1509
6225a498L215M92K0582K4250j4827k9532O786J6659l2695J84m500Q787J6722L0671
6211D5296l3209p71L0945j2281J857j8919m820J3352j2341J8122k7390q537j3326
6198b2022l23K2029l187Q710m538J2572O827r119J1511k0762k3071J5353K3606
6185A7586l551J1298m476m231l3971l4967L5536R882j3597K9559Q39j1720J0622
$$ plain form
6172 8809 33240 27258 55487 43234 35645 10653 -12294 -6345 490 11048 19917 26681 43095
6159 43095 15684 48884 45207 23639 24538 22179 13563 -16377 22619 33538 33904 21482 33931
6146 33931 72000 61986 22435 11401 18121 32359 19418 27221 58060 34841 46957 54561
6134 54561 48443 36497 26796 31770 38927 14097 7337 16052 5299 2510 -26902 50678 44693
6121 44693 27132 21605 18806 -2589 33324 9805 -26285 -25437 -21934 9361 34398 11313 13505
6108 13505 -7975 741 14922 5386 2987 -10392 11686 27923 35893 14730 25247 22599 45448
6095 45448 15529 -5856 -3006 -25510 -31769 -6712 11957 16566 -25520 -9511 11270 -9199
6083 -9199 15357 27088 46030 19743 25017 38892 49582 49297 47569 23868 13578 5071 10594
$$ packed form
6172H809K4431n982K8229j2253p589k4992k2947N949O835J0558Q869O764J6414
6159D3095k7411L3200l677k1568Q99k359q616k9940L8996J0919L66j2422J2449
6146C3931L8069j0014l9551j1034O720J4238j2941P803L0839k3219J2116P604
6134E4561o118j1946r701M974P157k4830o760Q715j0753k789k9412P7580n985
6121D4693j7561n527k799k1395L5913k3519l6090Q48L503L1295K5037k3085K192
6108A3505k1480Q716J4181r536k399j3379K2078J6237P970k1163J0517k648K2849
6095D5448k9919k1385K850k2504o259K5057J8669M609m2086J6009K0781k0469
6083i199K4556J1731J8942k6287N274J3875J0690k85j728k3701j0290q507N523
$$ plain form
6070 10594 6561 28641 61035 35202 46044 42808 23704 16603 29231 10434 15684 24611 914
6057 914 22952 9963 33359 47128 19744 49056 42760 15986 47137 22639 4814 40421
6045 40421 34439 53200 82000 62907 60626 57081 46986 44185 59135 33784 41478 29591 32025
6032 32025 53020 21160 8174 56393 80776 60744 7769 -12095 9239 11008 16108 4854
6020 4854 6050 5312 13217 19494 21985 9970 30012 19409 17140 25028 60543 19070 11797 26504
6006 26504 17447 36604 45842 58710 63445 48142 70537 48809 55829 96592 76872 52054 59345
5993 59345 53775 49056 36510 28027 26870 20783 27948 48653 23494 -15917 6819 28934 48227
5980 48227 55285 43307 46572 49810 43374 42420 61454 6205 -6078 38029 35854 16404 -10358
$$ packed form
6070A0594m033K2080L2394k5833J0842l236j9104p101J2628j8797N250Q927k3697
6057I14K2038j2989K3396J3769k7384K9312o296k6774L1151k4498j7825L5607
6045D0421n982J8761K8800j9093k281l545j0095k801J4950k5351P694j1887K434
6032C2025K0995l1860j2986M8219K4383k0032n2975j9864K1334J769N100j1254
6020D854J196p38P905O277K491j2015K0042j0603k269P888L5515m1473p273J4707
6006B6504r057J9157R238J2868M735j5303K2395k1728P020M0763j9720k4818P291
5993E9345n570m719j2546q483j157o087P165K0705k5159l9411K2736K2115J9293
5980D8227P058j1978L265L238o436r54J9034n5249j2283M4107k175j9450k6762
$$ plain form
5967 -10358 20741 17805 6538 40669 706 -1246 34084 33659 27552 -12626 13761 1668 -10561
5954 -10561 12617 52213 80066 56517 43075 20195 -327 29534 59709 36049 21213 10911
5942 10911 19463 38653 34944 75064 38477 6325 42229 30524 59808 49052 59197 62112
5930 62112 43493 39369 40807 41591 22290 24305 26777 29723 15034 24526 8344 22129 71298
5917 71298 76516 65385 48178 61617 70060 3127 -4814 33725 75724 99042 77963 82854 48015
5904 48015 49035 8691 17528 48152 14680 41082 55227 48125 48587 85787 72739 98273 94703
5891 94703 86438 69087 60998 33357 41569 32475 3853 27541 54466 55888 55217 35643 53565
5878 53565 36484 30717 45313 49137 60624 40275 50977 31338 53458 24234 32641 56763
$$ packed form
5967a0358L1099k936j1267L4131l9963j952L5330m25o107m0178K6387j2093j2229
5954a0561K3178L9596K7853k3549j3442k2880k0522K9861L0175k3660j4836j0302
5942A0911Q552J9190l709M0120l6587l2152L5904j1705K9284j0756J0145K915
5930F2112j8619m124J438P84j9301K015K472K946j4689R492j6182J3785M9169
5917G1298N218j1131j7207J3439Q443o6933p941L8539M1999K3318k1079M891l4839
5904D8015J020m0344Q837L0624l3472K6402J4145p102M62L7200j3048K5534l570
5891I4703q265j7351q089k7641Q212r094k8622K3688K6925J422o71j9574J7922
5878E3565j7081n767J4596L824J1487k0349J0702j9639K2120k9224Q407K4122
$$ plain form
5866 56763 42883 15165 14195 26168 57020 42280 9586 8218 45540 64848 79541 84099 83376
5853 83376 73198 64495 86639 75930 55848 91736 99173 62183 49488 33661 48186 68139
5841 68139 68247 51719 78157 86109 51657 38707 55820 38964 43943 95755 53502 32503 27518
5828 27518 39404 42224 57779 89841 68115 74374 62346 52226 13452 5805 39551 35513 58508
5815 58508 51835 42282 37592 23616 36114 45092 76306 95054 89637 64290 67774 59344 74697
5802 74697 46952 63284 47403 21499 43438 64904 95146 83695 72845 93634 91473 87771
5790 87771 58673 62236 41786 47050 67099 68179 60795 63793 79641 77287 73921 60792 61930
5777 61930 59400 65636 110050 132003 102967 78691 86877 98619 89693 71908 74417 81452 90067
$$ packed form
5866E6763j3880k7718r70J1973L0852j4740l2694j368L7322J9308J4693M558p23
5853H3376j0178q703K2144j0709k0082L5888P437l6990j2695j5827J4525J9953
5841F8139J08j6528K6438P952l4452j2950J7113j6856M979N1812m2253k0999m985
5828B7518J1886K820J5555L2062k1726O259j2028j0120l8774p647L3746m038K2995
5815E8508o673r553m690j3976J2498Q978L1214J8748n417k5347L484q430J5353
5802G4697k7745J6332j5881k5904K1939K1466L0242j1451j0850K0789k161l702
5790H7771k9098L563k0450N264K0049J080p384K998J5848k354l366j3129J138
5777F1930k530O236M4414K1953k9036k4276Q186J1742q926j7785K509P035Q615
$$ plain form
5764 90067 45930 34573 93416 105345 118797 88148 113181 132175 105880 101763 119765 84423
5752 84423 83910 99390 126659 119718 116538 119059 85743 84450 133916 137235 117627 87817 130410
5739 130410 123650 125913 115889 132551 114383 122542 177054 174537 166942 195562 221862 256094 321114
5726 321114 353839 433495 467700 453952 432587 447389 412327 402849 403345 366537 385216 422344
5714 422344 460933 489174 500169 500056 503988 476915 428497 371143 350028 351149 321463 285009
5702 285009 271782 264644 260675 243686 237876 215223 218883 205612 197147 183224 184793 185747 195450
5689 195450 233642 218507 191077 161404 147894 156365 171332 165021 186608 154947 139738 134169
5677 134169 164964 228509 231299 187903 184659 186246 193292 165372 195773 203144 211882 213544 219115
$$ packed form
5764I0067m4137j1357N8843J1929J3452l0649K5033J8994k6295m117J8002l5342
5752H4423n13J5480K7269o941l180K521l3316j293M9466L319j9608k9810M2593
5739A30410o760K263j0024J6662j8168Q159N4512k517p595K8620K6300L4232O5020
5726C21114L2725P9656L4205j3748k1365J4802l5062r478M96l6808J8679L7128
5714D22344L8589K8241J0995j13L932k7073m8418n7354k1115J121k9686l6454
5702B85009j3227p138l969j6989n810k2653L660j3271q465j3923J569R54R703
5689A95450L8192j5135k7430k9673j3510Q471J4967o311K1587l1661j5209n569
5677A34169L0795O3545K790m3396l244J587P046k7920L0401P371Q738J662N571
$$ plain form
5664 219115 216057 216323 207250 196363 191546 187057 206785 217380 227412 254380 243053 228314 258305
5651 258305 262540 273818 303332 274900 283149 312942 303493 276418 303832 321707 311278 297318
5639 297318 327501 349656 284940 272027 271884 285781 271630 276508 253797 262700 280782 278635 268823
5626 268823 272752 275572 262193 252270 241672 242839 254274 246668 252661 236620 230373 229773 253334
5613 253334 267103 269247 257147 259454 285594 255203 251123 260725 279431 277610 273135 288713 284739
5600 284739 269584 225767 223623 247147 228228 241631 222301 221539 247507 288217 302623 311820
5588 311820 318036 299910 304067 312074 261762 284963 308979 311525 291306 290216 300320 297146 304071
5575 304071 323427 358529 339356 335448 349661 355299 357434 364177 374929 381547 372933 370545 379677
$$ packed form
5664B19115l058K66r073j0887m817m489J9728J0595J0032K6968j1327j4739K9991
5651B58305M235J1278K9514k8432Q249K9793r449k7075K7414J7875j0429j3960
5639B97318L0183K2155o4716j2913j43J3897j4151M878k2711Q903J8082k147r812
5626B68823L929K820j3379r923j0598J167J1435p606N993j6041o247o00K3561
5613B53334J3769K144j2100K307K6140l0391m080R602J8706j821m475J5578l974
5600B84739j5155m3817k144K3524j8919J3403j9330p62K5968M0710J4406R197
5588C11820O216j8126M157Q007n0312K3201K4016K546k0219j090J0104l174O925
5575C04071J9356L5102j9173l908J4213N638K135O743J0752O618q614k388R132
$$ plain form
5562 379677 400890 399047 353785 348972 369680 379900 372663 396957 411457 426644 459288 469629
5550 469629 462072 464536 478177 473657 512690 517385 506204 492896 491415 483005 480956 478630 499213
5537 499213 481737 519325 503266 499375 525953 502720 528458 517557 532883 595211 614113 629500
5525 629500 620335 602840 573811 570396 573580 606425 619049 650223 670523 656675 661809 669387 687321
5512 687321 709758 705118 715640 736595 768797 763715 713874 728351 744626 751581 789218 813401
5500 813401 820005 837021 830546 878640 902048 893659 892263 874760 850503 863258 906782 927231
5488 927231 926313 921004 929900 941176 967065 1005767 1015773 1066867 1087970 1084917 1127848 1167880 1187072
5475 1187072 1188854 1223245 1273548 1311717 1354695 1387176 1438158 1469060 1516950 1578536 1565025 1592826
$$ packed form
5562C79677K1213j843m5262m813K0708J0220p237K4294J4500J5187L2644J0341
5550D69629p557K464J3641m520L9033M695j1181j3308j481q410k049k326K0583
5537D99213j7476L7588j6059l891K6578k3233K5738j0901J5326O2328J8902J5387
5525F29500r165j7495k9029l415L184L2845J2624L1174K0300j3848N134P578J7934
5512F87321K2437m640J0522K0955L2202n082m9841J4477J6275O955L7637K4183
5500H13401O604J7016o475M8094K3408q389j396j7503k4257J2755M3524K0449
5488I27231r18n309Q896J1276K5889L8702J0006N1094K1103l053M2931M0032J9192
5475A187072J782L4391N0303L8169M2978L2481N0982L0902M7890O1586j3511K7801
$$ plain form
5463 1592826 1615532 1658465 1743776 1824554 1866057 1940155 1997151 2013546 2046765 2119503 2186908
5452 2186908 2228714 2311927 2399136 2494836 2551675 2639905 2691294 2792895 2924973 3030394 3148991
5441 3148991 3280698 3378712 3519637 3703494 3847777 4037782 4253256 4460837 4699206 5002597
5431 5002597 5268592 5550349 5875635 6272180 6782717 7385099 8151451 9048706 10088622
5422 10088622 11289510 12796192 14674449 17312444 21206061 27739453 37769731 50193177
5414 50193177 62299433 70432956 73744933 73778332 71578338 66952812 61597695 57488145
5406 57488145 55850659 58395903 64524200 72276518 78105865 79812457 78012708 74009523
5398 74009523 67563475 59145811 50694654 42801971 35930087 29874505 24511728 20105500
$$ packed form
5463A592826K2706M2933Q5311Q0778M1503P4098N6996J6395L3219P2738O7405
5452B186908M1806Q3213Q7209R5700N6839Q8230N1389J01601J32078J05421J18597
5441C148991J31707R8014J40925J83857J44283J90005K15474K07581K38369L03391
5431E002597K65995K81757L25286L96545N10537O02382P66352Q97255J039916
5422A0088622J200888J506682J878257K637995L893617O533392J0030278J2423446
5414E0193177J2106256Q133523L311977L3399k199994m625526n355117m109550
5406E7488145j637486K545244O128297P752318N829347J706592j799749m003185
5398G4009523o446048q417664q451157p892683o871884o055582n362777m406228
$$ plain form
5390 20105500 16824809 14467530 12682225 11298828 10168114 9216043 8402816 7757098 7248574
5381 7248574 6849492 6472943 6131615 5783734 5398829 5051564 4786854 4536550 4318194 4134056
5371 4134056 3953957 3818742 3670585 3527564 3398200 3264489 3146416 3036024 2939622 2843255
5361 2843255 2758532 2661994 2599625 2518155 2483463 2423104 2286905 2249517 2200832 2151444 2052914
5350 2052914 1967261 1911131 1856061 1822838 1812635 1757107 1696885 1648422 1588283 1519048 1511935 1481079
5338 1481079 1472754 1453213 1397286 1341467 1303822 1283183 1252975 1264875 1211681 1191967 1151601 1127585
5326 1127585 1108946 1063226 1018207 988621 971542 960679 931494 899673 887466 867219 852514
5315 852514 824274 805826 760338 727868 741369 725924 705151 678188 656424 663362 646467 622993
$$ packed form
5390B0105500l280691k357279j785305j383397j130714r52071q13227o45718n08524
5381G248574l99082l76549l41328l47881l84905l47265k64710k50304k18356j84138
5371D134056j80099j35215j48157j43021j29364j33711j18073j10392r6402r6367
5361B843255q4723r6538o2369q1470l4692o0359j36199l7388m8685m9388r8530
5350B052914q5653n6130n5070l3223j0203n5528o0222m8463o0139o9235p113l0856
5338A481079q325j9541n5927n5819l7645k0639l0208J1900n3194j9714m0366k4016
5326A127585j8639m5720m5019k9586j7079j0863k9185l1821j2207k0247j4705
5315H52514k8240j8448m5488l2470J3501j5445k0773k6963k1764O938j6895k3474
$$ plain form
5303 622993 629836 613649 577855 601015 591149 549374 540162 554273 562995 556964 572705 540674 522209
5290 522209 509970 470383 487899 468548 481209 466301 442558 441783 428940 422150 411845 410919 427078
5277 427078 430802 421476 411807 382034 323283 328036 335332 328901 307187 299152 288174 286980 271239
5264 271239 283799 308420 299286 268141 247720 247267 250758 224402 237385 232188 214114 216286 240568
5251 240568 189431 150793 171309 148137 176052 196681 183382 192367 195175 152741 149070 163528
5239 163528 198545 166911 153395 167554 151528 162064 201282 183507 158745 138440 133709 151454
5227 151454 170453 138708 155467 149106 153037 152060 142334 137391 136501 135873 116452 103712 101190 117639
5213 117639 115769 117298 149841 131795 127468 120965 98088 117886 119899 107615 126291 100004 108115
$$ packed form
5303F22993O843j6187l5794K3160r866m1775r212J4111Q722o031J5741l2031j8465
5290E22209j2239l9587J7516j9351J2661j4908k3743p75j2843o790j0305r26J6159
5277D27078L724r326r669k9773n8751M753P296o431k1714q035j0978j194j5741
5264B71239J2560K4621r134l1145k0421m53L491k6356J2983n197j8074K172K4282
5251B40568n1137l8638K0516k3172K7915K0629j3299Q985K808m2434l671J4458
5239A63528L5017l1634j3516J4159j6026J0536L9218j7775k4762k0305m731J7745
5227A51454J8999l1745J6759o361L931r77r726m943q90o28j9421j2740k522J6449
5213A17639j870J529L2543j8046m327o503k2877J9798K013j2284J8676k6287Q111
$$ plain form
5200 108115 113570 78958 73716 44983 62174 87199 71392 55590 111930 104312 71485 40625
5188 40625 68671 129770 94528 71478 63410 57119 44214 75159 76913 68238 82282 61325 54184
5175 54184 84858 62271 66166 71320 67905 59766 45180 9627 17110 32759 58874 61001 61459
5162 61459 51144 49261 93257 60796 52223 49186 29406 29640 34542 80950 65560 44584 17205
5149 17205 8987 33923 37785 48178 36020 51964 38409 26492 64037 46777 52977 25157
5137 25157 13376 26862 -12432 20271 30789 45499 66423 55722 19658 31286 30276 37437
5125 37437 24315 57925 71509 67882 40552 51803 55967 62421 22623 36773 36012 37379 11618
5112 11618 17641 43526 42978 55307 58147 54775 78244 91499 95204 112427 124045 173314 236187
$$ packed form
5200A08115N455l4612n242k8733J7191K5025j5807j5802N6340p618l2827l0860
5188D0625K8046O1099l5242k3050q068o291j2905L0945J754q675J4044k0957p141
5175E4184L0674k2587L895N154l415q139j4586l5553P483J5649K6115K127M58
5162F1459j0315j883M3996l2461q573l037j9780K34M902M6408j5390k0976k7379
5149A7205q218K4936L862J0393j2158J5944j3555j1917L7545j7260O200k7820
5137B5157j1781J3486l9294L2703J0518J4710K0924j0701l6064J1628j010P161
5125C7437j3122L3610J3584l627k7330J1251M164O454l9798J4150p61J367k5761
5112A1618O023K5885n48J2329K840l372K3469J3255L705J7223J1618M9269O2873
$$ plain form
5099 236187 292098 346187 403051 412796 432259 387325 343266 305433 303577 310226 340425 384408
5087 384408 422352 432719 429001 425669 412854 359366 289040 245172 199840 174213 129584 115591
5075 115591 108589 67806 56543 47009 63366 43985 57102 69169 104261 94475 66840 66319 58723
5062 58723 57324 59420 70109 45160 34173 25652 47541 4390 -18824 19066 28466 49143 51237
5049 51237 71117 68544 62513 38814 32619 37365 11210 27210 9776 47080 49651 37584 53121
5036 53121 44758 12248 2186 10970 56682 76595 55798 20183 21105 40518 41574 50425 31673
5023 31673 26705 17461 32629 52782 37835 46615 43428 27988 29714 24940 7723 985 30742
5010 30742 11970 25239 45028 33178 37651 28378 62118 115731 102624 125815 138966 125989
$$ packed form
5099B36187N5911N4089N6864R745J9463m4934m4059l7833j856O649L0199M3983
5087C84408L7944J0367l718l332j2815n3488p0326m3868m5332k5627m4629j3993
5075A15591p002m0783j1263r534J6357j9381J3117J2067L5092r786k7635n21p596
5062E8723j399K096J0689k4949j0987q521K1889m3151k3214L7890R400K0677K094
5049E1237J9880k573o031k3699o195M746k6155J6000j7434L7304K571j2067J5537
5036E3121q363l2510j0062Q784M5712J9913k0797l5615R22J9413J056Q851j8752
5023C1673m968r244J5168K0153j4947Q780l187j5440J726m774j7217o738K9757
5010C0742j8772J3269J9789j1850M473r273L3740N3613j3107K3191J3151j2977
$$ plain form
4998 125989 141768 150093 123431 108171 101216 60193 31494 65771 54050 46883 73057 87526
4986 87526 74301 53802 51304 9320 -11472 18304 31936 31495 10714 -27735 -16549 6757
4974 6757 5953 -2583 -329 9839 17862 11065 6668 15704 23327 35535 35097 27980 16481 54256
4960 54256 58537 9978 -9742 25838 23328 27072 37262 42515 41013 34640 34892 35121 59495 36627
4946 36627 27344 50349 33460 58739 52390 57563 53769 44468 39437 39326 37506 58497 97385 121749
4932 121749 152667 148400 114827 128256 132801 120870 127279 74456 57238 50444 48686 26791 1395
4919 1395 -2722 3131 -6727 -11389 9888 38527 56905 71143 46390 34344 39748 24271 26314
4906 26314 35131 28046 11383 15712 30426 36730 30142 11745 25055 42830 38344 34180 17999
$$ packed form
4998A25989J5779Q325k6662j5260o955m1023k8699L4277j1721p167K6174J4469
4986H7526j3225k0499k498m1984k0792K9776J3632m41k0781l8449J1186K3306
4974F757q04q536K254J0168Q023o797m397R036P623J2208m38p117j1499L7775
4960E4256M281m8559j9720L5580k510L744J0190N253j502o373K52K29K4374k2868
4946C6627r283K3005j6889K5279o349N173l794r301n031j11j820K0991L8888K4364
4932A21749L0918m267l3573J3429M545j1931O409n2823j7218o794j758k1895k5396
4919A395m117N853r858m662K1277K8639J8378J4238k4753j2046N404j5477K043
4906B6314Q817p085j6663M329J4714O304o588j8397J3310J7775m486m164j6181
$$ plain form
4893 17999 21142 50273 45238 52269 31769 37941 36051 59002 50361 68775 75948 63355 54522
4880 54522 67685 33536 42769 57041 68884 68805 73449 109405 115386 99526 108988 128088 135334
4867 135334 115107 128115 122588 124888 152113 158692 208381 198311 193870 223169 219785 203130 207627
4854 207627 178837 148832 153226 143596 145839 158132 156146 122177 98774 106435 110724 121737 71114
4841 71114 58956 52706 58702 64669 71039 66792 49782 28896 57836 74222 71138 55111 47327
4828 47327 26974 -286 891 45625 69345 77001 82181 97359 51443 58111 52144 51334 34655
4815 34655 25480 49311 53985 49472 51455 30686 23131 49838 15914 14070 36357 44024 60422
4802 60422 50911 36504 53675 64972 64682 34155 70784 52900 21977 18888 8227 -2902 13096
$$ packed form
4893A7999L143K9131n035P031k0500O172j890K2951q641J8414P173j2593q833
4880E4522J3163l4149R233J4272J1843p9M644L5956N981j5860R462J9100P246
4867A35334k0227J3008n527K300K7225O579M9689j0070m441K9299l384j6655M497
4854B07627k8790l0005M394r630K243J2293j986l3969k3403P661M289J1013n0623
4841G1114j2158o250N996N967O370m247j7010k0886K8940J6386l084j6027p784
4828D7327k0353k7260J177M4734K3720P656N180J5178m5916O668n967q10j6679
4815C4655r175K3831M674m513J983k0769p555K6707l3924j844K2287P667J6398
4802F0422r511j4407J7171J1297k90l0527L6629j7884l0923l089j0661j1129J5998
$$ plain form
4789 13096 31092 50698 46330 28463 47006 65515 70760 65794 54817 50597 51037 51450 50078 43296
4775 43296 64780 57930 61378 55072 21829 41441 62333 73282 69583 64991 37723 34428 33052
4762 33052 35524 68670 91943 44357 31852 28255 54037 55153 18753 23323 29036 57574 64528
4749 64528 62158 46109 53309 10655 24233 51455 43767 41288 50741 59546 67347 44880 47470
4736 47470 64018 49050 34646 40689 56225 69629 44826 40471 47255 48753 79839 48443 53240
4723 53240 40171 42064 61157 35936 17941 61280 77334 60987 57377 50913 48087 47799 83948
4710 83948 61872 35697 61476 36502 56673 70744 63261 61118 73609 85589 92331 62421
4698 62421 25635 38896 84035 109210 71996 68019 73420 86744 119404 136170 88386 74077
$$ packed form
4789A3096J7996J9606m368j7867J8543J8509N245m966j0977m220M40M13j372o782
4775D3296K1484o850L448o306l3243J9612K0892J0949l699m592k7268l295j376
4762C3052K472L3146K3273m7586j2505l597K5782J116l6400M570N713K8538O954
4749F4528k370j6049P200m2654J3578K7222p688k479R453Q805P801k2467K590
4736D7470J6548j4968j4404O043J5536J3404k4803m355O784J498L1086l1396M797
4723E3240j3069J893J9093k5221j7995M3339J6054j6347l610o464k826k88L6149
4710H3948k2076k6175K5779k4974K0171J4071p483k143J2491J1980O742k9910
4698F2421l6786J3261M5139K5175l7214l977N401J3324L2660J6766m7784j4309
$$ plain form
4686 74077 75154 63755 56293 32389 25187 55416 61434 76218 73011 48353 66078 70311 67262
4673 67262 65478 62686 49000 55229 55640 30338 70871 86829 81813 80464 107801 116285 98750
4660 98750 93676 71712 76563 59012 65619 77759 63507 89920 89562 91098 94371 78360 97872
4647 97872 90629 93089 100838 99000 85321 94259 107593 123306 98405 93987 106807 96422 100470
4634 100470 112800 83101 70169 101892 112507 106472 70852 86086 122078 98085 100947 116662
4622 116662 117389 117581 93361 98520 119245 106175 115328 134129 131170 112844 101337 129802 87672
4609 87672 80310 104315 114008 140044 132493 118626 104081 107530 114601 129429 108235 105982 119438
4596 119438 99895 105112 124782 122054 95411 121034 141638 150269 145057 115200 120879 110098 122334
$$ packed form
4686G4077J077j1399p462k3904p202L0229O018J4784l207k4658J7725M233l049
4673F7262j784k792j3686O229M11k5302M0533J5958n016j349K7337Q484j7535
4660I8750n074k1964M851j7551O607J2140j4252K6413l58J536L273j6011J9512
4647I7872p243K460P749j838j3679Q938J3334J5713k4901m418J2820j0385M048
4634A00470J2330k9699j2932L1723J0615o035l5620J5234L5992k3993K862J5715
4622A16662P27J92k4220N159K0725j3070R153J8801k959j8326j1507K8465m2130
4609H7672p362K4005R693K6036p551j3867j4545L449P071J4828k1194k253J3456
4596A19438j9543N217J9670k728k6643K5623K0604Q631n212k9857N679j0781J2236
$$ plain form
4583 122334 96327 100847 128500 115706 84997 113426 174763 151849 110546 101029 113945 125768
4571 125768 135046 147163 131508 115702 170899 206397 183861 176279 146801 135314 187401 194211
4559 194211 167220 164631 169384 194316 203956 173274 161284 169834 169848 187524 199031 173596 183175
4546 183175 193151 211758 213193 211477 211515 250140 237050 214458 210515 194267 191068 198866 209508
4533 209508 218728 222519 223976 245905 250747 272346 248595 248548 257670 255780 309821 317954 281172 274995
4519 274995 281897 313363 336500 328874 336637 371499 366892 400936 398588 396857 396449 409073 444255
4506 444255 452487 489995 499391 523471 526322 513199 519059 527670 529682 542409 527378 517322 516683
4493 516683 526631 551302 542293 513345 537536 531886 551358 540434 541601 559229 560916 528371 540163
$$ packed form
4583A22334k6007M520K7653j2794l0709K8429O1337k2914m1303r517J2916J1823
4571A25768R278J2117j5655j5806N5197L5498k2536p582k9478j1487N2087O810
4559A94211k6991k589M753K4932R640l0682j1990Q550J4J7676J1507k5435R579
4546A83175R976J8607J435j716L8L8625j3090k2592l943j6248l199P798J0642
4533B09508R220L791J457K1929M842K1599k3751m7R122j890N4041Q133l6782o177
4519B74995O902L1466K3137p626P763L4862m607L4044k348j731m08J2624L5182
4506D44255Q232L7508R396K4080K851j3123N860Q611K012J2727j5031j0056o39
4493E16683R948K4671r009k8948K4191n650J9472j0924J167J7628J687l2545J1792
$$ plain form
4480 540163 553891 520556 514814 514407 516236 498860 505611 479006 453028 465057 496862 512039 464604
4467 464604 430236 435595 431303 454125 448641 447625 433705 392786 378128 389938 396495 436055 454416
4454 454416 437851 424179 439638 431011 424472 416037 402199 409934 425359 426362 415003 432830 430746
4441 430746 464869 467345 463426 438632 451863 459589 468153 448774 425159 450879 456966 460741 455733
4428 455733 454800 492640 501467 510626 516614 516930 548287 568961 592513 610228 619226 621193 646432
4415 646432 653925 644250 629824 622521 654369 728405 738124 818566 837872 824535 785289 752967
4403 752967 742924 757979 765492 761218 759862 772720 782491 781090 794211 782456 788597 784117 776177
4390 776177 782608 763743 758777 743971 742928 781403 789548 783460 778835 818702 828128 814620 841577
$$ packed form
4480E40163J3728l3335n742m07J829j7376O751k6605k5978J2029L1805J5177m7435
4467D64604l4368N359m292K2822n484j016j3920m0919j4658J1810O557L9560J8361
4454D54416j6565j3672J5459q627o539q435j3838P735J5425J003j1359J7827k084
4441D30746L4123K476l919k4794J3231P726Q564j9379k3615K5720O087L775n008
4428D55733r33L7840Q827R159N988L16L1357K0674K3552J7715Q998J967K5239
4415F46432P493r675j4426p303L1848P4036R719Q0442J9306j3337l9246l2322
4403G52967j0043J5055P513m274j356J2858R771j401J3121j1755O141m480p940
4390G76177O431j8865m966j4806j043L8475Q145o088m625L9867R426j3508K6957
$$ plain form
4377 841577 843572 846511 869054 905111 931408 936890 921689 954395 999869 1054117 1081625 1136386
4365 1136386 1180204 1179793 1198073 1191719 1195649 1210166 1223242 1243532 1267637 1283607 1328539 1376641
4353 1376641 1386482 1381335 1403890 1419673 1456034 1531596 1551421 1515562 1576148 1620819 1675993 1727684
4341 1727684 1738367 1779341 1828212 1897800 1954150 2003874 2060423 2113595 2174002 2228047 2276943
4330 2276943 2358108 2455791 2525036 2608734 2668865 2802855 2900556 3050276 3200605 3372843 3587968
4319 3587968 3828783 4110974 4422842 4820064 5354723 6128412 7338438 9382092 12290375
4310 12290375 15608973 18511437 20194354 20852683 20970613 20603609 19738671 19125602 19151079
4301 19151079 20775926 24343112 29226854 34056681 36841834 37380240 36572510 34897028
$$ packed form
4377H41577J995K939K2543L6057K6297N482j5201L2706M5474N4248K7508N4761
4365A136386M3818m11J8280o354L930J4517J3076K0290K4105J5970M4932M8102
4353A376641R841n147K2555J5783L6361P5562J9825l5859O0586M4671N5174N1691
4341A727684J0683M0974M8871O9588N6350M9724N6549N3172O0407N4045M8896
4330B276943Q1165R7683O9245Q3698O0131J33990R7701J49720J50329J72238K15125
4319C587968K40815K82191L11868L97222N34659P73689J210026K043654K908283
4310A2290375L318598K902464J682917O58329J17930l67004q64938o13069K5477
4301A9151079J624847L567186M883742M829827K785153N38406q07730j675482
$$ plain form
4293 34897028 31775920 28386177 25456636 23308034 22450940 22492467 23125590 23468240 23011167
4284 23011167 21986755 20619684 18730237 16507616 14374974 12422879 10752440 9303427
4276 9303427 8054273 7075337 6333681 5816686 5440036 5127622 4899439 4715492 4558814
4267 4558814 4446396 4372176 4278826 4186719 4142466 4139151 4101496 4094711 4092699 4104919 4093564 4108507
4255 4108507 4136453 4172079 4252952 4321672 4381778 4480899 4605345 4729333 4808332 4948996 5118144
4244 5118144 5298818 5539362 5758606 6030790 6300601 6597825 6978983 7370384 7809239 8276601
4234 8276601 8758236 9292080 9945111 10629099 11367833 12200752 13084835 13986624 14934750 15963998
4224 15963998 17066697 18210541 19369230 20597572 21897533 23215307 24546195 25995922
$$ packed form
4293C4897028l121108l389743k929541k148602q57094M1527O33123L42650m57073
4284B3011167j024412j367071j889447k222621k132642j952095j670439j449013
4276I303427j249154r78936p41656n16995l76650l12414k28183j83947j56678
4267D558814j12418p4220r3350r2107m4253l315l7655o785k012J2220j1355J4943
4255D108507K7946L5626Q0873O8720O0106R9121J24446J23988P8999J40664J69148
4244E118144J80674K40544K19244K72184K69811K97224L81158L91401M38855M67362
4234H276601M81635N33844O53031O83988P38734Q32919Q84083R01789R48126J029248
4224A5963998J102699J143844J158689J228342J299961J317774J330888J449727
$$ plain form
4216 25995922 27463994 28993294 30552199 32163097 33790638 35443264 37087156 38686005
4208 38686005 40258547 41803858 43316550 44706538 46051681 47326602 48540121 49699630
4200 49699630 50785873 51838852 52822055 53718495 54566916 55272568 55758900 56065382 56201765
4191 56201765 56220195 56054911 55760852 55345337 54821505 54276206 53578502 52815840 52020380 51105077
4181 51105077 50095421 48944188 47711863 46358748 44942665 43434324 41822189 40225971
4173 40225971 38566957 36934440 35328704 33679342 32130860 30625867 29121696 27680607
4165 27680607 26225835 24836943 23456782 22075347 20766286 19477413 18234320 17057901
4157 17057901 15929346 14920494 13944070 12998183 12137205 11376022 10633510 9958576 9320112
$$ packed form
4216B5995922J468072J529300J558905J610898J627541J652626J643892J598849
4208C8686005J572542J545311J512692J389988J345143J274921J213519J159509
4200D9699630J086243J052979R83203Q96440Q48421P05652M86332L06482J36383
4191E6201765J8430j65284k94059m15515n23832n45299o97704p62662p95460r15303
4181E1105077j009656j151233j232325j353115j416083j508341j612135j596218
4173D0225971j659014j632517j605736j649362j548482j504993j504171j441089
4165B7680607j454772j388892j380161j381435j309061j288873j243093j176419
4157A7057901j128555j008852r76424r45887q60978p61183p42512o74934o38464
$$ plain form
4148 9320112 8754947 8250712 7751622 7312417 6872263 6467545 6109525 5806414 5507277 5215993
4138 5215993 4964797 4746303 4563985 4369575 4194187 4034029 3885003 3782642 3682170 3580227
4128 3580227 3477726 3342533 3239949 3184934 3108458 3077651 3004524 2953841 2894093 2839290 2793542
4117 2793542 2774772 2697874 2645368 2622020 2598745 2595038 2540550 2538345 2526421 2529839 2565151 2566415
4105 2566415 2582661 2627672 2689582 2732749 2788164 2818415 2886895 2927146 2921432 2968954 3019316 3030955
4093 3030955 3041440 3064671 3056659 3042539 3018807 2982399 2920845 2892639 2879495 2843039 2813435 2794899
4081 2794899 2748580 2747946 2694382 2620937 2584369 2526489 2457113 2407551 2327785 2250773 2184041 2102782
4069 2102782 2066415 2037050 1985932 1952497 1904869 1870110 1825153 1796879 1776256 1719485 1671323
$$ packed form
4148I320112n65165n04235m99090m39205m40154m04718l58020l03111k99137k91284
4138E215993k51196k18494j82318j94410j75388j60158j49026j02361j00472j01943
4128C580227j02501j35193j02584n5015p6476l0807p3127n0683n9748n4803m5748
4117B793542j8770p6898n2506k3348k3275l707n4488k205j1924L418L5312J264
4105B566415J6246M5011O1910M3167N5415L0251O8480M0251n714M7522N0362J1639
4093C030955J0485K3231q012j4120k3732l6408o1554k8206j3144l6456k9604j8536
4081B794899m6319o34n3564p3445l6568n7880o9376m9562p9766p7012o6732q1259
4069B102782l6367k9365n1118l3435m7628l4759m4957k8274k0623n6771m8162
$$ plain form
4058 1671323 1675700 1621366 1584919 1587364 1559426 1500979 1478507 1469358 1443440 1411026 1374305 1390927
4046 1390927 1378800 1354186 1341107 1351195 1322961 1311192 1302253 1267437 1255369 1253596 1212733 1193465
4034 1193465 1188547 1166912 1183491 1206051 1211710 1208560 1191964 1207054 1217606 1258508 1271400 1235669
4022 1235669 1256304 1268477 1266221 1324815 1353776 1350903 1370154 1405197 1438817 1410135 1438227 1505524
4010 1505524 1556349 1615252 1645661 1673736 1701364 1744795 1784890 1805412 1808939 1860112 1901290 1907403
3998 1907403 1909887 1878284 1861916 1845132 1899532 1896677 1889455 1933832 1973292 1974207 1967558 1992776 1947753
3985 1947753 1916268 1905519 1886248 1836173 1816939 1781054 1814899 1807858 1809943 1814691 1815550 1826732
3973 1826732 1865870 1893578 1898240 1927336 1934592 1948404 1942225 1972901 2007964 2022820 2057627 2084880
$$ packed form
4058A671323M377n4334l6447K445k7938n8447k2472r149k5918l2414l6721J6622
4046A390927j2127k4614j3079J0088k8234j1769q939l4816j2068j773m0863j9268
4034A193465m918k1635J6579K2560N659l150j6596J5090J0552M0902J2892l5731
4022A235669K0635J2173k256N8594K8961k873J9251L5043L3620k8682K8092O7297
4010A505524N0825N8903L0409K8075K7628M3431M0095K0522L527N1173M1178O113
3998A907403K484l1603j6368j6784N4400k855p222M4377L9460R15o649K5218m5023
3985A947753l1485j0749j9271n0075j9234l5885L3845p041K085M748Q59J1182
3973A826732L9138K7708M662K9096P256J3812o179L0676L5063J4856L4807K7253
$$ plain form
3961 2084880 2093376 2140848 2171964 2184072 2220911 2264892 2238237 2253200 2287585 2285817 2308180 2340370
3949 2340370 2352444 2392832 2413876 2426313 2457957 2527513 2557420 2593555 2605588 2629755 2623698 2648994
3937 2648994 2676792 2694069 2722210 2741862 2750336 2784697 2845651 2911893 2952762 2955139 3000808 3036364
3925 3036364 3079893 3107097 3167560 3213755 3265734 3310515 3338906 3426794 3499175 3539861 3608150
3914 3608150 3688672 3739341 3788038 3871212 3962432 4035388 4118918 4216501 4326258 4418829 4500242
3903 4500242 4590387 4665020 4795119 4949090 5066661 5160713 5295476 5449121 5601189 5757635
3893 5757635 5939057 6111317 6301546 6522348 6784435 7055062 7352837 7706507 8067423 8533142
3883 8533142 9056639 9613756 10244013 10864460 11513947 12179787 12824448 13474909 14027953 14552580
$$ packed form
3961B084880Q496M7472L1116J2108L6839M3981k6655J4963L4385j768K2363L2190
3949B340370J2074M0388K1044J2437L1644O9556K9907L6135J2033K4167o057K5296
3937B648994K7798J7277K8141J9652Q474L4361O0954O6242M0869K377M5669L5556
3925C036364M3529K7204O0463M6195N1979M4781K8391Q7888P2381M0686O8289
3914C608150Q0522N0669M8697Q3174R1220P2956Q3530R7583J09757R2571Q1413
3903D500242R0145P4633J30099J53971J17571R4052J34763J53645J52068J56446
3893E757635J81422J72260J90229K20802K62087K70627K97775L53670L60916M65719
3883H533142N23497N57117O30257O20447O49487O65840O44661O50461N53044N24627
$$ plain form
3873 14552580 15060295 15576098 16072698 16556654 17089842 17641100 18220592 18834711 19446525
3864 19446525 20016755 20490959 20919550 21258373 21454541 21547170 21556120 21546791 21431338 21305897
3854 21305897 21227421 21119072 21059130 21001428 20938569 20945301 20981110 20969940 20975747 21045069 21122163
3843 21122163 21223675 21361390 21541496 21771310 22121997 22574238 23129343 23803168 24621802
3834 24621802 25601127 26815411 28288753 30086796 32170663 34625280 37513225 40906101
3826 40906101 44739401 49188713 54245287 60030169 66609195 74178578 83047155 93460931
3818 93460931 105925893 120739471 137906357 156857689 176520797 195805563 213786516
3811 213786516 229634730 242638178 252468795 259144591 263068718 264858968 265084516 264558692
$$ packed form
3873A4552580N07715N15803M96600M83956N33188N51258N79492O14119O11814
3864A9446525N70230M74204M28591L38823J96168R2629Q950r329j15453j25441
3854B1305897p8476j08349n9942n7702o2859O732L5809j1170N807O9322P7094
3843B1122163J01512J37715J80106K29814L50687M52241N55105O73825Q18634
3834B4621802R79325J214284J473342J798043K083867K454617K887945L392876
3826D0906101L833300M449312N056574N784882O579026P569383Q868577J0413776
3818I3460931J2464962J4813578J7166886J8951332J9663108J9284766J7980953
3811B13786516J5848214J3003448R830617O675796L924127J790250K25548n25824
$$ plain form
3803 264558692 263921403 263726783 264270280 265673719 267871467 270616351 273189362 274317076
3795 274317076 272580204 267086110 257848262 245614506 231211760 215619255 199925632
3788 199925632 184959742 171284830 159077382 148379108 139182793 131382187 124772750
3781 124772750 119028403 113983618 109334201 104910252 100621429 96355443 92122614 87942830
3773 87942830 83874672 79970042 76278707 72753388 69421631 66344373 63427972 60608876
3765 60608876 57827872 55017136 52147644 49223733 46298033 43382687 40514392 37741842
3757 37741842 35144654 32763507 30609874 28660274 26928489 25463623 24154493 23083896
3749 23083896 22226462 21557690 21056351 20689616 20476280 20425776 20371088 20360693 20375451 20332512
$$ packed form
3803B64558692o37289j94620N43497J403439K197748K744884K573011J127714
3795B74317076j736872n494094r237848j2233756j4402746j5592505j5693623
3788A99925632j4965890j3674912j2207448j0698274r196315p800606o609437
3781A24772750n744347n044785m649417m423949m288823m265986m232829m179784
3773H7942830m068158l904630l691335l525319l331757l077258k916401k819096
3765F0608876k781004k810736k869492k923911k925700k915346k868295k772550
3757C7741842k597188k381147k153633j949600j731785j464866j309130j070597
3749B3083896q57434o68772n01339l66735k13336n0504n4688j0395J4758m2939
$$ plain form
3739 20332512 20258652 20167158 20036035 19952503 19907038 19881421 19930349 20056706 20210182 20391099
3729 20391099 20609591 20742199 20793640 20835814 20799547 20673973 20473779 20144212 19740025 19261276
3719 19261276 18730257 18176646 17602181 17014799 16451848 15921732 15448441 14959577 14454982
3710 14454982 13946931 13460502 12921402 12364040 11777717 11203065 10630395 10057007 9534450
3701 9534450 9039257 8524784 8091722 7672593 7289888 6958721 6645644 6381115 6157258 5941376
3691 5941376 5698026 5525471 5372644 5215489 5064876 4912434 4786319 4679583 4569090 4474376
3681 4474376 4394508 4290372 4186259 4089595 4013813 3959628 3886014 3820335 3756065 3668958 3566892
3670 3566892 3529374 3444084 3370632 3327430 3269442 3198945 3124826 3051468 2999972 2943549 2883967
$$ packed form
3739B0332512p3860r1494j31123q3532m5465k5617M8928J26357J53476J80917
3729B0391099K18492J32608N1441M2174l6267j25574k00194l29567m04187m78749
3719A9261276n31019n53611n74465n87382n62951n30116m73291m88864n04595
3710A4454982n08051m86429n39100n57362n86323n74652n72670n73388n22557
3701I534450m95193n14473m33062m19129l82705l31167l13077k64529k23857k15882
3691E941376k43350j72555j52827j57155j50613j52442j26115j06736j10493r4714
3681D474376p9868j04136j04113r6664p5782n4185p3614o5679o4270q7107j02066
3670C566892l7518q5290p3452m3202n7988p0497p4119p3358n1496n6423n9582
$$ plain form
3659 2883967 2863932 2754612 2721705 2710415 2654494 2630454 2587706 2548354 2538505 2471696 2453064
3648 2453064 2424121 2386548 2365738 2297336 2275176 2221743 2180758 2179143 2181047 2152853 2140552 2158914
3636 2158914 2132665 2114716 2111651 2055891 2020179 2056270 2069854 2035337 2001723 2015970 1998097 1983682
3624 1983682 1966948 2027006 2026918 1979205 1954383 1926378 1915573 1898833 1880848 1871794 1850633 1855786
3612 1855786 1848957 1807990 1805771 1816476 1846369 1841835 1830914 1806390 1797398 1839352 1829460 1800929
3600 1800929 1818570 1827624 1832381 1821166 1832806 1829289 1800106 1811814 1869116 1868155 1876374 1899643 1922602
3587 1922602 1935557 1954092 1936143 1957069 1969998 1976712 2002106 1997885 2024686 2078389 2110706 2115272
3575 2115272 2148870 2182530 2214328 2257291 2279819 2291619 2303722 2342185 2340648 2342721 2379043 2416792
$$ packed form
3659B883967k0035j09320l2907j1290n5921k4040m2748l9352r849o6809j8632
3648B453064k8943l7573k0810o8402k2160n3433m0985j615J904k8194j2301J8362
3636B158914k6249j7949l065n5760l5712L6091J3584l4517l3614J4247j7873j4415
3624A983682j6734O0058q8m7713k4822k8005j0805j6740j7985r054k1161N153
3612A855786o829m0967k219J0705K9893m534j0921k4524q992M1954r892k8531
3600A800929J7641R054M757j1215J1640l517k9183J1708N7302r61Q219K3269K2959
3587A922602J2955J8535j7949K0926J2929O714K5394m221K6801N3703L2317M566
3575B115272L3598L3660L1798M2963K2528J1800J2103L8463j537K073L6322L7749
$$ plain form
3563 2416792 2433369 2464926 2522259 2537865 2580224 2640239 2705893 2750646 2792906 2838939 2872039
3552 2872039 2893486 2947874 3014513 3056817 3111537 3184490 3221807 3267039 3360023 3437402 3503034
3541 3503034 3560845 3678096 3783571 3881097 4011661 4165561 4258508 4388927 4523620 4673275
3531 4673275 4872991 5040586 5213807 5410420 5625843 5789629 6030383 6241521 6433023 6657731
3521 6657731 6860111 7076348 7270902 7453027 7698976 7896214 8069698 8284395 8512964 8742444
3511 8742444 8934036 9171003 9421177 9655689 9892388 10121188 10366311 10606592 10857374 11083811
3501 11083811 11306124 11550212 11770349 12010899 12232278 12467016 12724426 12948976 13174082
3492 13174082 13398259 13598494 13762005 13892649 14051967 14209309 14318304 14414638 14474417 14481858
$$ packed form
3563B416792J6577L1557N7333J5606M2359O0015O5654M4753M2260M6033L3100
3552B872039K1447N4388O6639M2304N4720P2953L7317M5232R2984P7379O5632
3541C503034N7811J17251J05475R7526J30564J53900R2947J30419J34693J49655
3531D673275J99716J67595J73221J96613K15423J63786K40754K11138J91502K24708
3521F657731K02380K16237J94554J82125K45949J97238J73484K14697K28569K29480
3511H742444J91592K36967K50174K34512K36699K28800K45123K40281K50782K26437
3501A1083811K22313K44088K20137K40550K21379K34738K57410K24550K25106
3492A3174082K24177K00235J63511J30644J59318J57342J08995R6334N9779P441
$$ plain form
3482 14481858 14485909 14437680 14367221 14309828 14201630 14022337 13877021 13696381 13487958 13293888
3472 13293888 13052360 12843808 12580328 12302884 12017018 11723935 11452911 11203207 10938858
3463 10938858 10637472 10361272 10074580 9842233 9578028 9303740 9100328 8865706 8663547
3454 8663547 8459074 8232818 8040829 7880919 7706710 7537356 7333216 7186392 7008991 6791560
3444 6791560 6628964 6444344 6222517 6034090 5837818 5624359 5431922 5300911 5185816 5026328
3434 5026328 4860002 4732143 4590913 4463018 4334633 4200185 4061322 3917513 3816280 3733284
3424 3733284 3620944 3571939 3500324 3396089 3294755 3218843 3158195 3052017 3017820 2942056 2882684
3413 2882684 2824851 2771266 2715857 2638261 2613916 2546611 2496569 2445113 2367588 2340828 2278325
$$ packed form
3482A4481858M051m8229p0459n7393j08198j79293j45316j80640k08423j94070
3472A3293888k41528k08552k63480k77444k85866k93083k71024k49704k64349
3463A0938858l01386k76200k86692k32347k64205k74288k03412k34622k02159
3454H663547k04473k26256j91989j59910j74209j69354k04140j46824j77401k17431
3444F791560j62596j84620k21827j88427j96272k13459j92437j31011j15095j59488
3434E026328j66326j27859j41230j27895j28385j34448j38863j43809j01233q2996
3424C733284j12340m9005p1615j04235j01334p5912o0648j06178l4197p5764n9372
3413B882684n7833n3585n5409p7596k4345o7305n0042n1456p7525k6760o2503
$$ plain form
3402 2278325 2214156 2174343 2153281 2102547 2077473 2047496 1978508 1932877 1889781 1850460 1824748
3391 1824748 1791900 1771786 1719592 1681676 1634772 1628844 1600667 1549285 1522940 1519174 1522788 1469188
3379 1469188 1402837 1365015 1348138 1345712 1306676 1269412 1260087 1241857 1202718 1194442 1192647 1179504
3367 1179504 1177224 1167969 1131274 1084436 1091712 1089720 1077434 1061350 1030914 998459 996759 1000348 985955
3354 985955 933761 903114 920631 894022 896393 876041 846914 804989 807724 805665 796126 793829 781770
3341 781770 791117 799000 825035 787032 729465 686003 670314 710155 723675 693503 686809 651259
3329 651259 664131 650562 647422 665360 648347 659250 630506 596403 618756 581295 594620 586405
3317 586405 577588 591982 592201 571210 546605 533699 535727 548713 547721 559955 539065 537173 498150
$$ packed form
3402B278325o4169l9813k1062n0734k5074k9977o8988m5631m3096l9321k5712
3391A824748l2848k0114n2194l7916m6904n928k8177n1382k6345l766L614n3600
3379A469188o6351l7822j6877k426l9036l7264r325j8230l9139q276j795j3143
3367A179504k280r255l6695m6838P276j992j2286j6084l0436l2455j700L589j4393
3354I85955n2194l0647J7517k6609K371k0352k9127m1925K735k059r539k297j2059
3341G81770R347P883K6035l8003n7567m3462j5689L9841J3520l0172o694l5550
3329F51259J2872j3569l140J7938j7013J0903k8744l4103K2353l7461J3325q215
3317E86405q817J4394K19k0991k4605j2906K028J2986r92J2234k0890j892l9023
$$ plain form
3304 498150 486053 505903 511025 480964 467151 479539 462838 434802 444984 448854 442190 420298
3292 420298 411373 436765 426861 413972 406052 396550 395167 364420 366735 341339 346732 327652 286201
3279 286201 330779 339476 322767 284566 322557 360807 374995 381263 350425 334086 324203 290047
3267 290047 292779 291693 277234 273185 287601 275378 247879 272860 278162 258049 261854 265401 303561
3254 303561 282415 270071 288800 293933 305197 304810 270872 235500 233240 256919 268818 233277
3242 233277 231424 226638 231654 266518 259449 270642 229289 196897 228881 267175 238937 210705
3230 210705 214111 203298 215773 198762 208410 212658 236863 199829 167082 184467 168526 175100
3218 175100 170404 151807 185311 159643 175620 182017 205240 210247 180922 136674 155222 152994
$$ packed form
3304D98150j2097J9850N122l0061j3813J2388j6701k8036J0182L870o664k1892
3292D20298q925K5392r904j2889p920r502j383l0747K315k5396N393j9080m1451
3279B86201M4578Q697j6709l8201L7991L8250J4188O268l0838j6339r883l4156
3267B90047K732j086j4459m049J4416j2223k7499K4981N302k0113L805L547L8160
3254C03561k1146j2344J8729N133J1264l87l3938l5372k260K3679J1899l5541
3242B33277j853m786N016L4864p069J1193m1353l2392L1984L8294k8238k8232
3230B10705L406j0813J2475j7011R648M248K4205l7034l2747J7385j5941O574
3218A75100m696j8597L3504k5668J5977O397K3223N007k9325m4248J8548k228
$$ plain form
3206 152994 160877 152939 127627 138191 141868 145951 124496 152852 153317 140759 135105 132410 127786
3193 127786 152538 147581 150872 159457 153003 182485 171564 176661 165524 173085 166749 135022 143974
3180 143974 151759 163940 137881 136570 139768 138788 109924 114695 138423 144082 118039 121535 154721
3167 154721 155967 171831 179036 134837 133883 114231 118979 128880 162331 165347 165500 152041 151818 135249
3153 135249 138503 152745 133107 151132 165468 167185 119258 114528 135076 170576 194360 198938
3141 198938 191953 210438 191859 202966 208784 213337 212084 205482 232159 220372 210853 229445 219575
3128 219575 219740 206872 200274 202677 212275 213666 202686 225743 212093 220036 226485 205222 225461
3115 225461 236536 276401 309264 342205 355324 342791 338019 293604 289652 299526 293493 279622
$$ packed form
3206A52994P883p938k5312J0564L677M083k1455K8356M65j2558n654k695m624
3193A27786K4752m957L291Q585o454K9482j0921N097j1137P561o336l1727Q952
3180A43974P785J2181k6059j311L198r80k8864M771K3728N659k6043L496L3186
3167A54721J246J5864P205m4199r54j9652M748R901L3451L016J53j3459k23j6569
3153A35249L254J4242j9638J8025J4336J717m7927m730K0548L5500K3784M578
3141A98938o985J8485j8579J1107N818M553j253o602K6677j1787r519J8592r870
3128B19575J65j2868o598K403R598J391j0980K3057j3650P943O449k1263K0239
3115B25461J1075L9865L2863L2941J3119j2533m772m4415l952R874o033j3871
$$ plain form
3103 279622 275516 231732 190416 177334 183882 182025 181862 194504 199365 205111 184798 173515 175307
3090 175307 162001 166353 182175 192548 206094 192340 211397 228425 161184 167278 216559 201879
3078 201879 201344 206534 183799 188895 192224 172101 172208 154316 136384 160666 187086 149285 157335
3065 157335 142898 148945 153849 137416 121776 112817 124959 125110 107917 91949 87768 105533 117230
3052 117230 102982 106055 113641 101666 68480 78598 60705 53540 53187 49331 58617 44023 69837
3039 69837 48022 52941 55706 27986 67177 69808 47850 70972 55778 37050 77798 93008
3027 93008 49933 20475 21104 30636 59610 48739 69315 89834 54270 37520 31644 23851 44632
3014 44632 56708 70899 54553 25742 -1213 18824 32908 31386 45441 56686 61384 42206
$$ packed form
3103B79622m106m3784m1316j3082O548j857j63J2642M861N746k0313j1283J792
3090A75307j3306M352J5822J0373J3546j3754J9057J7028o7241O094M9281j4680
3078B01879n35N190k2735N096L329k0123J07j7892j7932K4282K6420l7801Q050
3065A57335j4437O047M904j6433j5640q959J2142J51j7193j5968m181J7765J1697
3052A17230j4248L073P586j1975l3186J0118j7893p165l53l856R286j4594K5814
3039F9837k1815M919K765k7720L9191K631k1958K3122j5194j8728M0748J5210
3027I3008m3075k9458O29R532K8974j0871K0576K0519l5564j6750n876p793K0781
3014D4632J2076J4191j6346k8811k6955K0037J4084j522J4055J1245M698j9178
$$ plain form
3002 42206 59909 74397 46407 37947 28639 36133 43837 82460 73959 50556 51032 72385 45733
2989 45733 28349 38077 36429 23291 18906 19947 23682 27881 43820 36380 5246 6708 16695 45094
2975 45094 18985 19938 9589 -20574 -3405 630 -10387 1096 21816 37725 25993 20384 28372
2962 28372 32344 19544 30287 22471 13814 26683 12087 14536 -7195 -11124 -20692 -27751 -36150
2949 -36150 -43425 -1120 14001 2541 31284 37694 21888 8795 18368 40699 49832 49519 25873
2936 25873 23598 29047 -13697 -36823 -10184 -8057 -13712 -2611 4029 13560 29431 9867 13041
2923 13041 727 9137 13488 -14883 -13986 23349 -4783 7145 -14307 -2871 -6190 16261 10336
2910 10336 15875 20384 18508 -3654 20091 20776 4879 5061 -17809 3709 6823 25698 12065
$$ packed form
3002D2206J7703J4488k7990q460r308P494P704L8623q501k3403M76K1353k6652
2989D5733j7384R728j648j3138m385J041L735M199J5939p440l1134J462R987K8399
2975D5094k6109R53j0349l0163J7169M035j1017J1483K0720J5909j1732n609P988
2962B8372L972j2800J0743p816q657J2869j4596K449k1731l929r568p059q399
2949c6150p275M2305J5121j1460K8743O410j5806j3093R573K2331R133l13k3646
2936B5873k275N449m2744k3126K6639K127n655J1101O640R531J5871j9564L174
2923A3041j2314Q410M351k8371Q97L7335k8132J1928k1452J1436l319K2451n925
2910A0336N539M509j876k2162K3745O85j5897J82k2870K1518L114J8875j3633
$$ plain form
2897 12065 11830 -19378 -42000 -19457 -13726 -22083 -19608 4607 41863 36567 27699 16858 60
2884 60 15739 16459 -5309 -5071 -16917 -1405 14164 39010 23845 5607 -15376 -26252 3096
2871 3096 -18687 -34180 -34770 -28176 -46145 -41382 -16321 -11299 -8747 4221 9952 26812 36694 13479
2857 13479 13199 1776 -19146 7646 10164 2198 20529 -42178 -28106 -18778 -8605 29294 39332
2844 39332 -3512 -4138 14065 -4740 -28501 -8450 -8665 -1523 32967 32377 22347 12533 12160 27491
2830 27491 -2179 -6117 11476 26479 8709 -10569 1600 11246 -11348 -18251 -19435 -14867 27279
2817 27279 33051 7547 5875 18288 5995 43612 16244 -14228 -16980 -25539 7563 -6441 -3696
2804 -3696 -36905 -28514 -17440 -24693 -3023 7799 -2739 21421 27614 13024 -15994 -23182 -42684
$$ packed form
2897A2065k35l1208k2622K2543N731q357K475K4215L7256n296q868j0841j6798
2884F0J5679P20k1768K38j1846J5512J5569K4846j5165j8238k0983j0876K9348
2871C096k1783j5493n90O594j7969M763K5061N022K552J2968N731J6860R882k3215
2857A3479k80j1423k0922K6792K518p966J8331o2707J4072R328J0173L7899J0038
2844C9332m2844o26J8203j8805k3761K0051k15P142L4490n90j0030r814l73J5331
2830B7491k9670l938J7593J5003j7770j9278J2169R646k2594o903j184M568M2146
2817B7279N772k5504j672J2413j2293L7617k7368l0472k752q559L3102j4004K745
2804c696l3209Q391J1074p253K1670J0822j0538K4160O193j4590k9018p188j9502
$$ plain form
2791 -42684 -74926 -44308 -13264 -13034 -29743 -30664 -31756 -40900 -14145 -22607 -58054 -55945 -47492 -45844
2777 -45844 -15013 -17210 -32287 -16307 -3618 2595 -18286 -13526 28 1324 -13181 -21164 -22907
2764 -22907 -3021 -1171 -8793 -17886 -6882 29675 11553 5001 -21139 -53055 -22082 -46152 -35239
2751 -35239 -51414 -10327 -8875 -2362 743 25065 -16602 -14409 -21891 -15538 6650 33716 29471
2738 29471 33672 4575 -2228 -8844 -21216 -27492 -33105 -13955 -25229 -41692 -17927 -30067 -28644
2725 -28644 -15123 -10538 34197 17310 -3121 -22483 -31210 -30586 4852 22881 -9697 -42223 -29240
2712 -29240 -6218 8119 -3654 -43903 -20423 -9678 -10023 -15576 -8528 -26938 -56833 -37489 -19777
2699 -19777 -3797 -14596 3099 -29370 20420 40668 32132 27678 11845 -19457 -43590 9456
$$ packed form
2791d2684l2242L0618L1044K30j6709r21j092r144K6755q462l5447K109Q453J648
2777d5844L0831k197j5077J5980J2689O213k0881M760J3554J296j4505p983j743
2764b2907J9886J850p622r093J1004L6557j8122o552k6140l1916L0973k4070J0913
2751c5239j6175M1087J452O513L105K4322m1667K193p482O353K2188K7066m245
2738B9471M201k9097o803o616j2372o276n613J9150j1274j6463K3765j2140J423
2725b8644J3521M585M4735j6887k0431j9362q727O24L5438J8029l2578l2526J2983
2712b9240K3022J4337j1773m0249K3480J0745l45n553P048j8410k9895J9344J7712
2699a9777J5980j0799J7695l2469M9790K0248q536m454j5833l1302k4133N3046
$$ plain form
2687 9456 21412 -18616 -26627 1580 -2192 -1293 6466 23223 59273 -6035 -1647 9925 37505
2674 37505 9398 -8515 -2943 2489 -21244 -19300 -16071 -11797 -9543 34139 32120 -1681 -12859
2661 -12859 -20667 -20057 -357 16463 20613 7876 11573 14327 -9941 -51144 -21217 6452 8971
2648 8971 17093 14390 18041 5615 -10820 -38512 -5773 17075 -3636 -12145 4411 18133 19619
2635 19619 29989 23582 24727 30089 35434 15491 -6959 -5357 -7951 11143 3565 617 -9205 -7157
2621 -7157 -2977 -9602 -13132 -37016 -58269 -9094 13424 20178 4480 2630 -5139 -13132 -24702
2608 -24702 -46719 -63888 -12970 20351 10663 -6784 4402 15787 15413 -38679 -30377 -27581 -29887
2595 -29887 -27033 -10460 34073 48114 1270 -9 8608 -735 -14851 -1391 16132 4169 22590
$$ packed form
2687I456J1956m0028q011K8207l772Q99P759J6757L6050o5308M388J1572K7580
2674C7505k8107j7913N572N432k3733J944L229M274K254M3682k019l3801j1178
2661a2859p808O10J9700J6820M150j2737L697K754k4268m1203K9927K7669K519
2648H971Q122k703L651j2426j6435k7692L2739K2848k0711q509J6556J3722J486
2635A9619J0370o407J145N362N345j9943k2450J602k594J9094p578k948r822K048
2621g157M180o625l530k3884k1253M9175K2518O754j5698j850p769p993j1570
2608b4702k2017j7169N0918L3321r688j7447J1186J1385l74n4092Q302K796k306
2595b9887K854J6573M4533J4041m6844j279Q617r343j4116J3460J7523j1963J8421
$$ plain form
2582 22590 13393 4215 31482 57278 89151 103314 98734 105290 111950 105421 62246 66095 59479
2569 59479 64844 55092 33425 28989 48707 33393 -12720 20185 31990 20790 16273 16698 31697
2556 31697 -7666 38852 28615 3469 -5072 -20613 -19276 -14629 -18700 -26930 -17580 -6434 -24427
2543 -24427 -22175 -8439 1905 9270 7755 36203 30719 2883 -4196 2701 19094 30605 20983
2530 20983 34496 60550 48773 28436 28264 25255 5025 -17204 -4925 10388 16700 7683 18155
2517 18155 21958 40244 -3639 -5924 8598 4084 8214 25188 8899 -28526 -19773 9139 7232
2504 7232 4003 6031 -24094 -41956 -17733 -4727 -24515 -9825 -31715 729 6796 21187 29353
2491 29353 33414 41660 18416 -1324 -4480 14530 17958 27907 28154 29682 17562 12807 -21687 -19198
$$ packed form
2582B2590r197r178K7267K5796L1873J4163m580O556O660o529m3175L849o616
2569E9479N365r752k1667m436J9718j5314m6113L2905J1805j1200m517M25J4999
2556C1697l9363M6518j0237k5146q541j5541J337M647m071q230R350J1146j7993
2543b4427K252J3736J0344P365j515K8448n484k7836p079O897J6393J1511r622
2530B0983J3513K6054j1777k0337j72l009k0230k2229J2279J5313O312r017J0472
2517A8155L803J8286m3883k285J4522m514M130J6974j6289l7425Q753K8912j907
2504G232l229K028l0125j7862K4223J3006j9788J4690k1890L2444O067J4391Q166
2491B9353M061Q246k3244j9740l156J9010L428R949K47J528j2120m755l4494K489
$$ plain form
2477 -19198 -10206 3207 8006 15285 34981 26549 32289 4426 5521 2165 13736 6846 32053
2464 32053 37953 28084 19440 8323 21655 6914 5906 -692 -3888 30476 48407 23203 9360
2451 9360 -32586 12928 42488 35438 50370 48245 36778 29468 42839 51786 52152 64582 37253
2438 37253 7653 53847 71546 50307 36597 17315 36284 47382 40734 46964 32582 25090
2426 25090 29327 44672 48505 47829 61916 70249 54516 57161 71911 72581 52737 63772 84720
2413 84720 69298 57178 88176 79303 52565 61197 74030 70468 96781 78649 64813 57171 61019
2400 61019 79798 51225 41238 75467 96519 113010 122558 90737 95472 93271 62471 58071 82267
2387 82267 100029 99244 98166 80094 117499 134316 148448 148773 131290 99282 92159 149526 123723
$$ packed form
2477a9198Q992J3413M799P279J9696q432N740k7863J095l356J1571o890K5207
2464C2053N900r869q644j1117J3332j4741j008o598l196L4364J7931k5204j3843
2451I360m1946M5514K9560p050J4932k125j1467p310J3371Q947L66J2430k7329
2438C7253k9600M6194J7699k1239j3710j9282J8969J1098o648O230j4382p492
2426B5090M237J5345L833o76J4087Q333j5733K645J4750O70j9844J1035K0948
2413H4720j5422j2120L0998q873k6738Q632J2833l562K6313j8132j3836p642L848
2400F1019J8779k8573r987L4229K1052J6491R548l1821M735k201l0800m400K4196
2387H2267J7762p85j078j8072L7405J6817J4132L25j7483l2008p123N7367k5803
$$ plain form
2374 123723 118469 146744 162521 146420 123156 149934 147330 153849 152884 168955 163676 194213 209372
2361 209372 184551 176419 206577 224279 249865 254718 241521 255611 270339 293645 304674 315865
2349 315865 345250 373762 352459 382080 395237 387799 399470 435233 475833 470423 474983 511258
2337 511258 514030 544065 588533 572644 580902 623692 680343 766494 841918 987975 1161860 1359208
2325 1359208 1445345 1550734 1694097 1842693 1963738 2144026 2353832 2697220 3156228 3892925
2315 3892925 5009249 7335907 10839788 15048902 18484550 19982488 20041254 19429005 18009733
2306 18009733 15572108 13189614 10942057 9027989 7342618 5792040 4552433 3715072
2298 3715072 3175272 2886510 2680725 2457650 2233626 2046973 1840531 1669710 1514681 1385626
$$ packed form
2374A23723n254K8275J5777j6101k3264K6778k604O519r65J6071n279L0537J5159
2361B09372k4821q132L0158J7702K5586M853j3197J4090J4728K3306J1029J1191
2349C15865K9385K8512k1303K9621J3157p438J1671L5763M0600n410M560L6275
2337E11258K772L0035M4468j5889Q258M2790N6651Q6151P5424J46057J73885J97348
2325A359208Q6137J05389J43363J48596J21045J80288K09806L43388M59008P36697
2315C892925J116324K326658L503881M209114L435648J497938N8766o12249j419272
2306A8009733k437625k382494k247557j914068j685371j550578j239607q37361
2298C715072n39800k88762k05785k23075k24024j86653k06442j70821j55029j29055
$$ plain form
2288 1385626 1296545 1175458 1052812 973035 850669 791697 796823 748585 719261 702663 664256
2277 664256 613738 594634 581439 563079 531233 489973 511913 514745 480728 462422 478443 464288
2265 464288 462713 436331 393752 381736 376469 372467 358636 347986 317359 325405 328883 280339 296188
2252 296188 291724 265175 268380 257026 252918 241550 235990 245065 257027 240843 209856 216444 214783
2239 214783 234587 243816 232749 214407 189771 198536 198815 187254 155943 156688 148232 130678 139103
2226 139103 133556 113364 77718 106622 112534 75468 94198 123161 93754 75364 78475 81611
2214 81611 80174 72317 100392 93349 89255 73042 76964 53584 81045 106975 123974 115120 97671
2201 97671 84855 65071 102974 71853 98338 86597 53137 48179 53304 48649 66233 91761
$$ packed form
2288A385626q9081j21087j22646p9777j22366n8972N126m8238k9324j6598l8407
2277F64256n0518j9104j3195j8360l1846m1260K1940K832l4017j8306J6021j4155
2265D64288j575k6382m2579j2016n267m002j3831j0650l0627Q046L478m8544J5849
2252B96188m464k6549L205j1354m108j1368n560R075J1962j6184l0987O588j661
2239B14783J9804R229j1067j8342k4636Q765K79j1561l1311P45q456j7554Q425
2226A39103n547k0192l5646K8904N912l7066J8730K8963k9407j8390L111L136
2214H1611j437p857K8075p043m094j6213L922k3380K7461K5930J6999q854j7449
2201I7671j2816j9784L7903l1121K6485j1741l3460m958N125m655J7584K5528
$$ plain form
2189 91761 87779 81665 73451 75624 85446 49465 36487 46673 54481 42619 43752 53604 56069 65646
2175 65646 52798 63467 73686 54245 17908 28418 20833 39925 42448 45290 52240 56537 32939
2162 32939 16639 36541 36944 42216 59046 42844 22416 26855 26944 -8307 1622 -3242 1709 3582
2148 3582 20378 17346 -15274 -16919 11741 57394 51324 52482 19080 18164 19651 29378 30202 30292 42634
2133 42634 21425 24631 21012 10871 -3438 103 1180 6651 19970 22589 17163 43881 8868
2120 8868 -405 21845 5545 -29664 -50325 11346 5987 -26818 4732 -4341 -20130 -1977 -535
2107 -535 3406 9424 -9649 -30852 -16674 -4380 -4085 -8628 4009 380 898 -12397 4200 32806
2093 32806 31546 3367 -16932 16595 13087 -6717 -33659 1274 8447 -2655 -9513 1903 31282
$$ packed form
2189I1761l982o114q214K173R822l5981j2978J0186P808j1862J133R852K465R577
2175F5646j2848J0669J0219j9441l6337J0510p585J9092K523K842O950M297k3598
2162C2939j6300J9902M03N272J6830j6202k0428M439Q9l5251R929m864M951J873
2148C582J6796l032l2620j645K8660M5653o070J158l3402r16J487R727Q24R0J2342
2133D2634k1209L206l619j0141j4309L541J077N471J3319K619n426K6718l5013
2120H868r273K2250j6300l5209k0661O1671n359l2805L1550r073j5789J8153J442
2107e35L941O018j9073k1203J4178J2294K95m543J2637l629N18j3295J6597K8606
2093C2806j260k8179k0299L3527l508j9804k6942L4933P173j1102o858J1416K9379
$$ plain form
2080 31282 29520 36034 48916 39509 37121 18332 -13548 -20733 -17961 -6379 -10568 -20052 -29990 10010
2066 10010 11771 -12110 12472 20198 -2124 -18951 20512 -3261 -24529 -25092 -29692 -2785 -2455
2053 -2455 7066 4071 17238 15921 16056 -18399 -18501 -11396 14500 40376 71092 90096 81043 70871
2039 70871 112949 131661 110208 75285 57216 54244 33475 12122 4421 -21366 -24916 -27340 -25966
2026 -25966 -21871 5585 -6162 -36692 -10828 21060 19396 -2350 5130 -1383 -5490 2480 2814
2013 2814 -3765 -31500 -39645 2019 1243 11632 18126 11136 -12954 -16484 -24344 -53232 -33273 -19495
1999 -19495 -29358 -21474 -26902 -3714 9026 45554 5940 -17940 -750 7576 7908 -10097 -16043
1986 -16043 -14231 -10123 -5068 -12376 -25138 -19364 16770 25630 27972 23553 -1156 11922 -4947
$$ packed form
2080C1282j762O514J2882r407k388j8789l1880p185K772J1582m189r484r938M0000
2066A0010J761k3881K4582P726k2322j6827L9463k3773k1268n63m600K6907L30
2053b455R521k995J3167j317J35l4455j02P105K5896K5876L0716J9004r053j0172
2039G0871M2078J8712k1453l4923j8069k972k0769k1353p701k5787l550k424J374
2026b5966M095K7456j1747l0530K5864L1888j664k1746P480o513m107P970L34
2013B814o579k7735q145M1664p76J0389O494o990k4090l530p860k8888J9959J3778
1999a9495r863P884n428K3188J2740L6528l9614k3880J7190Q326L32j8005n946
1986a6043J812M108N055p308j2762N774L6134Q860K342m419k4709J3078j6869
$$ plain form
1973 -4947 -11228 21693 46715 42707 8061 -12381 -37075 -10570 13110 -906 21098 -1643
1961 -1643 -6080 -18224 -27816 -28599 -29786 -33324 -10038 -29736 8030 31335 -1347 -22452 -19741
1948 -19741 -31988 -25984 -37217 -60379 -34839 -38764 -15564 26281 19451 -2840 -21873 -29346 -22421
1935 -22421 -21238 -28575 -33480 -14060 -12327 13382 10339 5514 -8725 -17204 -19500 -4508 5663
1922 5663 -229 18110 2880 -34545 -18141 -11985 -32751 -29775 -23458 -22608 -745 -7931 24320
1909 24320 18066 -2722 -27073 -20972 2449 2681 -6573 -28210 -20501 -17143 -38132 -17216 -19216
1896 -19216 -37027 -20085 -9473 -31524 -25645 -21028 -15857 2815 9659 19491 -10037 8393 -8349
1883 -8349 -1052 -22834 -20865 -19888 31519 23375 -20901 -5640 -14416 -29305 -48433 -30829 -28476
$$ packed form
1973d947o281L2921K5022m008l4646k0442k4694K6505K3680j4016K2004k2741
1961a643m437j2144r592p83j187l538K3286j9698L7766K3305l2682k1105K711
1948a9741j2247O004j1233k3162K5540l925K3200M1845o830k2291j9033p473O925
1935b2421J183p337m905J9420J733K5709l043m825j4239q479k296J4992J0171
1922E663n892J8339j5230l7425J6404O156k0766K976O317Q50K1863p186L2251
1909B4320o254k0788k4351O101K3421K32r254k1637P709L358k0989K0916k000
1896a9216j7811J6942J0612k2051N879M617N171J8672O844R832k9528J8430j6742
1883h349P297k1782J969R77N1407q144m4276J5261q776j4889j9128J7604K353
$$ plain form
1870 -28476 -35962 -21251 -24295 -36883 -29941 -17093 -16795 9614 12807 10032 -9563 -26361 -10392
1857 -10392 -26985 -31536 -37858 -14081 -58407 -46654 -30568 5992 9367 -34740 -20896 -26161 -34715
1844 -34715 -33477 -24977 -12772 1886 7785 -22369 -4139 -1158 -18801 -47016 -23880 4543 -25891
1831 -25891 -52730 -50282 -34901 -3081 10327 -13478 -2741 -3607 -7261 1597 33356 7882 16460
1818 16460 -7484 -45060 -7660 -29760 -25766 -16903 -46126 -2065 15962 12498 -23339 -3806
1806 -3806 -38525 -59090 -48250 -13054 -3521 10050 -10921 -44779 -24684 -1617 -2489 -23410 -33
1793 -33 9471 -20267 -26847 -49025 -41236 -12352 18904 38750 18894 -23565 -32764 -49476 -47738
1780 -47738 -17048 -22942 2543 2095 -12529 -38697 -26517 -27289 -26622 -8131 -9238 -38518 -62287
$$ packed form
1870b8476p486J4711l044j2588O942J2848K98K6409L193k775j9595j6798J5969
1857a0392j6593m551o322K3777m4326J1753J6086L6560L375m4107J3844n265q554
1844c4715J238Q500J2205J4658N899l0154J8230K981j7643k8215K3136K8423l0434
1831b5891k6839K448J5381L1820J3408k3805J0737q66l654Q858L1759k5474Q578
1818A6460k3944l7576L7400k2100L994Q863k9223M4061J8027l464l5837J9533
1806c806l4719k0565J0840L5196R533J3571k0971l3858K0095K3067q72k0921K3377
1793c3R504k9738o580k2178P789K8884L1256J9846j9856m2459r199j6712J738
1780d7738L0690n894K5485m48j4624k6168J2180p72O67J8491j107k9280k3769
$$ plain form
1767 -62287 -24345 -1264 -4139 -3737 -13981 -29311 -19700 16269 9831 18532 -27625 -51440 -19413
1754 -19413 -42066 -20597 -17506 -33096 -25319 -39846 -21983 -17552 -4588 -26263 -18040 30333 36364
1741 36364 12029 16635 -16494 3483 13838 19047 -2451 -32422 -42220 -22794 1888 -24562
1729 -24562 -31490 -2469 -30695 -11298 -3473 -3249 16610 -8434 -13171 -24995 53 -1481 7419
1716 7419 769 -1008 36481 27546 10295 11936 12002 32285 33676 21854 1054 -9929 3566 -2637
1702 -2637 -16063 -15620 5282 24251 7845 -13020 -24180 -37257 -35639 -50570 -50379 -12214 9580
1689 9580 165 -8644 -1255 -12040 -19162 -28320 -52202 -44532 -12592 -9291 36211 10678 -41357
1676 -41357 -53576 -36017 -14553 -5215 20395 24051 1235 -14966 -29271 -18084 -888 -20620
$$ packed form
1767f2287L7942K3081k875M02j0244j5330R611L5969o438Q701m6157k3815L2027
1754a9413k2653K1469L091j5590P777j4527J7863M431J2964k1675Q223M8373O031
1741C6364k4335M606l3129J9977J0355N209k1498k9971r798J9426K4682k6450
1729b4562o928K9021k8226J9397P825K24J9859k5044m737j1824K5048j534Q900
1716G419o650j777L7489q935j7251J641O6K0283J391j1822k0800j0983J3495o203
1702b637j3426M43K0902J8969j6406k0865j1160j3077J618j4931J91L8165K1794
1689I580r415q809P389j0785p122r158k3882P670L1940L301M5502k5533n2035
1676d1357j2219J7559K1464R338K5610L656k2816j6201j4305J1187J7196j9732
$$ plain form
1664 -20620 -50650 -32801 -24550 -16596 -25691 -23825 -29518 -20455 -29515 -22997 -3321 -20014 -21854 -43916
1650 -43916 -18445 -36241 -13509 11624 33643 -2562 7913 14750 -36855 -22907 -53780 -31356
1638 -31356 -3387 8065 -3204 -23278 -17323 -3224 13541 26126 30941 17235 -12107 -1679
1626 -1679 16639 -25823 -7817 -17381 -21845 -1854 -12333 1380 -4683 14344 19879 15445 17563
1613 17563 35323 -5102 -27632 -22473 -2480 -8498 -10947 7502 2227 15958 19728 35985 10424
1600 10424 2633 -32195 -40136 10326 416 -13290 -27962 8103 3567 -8100 -32110 -22098 -1577
1587 -1577 11652 13271 12885 -20124 -19859 -1940 -16505 -9542 -38263 -2480 23230 8869 -5998
1574 -5998 -43026 -61729 -3693 1527 -12527 8681 25288 23173 17472 -4514 -48884 -63115 -44503
$$ packed form
1664b0620l0030J7849Q251P954r095J866n693R063r060O518J9676j6693j840k2062
1650d3916K5471j7796K2732K5133K2019l6205J0475O837n1605J3948l0873K2424
1638c1356K7969J1452j1269k0074N955J4099J6765J2585M815j3706k9342J0428
1626a679J8318m2462J8006r564m464J9991j0479J3713o063J9027N535m434K118
1613A7563J7760m0425k2530N159J9993o018k449J8449n275J3731L770J6257k5561
1600A0424p791l4828p941N0462r910j3706j4672L6065m536j1667k4010J0012K0521
1587a577J3229J619l86l3009K65J7919j4565O963k8721L5783K5710j4361j4867
1574e998l7028j8703N8036N220j4054K1208J6607k115n701k1986m4370j4231J8612
$$ plain form
1561 -44503 -46767 -11553 -1967 4823 -8362 -29185 -19009 -23313 -27591 9294 2077 6930 6570 3602
1547 3602 6113 2115 -8942 -14676 14565 4569 -8615 -23922 -2513 16524 28241 11306 -17725
1534 -17725 -30373 -27022 -3640 2684 -6527 3855 15670 -17803 -28307 -29642 -29937 -20782 9456
1521 9456 6074 -17193 -18680 -14342 -37067 -1533 -6722 -8491 7323 -9054 -16697 4112 7467
1508 7467 4665 -27715 -22274 -12388 -11900 -13221 1574 7010 -43058 -26989 -10374 -1494 10335 2027
1494 2027 -13658 -1684 -19080 -17618 -23956 276 11773 -23113 -27565 -9672 -13089 3355 1217
1481 1217 26411 4172 17792 20810 -7978 -20665 -43531 -7177 38217 -1139 -6421 -12193 -43959
1468 -43959 -14860 11771 -23186 -23467 14679 9604 2026 -14858 -24808 -23780 3973 18831 9939
$$ packed form
1561d4503k264L5214R586O790j3185k0823J0176m304m278L6885p217M853l60k968
1547C602K511l998j1057n734K9241r996j3184j5307K1409J9037J1717j6935k9031
1534a7725j2648L351K3382O324r211J0382J1815l3473j0504j335k95R155L0238
1521I456l382k3267j487M338k2725L5534n189j769J5814j6377p643K0809L355
1508G467k802l2380N441R886M88j321J4795N436n0068J6069J6615Q880J1829q308
1494B027j5685J1974j7396J462o338K4232J1497l4886m452J7893l417J6444k138
1481A217K5194k2239J3620L018k8788j2687k2866L6354M5394l9356n282n772l1766
1468d3959K9099K6631l4957k81L8146n075p578j6884r950J028K7753J4858q892
$$ plain form
1455 9939 93 -2662 12897 1635 -26325 -40145 -20630 -11236 -3703 -8844 -22219 -41458 -29958
1442 -29958 12397 -18019 -33372 -8259 -4485 -2673 -10729 11720 -19090 -12565 -3999 -15870 -3005
1429 -3005 -1806 1532 11248 20353 183 3183 -5576 -20097 12016 11459 3996 15013 -14908 -3058
1415 -3058 168 -22571 -32205 -29624 -1475 24493 14263 33431 11123 -12199 12580 -289 483
1402 483 -1348 -6668 -218 -8501 37377 5684 -17344 -16955 21118 -19769 -47599 -20905 -20438 30029
1388 30029 15193 26238 22822 -969 9731 23782 28928 -7210 -30432 -17845 -8350 -39808
1376 -39808 -41134 -17533 -21891 -518 11568 5239 31630 37777 28957 29292 23504 -10884 -35784
1363 -35784 -31500 -18007 11958 12315 12202 8052 -31129 -43652 -12643 4638 12782 1502 17870
$$ packed form
1455I939r846k755J5559j1262k7960j3820J9515R394P533n141j3375j9239J1500
1442b9958M2355l0416j5353K5113L774J812q056K2449l0810O525Q566j1871J2865
1429c005J199L338R716R105k0170L000q759j4521L2113n57p463J1017k9921J1850
1415c058L226k2739r634K581K8149K5968j0230J9168k2308k3322K4779j2869P72
1402D83j831n320O450q283M5878l1693k3028L89L8073m0887k7830K6694M67N0467
1388C0029j4836J1045l416k3791J0700J4051N146l6138k3222J2587R495l1458
1376c9808j326K3601m358K1373J2086o329K6391O147q820L35n788l4388k4900
1363c5784M284J3493K9965L57j13m150l9181j2523L1009J7281Q144j1280J6368
$$ plain form
1350 17870 16132 17378 9853 -1100 -8527 14096 -4668 13763 25826 26394 30406 -3698 28028
1337 28028 36581 61690 21410 6306 17117 45573 49721 50325 21425 13089 4876 -12602 -2572
1324 -2572 -7596 20370 -2119 -14642 -17781 -35335 -13963 -13274 -8788 -37524 -87483 -55690 -18527
1311 -18527 -29544 -47086 -22564 -52521 -57254 -19141 -22822 21111 18744 -15117 -40467 -41852 -56081
1298 -56081 -51985 -14982 -9861 -23602 -23188 -34835 -35770 -38984 -38579 -31194 -49568 -35533 -27716 832
1284 832 -16751 -39660 -27113 6549 -10475 -23307 16386 3997 -530 15671 -6096 11486
1272 11486 11248 18942 5684 -3944 9517 -1550 -28140 -15280 -32320 -30345 98 -14090 -26733
1259 -26733 -41028 -42960 -37083 -42975 -21183 -5258 3772 15575 6021 -19266 -23003 -4981 -20187
$$ packed form
1350A7870j738J246p525j0953p427K2623j8764J8431J2063N68M012l4104L1726
1337B8028Q553K5109m0280j5104J0811K8456M148O04k8900q336q213j7478J0030
1324b572n024K7966k2489j2523l139j7554K1372O89M486k8736m9959L1793L7163
1311a8527j1017j7542K4522k9957m733L8113l681M3933k367l3861k5350j385j4229
1298e6081M096L7003N121j3741M14j1647r35l214M05P385j8374J4035P817K8548
1284H32j7583k2909J2547L3662j7024j2832L9693j2389m527J6201k1767J7582
1272A1486k38P694j3258r628J3461j1067k6590J2860j7040J975L0443j4188j2643
1259b6733j4295j932N877n892K1792J5925R030J1803r554k5287l737J8022j5206
$$ plain form
1246 -20187 -4962 -16083 -16358 17003 -6240 -18526 -14458 -6900 27633 -1851 -29782 -43959 -48854
1233 -48854 -23610 -13816 25346 18324 -9948 9931 12515 -862 12332 6771 -15887 -13137 -26526
1220 -26526 -6154 -6622 17685 -4082 -15166 -8891 -22001 -27211 -20819 -1563 -2383 13804 6630
1207 6630 3850 -14898 -19055 3491 900 -2111 -35873 -54433 -42222 -56990 -19906 -22420 -16330
1194 -16330 -22359 -50367 -32683 -28647 -35317 -6174 -24043 -9695 1586 32387 13801 3452
1182 3452 -22473 -6724 31029 3932 -8765 -17942 -18206 -7848 20527 18990 25320 18797 33578
1169 33578 9042 20428 25739 44780 47875 25195 3377 -5141 213 -2777 -12634 24348 35572
1156 35572 39843 59399 29556 -1127 18679 33214 13503 -1814 12278 5244 -10390 -29194
$$ packed form
1246b0187J5225j1121k75L3361k3243j2286M068P558L4533k9484k7931j4177m895
1233d8854K5244R794L9162p022k8272J9879K584j3377J3194n561k2658K750j3389
1220b6526K0372m68K4307k1767j1084O275j3110n210O392J9256q20J6187p174
1207F630k780j8748m157K2546k591l011l3762j8560J2211j4768L7084k514O090
1194a6330o029k8008J7684M036o670K9143j7869J4348J1281L0801j8586j0349
1182C452k5925J5749L7753k7097j2697r177k64J0358K8375j537O330o523J4781
1169C3578k4536J1386N311J9041L095k2680k1818q518N354k990r857L6982J1224
1156C5572M271J9556k9843l0683J9806J4535j9711j5317J4092p034j5634j8804
$$ plain form
1144 -29194 -24861 -18313 -18821 3745 31384 17051 1554 -33577 -53059 -29598 -25248 -14975 -8660
1131 -8660 5771 -10157 -10182 -19504 5287 23634 4014 20519 2636 -7113 -14620 -6329 9983
1118 9983 -15971 -27187 2870 1070 40188 16441 4848 -4526 -12906 -23075 -41273 -28831 -3997
1105 -3997 3567 -8 -5828 -6165 21393 -1713 -18048 -78 797 -4163 390 -4292 2271 -6286
1091 -6286 23078 10369 5087 6149 14203 -7924 -32903 -34881 -12196 15672 5364 6295 -2941
1078 -2941 2732 -3565 -20298 14311 20381 19494 -1187 32009 34803 368 16898 8661 -3496
1065 -3496 -9081 -14360 -2959 -17792 1249 -29564 -22701 -4137 -12807 3442 18504 -12549 -23246
1052 -23246 -39447 -11402 10307 -8413 21514 5053 -16846 -28698 -15416 -4688 12779 -12760
$$ packed form
1144b9194M333O548n08K2566K7639j4333j5497l5131j9482K3461M350J0273O315
1131h660J4431j5928k5r322K4791J8347j9620J6505j7883r749p507Q291J6312
1118I983k5954j1216L0057j800L9118k3747j1593r374q380j0169j8198J2442K4834
1105c997P564l575n820l37K7558k3106j6335J7970Q75m960M553m682O563q557
1091f286K9364j2709n282J062Q054k2127k4979j978K2685K7868j0308R31r236
1078b941N673o297j6733L4609O070q87k0681L3196K794l4435J6530q237j2157
1065c496n585n279J1401j4833J9041l0813O863J8564q670J6249J5062l1053j0697
1052b3246j6201K8045K1709j8720K9927j6461k1899j1852J3282J0728J7467k5539
$$ plain form
1040 -12760 -17411 -34069 640 22721 11454 4671 -14877 -12649 -32205 -20934 -7785 -6760 -12208
1027 -12208 -6491 -4515 -12064 -36984 -8663 5284 -22862 -2910 -14068 -3053 -12164 -4854 9076
1014 9076 8179 18392 22609 21636 10850 19782 -11838 -10347 -664 992 1137 4161 18570 44766
1000 44766 34775 43770 215 -13357 -8394 -32779 -35998 -41862 2815 -4521 -13529 -11201 -6055 2906
986 2906 5167 -26362 -53459 -16305 -3807 -9252 -38537 -40571 -20732 1154 -3266 2269 24444
973 24444 24250 47355 9560 6769 -8567 -4518 15869 19166 2747 -5163 -54277 -35197 -20722
960 -20722 -25652 -21225 -9316 -14210 16216 23639 40564 18682 3179 18299 9454 -7464 8812
947 8812 -379 -11534 -12388 6510 27594 -5837 -28730 5207 18838 1184 5869 14718 14877 -9018
$$ packed form
1040a2760m651j6658L4709K2081j1267o783j9548K228j9556J1271J3149J025n448
1027a2208N717J976p549k4920K8321J3947k8146J9952j1158J1015r111P310J3930
1014I076q97J0213M217r73j0786Q932l1620J491R683J656J45L024J4409K6196
1000D4766r991Q995m3555j3572M963k4385l219n864M4677p336r008K328N146Q961
986B906K261l1529k7097L7154J2498n445k9285k034J9839K1886m420N535K2175
973B4444j94K3105l7795k791j5336M049K0387L297j6419p910m9114J9080J4475
960b0722m930M427J1909m894L0426P423J6925k1882j5503J5120q845j6918J6276
947H812r191j1155q54J8898K1084l3431k2893L3937J3631j7654M685Q849J59k3895
$$ plain form
933 -9018 5073 1431 24368 8098 13739 14247 46030 48974 19178 -3617 -11228 -16189 6183 12511
919 12511 17036 -9297 -13284 -4446 -15319 -7530 4347 -5506 -11027 11991 23322 18779 17592 3697
905 3697 270 3982 10836 25014 12072 14007 25081 26865 -528 -5620 44487 30016 34466 20737
891 20737 20555 19431 4389 12845 3224 19133 26039 -9118 -16089 -7954 28630 35324 22111 16101
877 16101 40894 41771 28397 21426 7443 6225 3125 22364 12644 35940 16866 1270 16337
864 16337 10634 18383 37948 -1914 -20818 -26733 -541 6679 30437 -5225 -22549 -33935 -17782
851 -17782 -18068 -16977 -29570 3710 -17717 -49852 -5898 -943 26001 4026 21370 -26708 -824
838 -824 -10937 -20531 -17153 -18715 14004 22226 2012 24696 57029 34299 42507 13882 -4108
$$ packed form
933i018J4091l642K2937j6270N641N08L1783K944k9796k2795p611m961K2372O328
919A2511M525k6333l987Q838j0873P789J1877r853n521K3018J1331m543j187j3895
905C697l427L712O854J4178j2942J935J1074J784k7393n092N0107j4471M450j3729
891B0737j82j124j5042Q456r621J5909O906l5157o971Q135L6584O694j3213o010
877A6101K4793Q77j3374o971j3983j218l100J9239r720K3296j9074j5596J5067
864A6337n703P749J9565l9862j8904n915K6192P220K3758l5662j7324j1386J6153
851a7782k86J091j2593L3280k1427l2135M3954M955K6944k1975J7344m8078K5884
838h24j0113r594L378j562L2719Q222k0214K2684L2333k2730Q208k8625j7990
$$ plain form
825 -4108 21768 31592 21650 -9136 -18640 19452 28555 16945 11155 12253 34962 32814 38670 35666
811 35666 6761 5780 9897 -2967 -12618 -20666 -24223 -2886 8424 1836 -16083 -1802 -8615 -7604
797 -7604 -6401 -9354 2488 4840 -1962 -3548 8846 -778 12350 10409 -9008 -8606 -8446 2055
783 2055 6865 -17699 -7103 -16657 -5569 -9346 9185 27567 -11385 -27124 -59472 -79707 -63713
770 -63713 -44520 -22510 -19221 -32752 -8167 -14004 -21065 -20002 -31586 -22843 -19175 -25574 -15919 -4748
756 -4748 801 -335 -32746 -37139 -27350 -1867 18283 -4292 -1390 20559 17754 14932 35882 40355
742 40355 30884 3775 6626 56409 24179 11312 30857 12348 6451 -6909 17847 9930 -5867
729 -5867 -18331 -538 -3617 -18090 -1494 6618 -10996 -9878 -13574 -34547 -25697 -4983 6893
$$ packed form
825d108K5876R824r942l0786r504L8092R103j1610n790J098K2709k148N856l004
811C5666k8905r81M117j2864r651q048l557K1337J1310o588j7919J4281o813J011
797g604J203k953J1842K352o802j586J2394r624J3128j941j9417M02J60J0501
783B055M810k4564J0596r554J1088l777J8531J8382l8952j5739l2348k0235J5994
770f3713J9193K2010L289j3531K4585n837p061J063j1584Q743L668o399R655J1171
756d748N549j136l2411m393R789K5483K0150k2575K902K1949k805k822K0950M473
742D0355r471k7109K851M9783l2230j2867J9545j8509n897j3360K4756p917j5797
729e867j2464J7793l079j4473J6596Q112j7614J118l696k0973Q850K0714J1876
$$ plain form
716 6893 -23197 -3420 16539 -4914 -22464 16894 11879 142 20382 21286 -7594 -1644 -1851
703 -1851 -21664 19896 29230 -19118 -11469 -14643 -31005 -19519 -17457 -2297 5294 17023 24384
690 24384 39030 36524 11032 -29049 -14308 -30686 -12405 -8310 -9016 4938 18873 -6339 39639
677 39639 45888 -589 16046 28773 28454 15461 22787 35302 31635 49960 48318 56241 47972 25726
663 25726 30509 17667 39861 11551 39124 44489 40996 11791 -9434 -6358 -5607 -25929 -22907
650 -22907 -3272 7205 -13529 7465 21958 -5563 17166 14742 -1812 9864 -11796 -10857 -7412
637 -7412 14696 19585 12657 14505 343 11344 10120 30722 5178 10582 20538 27850 14230 27003
623 27003 21336 -4511 -24212 -12746 7966 30094 14182 15846 24030 11581 1931 -10801 4265
$$ packed form
716F893l0090J9777J9959k1453j7550L9358n015j1737K0240R04k8880N950k07
703a851j9813M1560R334m8348P649l174j6362J1486K062J5160P591J1729P361
690B4384J4646k506k5492m0081J4741j6378J8281M095p06J3954J3935k5212M5978
677C9639O249m6477J6635J2727l19j2993P326J2515l667J8325j642P923q269k2246
663B5726M783j2842K2194k8310K7573N365l493k9205k1225L076P51k0322L022
650b2907J9635J0477k0734K0994J4493k7521K2729k424j6554J1676k1660R39L445
637g412K2108M889o928J848j4162J1001j224K0602k5544N404R956P312j3620J2773
623B7003n667k5847j9701J1466K0712K2128j5912J664Q184j2449r650j2732J5066
$$ plain form
610 4265 741 17831 -312 -8069 -4842 36624 40069 38922 648 -18044 -1156 6336 1085 -13807
596 -13807 -15272 2156 339 38235 35860 39555 20880 40615 64555 50243 31093 5785 -8160
583 -8160 -10448 44265 93859 76404 52866 35730 -1855 13161 11105 36017 41903 30426 2779
570 2779 16030 5670 -15134 -22922 -4293 18183 12881 -20207 4811 -1176 -6616 40990 28148
557 28148 32650 27705 22871 48815 16356 -13265 -11511 21162 -8624 584 -26967 -36972 -33213
544 -33213 -1264 8615 9544 32777 -10840 5092 25544 8757 -5961 -21423 -25028 -14655 -37547
531 -37547 -28722 -8300 10891 24918 36662 36943 36005 19135 -2544 -3785 -6662 -8621 -1194 -7526
517 -7526 12521 21563 27719 35942 34549 15386 13127 6128 -429 -5830 -23762 -34677 -13935 -21966
$$ packed form
610D265l524J7090j8143p757L227M1466L445j147l8274j8692J6888P492n251j4892
596a3807j465J7428j817L7896k375L695j8675J9735K3940j4312j9150k5308j3945
583h160k288N4713M9594j7455k3538j7136l7585J5016k056K4912N886j1477k7647
570B779J3251j0360k0804p788J8629K2476n302l3088K5018n987n440M7606j2842
557B8148M502m945m834K5944l2459k9621J754L2673k9786R208k7551j0005L759
544c3213L1949R879R29K3233m3617J5932K0452j6787j4718j5462l605J0373k2892
531c7547Q825K0422J9191J4027J1744K81r38j6870k1679j241k877j959P427o332
517g526K0047R042O156Q223j393j9163k259o999o557n401j7932j0915K0742q031
$$ plain form
503 -21966 -21694 16999 10270 15030 32529 5100 1944 16799 4517 -17511 -15451 -7176 -28188
490 -28188 -31903 -36616 -18621 -5828 -24798 36 -1257 19372 17609 -829 17556 49124 20875
477 20875 -3504 3442 -7071 7671 27629 -788 10694 19769 19016 13930 5359 9777 -3535
464 -3535 -12438 -27046 -6636 -4496 13391 51081 46459 28766 24502 27629 50966 6671 193
451 193 15884 25202 23511 28446 42336 26336 28181 35879 12338 30833 21221 7950 32726 37353
437 37353 2230 8371 33376 13441 1761 44395 46888 15619 7724 -9886 490 5284 13477
424 13477 30091 32397 26617 15916 2514 30327 12942 14067 19702 9168 -15009 -2087 21987
411 21987 23099 2705 -4813 48378 50393 6686 16841 39056 48913 43057 17686 44366 64638
$$ packed form
503b1966K72L8693o729M760J7499k7429l156J4855j2282k2028K060Q275k1012
490b8188l715m713J7995J2793j8970K4834j293K0629j763j8438J8385L1568k8249
477B0875k4379O946j0513J4742J9958k8417J1482R075p53n086q571M418j3312
464c535q903j4608K0410K140J7887L7690m622j7693m264L127K3337m4295o478
451A93J5691R318j691M935J3890j6000J845P698k3541J8495r612j3271K4776M627
437C7353l5123O141K5005j9935j1680M2634K493l1269p895j7610J0376M794Q193
424A3477J6614K306n780j0701j3402K7813j7385J125N635j0534k4177J2922K4074
411B1987J112k0394p518N3191K015m3707J0155K2215R857n856k5371K6680K0272
$$ plain form
398 64638 68543 70568 79151 37959 18202 37101 33715 18941 47933 38942 29064 58207 32789
385 32789 12689 26542 24212 26109 25908 29736 20306 46349 44098 27736 49312 57568 58966 29472
371 29472 34798 31094 15467 14333 39378 44167 18525 33860 32088 34435 10738 7519 27399
358 27399 39007 62904 52854 56496 54342 50651 50762 64407 51446 42283 46056 60490 28965
345 28965 31574 38705 36741 21475 7647 18181 63966 64262 32722 39143 42174 1152 -376 18751
331 18751 3415 38987 51720 39337 19057 38037 60355 55385 71535 47816 40822 48423 25785
318 25785 37313 27479 19686 48108 42035 38278 51108 38627 38497 10441 10538 13166 41247 42866
304 42866 35861 35603 66058 93601 66137 52162 23329 14095 -10833 -7506 19787 51237 65477
$$ packed form
398F4638L905K025Q583m1192j9757J8899l386j4774K8992q991r878K9143k5418
385C2789k0100J3853k330J897k01L828r430K6043k251j6362K1576Q256J398k9494
371B9472N326l704j5627j134K5045M789k5642J5335j772K347k3697l219J9880
358B7399J1608K3897j0050L642k154l691J11J3645j2961r163L773J4434l1525
345B8965K609P131j964j5266j3828J0534M5785K96l1540O421L031m1022j528J9127
331A8751j5336L5572J2733j2383k0280J8980K2318m970J6150k3719o994P601k2638
318B5785J1528r834p793K8422o073l757J2830j2481j30k8056R7K628K8081J619
304D2866p005k58L0455K7543k7464j3975k8833r234k4928L327K7293L1450J4240
$$ plain form
291 65477 76230 80225 50496 39322 42533 30965 27332 52608 59586 4534 2492 5251 16245
278 16245 18691 36622 52647 32329 28551 38953 38003 20692 41387 48947 56162 46383 50965 69653
264 69653 48600 8690 18575 51020 63881 80339 84184 89274 67897 47062 55899 68115 45551
251 45551 33336 45530 47770 76655 73847 92281 55161 39230 24123 26002 32613 35348 31694
238 31694 32505 48278 60398 25891 9722 46188 36875 45167 43798 34846 39955 46293 27985 30752
224 30752 23484 36194 60592 77314 39974 26499 28587 52102 51023 44506 37291 30000 45266
211 45266 45168 29121 8217 27074 28292 62264 24612 41441 32039 44184 59620 35877 7991
198 7991 28774 43118 92548 68529 34287 43331 40010 52428 42746 49133 72663 65128 33506
$$ packed form
291F5477J0753L995k9729j1174L211j1568l633K5276O978n5052k042K759J0994
278A6245K446J7931J6025k0318l778J0402r50j7311K0695P560P215r779M582J8688
264F9653k1053l9910R885L2445J2861J6458L845N090k1377k0835Q837J2216k2564
251D5551j2215J2194K240K8885k808J8434l7120j5931j5107J879O611K735l654
238C1694Q11J5773J2120l4507j6169L6466r313Q292j369q952N109O338j8308K767
224C0752p268J2710K4398J6722l7340j3475K088K3515j079o517p215p291J5266
211D5266r8j6047k0904J8857J218L3972l7652J6829r402J2145J5436k3743k7886
198G991K0783J4344M9430k4019l4242R044l321J2418r682O387K3530p535l1622
$$ plain form
185 33506 28346 30709 38025 6602 63668 81798 72137 66759 45848 59684 65468 39629 48315
172 48315 45914 19886 25712 23919 23377 77502 78724 65089 34685 51905 51025 61161 65524 70118
158 70118 21445 -3851 -1826 27259 37094 24160 38711 33575 23354 28180 36609 48476 30787
$$ packed form
185C3506n160K363P316l1423N7066J8130r661n378k0911J3836N784k5839Q686
172D8315k401k6028N826j793n42N4125J222j3635l0404J7220q80J0136M363M594
158G0118m8673k5296K025K9085R835j2934J4551n136j0221M826Q429J1867j7689
$$ [...]
##END NTUPLES=NMR SPECTRUM
##END=
