##TITLE=1H_EC-3384(5)-5`
 200.13Hz, CDCl3.
 8 sc
 18.8.2026
##JCAMPDX= 6.0         $$ Bruker NMR JCAMP-DX V2.0
##DATA TYPE= NMR SPECTRUM
##DATA CLASS= NTUPLES
##ORIGIN= UXNMR, Bruker Analytische Messtechnik GmbH
##OWNER= pz
$$ XWIN-NMR		Version 3.5
$$ Tue Aug 18 13:15:27 2026 Russian Standard Time (UT+4h)  she@DPX200
##.OBSERVE FREQUENCY= 200.1313
##.OBSERVE NUCLEUS= ^1H
##.ACQUISITION MODE= SIMULTANEOUS
##.ACQUISITION SCHEME= undefined
##.AVERAGES= 8
##.DIGITISER RES= 18
##SPECTROMETER/DATA SYSTEM= spect
##.PULSE SEQUENCE= zg30
##.SOLVENT NAME= CDCl3
##.SHIFT REFERENCE= (INTERNAL, CDCl3, 0, 15.5904)
##AUDIT TRAIL= $$ (NUMBER, WHEN, WHO, WHERE, WHAT)
$$ ##TITLE= Audit trail, XWIN-NMR		Version 3.5
$$ ##JCAMPDX= 5.01
$$ ##ORIGIN= Bruker BioSpin GmbH
$$ ##OWNER= she
$$ F:/spectra/data/she/nmr/H-C/1/pdata/1/auditp.txt
$$ ##AUDIT TRAIL=  $$ (NUMBER, WHEN, WHO, WHERE, WHAT)
(   1,<2026-08-18 13:14:09.37 +0400>,<she>,<DPX200>,
      <created by zg, POWCHK disabled, PULCHK disabled
       configuration hash MD5:
       00 E9 B6 7A A2 85 ED C7 34 08 36 98 17 FE 4E 26
       data hash MD5: 16K
       01 F1 B5 9E F9 FA BE DD 76 BB 33 6B BC 1C F0 30>)
(   2,<2026-08-18 13:14:11.73 +0400>,<she>,<DPX200>,
      <Start of raw data processing
       efp BC_mod = 2 LB = 0.25 FT_mod = 6 PKNL = 1 PHC0 = -4491.741 PHC1 = 11.5923 SI = 16K 
       data hash MD5: 16K
       5F EA 87 54 C3 EA C4 84 A4 07 BC A6 88 9B CA A2>)
(   3,<2026-08-18 13:14:30.84 +0400>,<she>,<DPX200>,
      <pk PHC0 = 1.94685 PHC1 = -3.2 
       data hash MD5: 16K
       A1 12 30 EB 27 0D 48 B6 A2 51 92 BD 85 B0 0E 54>)
(   4,<2026-08-18 13:14:35.25 +0400>,<she>,<DPX200>,
      <abs ABSG = 5 
       data hash MD5: 16K
       73 41 16 FD E1 A8 1D 73 70 B8 AF C3 E8 DD 5E 9E>)
$$ ##END=
$$ 
$$ hash MD5
$$ 7E A4 33 EA 3E E5 43 A7 A4 1B 2A D1 EA 33 3C 33
##$RELAX= 
##$RELAX= 
##$RELAX= 
##$RELAX= 
##$RELAX= 
##$RELAX= 
$$ Bruker specific parameters
$$ --------------------------
##$DU= <F:/spectra>
##$EXPNO= 1
##$NAME= <H-C>
##$PROCNO= 1
##$TYPE= <nmr>
##$USER= <she>
##$AMP= (0..31)
100 100 100 100 100 100 100 100 100 100 100 100 100 100 100 100 100 100 
100 100 100 100 100 100 100 100 100 100 100 100 100 100 
##$AQSEQ= 0
##$AQ_mod= 1
##$AUNM= <au_zg>
##$AUTOPOS= <>
##$BF1= 200.13
##$BF2= 200.13
##$BF3= 200.13
##$BF4= 200.13
##$BF5= 200.13
##$BF6= 200.13
##$BF7= 200.13
##$BF8= 200.13
##$BYTORDA= 1
##$CFDGTYP= 0
##$CFRGTYP= 5
##$CHEMSTR= <none>
##$CNST= (0..31)
1 1 145 1 1 1 1 1 1 1 1 1 1 1 1 1 1 1 1 1 1 1 1 1 1 1 1 1 1 1 1 1 
##$CPDPRG= <>
##$CPDPRG1= <>
##$CPDPRG2= <>
##$CPDPRG3= <>
##$CPDPRG4= <mlev>
##$CPDPRG5= <mlev>
##$CPDPRG6= <mlev>
##$CPDPRG7= <mlev>
##$CPDPRG8= <mlev>
##$CPDPRGB= <>
##$CPDPRGT= <>
##$D= (0..31)
0 0.7 0 0 0 0 0 0 0 0 0 0.03 0 0 0 0 0 0 0 0 0 0 0 0 0 0 0 0 0 0 0 0 
##$DATE= 1787044448
##$DBL= (0..7)
120 120 120 120 120 120 120 120 
##$DBP= (0..7)
150 150 150 150 150 150 150 150 
##$DBP07= 0
##$DBPNAM0= <>
##$DBPNAM1= <>
##$DBPNAM2= <>
##$DBPNAM3= <>
##$DBPNAM4= <>
$$ [...]
##$SUBNAM3= <"">
##$SUBNAM4= <"">
##$SUBNAM5= <"">
##$SUBNAM6= <"">
##$SUBNAM7= <"">
##$SUBNAM8= <"">
##$SUBNAM9= <"">
##$SW= 18.0517328524113
##$SWIBOX= (0..15)
0 0 2 0 0 0 0 0 0 0 0 0 0 0 0 0 
##$SW_h= 3612.71676300578
##$TD= 16384
##$TD0= 1
##$TE= 0
##$TE2= 300
##$TE3= 300
##$TEG= 300
##$TL= (0..7)
0 120 120 120 120 120 120 120 
##$TP= (0..7)
150 150 150 150 150 150 150 150 
##$TP07= 0
##$TPNAME0= <>
##$TPNAME1= <>
##$TPNAME2= <>
##$TPNAME3= <>
##$TPNAME4= <>
##$TPNAME5= <>
##$TPNAME6= <>
##$TPNAME7= <>
##$TPOAL= (0..7)
0.5 0.5 0.5 0.5 0.5 0.5 0.5 0.5 
##$TPOFFS= (0..7)
0 0 0 0 0 0 0 0 
##$TUNHIN= 0
##$TUNHOUT= 0
##$TUNXOUT= 0
##$USERA1= <user>
##$USERA2= <user>
##$USERA3= <user>
##$USERA4= <user>
##$USERA5= <user>
##$V9= 5
##$VALIST= <valist>
##$VCLIST= <CCCCCCCCCCCCCCC>
##$VD= 0
##$VDLIST= <DDDDDDDDDDDDDDD>
##$VPLIST= <PPPPPPPPPPPPPPP>
##$VTLIST= <TTTTTTTTTTTTTTT>
##$WBST= 1024
##$WBSW= 4
##$XGAIN= (0..3)
0 0 0 0 
##$XL= 0
##$YL= 0
##$YMAX_a= 344970
##$YMIN_a= -306652
##$ZGOPTNS= <>
##$ZL1= 120
##$ZL2= 120
##$ZL3= 120
##$ZL4= 120
##$ABSF1= 18.0051
##$ABSF2= -0.04679489
##$ABSG= 5
##$ABSL= 3
##$ALPHA= 0
##$AQORDER= 0
##$ASSFAC= 0
##$ASSFACI= 0
##$ASSFACX= 0
##$ASSWID= 0
##$AUNMP= <proc_1d>
##$AZFE= 0.1
##$AZFW= 0.1
##$BCFW= 0
##$BC_mod= 2
##$BYTORDP= 0
##$COROFFS= 0
##$CY= -3
##$DATMOD= 1
##$DC= 0
##$DFILT= <>
##$DTYPP= 0
##$F1P= 0
##$F2P= 0
##$FCOR= 1
##$FTSIZE= 16384
##$FT_mod= 6
##$GAMMA= 0
##$GB= 0
##$INTBC= 1
##$INTSCL= 3.241238e-09
##$ISEN= 128
##$LB= 0.25
##$LEV0= 0
##$LPBIN= 0
##$MAXI= 10000
##$MC2= 0
##$MEAN= 0
##$ME_mod= 0
##$MI= 1.114404
##$NCOEF= 0
##$NC_proc= -6
##$NLEV= 6
##$NOISF1= 3.799351
##$NOISF2= 2.8
##$NSP= 0
##$NTH_PI= 0
##$NZP= 0
##$OFFSET= 15.59044
##$PC= 1
##$PHC0= -4489.794
##$PHC1= 8.392301
##$PH_mod= 1
##$PKNL= yes
##$PPARMOD= 0
##$PSCAL= 0
##$PSIGN= 0
##$REVERSE= no
##$SF= 200.129986244985
##$SI= 16384
##$SIGF1= 3
##$SIGF2= 2
##$SINO= 0.751879
##$SIOLD= 32768
##$SREGLST= <19F.Aceton>
##$SSB= 0
##$STSI= 16384
##$STSR= 0
##$SW_p= 3612.71676300578
##$SYMM= 0
##$S_DEV= 0
##$TDeff= 16384
##$TDoff= 0
##$TI= <>
##$TILT= no
##$TM1= 0
##$TM2= 0
##$TOPLEV= 0
##$USERP1= <user>
##$USERP2= <user>
##$USERP3= <user>
##$USERP4= <user>
##$USERP5= <user>
##$WDW= 1
##$XDIM= 16384
##$YMAX_p= 471825187
##$YMIN_p= -295944
$$ End of Bruker specific parameters
$$ ---------------------------------
##NTUPLES= NMR SPECTRUM
##VAR_NAME=  FREQUENCY,     SPECTRUM/REAL,   SPECTRUM/IMAG
##SYMBOL=    X,             R,               I
##VAR_TYPE=  INDEPENDENT,   DEPENDENT,       DEPENDENT
##VAR_FORM=  AFFN,          ASDF,            ASDF
##VAR_DIM=   16384,         16384,           16384
##UNITS=     HZ,            ARBITRARY UNITS, ARBITRARY UNITS
##FACTOR=    0.220516191357247, 1,           1
##FIRST=     3120.11450201636, 0,            0
##LAST=      -492.602260989424, 0,           0
##MIN=       -492.602260989424, -295944,     0
##MAX=       3120.11450201636, 471825187,    0
$$ Real data points
##PAGE= N=1
##DATA TABLE= (X++(R..R)), XYDATA
$$ [...]
7092A2420J2589L813J182Q01j0737n556K844m414j6326n538K5225O715o019M978
7078B1977j3401k3060j044p245L046L236J4181N527l8937R629n333R442J4847
7065g135K3817o060j7767K2174K279Q565M1801k3552J427q501l0512j0432J7384
7052A3488j0502k866j104j6884p646J4328Q277j3590M656M358O490J0082J6076
7039B5163J266k3733J2589K1417J235j7401M71L020q468J944j6020R28J2339o589
7025H161n990M688P444k4691j1047o582j546J8689r835j0186J3396K822k1490
7012c6167Q600Q373K1867Q322j0234j0454j6600Q166J4972m934R24r223J7893
6999A505L936k0235j1119J0061j8802L666J1781q529k391N894q232n765l113J2675
$$ plain form
7092 12420 25009 28822 30004 30805 20068 14512 17356 12942 -3384 -8922 16303 23018 16999 21977
7078 21977 8576 -14484 -15528 -22773 -19727 -16491 -2310 3217 -35720 -26091 -31424 -21982 -7135
7065 -7135 16682 10622 -7145 15029 17308 25873 67674 44122 45549 37048 6536 -3896 13488
7052 13488 2986 120 -984 -17868 -25514 -11186 -2909 -16499 -11843 -7485 -995 9087 25163
7039 25163 26429 2696 15285 36702 37937 20536 21007 24027 15559 17503 1483 2411 14750 8161
7025 8161 2171 6859 14303 -10388 -21435 -28017 -29563 -10874 -20709 -30895 -17499 -14677 -36167
7012 -36167 -27567 -19194 2673 10995 761 -9693 -26293 -18127 -3155 -8089 -7165 -16388 1505
6999 1505 5441 -14794 -25913 -15852 -34654 -30988 -19207 -27736 -30127 -24233 -32465 -38230 -41343 -28668
6985b8668l603O451j0879J645N380K191o246J2525N017O3l029J372o411k806J2180
6970a4818R011P651j0892L4j1184L842O68J0855K41k1479o190J7415Q527q2j8697
6955b5098j721Q241L2300P49m810j0673J238p906o131j3646K131r301P82o525
6941d0370N163k192r500J5357Q089J9358O485J578k0874j6613j6950J5457P824
6928b7188j74Q516j0099K897J0402J6123Q106J0862O63l598j5823q055k1203P346
6914b1225r354j218J8493m164j852J7724J6681j5959p305m830J0151j2959j0714
6901b6531j1442n486O724R884k861j143j4526O995R097K188j303K1538j0925J0628
6887g163P168o216j2106r792L019J4470J5401J896j1974O176j4591j631O266O203
$$ plain form
6985 -28668 -32271 -25820 -36699 -35054 -29674 -27483 -33729 -21204 -16187 -16124 -19153 -17781 -24192 -26998 -14818
6970 -14818 -5807 1844 -9048 -9014 -20198 -16356 -15688 -4833 -4592 -26071 -32261 -14846 -6319 -6401 -25098
6955 -25098 -26819 -18578 13722 14471 9661 -1012 226 -7680 -13811 -27457 -25326 -34627 -33845 -40370
6941 -40370 -35207 -37399 -46899 -31542 -23453 -4095 2390 3968 -16906 -33519 -50469 -35012 -27188
6928 -27188 -27362 -18846 -28945 -26048 -15646 477 8583 19445 20108 16510 687 -7368 -28571 -21225
6914 -21225 -30579 -31797 -13304 -17468 -19320 -1596 15085 -874 -8179 -13009 -2858 -15817 -26531
6901 -26531 -37973 -43459 -36735 -26851 -29712 -30855 -45381 -38386 -29289 -27101 -28404 -6866 -17791 -7163
6887 -7163 5 -6211 -18317 -28109 -25090 -10620 4781 6677 -5297 879 -13712 -15343 -9077 -2874
6873b874J0350R341P297k3229p050k098k961R879l824k227j771p716q796j2656
6859c8335J3133m507J3860k4L509p589j9104K987J0536K2865N471j4615n097j7777
6845c4687j1280J0575O214q658J7334r284Q560O308r192m573J0292j5669j450
6832c5510K1209J1948k0695m450O122J8115j588j1940r684k349K3986j5542q490
6819b8868r35J9914o412N257j854m344j09N39J0727J1853m081j3380j9269J06
6805c0856M745J2726J4340l2863L019K6499J049j4120r011r89Q294j098j718J437
6791a8546p26j4743M320O718k015J564j322J633Q380n413j989R05n942N359O495
6776a5322M832m420M523J3898j622J1452k921n725J4515k0247N133J1511j0941
$$ plain form
6873 -2874 7476 16817 24114 885 -6165 -8263 -11224 -1345 -5169 -7396 -9167 -16883 -25679 -38335
6859 -38335 -25202 -29709 -15849 -15873 -12364 -19953 -39057 -36070 -25534 -2669 2802 -11813 -16910 -34687
6845 -34687 -45967 -35392 -29178 -37836 -20502 -29786 -21226 -14918 -24110 -28683 -18391 -34060 -35510
6832 -35510 -14301 -2353 -23048 -27498 -21376 -3261 -4849 -16789 -26473 -28822 -4836 -20378 -28868
6819 -28868 -29803 -9889 -16301 -11044 -12898 -17242 -17351 -16812 -6085 5768 1687 -11693 -30962 -30856
6805 -30856 -26111 -13385 955 -31908 -28889 -2390 -1341 -15461 -24472 -25461 -17167 -18265 -19983 -18546
6791 -18546 -19272 -34015 -29695 -22977 -24992 -23428 -24750 -23117 -14737 -20150 -22139 -21234 -27176 -21817 -15322
6776 -15322 -10490 -14910 -10387 3511 1889 13341 10420 4695 19210 -1037 4096 15607 4666
6763D666j4825o58J4597n479l022k609J1128l192j4267L03J4737k232Q778J6080
6749B4005k3013j3177j336j401P482J5325q662j5711j2144J1718J3195K647J3667
6736A2595Q80j2388k9879K774K1433j4595J4673j0060r315N829j9638j1237K5543
6723b3385J3861j9816k606J6862J6181o5k0512J7100j0240M174K7635J209j4480
6710E918o017J4518j3389o733Q379j8684q194o94R000k0483N355P664J4K149J2867
6695h330L302N81l078P450Q169j9163O549o89J4173J918q941k4350N141j1103
6681b8371q892R152J1597J4493o777R699J3731l637P812j3219k9321p401O992
6668b4142n284J1274J3763K5788o51j3499J276l2513j8447J3475Q779J6031k962
$$ plain form
6763 4666 -10159 -10817 3780 -1699 -4721 -7330 3798 606 -13661 -13358 1379 -853 7925 24005
6749 24005 992 -12185 -13521 -14922 -7440 7885 -777 -16488 -28632 -16914 -3719 -1072 12595
6736 12595 13475 1087 -28792 -26018 -4585 -19180 -4507 -14567 -23882 -18053 -37691 -48928 -23385
6723 -23385 -9524 -29340 -31946 -15084 1097 1032 -19480 -2380 -12620 -8446 19189 20398 5918
6710 5918 -99 14419 1030 -5703 2676 -16008 -24202 -24896 -15896 -36379 -31024 -23360 -23346 -21197 -8330
6695 -8330 -5028 -4447 -7525 -75 8094 -11069 -4520 -5209 8964 10882 1941 -22409 -17268 -28371
6681 -28371 -37263 -28111 -16514 -2021 -8798 901 14632 10995 18807 5588 -23733 -31134 -24142
6668 -24142 -29426 -18152 -4389 21399 20748 7249 8525 -23988 -42435 -28960 -20181 -4150 -7112
6655g112L26M35P734n407P312P474k7333L755n56j9725p25L97O594p07O408K629
6639a8501p03J4835N522P885j9366N856J777k5291J6235J4761J4761J496j5046
6626D221l227r90L274K178n102k3574J1612J3861N57k485O734o494m625M74p652
6611a1238p523K444J2553p258J9459O111k0211k6090J3558R344J0266M14k6352
6598b4523o312k677K0356q268m952J9321K0167o585k1144k0491M87J2930K4754
6585C063J3740j6195M508j1007Q26J5931j2016j1146P114J7529m913L934p573
6572C795k4809J2490J8602J1881R548k1571n877N589J5677J4026j8840R838J3996
6559D4345j3437l579p239J638J5916O86k980p252k5158p113J5206p063J469n909
$$ plain form
6655 -7112 -6786 -6351 1383 -4024 3288 10762 -16571 -12816 -13372 -33097 -33822 -33425 -26831 -27538 -21130 -18501
6639 -18501 -19204 -4369 1153 9038 -10328 -4472 -2695 -27986 -11751 3010 17771 19267 4221
6626 4221 994 4 3278 5456 354 -23220 -11608 2253 2810 325 7059 565 -4060 -3586 -11238
6611 -11238 -18761 -16317 -3764 -11022 8437 14548 -5663 -31753 -18195 -8851 1415 1829 -24523
6598 -24523 -30835 -33512 -13156 -21424 -26376 -7055 13112 6527 -14617 -35108 -34621 -21691 3063
6585 3063 16803 608 5116 -5891 -5065 10866 -1150 -12296 -5182 12347 7434 11368 3795
6572 3795 -21014 -8524 10078 21959 31507 9936 4059 9648 25325 39351 20511 30349 44345
6559 44345 30908 27329 20090 21728 37644 38330 35350 28098 2940 -4173 11033 3970 5439 -470
6545d70m618k861K1226l702r330J1422r917n331J6648K831L471l847r820q682
6531b980k3983q75k211K502J4697J6279K186j7700n672K722Q534j436J8337l093
6517G307j3236j6135k777J5560K282j403J5537j0032k78O694j2450m75N767R105
6503E466J4887N700j8970J665j4650J0684Q807j0196K282r911j563Q29K338J6388
6489A3756r565N458R494k4496j9159M145O025Q936L328L636j6855Q411Q498l09
6475A303J95J876m311J817l607J1354J414p491J7671l426k507K0886j8762j7719
6461a307m027M913k1485L298P421m956J4824R095j158q49j3048N015R64j9734
6447b1034j9631j6497K2321J4282n535k903R615N515J2036J7268j974j9252m575
$$ plain form
6545 -470 -5088 -7949 13277 9575 245 11667 1750 -3581 13067 15898 19369 15522 5702 -2980
6531 -2980 -26963 -27838 -30049 -27547 -12850 3429 5615 -12085 -17757 -15035 -6501 -7937 10400 7307
6517 7307 -5929 -22064 -24841 -9281 -6999 -8402 7135 -2897 -3175 3519 -8931 -9406 -3639 5466
6503 5466 20353 26053 7083 8748 -5902 4782 13589 3393 5675 -4236 -5799 -4970 -2632 13756
6489 13756 4191 9649 19143 -5353 -24512 -20367 -14342 -5406 -2078 1558 -15297 -6886 1612 1303
6475 1303 1498 3374 -937 880 -2727 8627 10041 2550 20221 16795 14288 35174 16412 -1307
6461 -1307 -5334 -421 -21906 -18608 -11187 -16143 -1319 7776 6618 5769 -7279 -2264 -1300 -21034
6447 -21034 -40665 -57162 -34841 -20559 -26094 -28997 -19382 -13867 -1831 15437 13463 -5789 -10364
6434a0364P318K562k7467j9025j4830K4364K6419O472K325j668j3024R695r452
6421a6675j1747k173K564M80L4406J4948k2733j9472O476K5353j2911J353R024
6408H893k1591j4893J5230p250r814J2000J9489O767j803O719n645j3745Q733
6395C090R242l64L223n44Q021q649q023j857P640J190r216J9806o116j1099m136
6380B208L925J470k964N249q452K577K447O261M595J3861M041q216p994l2362
6366a3354o696k604K2574K9555j1923K936p80J966j3190j7171n285J4399J1001
6353A1428m024r165M562k110O64j4642k7455P089K3010r720o036j2358J1982O22
6339b6153j2851L2797o026j015P938o907J947K2108j4634j2452J4427M806J990
$$ plain form
6434 -10364 -3046 -484 -27951 -46976 -61806 -37442 -11023 -4551 -2226 -3894 -16918 -7223 -16675
6421 -16675 -28422 -30595 -28031 -27551 6855 21803 -930 -20402 -13926 11427 -1484 -131 8893
6408 8893 -12698 -27591 -12361 -19611 -29425 -17425 2064 8831 7028 13747 8102 -5643 3090
6395 3090 12332 11968 15191 14647 22668 14019 5996 4139 11779 12969 3753 23559 17443 6344 2208
6380 2208 6133 7603 4639 9888 1436 4013 6460 12721 17316 31177 35218 27002 19008 -13354
6366 -13354 -20050 -22654 -80 29475 17552 20488 19708 21674 8484 -8687 -13972 427 11428
6353 11428 7404 -1761 2801 691 1355 -13287 -40742 -33653 -10643 -20363 -26399 -38757 -26775 -26153
6339 -26153 -39004 -6207 -12233 -13248 -5310 -12217 -10270 11838 -2796 -15248 -821 3985 5975
6326E975q93r262j2987j0491Q030J2738M816j494J577o374K373m859J0579J0914
6312A0642p54j3975r890N350j1343K4624J3715J054j097r445N491j2364n782K163
6298a611n650J4514O935l977J1750j8549L507J8412j3103K235N068J1867o977
6285B4421Q43J3645o065J7643K065O749L3083M8170P246K315K5189J4955k610
6272A87649p581o193m905q659l3181l9371j6640j3510L319k2976k4254m851n6
6259H791L825k5060q711J1499K8836j8054l5203K3746K335o872j1669M800M567
6246a7170q478M729J4745r295j6337J3301m413j7841m662J4354k608j67K7801
6233f041J5439k5568R206j4939o575J7646O429p519k02J8792J1671p706j2632
$$ plain form
6326 5975 5082 -4180 -17167 -27658 -19628 -6890 -2074 -3568 -1991 -8365 -5992 -10851 -272 10642
6312 10642 9888 -4087 -13977 -8627 -19970 4654 18369 19423 18326 8881 14372 2008 -3774 -1611
6298 -1611 -7261 7253 14188 10211 21961 3412 6919 25331 12228 14463 19531 31398 24421
6285 24421 25264 38909 32844 50487 52552 59301 92384 140554 147800 150115 175304 190259 187649
6272 187649 180068 173875 168970 160311 127130 87759 71119 57609 60928 37952 13698 8847 8791
6259 8791 12616 -12444 -21155 -9656 19180 1126 -34077 -10331 -7996 -14868 -26537 -21737 -17170
6246 -17170 -25648 -20919 -6174 -15469 -31806 -18505 -22918 -40759 -45421 -31067 -33675 -33842 -6041
6233 -6041 9398 -16170 -6964 -21903 -28478 -10832 -4403 -11922 -12124 6668 18339 10633 -1999
6220a999j0602J8516r29K929N71p549j9292m765J1560P791P257M390P992j2548
6206C322n409J0712L290j3666R855N079P059k5020J0030P654m888J037j0978M473
6192B550Q714m382R917j0680k5084J6715k311r554K71J31Q907J2187k808o403
6178a830M644j115K0835j5531l15k099j4292J3980n679O929K1040n505j9068l720
6164a726P865J192j831l02J3780J417j7431K562O041k03R398Q800O210q896p584
6149A9292R693r260N96M335N294O312m647j0190K420J7995N302n334J5172j6266
6135D0714L729L843o191j4344j4425m751K9496P967N89k4779n565K796J3815P586
6121D0480m141n609k161j3899j6278q605J1100J0665M618K4546n005j6333k2073
$$ plain form
6220 -1999 -12601 5915 4986 7915 8486 937 -18355 -23120 -11560 -3769 3488 7878 15870 3322
6206 3322 -2087 8625 11915 -1751 8104 13183 20242 -4778 5252 12906 8018 9055 -1923 2550
6192 2550 11264 6882 16799 6119 -18965 -2250 -4561 -14115 -13844 -13713 -4806 7381 4573 -1830
6178 -1830 2814 1699 22534 7003 6688 4589 -9703 4277 -1402 5527 26567 21062 1994 -1726
6164 -1726 6139 7331 5500 5198 18978 20395 2964 5526 11567 11364 20762 29562 35772 26876 19292
6149 19292 28985 19725 20321 24656 29950 36262 31615 21425 23845 41840 47142 41808 56980 40714
6135 40714 44443 48286 42095 27751 13326 8575 38071 46038 46627 21848 16283 19079 32894 40480
6121 40480 36339 30730 28569 14670 -1608 -10213 887 11552 16170 40716 35711 19378 -2695
6108b695J1055J7606j688r496Q013J850m528Q421j1492k004K7954p96j1502j355
6094B9343K481j2228P39j69J4521m822o220P489R764q1J132l734j2068j3071R145
6079B2221l972q096J648n164J5090K0118J6169p025j1612J0911O726k6389q816
6066B1809L090m050J6195P001J2601m346l221m767j1586j3370J4150J451N32r777
6052B5712j7888J8933J6543o978N417j51j6910r869k48J737K0523L450J1818K4338
6038G6427L865l697p588J820J9644J6492j652j2060j0681J5788M246o803j2877
6025H2924M249M288R072M804k085j6705J9209L255m948J2014L917j6531p649m037
6011I1777N920R56p236P125j6252J238L200K144j0744R326Q536J0549R63j1014
$$ plain form
6108 -2695 8360 25966 24278 14782 22795 24645 20117 28538 17046 15042 42996 42200 30698 29343
6094 29343 31824 19596 20335 20166 34687 29865 23645 31134 40898 40817 41949 38215 26147 13076 22221
6079 22221 18249 10153 11801 6637 21727 41845 58014 50989 39377 50288 57014 30625 21809
6066 21809 24899 20849 37044 44045 56646 52300 49079 44312 32726 19356 33506 34957 35489 25712
6052 25712 7824 26757 43300 36322 41739 41588 24678 14809 14561 16298 36821 40271 52089 76427
6038 76427 80292 76595 69007 70827 90471 106963 105311 93251 82570 98358 102604 95801 82924
6025 82924 87173 91461 100533 105337 103252 86547 105756 109011 104063 116077 119994 103463 95814 91777
6011 91777 97697 98653 91417 98542 82290 83528 86728 88872 78128 87454 95990 106539 107502 96488
5997I6488L126J495o902J4364J5330J6279j408K314K265J5803L0312j806j020
5984A86640J3992J4333K7319K6534K8857M6841K7792M9587N1321L6570J2862q109
5972E14539P496k7129l4117o927O758J3168J8324K7840j7425j5185j2958k7539
5960D46845l1879k2050m0730l4294m0086l1741l4320k9965r870k52k3542j0780
5948A37336l579p841J0190R551P341r86l6732M487j304j0663R224n357j6061l291
5934I2315K1446j0653j4995j3981J1773K4588l991r729j9510j6578O031J9646
5922H6362J1925m134j5944P891K142k31j1789m530K1120J787J4595j0984j3253
5909H4957j933J5811J210J2949J1915j4495L76J1378J7758O392r206n724J8858
$$ plain form
5997 96488 99614 101109 94207 108571 123901 140180 138772 141086 143351 159154 189466 187660 186640
5984 186640 200632 214965 242284 268818 297675 344516 372308 421895 473216 509786 522648 514539
5972 514539 522035 494906 460789 453862 460620 473788 492112 519952 502527 487342 474384 446845
5960 446845 414966 392916 352186 317892 277806 246065 211745 181780 171910 171658 148116 137336
5948 137336 133757 125916 136106 145657 152998 152012 115280 119767 118463 107800 117024 111667 95606 92315
5934 92315 113761 103108 88113 74132 85905 110493 106502 96773 77263 60685 66716 86362
5922 86362 98287 94153 78209 86100 88242 88011 76222 71692 92812 94599 109194 98210 84957
5909 84957 83024 98835 100045 112994 124909 110414 110790 122168 139926 146318 137112 131388 150246
5896A50246J4988k843J1472r675K711L2925J7950L1123K1625M8139K9009J4294
5884C61964K6365K0297K7876J9544P928k64j418k1765J6109n712N938K8313K0178
5871E05353R277j9327l5229l1284k5990k4969k2967j8986k5217j1761m1187m4094
5859B13619k7485j1014J105J250k7616j5628j8489j3345J4623J8849J4849r082
5847A41636j7899j0330O385J910N994R115M577K0078K3171j753j871o733K911
5834A77191J1721J5941J0304m3599j1518O761l089r866k765J4083O628j471k3047
5821A47274k9625j3379J5582J2367J4647J757j9644k6973K3960J2187J920K3K78
5808A40374k4J3371J9431r079j4088R654O663M380q66k1482J5592K3537K3927
$$ plain form
5896 150246 165234 162391 173863 164188 166899 199824 217774 248897 270522 318661 347670 361964
5884 361964 388329 408626 436502 456046 463974 463710 462292 440527 456636 450924 456862 485175 505353
5871 505353 514630 495303 460074 428790 402800 377831 354864 335878 310661 298900 257713 213619
5859 213619 186134 175120 176225 177475 149859 134231 115742 102397 117020 135869 150718 141636
5847 141636 123737 113407 119792 121702 127696 136811 141388 161466 184637 182884 181013 174280 177191
5834 177191 188912 204853 215157 171558 160040 166801 163712 153846 151081 165164 171792 170321 147274
5821 147274 117649 104270 119852 132219 146866 148623 128979 102006 125966 138153 140073 140096 140374
5808 140374 140350 153721 173152 164073 149985 159639 166302 170682 169816 148334 163926 187463 211390
5795B11390m567m362J9871K398O500L135J2970j3333r585O640P574N550J3461
5782B57642l354k793j6833j3989K270R74L776R30k567j4780n287k0013J765Q408
5768A96149N495L455N919o792j5867j1983Q187Q002J8407j1431k3058J629j2597
5755A65515J0380q918J927J9082m726k7566o811N236J3466M246L4565J5489p094
5742B14791P416O397J3773K8800K0928M57Q053Q746J0154M450J5411J3291J3287
5729C65954J5987O75L032M508p690J4098K0592J4980r392J4882J2421k867j811
5716D45369j0327P361R698J5809l995n155R884J1089L353p337j2458J9661J5765
5703D98717J716J6632o13k159l4077J3723K4069L7141k312o514N038J7485J8351
$$ plain form
5795 211390 206823 202461 222332 224730 231230 234365 247335 234002 224417 231057 238631 244181 257642
5782 257642 254288 251495 234662 220673 222943 223917 227693 228623 226056 211276 205989 185976 187741 196149
5768 196149 201644 205099 211018 204226 188359 176376 184563 192565 210972 199541 176483 178112 165515
5755 165515 175895 166977 168904 187986 183260 155694 148883 154119 167585 171831 206396 221885 214791
5742 214791 222207 228604 242377 271177 292105 292562 300615 309361 319515 323965 339376 352667 365954
5729 365954 381941 382616 385648 390156 382466 396564 417156 432136 422744 437626 450047 447180 445369
5716 445369 435042 442403 452101 467910 463915 458760 468644 479733 483086 475749 463291 482952 498717
5703 498717 500433 517065 516452 514293 480216 493939 518008 555149 552837 546323 551361 568846 587197
5690E87197m70Q788R266J0956K2769r597m6381p991J2947L4244L2908J87o870
5677F47953R263K5435J1487J475J4881L0296K9220j0239J9616r115j348J5827
5665G84751K2976J0979j5024O476L0862K3747K3509R316J9790J3020K3171P278
5653I60851J1903O992K0451K8631M5156N0782N8044O2023R8920J29330R9588O2174
5641A634845K4457K0290J0871j6945J156N564J4664N4115M8767Q1666N4829P608
5629A941887J1885K387k8361k9574n4610k5449p595k1718M544K7022M930K2576
5617A847924L1708M3067L7568O7807N0205L4375L9954L7128O2791P8909P1877
5606B403313P8636Q6290P0929P6316Q8083O4754R9229J09305J17476J33395J39409
$$ plain form
5690 587197 586727 595515 604781 615737 638506 628909 582528 574537 587484 621728 654636 654823 647953
5677 647953 657216 682651 694138 695613 710494 740790 770010 759771 779387 770272 768924 784751
5665 784751 807727 818706 803682 810158 841020 864767 888276 897592 917382 930402 953573 960851
5653 960851 972754 979746 1000197 1028828 1073984 1124766 1182810 1244833 1343753 1473083 1572671 1634845
5641 1634845 1659302 1679592 1690463 1673518 1674674 1680238 1694902 1749017 1797784 1879450 1934279 1941887
5629 1941887 1953772 1956159 1927798 1898224 1843614 1818165 1810570 1788852 1793396 1820418 1825348 1847924
5617 1847924 1879632 1922699 1960267 2028074 2078279 2112654 2152608 2189736 2252527 2331436 2403313
5606 2403313 2481949 2568239 2639168 2715484 2803567 2868321 2967550 3076855 3194331 3327726 3467135
5595C467135J53289J78693K19186K56745K81736L03365L53724M12095N06776N44840
5585F677584O01177O75642P50183Q51918R85562J178389J457048J849250K392695
5576A7419448L170092M241244N588878P211363Q669541R540181R188363P345090
5568G2374200M803021K652945Q05057o41140q42707j09967J208787K430772K928925
5559H5609893K295838O13471j599837l410424m944178o572682p492422p693876
5551E6805783p507176p000854o248523n366212m403265l503626k752896k204764
5543A7818467j813305j527831j322842j100817r40797q11636p07847o04809n14652
5534H473931m74023m01031l79530l59315l04120k71430k35227k36718k43520k43318
$$ plain form
5595 3467135 3620424 3799117 4018303 4275048 4556784 4860149 5213873 5625968 6132744 6677584
5585 6677584 7278761 7954403 8704586 9556504 10542066 11720455 13177503 15026753 17419448
5576 17419448 20589540 24830784 30419662 37631025 46300566 55840747 65029110 72374200
5568 72374200 77177221 79830166 80635223 79994083 79151376 79041409 80250196 82680968 85609893
5559 85609893 87905731 88519202 86919365 83508941 78564763 71992081 64499659 56805783
5551 56805783 49298607 42297753 36049230 30683018 26279753 22776127 20023231 17818467
5543 17818467 16005162 14477331 13154489 12053672 11112875 10301239 9593392 8988583 8473931
5534 8473931 7999908 7598877 7219347 6860032 6555912 6284482 6049255 5812537 5569017 5325699
5524E325699k17374j91044j96447j53341j35852j32332j22220j39724j38536j21339
5514C777490j35046j01813p1218o4469q0041j12983q1615n5408n2081o3587n7990
5503B901239n4616p0991p3787n4453o2492o7787m0258l6128m0847n1921m5199
5492B302760o0560r964k5708k5414m0034m0691m7703m0237l2843l0884p609j1514
5480A929599l8128k7791m1852j2014j4868k3880k2787k9406l7123j6003n079q839
5468A651829l1703k2295K008J7901J1107j322k3991O745J654k2891j927j3432
5456A573683J2679l4368K773p787r237M061J2366N424L216n710K1552J770J6518
5443A596940j4974k342J5630J051J5558L909J6185p178K5455M4705M4702J9868
$$ plain form
5524 5325699 5108325 4917281 4720834 4567493 4431641 4299309 4177089 4037365 3898829 3777490
5514 3777490 3642444 3540631 3469413 3404944 3324903 3211920 3130305 3074897 3022816 2959229 2901239
5503 2901239 2846623 2775632 2701845 2647392 2584900 2517113 2476855 2440727 2399880 2347959 2302760
5492 2302760 2242200 2232236 2206528 2181114 2141080 2100389 2052686 2012449 1979606 1948722 1941113 1929599
5480 1929599 1891471 1863680 1821828 1809814 1794946 1771066 1748279 1718873 1681750 1665747 1660668 1651829
5468 1651829 1620126 1597831 1599839 1617740 1628847 1627525 1603534 1610279 1611933 1589042 1587115 1573683
5456 1573683 1586362 1551994 1554767 1546980 1537743 1541804 1554170 1559594 1562810 1557100 1578652 1580422 1596940
5443 1596940 1581966 1579624 1595254 1596305 1611863 1615772 1631957 1624779 1650234 1694939 1739641 1759509
5431A759509M875J9393R735K5661K9269L1864L2522N6416P5420P1202O3953O0005
5419B239824J04032J30812J46532J40264J35987J97341K65159M25987O52676R12609
5409E351223J165481J300511J137113P47500K97525Q556k16414l53988l48211
5400I089296k04235J13410M38451O40116O07690L21786n3214l11732n31446p64250
5390I345872q64323q69979q38580p64635o26804n37477m00781l01649j84406j34254
5380C822984q9892p2399n1119k0476Q571K3321K5013J9183j100K4640N7129N5315
5368C801170M6246O6646P6866O4988P4098N7182P4417R7148J07591J36239J56298
5357D758889K02552K12667K71692L10689L42394L46390L96372M24124N08428N63072
$$ plain form
5431 1759509 1764384 1783777 1793512 1819173 1848442 1880306 1912828 1969244 2044664 2115866 2179819 2239824
5419 2239824 2343856 2474668 2621200 2761464 2897451 3094792 3359951 3785938 4438614 5351223
5409 5351223 6516704 7817215 8954328 9701828 9999353 10007909 9791495 9437507 9089296
5400 9089296 8885061 8998471 9436922 10077038 10684728 11006514 10953300 10641568 10110122 9345872
5390 9345872 8481549 7611570 6772990 6008355 5381551 4844074 4443293 4141644 3957238 3822984
5380 3822984 3733092 3660693 3609574 3589098 3597669 3620990 3646003 3665186 3664086 3688726 3745855 3801170
5368 3801170 3847416 3914062 3990928 4055916 4130014 4187196 4261613 4358761 4466352 4602591 4758889
5357 4758889 4961441 5174108 5445800 5756489 6098883 6445273 6841645 7265769 7774197 8337269
5347H337269O45822P39640Q35937R89079J215343J449339J687718J972013K470507
5338B0342667L277546M736020P240756J1233678J5150853J7642354J6499986J0972124
5330A07095984M169433M83889k079049n843599o589933m868271j123456L758535
5322I5003533P998862R798192P315001J757867k803861m907298q730293j1720160
5314I3711843j2074291j1740749j0949686r836008q586478p037536n091988l614952
5306B4780155k782767k283422j903839j665507j402709j167024r58184p91528
5298A1825175o45148n63925n11960m85118m63605m43238l77922l44231l22626
5289G667402l31185l11362k72711k45958k36260k24641k47955k16237j72377j59890
$$ plain form
5347 8337269 8983091 9722731 10558668 11547747 12763090 14212429 15900147 17872160 20342667
5338 20342667 23620213 28356233 35596989 46830667 61981520 79623874 96123860 107095984
5330 107095984 111265417 111749306 109670257 103826658 97236725 92368454 91244998 95003533
5322 95003533 103002395 112800587 120115588 121873455 119069594 114162296 105432003 93711843
5314 93711843 81637552 69896803 58947117 49111109 40524631 33487095 28395107 24780155
5306 24780155 21997388 19713966 17810127 16144620 14741911 13574887 12616703 11825175
5298 11825175 11180027 10616102 10104142 9619024 9155419 8712181 8334259 7990028 7667402
5289 7667402 7336217 7024855 6752144 6506186 6269926 6045285 5797330 5581093 5408716 5248826
5279E248826j63346j44774j66163j53105j36258j07257j43830j40911j14767r9604
5269C878811r3755j07624j03535p7014p3094p2075j10412r3398q9712j05646p1216
5258B881330n3068n1493l2863k7403J282k2745m7088k9350l3175k5240l2600o8286
5246B459301n3565l6945m8917l5688l3173m6081l2092k3044o8332p0636o3932
5235A946896p5819p7630p5289p4104p8198p4616l8083k6286l2688n0012m7289
5224A296882l3526m2942m8323m1771m3998k4293j1173k1040q821p012j9740j7244
5212I76999l960j3330l2557j9696j0571p686j8121l6821k5939j3293j4829L932
5200G84128k3184k8117k4973j0523p797k0239j7997j779o622j3591j7986k4308
$$ plain form
5279 5248826 5085480 4940706 4774543 4621438 4485180 4377923 4234093 4093182 3978415 3878811
5269 3878811 3785056 3677432 3573897 3496883 3423789 3351714 3241302 3147904 3058192 2952546 2881330
5258 2881330 2828262 2776769 2743906 2716503 2717785 2695040 2647952 2618602 2585427 2560187 2527587 2459301
5246 2459301 2405736 2368791 2319874 2284186 2251013 2204932 2172840 2149796 2081464 2010828 1946896
5235 1946896 1871077 1793447 1718158 1644054 1565856 1491240 1453157 1426871 1394183 1344171 1296882
5224 1296882 1263356 1220414 1172091 1130320 1086322 1062029 1050856 1029816 1020995 1013983 994243 976999
5212 976999 973039 959709 927152 907456 896885 889199 871078 834257 808318 795025 780196 784128
5200 784128 760944 732827 707854 697331 689534 669295 651298 649519 642897 629306 611320 587012
5188E87012l2139p917o430M63N794j2206o544J1308j87j1890r724j2486K032P90
5174E07876k0231l1866k4803p733q708M696j1240k544k0583N648Q366p862j9323
5161C71693j1630k749r82j1241m4934k8229k784M896J5619J1842J8967J9163k610
5148C37021Q634p78n557q112p596k284j0298k4191J1768L1155J9264R028L39j562
5134C56831J4387J4852M368N91n307n125Q281j6041J86r158k9614j7605k6734
5121B89912j9633j7598j5333M123K0216j1551k4146k0769j8831N532j1078j9741
5109A61103k2455p006J970M655o791R570J8519n423o152P076k0056j2729P491
5096A29772K0115M276j8099l7875M569J5942J5946J1523j786k183j241J606j378
$$ plain form
5188 587012 554873 546956 540526 540989 546783 534577 528033 539341 539154 527264 517540 505054 507086 507876
5174 507876 487645 455779 430976 423243 414535 419231 407991 405447 384864 390512 398878 391016 371693
5161 371693 360063 357314 356332 345091 300157 271928 269144 274040 289659 301501 320468 339631 337021
5148 337021 345655 344877 339320 331208 323612 321328 311030 286839 298607 329762 349026 358054 358393 356831
5134 356831 371218 386070 390438 391029 385722 380597 388878 372837 373023 363865 334251 316646 289912
5121 289912 270279 252681 237348 241471 261687 250136 225990 205221 186390 191922 180844 161103
5109 161103 138648 131642 133612 138267 131476 141046 159565 154142 147990 155066 135010 122281 129772
5096 129772 149887 154163 136064 98189 102758 118700 134646 146169 144383 142200 140959 142565 141187
5083A41187L151o458K7463L458m788j80L781K9780J5148P731j777P744j3999k1019
5069A91222o675r608p098j5878L4931n407L130L689k5559k0776r437q61J8078
5056A49751l008m811M285N698p445L315J215M377J3727n095n278j2711O865J0953
5042A61838j0363k5132j5128r479J1010J0823K612k4770K691J3504n229K7395
5030A39772l477l322J0320L35j928P105K6804J4149J3897L4650M7892P3900R1710
5017D51807Q5422P8736K0299j0071J3092j3740k9154k5034j4599J6125K9862N0667
5005F53412K8746p113k4548j3481l5687m9382p7027n4437o3316m7780k7901m9169
4993B32317j7667k8392k9846j8270j0456l135n000m271M155j4957j6619q867L506
$$ plain form
5083 141187 144338 137880 165343 168801 164013 163833 167614 197394 212542 220273 218496 226240 212241 191222
5069 191222 184547 174939 167841 151963 186894 181487 184617 188306 162747 141971 132534 131673 149751
5056 149751 146743 141932 146217 151915 144470 147785 149000 153377 167104 162009 156731 144020 150885 161838
5042 161838 151475 126343 111215 101736 112746 123569 126181 101411 104102 117606 112377 139772
5030 139772 136295 132973 143293 143628 141700 148805 175609 189758 203655 238305 286197 360097 451807
5017 451807 537229 615965 636264 626193 639285 625545 596391 571357 556758 572883 602745 653412
5005 653412 682158 675045 650497 637016 601329 551947 474920 420483 357167 309387 281486 232317
4993 232317 214650 186258 156412 138142 127686 124551 119551 115280 119435 104478 87859 78992 82498
4980H2498J3894K435M004J5842o386j6176K2874k0057j4804j2535M974P929n282
4967G9210L627K123K569o659O69J092Q377j4359m900Q033N913k7320k0293j2661
4953B5421J6252N031O049Q344m852J073m458m529J7693r356L815M003J745o409
4939E9822j3853L436Q901J6572k681P984k584J0080l960p110J2325J858r20r792
4925H0078j5647P62j0084J5888j411J6892M416o320j901k838N290n059p959r525
4911F2582j451N129N088o925N717J3414J8203r281J322P519p53r25p692P298r750
4896H9495r545J4107r144K399Q1j517J1525J776M138k655r112J3620J0314R842
4882A25324j4831j3543J8208P829J38K872n537q201o177n784Q31q218O732P985
$$ plain form
4980 82498 96392 98827 102831 118673 112287 96111 118985 98928 84124 71589 76563 84492 79210
4967 79210 82837 84960 87529 80870 81539 82631 91008 76649 71749 79782 85695 58375 38082 25421
4953 25421 41673 46704 52753 61097 56245 57318 52860 48331 66024 56668 60483 64486 66231 59822
4939 59822 45969 49405 58306 74878 72197 80181 77597 87677 83717 76607 88932 90790 89870 80078
4925 80078 64431 65193 55109 70997 69586 86478 90894 84574 82673 79835 85125 80066 72107 62582
4911 62582 61131 66260 71348 64423 70140 83554 101757 92476 93798 101317 100564 99639 91947 99245 89495
4896 89495 79950 94057 84913 87312 87393 85876 97401 99177 103315 100660 91548 105168 115482 125324
4882 125324 110493 96950 115158 122987 123125 125997 120460 112259 106082 100298 101129 92911 99643 107628
4868A07628j3482J017q262j2503R714J3438R093j4601r351r837L832K6522O173
4855A09381J998J3769k910k4693l568q164r101J4435K3667j2031j4917R296k563
4842I4599P15J4560k035m043j3850k539j6436J073L233J615K5391L390o259n208
4828I4206P038k522L2683n497p997k452J0304q502M610J5408m023K5535N7850
4815B16641K2113K330J521L743K4597K2442K8842q162J4721N3253N1316K6093
4803D59450L5798N548j5999j5181N849J0500J2191K6177K6330J0494r45j6449
4791E43763k2521k775j3491l2564m9181k9297k5546o518M964J894k7982l6424
4779C04322k3200k2586k1350k2891P24J4282j1399l2573k3029j8838L983J6401
$$ plain form
4868 107628 94146 95163 86901 74398 84112 97550 106643 92042 82691 72854 76686 103208 109381
4855 109381 111379 125148 122238 97545 93977 85813 76712 91147 114814 102783 87866 97162 94599
4842 94599 95314 109874 107839 103796 89946 87407 70971 72044 75277 76892 102283 105673 99414 94206
4828 94206 101244 98722 131405 125908 117911 115459 125763 117261 121871 137279 133256 158791 216641
4815 216641 238754 241084 242605 246348 270945 293387 322229 314067 328788 382041 433357 459450
4803 459450 495248 500796 484797 469616 475465 485965 498156 524333 550663 561157 560212 543763
4791 543763 521242 518467 504976 472412 423231 393934 368388 361870 366834 368728 340746 304322
4779 304322 281122 258536 237186 214295 215019 229301 217902 185329 162300 143462 147445 163846
4767A63846J2828j6797j3616j104n176J0375n180M399r459J2508k753k2347k0497
4754A07027R470L4875r030j004N338j3337o006j2714J0318J0073j8319O191N780
4741A28662j9020J72J8666j2220N797K347k395L764P870P379l56q382J6764k038
4727A47010j337p865O399Q172p823R857P03N891n160J188l643R898L155j6782
4713A49663k6330K550J1929R824M103J8039p837j3998J0451J8815l390j0389K593
4700A66023K0789j5633k2483n958J9134K5820l5j3467k9688j815P008J2967J0156
4687A72818J7289p387m576n542j8522K38J590Q554R695Q915N001m2508k0553Q020
4673A33032K4690Q540o500j7891j1049j381M792m947P890Q523L943J402p496j2552
$$ plain form
4767 163846 176674 159877 146261 145157 139981 150356 145176 149575 140116 152624 149871 127524 107027
4754 107027 116497 151372 142342 141338 146676 133339 127333 114619 124937 135010 116691 122882 128662
4741 128662 109642 109814 128480 116260 122057 124404 122009 125773 133643 141022 140666 132284 149048 147010
4727 147010 145673 137808 144207 152379 144556 154413 155116 161007 155847 157035 153392 163290 166445 149663
4713 149663 123333 125883 137812 147636 151739 169778 161941 147943 158394 177209 173819 163430 166023
4700 166023 186812 171179 148696 142738 161872 187692 187657 174190 144502 142687 149695 162662 172818
4687 172818 190107 182720 178144 172602 154080 154318 155908 164462 174157 183072 188073 145565 125012 133032
4673 133032 157722 166262 159762 141871 130822 129441 134233 129286 137176 145699 149642 151044 143548 130996
4659A30996k4798J3597L3752K9836j2983j5808q612r191R144k940k3172J77K2425
4646A42423p027J2561R978K7081p667O099k198n930j3637q53n412n514K880K0945
4632A73729N730j093K762J987J2371o981J0615J487j2853l351K1587j1698O111
4619B00403k266M307j8981K2089r060m386J9488K09o939p358M438j316R493P740
4605B17861J9969j054k7863j6223J4644O372R490P755J985J417j6953j3155J6895
4592B21140J6670P419Q597q125j1489n098M233M94J5612L620p621p361o681J682
4578B33092J921J3877L343O241P228o200R138m746m81Q835N094p593k724p735
4564B59290K27K664N759j4461M116J4055O892Q896J7155N181r207l275J5016J2239
$$ plain form
4659 130996 106198 119795 153547 183383 170400 154592 145980 136789 145933 142993 119821 119998 142423
4646 142423 135396 147957 157935 185016 177349 183448 181250 175320 161683 160830 155418 149904 152784 173729
4632 173729 179459 178366 181128 183115 195486 188505 199120 200607 187754 184403 205990 194292 200403
4619 200403 198137 202444 183463 205552 196492 192106 211594 211803 204864 197506 201944 200628 210121 217861
4605 217861 237830 236776 208913 192690 207334 213706 223196 230951 232936 234353 217400 204245 221140
4592 221140 237810 245229 253826 245701 234212 229114 233347 233841 249453 253073 245452 238091 231410 233092
4578 233092 235013 248890 252233 258474 265702 259502 268640 263894 263413 272248 277342 269749 267025 259290
4564 259290 259517 262181 267940 253479 257595 271650 278542 287438 304593 309774 300567 297292 312308 324547
4550C24547j4726K967J0501j806N711o162J965K0688L510j610J0309j6727j1649
4537C27518q661K6515J9801K860o864j9924L1898n965k2629K192N164m061K264
4524C50108N894k482k6391J3215J2811N355J1218j0730J3610N797p114p052K438
4511C66677J3078K621J895k4257J0226Q303J1867K28q80J3616O447R083j2906
4498D05998J7855J1321j060q522j943J3973k3609j25J2399J5729J4966Q829j1110
4485D54701J5546J1578k459r596M896L5365K1064J6158K1720p60R63J6793K0898
4472F06867j2018j5021J0348J7973L701J3672N760Q397M0210K6786K0922j1049
4460G16548j4125J7156J5670p496J0021K130J6135M3911K8505J5880P023L5038
$$ plain form
4550 324547 309821 312788 323289 321483 327194 321032 322997 343685 347195 345585 355894 339167 327518
4537 327518 318857 345372 365173 368033 361169 341245 373143 367178 344549 346741 351905 347844 350108
4524 350108 356002 353520 327129 340344 353155 358510 369728 358998 372608 378405 371291 364239 366677
4511 366677 379755 382376 384271 360014 370240 378543 390410 390638 389758 403374 409821 418904 405998
4498 405998 423853 435174 434114 425592 423649 437622 414013 413888 426287 442016 456982 465811 454701
4485 454701 470247 481825 479366 469770 474666 510031 531095 547253 568973 568213 569176 585969 606867
4472 606867 594849 579828 590176 608149 611850 625522 631282 639679 679889 706675 727597 716548
4460 716548 702423 719579 735249 727753 737774 739904 756039 799950 828455 844335 851358 886396
4448H86396N1733N3806K1457j4096K690K1038K2857R373L3454J4208L2150N1786
4436A186852L9287K1742K4184M0380L0460K0555M0223L8176L3332O6607R0583
4425A632381J09182J49413J61500J71703J42343R1609M4054l035j9462p8955r2060
4414B308673j11110j39851j08404o7923q3497o1332m0751k1140k3367j5057k7229
4403A609012l6788l1463j8170r002j6733l3002k7013j2300k8733k4659o811j8394
4391A345944j5029M300l847j8956l4493l450J9625l3069j6532n374k753J1663
4379A248029J965O673j7354J1170J4710J8596J8366J5630k479M084J6729K1945
4367A358064J7734K4429m532K4380M5551J5787L7271K8773L1962L3054L1038K2527
$$ plain form
4448 886396 938129 991935 1013392 999296 1001986 1023024 1045881 1055254 1088708 1102916 1135066 1186852
4436 1186852 1226139 1247881 1272065 1312445 1342905 1363460 1403683 1441859 1475191 1541798 1632381
4425 1632381 1741563 1890976 2052476 2224179 2366522 2458131 2502185 2499150 2479688 2400733 2308673
4414 2308673 2197563 2057712 1949308 1881385 1797888 1736556 1695805 1674665 1651298 1636241 1609012
4403 1609012 1572224 1540761 1522591 1513589 1496856 1463854 1436841 1424541 1395808 1371149 1364338 1345944
4391 1345944 1330915 1335215 1331368 1312412 1277919 1274469 1294094 1261025 1244493 1239119 1236366 1248029
4379 1248029 1249994 1256667 1239313 1250483 1265193 1283789 1302155 1317785 1315306 1319390 1336119 1358064
4367 1358064 1375798 1400227 1395695 1420075 1465626 1481413 1518684 1547457 1579419 1612473 1643511 1666038
4355A666038L4665O5025O6931O8813L8335M9135q816J2599K2310K9034K7795N3234
4343B125098N9043P1044L4553J8472J7885j186L2866K8714L6508O6787R8219J64922
4331B752925K35398K82535L04868K98805K09891J40504O8562j545M608N6877J26086
4320D479514K35609L76948M59559M54374L26044J20151p0465j44899k25359k81077
4310E730399k53630j91035j23735k1851K2865j5203m0684p8873j46696j75980
4300D705577j98239j82006j72358j49287j22471q0899m9434j9769j7041K2728
4290C736801L4501N4491M7573M6211O9609O5804O3478P0599O4515O0952J04857
4279D419391J14061J02371P6286Q5292J22926J35109J35888J25444J42029J84940
$$ plain form
4355 1666038 1700703 1765728 1832659 1901472 1939807 1988942 1980126 1992725 2015035 2044069 2071864 2125098
4343 2125098 2184141 2255185 2289738 2308210 2326095 2324909 2357775 2386489 2422997 2489784 2588003 2752925
4331 2752925 2988323 3270858 3575726 3874531 4084422 4224926 4293488 4291943 4296551 4353428 4479514
4320 4479514 4715123 5092071 5551630 6006004 6332048 6452199 6381734 6236835 6011476 5730399
4310 5730399 5476769 5285734 5161999 5140148 5163013 5147810 5107126 5028253 4881557 4705577
4300 4705577 4507338 4325332 4152974 4003687 3881216 3800317 3750883 3731114 3714073 3736801
4290 3736801 3771302 3825793 3873366 3919577 3989186 4054990 4118468 4189067 4253582 4314534 4419391
4279 4419391 4533452 4635823 4712109 4797401 4920327 5055436 5191324 5316768 5458797 5643737
4269E643737K10033K21707K44960K41410L19614L54732L97861M52132N92786P41187
4259I420159R26384J191189J440345J749319K083876K458419K730815K748173
4251B4748679K634856K431878K378538K575366L433741M737072O062779O958091
4243E5961000O498216M811715K923069J528968k59842j431412j617413q38663
4235F7575638J413433L602970N383648M954902K143528j256689k432075l855208
4227G7530147o208430o486936o094229m881676l415108k012706j239797j282520
4219D5908745k064777k512485k575908l343954l707061l537765l259500k893085
4211B2014210k516996k130939j683041j184141q93285o92960n78745n08583m82487
$$ plain form
4269 5643737 5853770 6075477 6320437 6561847 6881461 7236193 7634054 8086186 8678972 9420159
4259 9420159 10346543 11537732 12978077 14727396 16811272 19269691 22000506 24748679
4251 24748679 27383535 29815413 32193951 34769317 38203058 42940130 49002909 55961000
4243 55961000 62459216 67270931 70194000 71722968 71463126 70031714 68414301 67575638
4235 67575638 68989071 72592041 77975689 82930591 85074119 83817430 81385355 77530147
4227 77530147 71321717 64834781 58740552 53858876 50443768 48431062 47191265 45908745
4219 45908745 43843968 41331483 38755575 35411621 31704560 28166795 24907295 22014210
4211 22014210 19497214 17366275 15683234 14499093 13605808 12912848 12334103 11825520 11343033
4202A1343033m03260l36625k60984k11642j75434j73118j42705j01180r3880r7896
4192I346309q0447o6174l2062j5460n851J0842L9689N8603O8921Q6641Q8809R9456
4180I599276J54782J37149J60675J50627J89624K39549K41003K85454L05156L33700
4170A1796995L84570M58036N09230N75282O24980O95330P66930Q38464R28817
4161A7578634R78315J067991J168525J273765J372866J464839J573630J708365
4153B8186930J837203J958562K060064K203598K374188K448983K583175K701872
4145D6354575K793520K890252K963861L046068L051174L077333L100451L150437
4137G0427671L206294L198457L224469L248591L247511L231532L159535L037043
$$ plain form
4202 11343033 10939773 10603148 10342164 10130522 9955088 9781970 9639265 9538085 9444205 9346309
4192 9346309 9265862 9199688 9167626 9152166 9146315 9157157 9196846 9255449 9324370 9411011 9499820 9599276
4180 9599276 9754058 9891207 10051882 10202509 10392133 10631682 10872685 11158139 11463295 11796995
4170 11796995 12181565 12639601 13148831 13724113 14349093 15044423 15811353 16649817 17578634
4161 17578634 18556949 19624940 20793465 22067230 23440096 24904935 26478565 28186930
4153 28186930 30024133 31982695 34042759 36246357 38620545 41069528 43652703 46354575
4145 46354575 49148095 52038347 55002208 58048276 61099450 64176783 67277234 70427671
4137 70427671 73633965 76832422 80056891 83305482 86552993 89784525 92944060 95981103
4129I5981103K898497K733231K541140K296127K093493J891340J708219J564623
4121A13707773J420813J227566J073934Q47469O19491L19845J7319l02497o15099
4112A18316614q74523j136727j391715j602105j805228j920971k035885k165064
4104A05384396k317764k467913k609483k778103k889358l011589l161313l225347
4096H2923526l291302l284663l281561l256491l179159l123344l023430k942433
4088E7541143k874703k809748k713855k629004k544450k498669k411106k321423
4080C6738185k211707k065027j964661j829118j705764j573614j427928j331673
4072B2628693j236529j143941j026421r26769q77467p84442p32161o63460n92397
$$ plain form
4129 95981103 98879600 101612831 104153971 106450098 108543591 110434931 112143150 113707773
4121 113707773 115128586 116356152 117430086 118277555 118897046 119216891 119234210 118931713 118316614
4112 118316614 117442091 116305364 114913649 113311544 111506316 109585345 107549460 105384396
4104 105384396 103066632 100598719 97989236 95211133 92321775 89310186 86148873 82923526
4096 82923526 79632224 76347561 73066000 69809509 66630350 63507006 60483576 57541143
4088 57541143 54666440 51856692 49142837 46513833 43969383 41470714 39059608 36738185
4080 36738185 34526478 32461451 30496790 28667672 26961908 25388294 23960366 22628693
4072 22628693 21392164 20248223 19221802 18295033 17417566 16633124 15900963 15237503 14645106
4063A4645106n48528n06162m76708m53163m25160m11817l72778l33730l37855
4054A0779205k82245k53878k32343k17317k24576k02914j80873j88591k01377
4045H795091k07971k00532k15614j82279j78853j71427j65193j44273j04770r8133
4035G126046j02451o6904m5398k6657k212l1661N557K7480M7843M4059L9074N8699
4023G073475O3705P1692P5375P5600L9130M0393L0162L1448J9902q539K2107M8027
4011G582477L4140K3106L0321L6298o881p843j7918m4242n9779r9641o2786o0117
3999G347135q0924p2488o8369o2801p2766q4308r3885r1122q5667q4174j04538
3988F446093j06666j29917j02026j07815r1407q9035r7348o6881n3982m3489n2368
$$ plain form
4063 14645106 14096578 13590416 13113708 12660545 12235385 11823568 11450790 11117060 10779205
4054 10779205 10496960 10243082 10010739 9793422 9568846 9365932 9185059 8996468 8795091
4045 8795091 8587120 8386588 8170974 7988695 7809842 7638415 7473222 7328949 7224179 7126046
4035 7126046 7023595 6956691 6911293 6884636 6882424 6850763 6856320 6883800 6931643 6975702 7014776 7073475
4023 7073475 7137180 7208872 7284247 7359847 7398977 7439370 7469532 7500980 7520882 7512343 7534450 7582477
4011 7582477 7616617 7639723 7670044 7706342 7699461 7691618 7673700 7629458 7569679 7470038 7407252 7347135
3999 7347135 7266211 7193723 7125354 7062553 6989787 6905479 6811594 6720472 6634805 6550631 6446093
3988 6446093 6339427 6209510 6107484 5999669 5908262 5819227 5721879 5654998 5601016 5557527 5505159
3977E505159m4802o5480l8472k4584k6838l9565m8672l6858k6166l127j3203j893
3965E135499j1952p124J4702J2835K925j162J8199L5055J9187J6437L5545N3846
3953E323992M2916M7930M6666N6058N5739M6411P1506R5880R0988J02684J18047
3942F098817J20959J56328J73108J80139J91772K00030K10181J86427J90860K00378
3932G908999J83281J77582J69821J51615J55628J80759J85511K09712K29713K81783
3922I834404L23064L62860L72592M37848N10096N69006O48378P47826Q67155J003989
3912A5677218J174018J389425J652632J972297K352825K825431L439682M259311
3904C4742839N227663O293875P356334Q175071Q584506Q537353P883662O773723
$$ plain form
3977 5505159 5460357 5394877 5356405 5331821 5304983 5265418 5216746 5179888 5153722 5150595 5137392 5135499
3965 5135499 5123547 5116423 5131125 5143960 5146885 5145723 5163922 5198977 5218164 5234601 5270146 5323992
3953 5323992 5366908 5414838 5461504 5517562 5573301 5619712 5691218 5787098 5878086 5980770 6098817
3942 6098817 6219776 6376104 6549212 6729351 6921123 7121153 7331334 7517761 7708621 7908999
3932 7908999 8092280 8269862 8439683 8591298 8746926 8927685 9113196 9322908 9552621 9834404
3922 9834404 10157468 10520328 10892920 11330768 11840864 12409870 13058248 13806074 14673229 15677218
3912 15677218 16851236 18240661 19893293 21865590 24218415 27043846 30483528 34742839
3904 34742839 39970502 46264377 53620711 61795782 70380288 78917641 86801303 93575026
3896I3575026N341494L769947K247933R06559q8027p55614j022767r41499o30939
3887A02402113j53229L45641O60741O72565K38199o00940j748869l077784m418162
3878I4320275n595868o469171o991434p119036o953212o560761n985950n309019
3870D3335824m612586l937654l332672k794757k324327j975769j673151j413073
3862B1271835j210186j015382q69282p38444o03962n23355m37697l84626l27249
3853A5161652k61725k53299j87702j62251j50033j44804j03586r8957o9493p8264
3843A3651538p8357m0765k6310p823j5425p57P426N3421P6458O3302Q8187J31933
3831A3902828J48836J59251J34080J23870J26042J28849J13230J21265R5820J04570
$$ plain form
3896 93575026 98916520 102686467 104934400 105840959 105752932 104997318 103974551 103033052 102402113
3887 102402113 102248884 102594525 103255266 103927831 104166030 103565090 101816221 98738437 94320275
3878 94320275 88724407 82255236 75263802 68144766 61191554 54630793 48644843 43335824
3870 43335824 38723238 34785584 31452912 28658155 26333828 24358059 22684908 21271835
3862 21271835 20061649 19046267 18176985 17438541 16834579 16311224 15873527 15488901 15161652
3853 15161652 14899927 14646628 14458926 14296675 14146642 14001838 13898252 13799295 13729802 13651538
3843 13651538 13573181 13532416 13506106 13498283 13482858 13482101 13489527 13542948 13619406 13682708 13770895 13902828
3831 13902828 14051664 14210915 14344995 14468865 14594907 14723756 14836986 14958251 15054071 15158641
3821A5158641J15043J43447J86965J99729K23811K70062K99297L45247L75486
3812A7317728M02393M28711N12426N50619O02177O86714P60214Q22959Q76276
3803B2960217R09045R28467R16643R03132Q61540Q45843Q26897P97360Q28945
3794C0778089Q60144R29332R77972J012905J050770J030841R65137Q82478P50488
3785C9238156O00808M51555L11423J92666R9064N6091M2255K6792L8337M0285
3775D1097432O5707M5567L5130N1773K4607K6394L9509M9418J45842K27025L29578
3764D2137982M80728O41334Q37486J046705J287495J571101J915481K288112K714250
3755E4920674L207505L776028M425259N149209N953191O854909P875734Q981347
$$ plain form
3821 15158641 15273684 15417131 15604096 15803825 16027636 16297698 16596995 16942242 17317728
3812 17317728 17720121 18148832 18661258 19211877 19814054 20500768 21260982 22083941 22960217
3803 22960217 23869262 24797729 25714372 26617504 27479044 28324887 29151784 29949144 30778089
3794 30778089 31638233 32567565 33545537 34558442 35609212 36640053 37605190 38487668 39238156
3785 39238156 39838964 40290519 40601942 40794608 40893672 40949763 40992018 41018810 41057147 41097432
3775 41097432 41163139 41208706 41243836 41295609 41320216 41346610 41386119 41435537 41581379 41808404 42137982
3764 42137982 42618710 43260044 44097530 45144235 46431730 48002831 49918312 52206424 54920674
3755 54920674 58128179 61904207 66329466 71478675 77431866 84286775 92162509 101143856
3747A01143856J0285783J1811903J3650293J5935453J8706487K1834954K4969637
3740B18338366K7537293K8920396K8817536K7382433K4911755K1604121J7726985
3733C95238885J3768653J0123193P100695M890386L493718K923686L100137L778490
3725D44417843M639778N403166N891838N664292M290174J518096k600279p346225
3717D61878683j1691529j5179635j7757844j9228141j9548162j8937510j7712709
3710C41823153j6169929j4515936j2882382j1412885j0278630r505179r127032
3703B57931180r061137r184777r356103r474489r529585r391672r159865q825085
3695A83948467q372181p954642p577742p267356p041992o938001o897272o952424
$$ plain form
3747 101143856 111429639 123241542 136891835 152827288 171533775 193368729 218338366
3740 218338366 245875659 274796055 303613591 330996024 355907779 377511900 395238885
3733 395238885 409007538 419130731 426231426 431121812 434615530 437539216 440639353 444417843
3725 444417843 449057621 454460787 460352625 466016917 470307091 471825187 469224908 461878683
3717 461878683 450187154 435007519 417249675 398021534 378473372 359535862 341823153
3710 341823153 325653224 311137288 298254906 286842021 276563391 267058212 257931180
3703 257931180 248870043 239685266 230329163 220854674 211325089 201933417 192773552 183948467
3695 183948467 175576286 167621644 160043902 152776546 145734554 138796553 131899281 124946857
3687A24946857p004789p019825o984085o807559o546190o182926n732633n207811
3679G3461039m699253m158961l617886l132926k687040k296078j888225j507530
3671D9473140j176284q73009o63336m86116l69517k99262l30381l45316l73432
3662D4556487l90166l98139l91389k96103j96752p1817P5416J89949K03750J72474
3652D3453710J66671O3356r5866k65630m40473o29647p79140r09406r89262j072453
3642C8501860j059808j039190r50628q86880q66525q52023q38909q48002r07927
3633C0251968r52684r93965j017008j028823j017867j066373j034677r72812r09062
3624B1258697q65306q01505p47173o77288n99671n35972m65989m38372l99606
$$ plain form
3687 124946857 117942068 110922243 103938158 97130599 90584409 84401483 78668850 73461039
3679 73461039 68761786 64602825 60984939 57852013 55164973 52868895 50980670 49473140
3671 49473140 48296856 47423847 46760511 46274395 45904878 45605616 45275235 44929919 44556487
3662 44556487 44166321 43768182 43376793 43080690 42883938 42812121 42887537 43077486 43281236 43453710
3652 43453710 43620381 43683737 43587871 43322241 42881768 42252121 41472981 40563575 39574313 38501860
3642 38501860 37442052 36402862 35452234 34565354 33698829 32846806 32007897 31159895 30251968
3633 30251968 29299284 28305319 27288311 26259488 25241621 24175248 23140571 22167759 21258697
3624 21258697 20393391 19591886 18844713 18167425 17567754 17031782 16565793 16127421 15727815
3615A5727815l53850l49829k84774k53514k69293k58121k02626j91437j90394
3606A3373977k01891j79879j61413j39094j37882j51325j38833r7568p0277o5783
3596A2030032o1611m3840m0655l3505k9360j2787R707k0177J3486M0862K5311
3585A1877463J8802K1883M9182P6856P7926M8546O3485R2389J40512J27322J48365
3574A2742731J74145J82586K15545K42983K59285K49913K81720L01301L25871
3565A4976080L11421L29908L56724L61326L90196M05440M28701M47910M60737
3556A8468443N16522N17655N00767N47176N50233N69876N53813N42622N15292
3547B3282399M97083M87615M74933M41180L78230L24465K79659K43432J68350
$$ plain form
3615 15727815 15373965 15024136 14739362 14485848 14216555 13958434 13755808 13564371 13373977
3606 13373977 13172086 12992207 12830794 12691700 12553818 12402493 12263660 12166092 12095815 12030032
3596 12030032 11968421 11924581 11883926 11850421 11821061 11808274 11817981 11797804 11811290 11852152 11877463
3585 11877463 11896265 11918148 11967330 12044186 12122112 12170658 12234143 12326532 12467044 12594366 12742731
3574 12742731 12916876 13099462 13315007 13557990 13817275 14067188 14348908 14650209 14976080
3565 14976080 15287501 15617409 15974133 16335459 16725655 17131095 17559796 18007706 18468443
3556 18468443 18984965 19502620 20003387 20550563 21100796 21670672 22224485 22767107 23282399
3547 23282399 23779482 24267097 24742030 25183210 25561440 25885905 26165564 26408996 26577346
3538B6577346J20224M5832j7665o6465j21748k35915k71107l04921l61552m05795
3528B4958234m69048n14830n26033n16670n34193n62980n87712n97732n83312
3519B0065724n66535n69676n69719n50706n42479n45338n19774m95283n14054
3510A5192160m90406m44041m18145m20255m12795l88768l63039l46273l41267
3501A1567171l43101l29190l01549k93737k83080k68301k48671k25903k21040
3492I052599k16750k29795k15380j83214j85395j66170j69027k01515j81788j45010
3482G158555j29461j39438j58343j38032j31514j23625r6678j24592j14313j23475
3472E879084r2235q6388r5910j00520r4198n8867o2051l8280m9237q3125m1834
$$ plain form
3538 26577346 26697570 26743402 26725737 26659272 26537524 26301609 26030502 25725581 25364029 24958234
3528 24958234 24489186 23974356 23448323 22931653 22397460 21834480 21246768 20649036 20065724
3519 20065724 19499189 18929513 18359794 17809088 17266609 16721271 16201497 15706214 15192160
3510 15192160 14701754 14257713 13839568 13419313 13006518 12617750 12254711 11908438 11567171
3501 11567171 11224070 10894880 10593331 10299594 10016514 9748213 9499542 9273639 9052599
3492 9052599 8835849 8606054 8390674 8207460 8022065 7855895 7686868 7485353 7303565 7158555
3482 7158555 7029094 6889656 6731313 6593281 6461767 6338142 6241464 6116872 6002559 5879084
3472 5879084 5786849 5700461 5604551 5504031 5409833 5350966 5288915 5250635 5201398 5118273 5076439
3461E076439k2291o498n017k2596p577K2220L9761J8659M8234L2863N6962Q2711
3449E313870Q1930O1604M3454J9693O8562N3899j8655M975j7640q417j8616l6126
3437E548533n2195l3514n600m061m2548o3497o0993m3328m4197r4638j16564j31938
3425D855460j28107j20704j00322j16602j22065j18380r7924r1992q9639r6497
3415C773228q5512n1677o6918p9583p5351p6920n8582o4144n8110p6556p0134
3404C009741p2423n6021m7280n9958m2833o2595n1611k2458k7843p0991n1696
3393B444032j2289l6863j6657l5933m8555k623k084n945l202j2782J3161L9314
3381B319574L7836J0184L3889M9572O8547O7089O0739K7142j31J0136q077m5555
$$ plain form
3461 5076439 5054148 5047650 5042633 5020037 5012460 5034680 5074441 5093100 5141334 5174197 5231159 5313870
3449 5313870 5395800 5457404 5500858 5520551 5589113 5643012 5624357 5629332 5611692 5603275 5584659 5548533
3437 5548533 5496338 5462824 5457224 5453163 5410615 5347118 5286125 5242797 5198600 5103962 4987398 4855460
3425 4855460 4727353 4606649 4506327 4389725 4267660 4149280 4051356 3959364 3869725 3773228
3415 3773228 3687716 3636039 3569121 3489538 3414187 3337267 3278685 3214541 3156431 3079875 3009741
3404 3009741 2937318 2881297 2834017 2774059 2731226 2668631 2617020 2594562 2566719 2495728 2444032
3393 2444032 2431743 2394880 2378223 2342290 2293735 2291112 2289028 2283083 2279881 2267099 2280260 2319574
3381 2319574 2357410 2367594 2401483 2451055 2519602 2586691 2647430 2674572 2674441 2684577 2676500 2630945
3369B630945q8076r3529r8245q1106r9244j04658j04349o4434m2685o3323p4219
3358A717077n2551l9336j8525l7979k9614k3987m4213k9633j4862k784k9747n5536
3346A338310j3023j7928l0592j9233j3590j5092j8791q134k5284k8988l708J2981
3334A156928j0754K164k4290l0962k3571r765K3836j4833m5455K208N656j9714
3322A011448l5511l7416k509J8951J2713n864o526m1770k2665K1297J9960N790
3310I37898k5272j3348J2560P80q887j5354P563L1718j6169j4436k3099k2211
3298H51743j2048J401K877k7356k4594Q24O401j475n214l8737q901J6772o329
3285G55364k568k3930m498L3648M594j8373k4226j8897Q857J6880r06k1317l6925
$$ plain form
3369 2630945 2542869 2449340 2351095 2269989 2170745 2066087 1961738 1897304 1854619 1791296 1717077
3358 1717077 1664526 1625190 1606665 1568686 1539072 1515085 1470872 1441239 1426377 1423593 1393846 1338310
3346 1338310 1325287 1307359 1276767 1257534 1243944 1228852 1210061 1201927 1176643 1147655 1143947 1156928
3334 1156928 1146174 1148338 1124048 1093086 1069515 1059750 1083586 1068753 1023298 1025506 1031162 1011448
3322 1011448 975937 938521 936012 954963 967676 961812 955286 913516 890851 912148 932108 937898
3310 937898 912626 899278 911838 912618 903731 888377 895940 927658 911489 897053 873954 851743
3298 851743 839695 841096 843973 816617 792023 792847 799248 797773 792559 753822 744921 761693 755364
3285 755364 752796 728866 724368 758016 762610 744237 720011 701114 709971 726851 725945 704628 667703
3272F67703j3190K354Q777l390m783j3450P471R735q338k6509O268M422K1701
3259F58771j7130j015j6792m982J8201n023n398j619L102l759p233k3657l766
3246E89700J3798K8917J0794l9549l0100j2895K002J3855l261l1013q443j7615
3234E16190m138l545k5801J9682Q395L007R971k2827k3343j1346J7040L7614j3175
3221E07724j8982j7646J67M105J2802l167N279j3820K0368q569l65j675o346j651
3207D78224J9181p033l7805j5936M621L1706J4265m0396j7193m196n91R843O462
3194D41152j6943j1628K020K2500j9180k1536J9509J0157P854q048j3076k2116
3182C90665j2631J5405q470k2410K640j3960o58p268j6288k2820J4399N545n216
$$ plain form
3272 667703 654513 656867 665644 662254 657471 644021 651492 661227 652889 626380 632648 637070 658771
3259 658771 641641 640626 623834 618852 637053 632030 626632 625013 628115 624356 617123 593466 589700
3246 589700 603498 632415 643209 603660 573560 560665 562667 576522 573261 542248 533805 516190
3234 516190 512052 508507 482706 502388 510783 513790 523761 500934 477591 466245 483285 520899 507724
3221 507724 488742 471096 471263 475368 488170 485003 490282 476462 496830 488261 487896 486221 479875 478224
3207 478224 497405 490372 452567 436631 441252 472958 487223 446827 429634 425438 424847 434690 441152
3194 441152 424209 412581 414601 437101 417921 396385 415894 426051 433905 425857 412781 390665
3182 390665 378034 393439 384969 362559 365199 351239 350581 343313 327025 304205 318604 324149 318933
3169C18933j0314k3861j1539P419P285M643p624j6814k3954J6465K9824m936q187
3156B77340k905j5399r110p726k6575K6775J1146J7695j4877j6838J7887M109
3144B61522J5666J0407M7P026j0315M514K0786r872R609J8271K1706j5172k7643
3131C06552j6362m288K8351K7932k0273k4170n38o794J1832R725j7556j6256r835
3118B68320P285L954m725j9162m370R732L1883p862n987o139K4445K6703k0304
3105C03773l709l463j3063J3037n779l601n913P149J7032J6945J1880o712K4566
3092C52142L2683L2637N0712N1853N2154M7479M6178K0496j2121o129J08O457
3080F74649j1558r319K4801K2343J3788J8409j0530k4053q062j7145l8583l0535
$$ plain form
3169 318933 308619 284758 273219 280638 287923 292566 284942 268128 244174 260639 290463 285527 277340
3156 277340 274435 259036 249926 242200 215625 242400 253546 271241 256364 239526 257413 261522
3144 261522 277188 287595 287642 294668 284353 288867 309653 299781 309390 327661 349367 334195 306552
3131 306552 290190 285902 314253 342185 321912 297742 297204 290410 302242 311967 294411 278155 268320
3118 268320 275605 279559 274834 255672 251302 261034 292917 285055 279068 272929 297374 324077 303773
3105 303773 300064 296601 283538 296575 290796 287195 281282 288431 305463 322408 334288 327576 352142
3092 352142 384825 417462 468174 520027 572181 619660 665838 686334 674213 668084 668192 674649
3080 674649 663091 653772 678573 700916 714704 733113 722583 698530 690468 673323 634740 604205
3068F04205m2573k9956j5872j6438q505k0237O969R529J9727J8905J8582N1910
3056E96246M0732N2928K8632k487l665o455L73K7925J7936Q439J1347k942q636
3043G60373j3801k0748l3475l2968k4019k1622j7236l2705j4836k2502q324l175
3031E14962j3196j9289q696M78o827r809j7258l1799j6048m551N2j2350m142J4786
3017C86313L891P539j6450j2796J1396K5213n129j8676k1670M516K4600J1721
3005D00468K0617O52j6956R85p190k7433j0279J8174m718J543J7408j4955q744
2992C69572P361P306O511j4204j6424n006J517Q570r108K2727J4694K7364L8756
2979D59636K3350J6044P482q474m839l3412k7593m2810l8832l9827l1510j4259
$$ plain form
3068 604205 561632 531676 515804 499366 490861 470624 477593 487122 506849 525754 544336 596246
3056 596246 636978 689906 718538 716051 712386 705931 706304 734229 752165 760604 771951 769009 760373
3043 760373 746572 725824 692349 659381 635362 613740 596504 563799 548963 526461 518137 514962
3031 514962 501766 482477 473781 474259 467432 457623 440365 408566 392518 387967 388019 375669 371527 386313
3017 386313 390204 397743 381293 368497 379893 405106 399977 381301 359631 364147 388747 400468
3005 400468 421085 421737 404781 405766 398576 371143 360864 379038 374320 375863 393271 378316 369572
2992 369572 376933 384239 390750 376546 360122 355116 356633 365203 356095 378822 393516 420880 459636
2979 459636 482986 499030 506512 498038 493199 459787 432194 389384 350552 310725 279215 264956
2967B64956r511j4048j0924K864P864j3851k2120L487J7733O983p360q637j2550
2954B04886K1950J0230P206K3272M6462L3427L7671L0627P227j2500p069k3476
2942C79913k9558k7212l2080l0861k3736k7819l1612j5291q455j0127L259m521
2930A41900p692j3360M224K1354j8214j3705L079p45n305R403J1316l6043q508
2917H7704K5617K515N69p36l2274j555J5095K378j5505L020J7934J894k7572k4039
2903E5045L200J3279K3239q470l4601q707J1552J0130j8474M472j559j0742p274
2890C1090J4076J2969j4339o018J1262J9653j4649K219R87l120k25l529k109j0644
2876C7623K024J5438K0866J0209j748j8269o223J625N169j1644j3415K649R616
$$ plain form
2967 264956 255445 241397 230473 233337 241201 227350 205230 208717 226450 233433 226073 217436 204886
2954 204886 226836 237066 244272 267544 314006 347433 385104 415731 422958 410458 403389 379913
2942 379913 350355 323143 291063 260202 236466 208647 177035 161744 153289 143162 146421 141900
2930 141900 134208 120848 125072 146426 128212 114507 117586 116841 111536 120939 132255 96212 87704
2917 87704 113321 115836 116405 115669 83395 81840 96935 99313 83808 86828 104762 106656 79084 55045
2903 55045 58245 71524 94763 86293 51692 42985 54537 64667 46193 50665 49106 38364 31090
2890 31090 45166 58135 43796 37778 49040 68693 54044 56263 57250 54130 53905 50376 48267 37623
2876 37623 39647 55085 75951 86160 84412 66143 59920 61545 66714 55070 41655 44304 53920
2863E3920O717j4668n205L144J3379q534n120M7J316K623j0557o174J3095r30
2849D3053j988m172j7043l144M841J3464J2169O95l030l927q918l945J6166J1918
2835E6139o755j6069K173J2605m188R59q537N544J6306J3529n180j4403q696P394
2821E0821L1080r176j2154r416o916j052J6918l814j978L783k8209j2893K44O214
2807B3452N350o448N473Q159J0769j1004N596Q969K2141j5771j8545J216Q477
2794D7834Q24j1015l7899R528K6729K0526J2867k5074r894M260j5564j0753m942
2781G427J1242J0082m438J8108j7074j3875n993J3297M194o35j1391M080k48J0526
2767B5302K924k084q286M41Q121j2833k413q663O956m061k102P423n125n058L974
$$ plain form
2863 53920 60637 45969 40764 43908 57287 48753 43633 43680 44996 47619 37062 30888 43983 43053
2849 43053 41065 36893 19850 16706 21547 35011 47180 47875 44845 40918 32000 28055 44221 56139
2835 56139 49384 33315 35488 48093 43905 44864 36327 41871 58177 71706 66526 52123 43427 50821
2821 50821 81901 72725 60571 51155 44239 43187 60105 56291 54313 58096 29887 16994 17238 23452
2807 23452 28802 22354 27827 35986 46755 35751 41347 50316 72457 56686 38141 39357 47834
2794 47834 48658 37643 -256 9272 36001 56527 69394 44320 34426 38686 23122 12369 7427
2781 7427 18669 28751 24313 42421 25347 11472 5479 18776 22970 22335 10944 15024 14776 25302
2767 25302 28226 26142 17856 18297 26418 13585 11172 2509 9465 5404 3302 10725 5600 542 4516
2752D516K1949j0856j4587J2408K0171l032M749r427k0609K105J4790p628q600
2739E949M823M820K0067k947j0925J3441o008J2133N108j5402j5288q151k17K7265
2725C4668J0801k6425l094R249J3752q615r272k857q641O185K1564j0867j1439
2712A5009K104j406R334N020L159j2431j3313O983J577N618N81j3705J3403p053
2698A4880p526l260n509J4331P489N866l1777q897k123K4046K8146j7364q754
2685I548j1535O056J1967p6r990n201J1316Q678j0533k171n77J164N908l692r358
2670A504j8623m201K3518N537j3373R381J2508m376p525j1739M001j2624K642
2657a3370l059N180j0464q72K3806P027q169r744J0016K462j1128j1936j738N720
$$ plain form
2752 4516 26465 15609 1022 13430 33601 30569 35318 25891 5282 7387 22177 14549 5949
2739 5949 10772 15592 35659 32712 21787 35228 29220 41353 46461 31059 15771 7620 7403 34668
2725 34668 45469 19044 15950 25199 38951 30336 21064 18207 9566 15751 37315 26448 15009
2712 15009 17113 15707 25041 30061 33220 20789 7476 14459 16036 21654 22235 8530 21933 14880
2698 14880 7354 4094 -1415 12916 20405 26271 -5506 -14403 -16526 7520 35666 18302 9548
2685 9548 -1987 4069 16036 15960 5970 769 12085 20763 10230 8059 7482 8646 14554 10862 1504
2670 1504 -17119 -21320 2198 7735 -5638 3743 16251 11875 4350 -7389 -3388 -16012 -13370
2657 -13370 -16429 -11249 -21713 -22585 1221 8248 79 -9665 351 2813 -8315 -20251 -21989 -16269
2643a6269J4634J514j237Q583J0824j570K274J0373j1158k3914R92J6587O773
2630A8406k4858p32m571P078K1296M918k5084j3025N714J1390j632k487n890J4631
2616E154K2512k1408j0494n395j1212J2102J3643Q728j4766j0887k385k299k485
2603a9192K926N340m029J1054O928Q54K021j1459q363J1894O346o716j4608o251
2589b3255Q177R86N643J185Q43o443J1523n711o060O21P256p395j3056n392J1490
2574a9588J8669O293l698n198J542M24q369q26q512m577J6661j2045P516j0946
2560b2654j1867q875J3996J1792K2656K685l233m062q828k0536K805J7542J8044
2547I465j6560k5351j0044K8620J4221r360K015J6831n157j2863J6291Qk682P004
$$ plain form
2643 -16269 -1635 -121 -1358 7225 18049 16479 18753 29126 17968 -5946 -4954 11633 18406
2630 18406 -6452 -7184 -11755 -4677 16619 21537 -3547 -16572 -10858 532 -1100 -3587 -9477 5154
2616 5154 27666 6258 -4236 -9631 -20843 -8741 4902 13630 -1136 -12023 -14408 -16707 -19192
2603 -19192 -16266 -10926 -14955 -3901 3027 3881 5902 -5557 -13920 -2026 4320 -2396 -17004 -23255
2589 -23255 -15078 -14092 -8449 -7264 -6421 -12864 -1341 -7052 -13112 -12491 -5235 -12630 -25686 -31078 -19588
2574 -19588 -919 5374 1676 -3522 -1980 -1556 -9925 -10751 -19263 -23840 -7179 -19224 -11708 -22654
2560 -22654 -34521 -43396 -29400 -17608 5048 7733 4500 438 -8390 -28926 -26121 -8579 9465
2547 9465 -7095 -32446 -42490 -13870 351 -9009 -6994 9837 4680 -8183 8108 8116 5434 12438
2533A2438p163j4899k224O749K564q271O103P714J690l993L456j2173J8896J079
2519A1966j4746j844J0854k2878L053J0727Q610P314K116R050p307j1374J2496
2506A8037r092P347J2913l420q117O503J408O555P839j2861j9044j4196j298J5889
2492H463p153n858L233j677K5832j2725j1817J1957o889Q256L687j3263j6971
2479a4925p997L3362o789O691j1263j0094k6863J7455J745m029N365J7931n30
2466E9p130R471j0975j7172J3898O101M364O01k490O911J2012O873j0666j0936
2452I21J0291j5873r941K235j802j1470L251R285k403J0467M151R531Q592Q454
2438B5689r824j848j9532P550l484P394n073j2366N761Q69k792N168J0217l177
$$ plain form
2533 12438 5275 -9624 -11848 -5099 -2535 -10806 -4703 3011 4701 708 4164 -8009 10887 11966
2519 11966 -2780 -4624 6230 -16648 -13595 -2868 5742 13056 15172 24222 16915 5541 18037
2506 18037 8945 16292 29205 25785 17668 24171 25579 32134 39973 27112 8068 -6128 -7426 8463
2492 8463 1310 -4548 -1315 -2992 22840 10115 -1702 10255 3366 11622 15309 2046 -14925
2479 -14925 -22922 10440 3651 10342 -921 -11015 -37878 -20423 -18678 -22707 -17342 589 59
2466 59 -7071 2400 -8575 -25747 -11849 -5748 -1384 -783 -3273 3638 15650 22523 11857 921
2452 921 11212 -4661 -14602 -12367 -14169 -25639 -22388 -13103 -15506 -5039 -888 8643 17235 25689
2438 25689 15865 14017 -5515 2035 -1449 5945 872 -11494 -5733 -4864 -7656 -2488 7729 4552
2424D552j0936J2260j1868j2697m607J2815Q733K1797j3366j8117j6051R420J7518
2411e47J2772L64j6440j1927j4971K8712J1255o694k305K8568p135j0964J2790
2398B3478j1727j4917J3817J7722k3264j3038j7845P002Q652J2552M559j3111
2386f120j8881m088Q227M387J0935j372K933L787L832j2007n834J2884Q446J6867
2372B3996k780j8821P45m724L517J4475K660r228j6934j2529J2050J7368r112
2359F83N153J4409n342P588j1956o855j0780j922R118N592R048j3060j7100J8489
2345C065J8649R51j4899j3363J6319R023N493n481L826O347K209o863j9695j0032
2331d451l250K0814K486p203J942j6335k320J4219J4982k375j4218m20L995J072
$$ plain form
2424 4552 -6384 5876 -5992 -18689 -23296 -10481 -1748 20049 6683 -11434 -27485 -18065 -547
2411 -547 12225 12589 -3851 -15778 -30749 -2037 9218 2524 219 28787 21652 10688 23478
2398 23478 11751 -3166 10651 28373 5109 -7929 -25774 -18772 -10120 2432 6991 -6120
2386 -6120 -25001 -29089 -20862 -16475 -5540 -6912 -3979 -192 3640 -8367 -14201 -1317 7129 23996
2372 23996 21216 2395 3140 -1584 1933 16408 19068 9840 -7094 -19623 -7573 9795 683
2359 683 5836 20245 14903 22491 10535 3680 -7100 -9022 96 5688 14736 1676 -15424 3065
2345 3065 21714 22665 7766 -5597 10722 19745 25238 19757 23583 29930 32139 25276 5581 -4451
2331 -4451 -7701 13113 15599 8396 10338 -5997 -8317 5902 20884 18509 4291 3871 7866 8938
2317H938Q413M807M39R075k08k4683j3120P083p01K6181J4948j1998k0173J4783
2303B3784J3142J1982o67j4779p052j0622J9936J6072j641j1674l746p056J8950
2290D6629n708N15L0724j789j653J0223o051j3499N541K818J6782Q245o803j2996
2276G2978k503j884l778J0063l482j632Q439K7101O425j7683L616N387K7418j762
2262A28703J728k965k85L3563L5550K7816K2838M4178O1538O9750O4882L5396
2250E22692K4591N5403N7335M4362O2113Q4205J07300J62855K87002M57785P68297
2239B633940J092524J352893J217946O47911K3659j06999l40714p42081p73236
2230E005843p65159p17042o85795n86971m87423l43928k18315j16528q9530q7264
$$ plain form
2317 8938 17351 22158 22597 31672 31464 6781 -6339 744 43 26224 41172 29174 9001 23784
2303 23784 36926 48908 48241 33462 26410 15788 35724 51796 50155 38481 34735 27679 46629
2290 46629 40921 41436 72160 70371 68718 78941 72890 59391 64932 67750 84532 92777 85974 72978
2276 72978 70475 68591 64813 74876 71394 69762 78201 105302 111727 94044 97660 103047 130465 128703
2262 128703 130431 127466 127181 160744 196294 224110 246948 291126 352664 422414 487296 522692
2250 522692 547283 602686 660021 704383 766496 850701 958001 1120856 1407858 1865643 2633940
2239 2633940 3726464 5079357 6297303 6945214 6968873 6861874 6521160 5779079 5005843
2230 5005843 4240684 3523642 2837847 2250876 1763453 1419525 1201210 1084682 995152 907888
2220I07888q1904p4949r0726j05606n6987k2057l1627k8893l8535k0919k8204
2209C27481j3450M46j5845j1164j8500l0893j9097K279j4453j4370q348N968k274
2196A87780k4522o894n644J0623P111K703k625j2514j8880M72J4663r643l6050
2183A06580K996j3118O003j2198k644J341j5281R702K3740o098j1158j3679K899
2170G9085K1186j2511m201l0112q130J7716K7739R72k4142k0620M237O424q478
2157D9165j7310r76j6138K787n781k509J125j2885J5276K0594J9072j1345p308
2144C3767M183k9836P844J8020J2546j0557p973p473r315j3117K3963L3626J6607
2131G2285R542q409k5986O104O788l423J91l2109l1285j6757P114J39J3273J1921
$$ plain form
2220 907888 825984 751035 660309 554703 497716 475659 444032 415139 376604 355685 327481
2209 327481 314031 314477 298632 287468 268968 238075 218978 221257 206804 192434 184086 190054 187780
2196 187780 163258 156364 150720 161343 168454 171157 168532 156018 137138 137610 152273 142630 106580
2183 106580 109576 96458 102461 90263 87619 88960 73679 83381 107121 101023 89865 76186 79085
2170 79085 100271 87760 83559 53447 45317 63033 90772 91744 67602 46982 51219 57643 49165
2157 49165 31855 30879 14741 17528 11747 9238 10363 -2522 12754 33348 52420 41075 33767
2144 33767 37950 8114 15958 33978 46524 35967 27994 20521 11206 -1911 22052 55678 72285
2131 72285 81827 73418 47432 53536 60324 56901 57092 24983 -6302 -23059 -15945 -15806 -2533 9388
2117I388R127K606K3782j1110j6372n731j818J0078J2152K452k5841j7868j0978
2104b0133K176O394J0835l431j9027J8389J9436r368n217J413j7345J5744K5026
2091B4892j2158p449N15J1843p862K096k2955j6107J5240J5493r263j6253j5309
2078c7277j5645K0107J7122n42j8787n709J5930M49N185J8435j4192N339J599
2065g986R372O753j1650j3945J1454K7188m861j7813j8161K3824J0907o930p841
2052C11j1528j897m410O176K561l936j7581M251K9023k104n91j5572r934J1443
2038a3788K9047p100k7950k0192J0153J6092J2099k687k7399L819K976J23m046
2025b8853j4017P705L687J1585J1408m290j109q377N118J0727J2982j2231j6302
$$ plain form
2117 9388 18515 21121 44903 33793 17421 11690 9872 19950 32102 34554 8713 -9155 -20133
2104 -20133 -17957 -11563 -728 -4159 -23186 -4797 14639 5271 54 1467 -15878 -134 24892
2091 24892 12734 5285 5800 17643 9781 11877 -11078 -27185 -11945 3548 -5715 -21968 -37277
2078 -37277 -52922 -32815 -15693 -16235 -35022 -40731 -24801 -24352 -19167 -732 -14924 -9585 -7986
2065 -7986 1386 8139 -3511 -17456 -6002 21186 16325 -1488 -19649 4175 15082 8152 311
2052 311 -11217 -13114 -17524 -11348 -8787 -12723 -30304 -26053 2970 866 275 -15297 -25231 -13788
2038 -13788 15259 8159 -19791 -39983 -29830 -13738 -1639 -4326 -31725 -27906 -24930 -24807 -28853
2025 -28853 -42870 -35165 -31478 -19893 -8485 -12775 -13884 -22261 -17143 -6416 6566 -5665 -21967
2012b1967j7572K3520J5852k215j7410j128r887J3261Q625j0345K24j742K252
1999a8532N602l12j3912M724P563J6062K731j4458j7918j179J0506R618n63N618
1985d450r791n34n731N000j822M111j095J1180m780r553m378o479K1232J3888
1971F798R381j9577j2059P039J2079k671o355k320l85O020J334J1347j2009K522
1957A144l559j760o85j7734j1738j4120J1554L2568J1815j0893l886K856R275
1944D837j414j520j186K535j7619l657J1548j1407r441Q545J9207J4737j6773
1931a608j4759o70J3425j6386P723R874j7148o427J8986J5097n322j8265k0343
1918c5823P28R611l705j2995m010K059K4783q17j1111j1664K366J2650n46L810
$$ plain form
2012 -21967 -39539 -16019 -167 -2382 -19792 -20920 -30807 -17546 -8921 -19266 -19042 -20784 -18532
1999 -18532 -12930 -13242 -27154 -22430 -14867 1195 3926 -10532 -28450 -29629 -19123 -9505 -10068 -4450
1985 -4450 -14241 -14775 -20506 -15506 -17328 -13217 -14312 -3132 -7912 -17465 -21843 -28322 -7090 6798
1971 6798 16179 -3398 -15457 -8418 3661 990 -5365 -7685 -8070 -2050 -716 10631 -1378 1144
1957 1144 -2415 -4175 -4860 -22594 -34332 -48452 -36898 -4330 7485 -3408 -7294 -4438 4837
1944 4837 3423 1903 717 3252 -14367 -18024 -6476 -17883 -27324 -18779 428 15165 -1608
1931 -1608 -16367 -17037 -3612 -19998 -12275 -2401 -19549 -25976 -6990 8107 2785 -15480 -35823
1918 -35823 -35095 -25484 -29189 -42184 -46194 -44135 -19352 -20169 -31280 -42944 -40578 -27928 -28474 -24664
1904b4664j0776J7138J9521k968n82L462M008j2627j6791J1913L398j4943n074
1891b8985J2422J6399J0592l765j9502r405J1644J7089k0072L428M05Q439j3139
1878a4450o525K6593n109J231j8979n931q28n693n174K4038K942K226k1537k7618
1864e4814M757J8906K3370O074k0909j5875J2490L305K6443j2449j9170O037M707
1851a7128m281J4838k2458M069J4634m589j8107k786M417O981n710P145L183k035
1837b1827K397j2837L953K1108j0396j3350P316m222M456N606N846m989l531J2513
1823g957j424o515J0582k045k588K751m679j7232j3486J8929K6422j6561j0746
1810b4549N540J0141j688J5986j4623q376K765k0007L177J1933K0909m84q550
$$ plain form
1904 -24664 -35440 -18302 1219 -1749 -2331 1131 5139 -7488 -24279 -12366 -8968 -23911 -28985
1891 -28985 -16563 -164 10428 6663 -12839 -22244 -10600 6489 -13583 -10155 -9750 -1311 -14450
1878 -14450 -20975 5618 509 1740 -17239 -23170 -23998 -29691 -34865 -10827 -7885 -5659 -27196 -54814
1864 -54814 -50057 -31151 -7781 -1707 -22616 -38491 -26001 -22696 3747 -8702 -27872 -21835 -17128
1851 -17128 -21409 -6571 -29029 -24960 -10326 -14915 -33022 -35808 -31391 -24410 -30120 -22975 -19792 -21827
1837 -21827 -19430 -32267 -28314 -7206 -17602 -30952 -23636 -27858 -23402 -17796 -11950 -16939 -20470 -7957
1823 -7957 -9381 -15896 -5314 -7359 -9947 -7196 -11875 -29107 -42593 -23664 2758 -13803 -24549
1810 -24549 -19009 -8868 -10556 5430 -9193 -17569 -14804 -34811 -31634 -19701 1208 724 -7826
1797g826q762J4241L34m635o605j4232Q817N923m190J960K014j248l527k0034
1783c7770m266J2606J0964N156j2943K736M55J331K6449O183l335k4881j6414
1770c3729m567J5004M470o200J0413N678j4935J0857q63j4489L122Q578J0965
1757e696J9592j0322k741j0734L377O478j1258l554n1j546k231N17N004J4070
1743I05j3425k304Q735o817j978N384j0795r119Q220K270N126K996l376N206l0749
1728c9721j4437J1812L841p55N931p541r38O028J100P855K9525P1k3508p233J7497
1713a0473J2413n585j9998J7141j4157l93J6470o970l995j0093n532J174J8696
1700a1302j6477P36P404j2795q966J2400Q746J2284m258j1096j535M975j1085
$$ plain form
1797 -7826 -16588 -2347 -2013 -6648 -13253 -27485 -18668 -12745 -16935 -14975 -12961 -14209 -17736 -37770
1783 -37770 -42036 -29430 -18466 -13310 -26253 -23517 -23062 -21731 4718 10901 7566 -17315 -33729
1770 -33729 -38296 -23292 -18822 -25022 -14609 -8931 -23866 -13009 -13872 -28361 -25239 -16661 -5696
1757 -5696 13896 3574 833 -9901 -6524 -46 -11304 -14858 -14909 -16455 -18686 -18169 -13165 905
1743 905 -12520 -14824 -6089 -12906 -14884 -9500 -20295 -29414 -21194 -18924 -13798 -10802 -14178 -8972 -39721
1728 -39721 -54158 -42346 -38505 -39260 -33329 -40870 -41808 -35780 -34680 -26825 2700 2771 -20737 -27970 -10473
1713 -10473 1940 -3645 -23643 -6502 -20659 -21052 -4582 -11552 -15547 -25640 -31172 -29998 -11302
1700 -11302 -27779 -27043 -19639 -32434 -41400 -29000 -20254 -7970 -12228 -23324 -24859 -19884 -30969
1687c0969J8516l605K560J4310j2144M070O30O006n674o606M081K008j1484o975
1673b5276p170j979J475K247K200n963j2036J2298J4578J1273r492J7785R729
1660I669j8991l893J8574J106j3919j0784q353Q450P053P628n637j2265J6589
1647d773K0733j3092j3167n824J4967N952j3857j021q919m505n633J679J32o95
1633b8023K908k2188Q986K3908P540K219j2567J860J6154J542j4959m501j0850
1620b7971M000l016q207J4269j9786K4293j5389J1695J5385R14l933j1491j04
1607a9341r677J3703l911K185o795n328N967P339O13q037K7028j8492k2362J0634
1593b6474j75K577j908N488R398J1095R99m357J0573q836J3028j601m603l031
$$ plain form
1687 -30969 -12453 -16058 -13498 812 -11332 -7262 -6632 -626 -6300 -12906 -8825 -6817 -18301 -25276
1673 -25276 -32446 -34425 -32950 -30703 -28503 -34466 -46502 -34204 -19626 -8353 -17845 -60 9669
1660 9669 -9322 -13215 5359 6465 -7454 -18238 -26591 -18141 -11088 -3460 -9097 -21362 -4773
1647 -4773 15960 2868 -10299 -16123 -1156 4796 -9061 -10082 -19001 -23506 -29139 -27460 -27328 -28023
1633 -28023 -25115 -47303 -38317 -14409 -6869 -4650 -17217 -15357 797 2339 -12620 -17121 -27971
1620 -27971 -23971 -26987 -35194 -20925 -40711 -16418 -31807 -20112 -4727 -3813 -7746 -19237 -19341
1607 -19341 -29018 -15315 -19226 -17041 -23836 -29164 -23197 -15858 -15245 -23282 3746 -14746 -37108 -26474
1593 -26474 -26649 -24072 -25980 -20492 -11094 1 1000 -3357 7216 -1620 11408 9807 5204 2173
1579B173r739P615p916o232j4457J3649K3681L537o646L69k0744K411N181J2945
1565E827q480n844J1931K680k2409p618O609j492m977R553R537l336K06j3233
1551b1046q336l811m174J2634J0510n240K349J1641j0774N329J146L755J8439
1538A2422k3606j1414L690j5042K217K3419J7350o945R338j5343j7992j1143J9043
1525a4006J0133n65k324l836N019j0263J2143j323q086m675M496Q64J2245j2657
1511a2835J767l653P153j3110k0786N204N878O298q53m77K271k114j874J0002
1497a7129J1453J0686k2539N133N869L78j0452j1520m476K0054R6j1848P392J77
1483a6726m936n507P075L683p434J1189L706K262Q325j9925P583l0627J2166l120
$$ plain form
1579 2173 -7566 49 -7867 -14099 -28556 -14907 8774 12311 5665 6034 -14710 -12299 -7118 5827
1565 5827 -2653 -8497 3434 6114 -16295 -23913 -17304 -18796 -23773 -14220 -4683 -8019 -7813 -21046
1551 -21046 -29382 -33193 -37367 -24733 -14223 -19463 -17114 -5473 -16247 -10918 -9772 -6017 12422
1538 12422 -11184 -22598 -18908 -33950 -31733 -8314 9036 2091 11429 -3914 -21906 -33049 -14006
1525 -14006 -3873 -4438 -6762 -10598 -5579 -15842 -3699 -5022 -13108 -17783 -13287 -12423 -178 -12835
1511 -12835 -11068 -14721 -7568 -20678 -41464 -36260 -30382 -24084 -24937 -25414 -23143 -25257 -27131 -17129
1497 -17129 -5676 5010 -17529 -12396 -6527 -6149 -16601 -28121 -32597 -12543 -12447 -24295 -16903 -16726
1483 -16726 -21662 -27169 -20094 -16411 -23845 -12656 -8950 -6688 1637 -18288 -10705 -41332 -29166 -32286
1469c2286N078J5902O078M333j4609j8510l220K7028R869L358j036o969k771p442
1455a5197J0766N801J0073l608n742k569J42j1095O72J1148L98j618j1362o447
1441a8638n494R57l161n232K2724J2316j8877o833p250K1017p606J0189J1717
1428E829o421j1919k668J8134N822J0552j0597k992j4106Q863o208n909J4364
1415B744K089j2997j1611K512O505J6253O703j5021q224j2092J3507N395Q587
1402D350J2342k2506L075j035r457j1573J506k00J3663L508O073j7425j6074P075
1388b6678R947K5908q121j9102r346n23O635l882J5189M665p497Q266J5106j2446
1374a879o173q461Q659K718l362O515n492R953Q078j1701j2025r103j2264N481
$$ plain form
1469 -32286 -27208 -11306 -5228 -895 -15504 -34014 -37234 -10206 -337 3021 1985 -4984 -7755 -15197
1455 -15197 -4431 1370 11443 7835 2093 -476 -334 -11429 -10757 391 789 -829 -12191 -18638
1441 -18638 -24132 -23175 -26336 -31568 -8844 3472 -15405 -22238 -29488 -8471 -16077 -5888 5829
1428 5829 -592 -12511 -15179 2955 8777 19329 8732 5740 -8366 497 -5711 -11620 2744
1415 2744 4833 -8164 -19775 -17263 -10758 5495 12198 -2823 -11047 -23139 -9632 -4237 4350
1402 4350 16692 -5814 -2739 -3774 -13231 -24804 -23298 -23498 -9835 -6327 -254 -17679 -33753 -26678
1388 -26678 -16731 9177 1056 -18046 -27392 -27915 -21280 -25162 -9973 -5308 -12805 -4539 10567 -1879
1374 -1879 -8052 -16513 -7854 -5136 -8498 -1983 -7475 2478 10556 -1145 -13170 -22273 -34537 -29056
1360b9056m753n222K4395Q515k090k09o074P45Q620j78J8113k4894r700L770J3675
1345d343J1985Q50r137p675M488j178j7849k146Q559P929n331J3365j6605r211
1331b6299J3987L168j42p696n314K172R792J0801J0602o750j8211J9827J0471
1318A6408j0011j7086n865R234j7718J1209L632m40o153J5423q85r67n92L263
1304e48L809L572j6960o586J8990J3073j5368q577j7312l386R618J022L373Q366
1290f914m254o284l123J0312n03J3611J2262k0181j1348K606J653K585Q81R989
1276A292J113O253j5935j3839m075J7477P964q250j744l8j709P972l86p356j375
1261a2636J4690J701o84j5096J0847J0772K130L923o780k77L008Q26O138k0469
$$ plain form
1360 -29056 -33809 -39031 -14636 -6121 -8211 -8420 -14494 -13749 -5129 -5307 12806 -12088 -21788 -18018 -4343
1345 -4343 7642 8492 -645 -8320 -3832 -5010 -22859 -25005 -16446 -8517 -13848 -483 -17088 -26299
1331 -26299 -12312 -9144 -9286 -16982 -22296 -20124 -10332 469 11071 4321 -13890 5937 16408
1318 16408 6397 -10689 -16554 -7320 -25038 -13829 -10197 -10637 -16790 -1367 -2252 -3219 -3811 -548
1304 -548 3261 6833 -10127 -16713 2277 15350 -18 -8595 -25907 -29293 -19675 -18653 -15280 -6914
1290 -6914 -11168 -17452 -20575 -10263 -10766 2845 15107 -5074 -16422 -13816 -12163 -9578 -8697 1292
1276 1292 2405 8658 -7277 -21116 -25191 -7714 250 -8000 -9744 -9782 -11491 -3519 -3905 -11261 -12636
1261 -12636 2054 3755 3071 -12025 -1178 9594 11724 15647 8867 8590 11598 12424 18562 -1907
1247a907j4556P456n532n548p291O351J6963N27m032K009j3152J7725K1522J230
1233B1765j6239j5263N83J6798l560J838N91n293P33o460j968R045O377J3104
1219B2051k3355m195L8J655j3232J3991J0874j6124j0059K7288K2328o061j7613
1206G586j9121P63J0794J5693j0110j6547j5473o051K0845j0869p655K5145k882
1193g882J3637p534K390j6181q515O202p43J0078j3264m311O763J6227j2009K8702
1179A3560k4856j0482n313J9112n347j3349L725K7297K197r232L930n736j2376
1166a6870j1309K1280Q077j0775K729K1932j3259n470j2070m594N534K4554N003
1153A4762L355k4937o757J736J3486N137n535J0764Q224J0443j3363k4178l64
$$ plain form
1247 -1907 -16463 -9007 -14539 -20087 -27378 -21027 -4064 -3537 -7569 -5560 -18712 -987 20535 21765
1233 21765 5526 -9737 -9154 7644 4084 5922 6513 1220 1953 -4507 -6475 2570 8947 22051
1219 22051 -1304 -5499 -5461 -3806 -17038 -3047 7827 -8297 -18356 8932 31260 25199 7586
1206 7586 -11535 -10772 22 15715 5605 -10942 -26415 -32466 -11621 -22490 -30145 -5000 -7882
1193 -7882 5755 -1779 611 -15570 -24085 -17883 -18626 -8548 -21812 -26123 -19360 -3133 -15142 13560
1179 13560 -11296 -21778 -27091 -7979 -13326 -26675 -22950 4347 6544 -2688 1242 -4494 -16870
1166 -16870 -28179 -6899 1178 -9597 -6868 15064 1805 -3665 -15735 -20329 -14795 9759 14762
1153 14762 18117 -6820 -13577 -11841 1645 6782 1247 12011 20235 30678 17315 -6863 -7227
1140g227J5839J0963J5492j8879k6297k338J0006j3807J1651K0125j1260K427
1128F695j862j3752K531p757R607J4025j7150j5031o97J5162N216Q002j3631J5427
1114F785k0750J2810R799p888N009j3221k2059Q352J4707p067J0827K9306N272
1101C1882o19q870j7651o172R044J0961k6052m938m550J0261J1700k836J3690
1088A5850j7464K181l632k1386M039Q793J5911r149o974k715l884J8970Q451n351
1074C640j2895K949J2424J72K051j5369j3321J7795L2413N000k5527r987n980
1061f635n150J9068j046j4654J1876j402K764M612j2664Q13J7679K7141j6109
1048B6293l4148k2928j499J8845J7760q004o667j0561o009K0705J1790J719j1066
$$ plain form
1140 -7227 8612 19575 35067 16188 -10109 -12447 -2441 -16248 -4597 15528 4268 6695
1128 6695 4833 -8919 -6388 -14145 -4538 9487 -7663 -22694 -23391 -8229 -3013 4989 -8642 6785
1114 6785 -13965 -1155 8644 756 5765 -7456 -29515 -21163 -6456 -13523 -2696 26610 31882
1101 31882 31263 22393 4742 -1430 7614 18575 -7477 -12415 -16965 -6704 4996 2160 15850
1088 15850 -1614 567 -3065 -24451 -20412 -11619 4292 -4857 -11831 -14546 -18430 540 8991 3640
1074 3640 -9255 -6306 6118 6290 8341 -7028 -20349 -2554 29859 34859 9332 -655 -6635
1061 -6635 -11785 7283 6237 -8417 3459 2057 4821 9433 -3231 -2418 15261 42402 26293
1048 26293 -7855 -30783 -32282 -13437 4323 -3681 -10348 -20909 -26918 -6213 5577 7296 -3770
1035c770N619J2404j2443j5900o136O299J6270j940q801o919j3639K1706J722
1022e528P572o364j2952R388Q501J7816j039J629J1804j0476j1185j8363j4893
1009b4090J2566L731N26o01r174k004K1990L3753p014j5953k2612q677N838J5206
995C485N370j7073r04l562J4310O222n192j1751R219N053L450n144o313J2976
981A0146R738k490j0767o911J922P042N362J065k5380P169O144n466j2698p97
967a5921J5181J1606P44j663r562m729N890P787q257j4335J0943J7659m935k2185
953a1777q743j4835Q370J5879K2455k0355L310K1401J044l86j3618L38l165N140
939E058O935K020k744k536m010o523J2439j9355n103M96J4555J7721r269j1143
$$ plain form
1035 -3770 1849 14253 1810 -14090 -20226 -13927 2343 403 -8398 -15317 -28956 -7250 -5528
1022 -5528 2044 -4320 -17272 -7884 617 18433 17394 19023 30827 20351 9166 -9197 -24090
1009 -24090 -11524 -7793 -7267 -7868 -17042 -19046 2944 36697 29683 13730 -8882 -17559 -11721 3485
995 3485 8855 -8218 -9122 -12684 1626 7848 2656 -9095 124 5177 8627 3483 -2830 10146
981 10146 19884 17394 6627 -284 1638 8680 14042 15107 -10273 -3104 3040 -2426 -15124 -15921
967 -15921 -740 10866 11610 9947 385 -4344 1546 9333 1076 -13259 -2316 15343 10408 -11777
953 -11777 -20520 -35355 -26985 -11106 11349 -9006 -5696 15705 16749 16363 2745 3083 -82 5058
939 5058 11993 14013 11269 8733 4723 -1800 10639 -8716 -13819 -13323 1232 18953 9684 -1459
925a459k8013Q564K5244L7p392o768o748L0197J442k3074q287L764N571J0067
911C145k8325k0719J6048J1349L3076j4435j1573N254J845j904j374o108Q650
898e071K866J0442P659j6100l852k1243J5174J8350K692l826k0788R969K6545
885B2817P570o796l0002j1220K0083J8252p343k4332M282K0300L832j410k1831
872e798j2391l389m297J1932J9403N009p318K7957q06k3640l029q968K3976Q454
858B7095j9597k817K561J0160P99m572N146O31q350q016J392J2700J3117j3231
844A7018O57k251K86n064p939M653r567n852j3375O808K3041p850j6966N863R518
829a020L579J2723n468p921j319n36J4611n327r283M274L495L657k244j9880j4718
$$ plain form
925 -1459 -29472 -20908 4336 4373 -3019 -9787 -16535 13662 15104 -7970 -16257 -12493 -6922 3145
911 3145 -25180 -45899 -29851 -18502 14574 139 -11434 -6180 -4335 -6239 -7613 -13721 -5071
898 -5071 -2205 8237 15896 -204 -4056 -25299 -10125 8225 10917 7091 -13697 -3728 22817
885 22817 30387 23591 -6411 -17631 2452 20704 13361 -10971 -6689 13611 17443 16033 -5798
872 -5798 -18189 -21578 -25875 -13943 5460 10469 3151 31108 30302 6662 3633 -5335 18641 27095
858 27095 7498 4681 7242 17402 18201 13629 18775 19406 11056 3040 4432 17132 30249 17018
844 17018 17675 15424 15710 10646 2707 7360 -2207 -8059 -21434 -14626 8415 565 -16401 -10538 -1020
829 -1020 2559 15282 9814 1893 574 38 14649 9322 39 4313 7808 11465 9221 -10659 -25377
814b5377m499J1500J4663J3995n7n516j0322j8728p091Q628O768J6148J6021k723
800A3410k0293l665R756J8740J4121j9455k2333J415n661K4241J006n218J5337
787B1401N67J0394l2779j2902K5991k277N088O121j9567j5818q669J2892R874
774C16M335m166P103J8929J0658k3119j0696o827J7197J3995p143j3132k928r661
760e139k626J8429J188j2806l400J4942J1479k327n184j2630o082j867J8428j0154
746B251j3469J2686J0417k567j6182M324N784o139M18J8710k5336p128P604J8932
732A0305L489j2661p443J714k814K1842k0271q011K060K0377j7497O842J1144
719I076j0776K294K726J8707j4693K043K33j1694q040J6763J503p858L381M400
$$ plain form
814 -25377 -29876 -18376 -3713 10282 10225 4709 -5613 -24341 -31432 -22804 -16036 112 16133 13410
800 13410 -6883 -10548 -792 17948 32069 12614 -9719 -8304 -13965 10276 11282 6064 21401
787 21401 21968 32362 -417 -13319 12672 10395 15483 21604 2037 -13781 -22450 -9558 316
774 316 4651 485 7588 26517 37175 14056 3360 -3467 13730 27725 20582 7450 4522 -5139
760 -5139 -7765 10664 11852 -954 -4354 10588 22067 19740 14556 1926 -4156 -6023 12405 2251
746 2251 -11218 1468 11885 9318 -6864 -2540 3244 -2895 -2477 16233 -9103 -16231 -8627 10305
732 10305 13794 1133 -6310 -4596 -7410 14432 -5839 -13850 -11790 8587 -8910 -2068 9076
719 9076 -1700 594 3320 22027 7334 9377 9610 -2084 -10124 6639 8142 284 3665 8065
705H065j575n57O503l226P358m774m56k503K236J777l225j3155L782Q024m439
690C835J1676J9304L131M394J951l9161L967j241J45P460L461j8145j8831M757
676a3297J0600q249K2015o126J224J6422k770j4726M451M44M453K881n221j3255
662a154j169R665L956k090K087O901p213p006J1147m514k3937M822K6119o84j7030
647a00j2146r94J7632O039L202J5217j4033o047l301P56k162Q321j516j0870J0401
632A0399Q745k297o924K0452Q793L226l2428k5548j1428M2498L4156j0963m458
619C4223k1360K661j228J0632P664j5196k4901J1001j0345N227K0941J2764o178
606B5905n061n920j6134J134n076o919N305K5908r424L052j946m907J0176J9130
$$ plain form
705 8065 6490 5933 12436 9210 16568 11794 11338 8835 11071 12848 9623 -3532 250 8274 3835
690 3835 15511 34815 37946 42340 44291 5130 9097 7856 8001 15461 18922 777 -18054 -13297
676 -13297 -2697 -10946 11069 4943 6167 22589 19819 5093 9544 9988 14441 17322 12101 -1154
662 -1154 -2323 7342 11298 9208 11295 18196 10983 3977 15124 10610 -13327 -8505 17614 16930 -100
647 -100 -12246 -13240 4392 10431 13633 28850 14817 8770 5469 6225 4063 12384 10868 -2 10399
632 10399 19144 16847 9923 30375 39168 42394 9966 -15582 -27010 15488 49644 38681 34223
619 34223 12863 15524 14296 24928 32592 17396 -7505 3496 -6849 -1622 19319 32083 25905
606 25905 20844 14924 -1210 -76 -5152 -12071 -6766 19142 9718 12770 10824 5917 16093 35223
592C5223j2526L109j336j3233j5971L096R812J3180K380o270K357J958p753O168
578B0194M240N418l516j2784j7917J5174J2660K979j8681r22j1771J1336P79q677
564a488J4506k319m747J1893P092q547P728p131j0779R742L382j0921j8381o5
550a0035K6943r633q275j122O709J1716Q559P756q611P301l582k838j4533L058
536A3413m512p180J2159P595j4008j5518J659Q729P564l980K939o745J7942j97
522A9860p711P162O641j8136j968j3446J2472J2882m649K466Q451M564j0470k4222
508f104K875K0952L915k4022O363Q134j0466m178k48J875J4011J792K708o965
494A0642j779M53Q590O933o220J511j2401N222m633R46l298J1732n116j7036K3886
$$ plain form
592 35223 22697 25806 24470 11237 -4734 -1638 8174 21354 23734 17464 19821 21779 14026 20194
578 20194 24434 29852 26336 13552 -4365 10809 23469 26448 7767 6845 -4926 6410 7189 -1488
564 -1488 13018 10699 5952 17845 24937 16390 24118 16987 6208 15950 19332 8411 -9970 -10035
550 -10035 16908 7275 -1000 -2122 4587 16303 24862 32618 24007 31308 27726 24888 10355 13413
536 13413 8901 1721 13880 21475 7467 -8051 -6392 2337 9901 5921 8860 2115 20057 19860
522 19860 12149 19311 25952 7816 5848 -7598 4874 17756 13107 15573 24024 28588 18118 -6104
508 -6104 -3229 17723 21638 -2384 3979 12113 1647 -2531 -2779 -904 13107 14899 17607 10642
494 10642 8863 9316 17906 24839 18619 20130 7729 12951 8318 9264 5966 17698 12582 -4454 19432
479A9432J0779p908K139l618J1347j5084r474J0998q189m849P8R567j539J095
465A4774m065P168j136N989J1204J921j9886J396k1451L94J1216J453N880j4253
451F04j234M67k754J4087O219K841p953j0700P275L83L188K0830J294P538j2353
436B9732k7862L309o595K4043R669j863r599l531K922Q48j20q029J909l584K949
421A4198j5317j4515J029L1006J2841j0328J496n234m846N430J7826p949p085
408A8552j9000J2549N580p909R272q609Q407J1170o125q485p725R791Q783K737
394B8988j128k4103q451K0322O107K584J891j7875k2881M689J4187J1486m741
381A1075L279l432j2136N030o178J0035J2372j259l849n924K699j2240L472l018
$$ plain form
479 19432 30211 22303 24442 20824 32171 17087 7613 18611 10422 5573 5651 15218 13679 14774
465 14774 10709 17877 16741 22730 33934 35855 15969 17365 -4086 -3692 7524 8977 14857 604
451 604 -630 -163 -2917 11170 17389 20230 12277 1577 8852 9235 12423 33253 34547 42085 29732
436 29732 1870 5179 -1416 22627 32296 30433 20834 17303 20225 21073 20953 12924 14833 11249 14198
421 14198 -1119 -15634 -14605 16401 29242 18914 20410 15176 10330 15760 33586 25637 18552
408 18552 -448 12101 17681 9772 19044 10435 18842 30012 23887 15402 7677 17468 26251 28988
394 28988 27860 3757 -4694 15628 21735 24319 26210 8335 -14546 -9857 4330 15816 11075
381 11075 14354 10922 -1214 3816 -2362 7673 20045 18786 14937 9013 11712 -528 2944 -74
367g4J4081K0722m918j1250j8886r201K8648R609O102k430l834K897J0336Q6q836
352C3052j1104J2385o833k1691k01k3617J0100M1366o241l644p053m02Q161K556
338B6834J1751r955k4172J05k812R377J785J5737k497r109m586J103k2583L838
324e184K3386K3795M221j0803k455j6119J9762o391L239Q95Q65j6113j2832L582
310I848j3924M174J9850J3556J9814j6784j8476l752K2371r443j878P975k5737
297G594k4285O431J1327K230j9897L44J1355J3414p127J308J4568R539r806q577
283H418o330K342r617Q946O512J5624q591L042J1064j1746r76J8172m586K27P435
268C9936j5194j82l697M258j3285L364j9350o789O675L164J7753m703R839P878
$$ plain form
367 -74 14007 34729 29811 18561 -325 -9526 19122 28731 34833 32403 28569 31466 41802 41888 33052
352 33052 21948 34333 27500 5809 5608 -18009 -7909 33457 27216 23572 16519 16117 24278 26834
338 26834 38585 28630 4458 4563 1751 11128 12913 28650 26153 17044 12458 13561 -9022 -5184
324 -5184 18202 41997 46218 35415 32960 16841 36603 30212 33451 34346 35211 19098 6266 9848
310 9848 -4076 98 19948 33504 53318 36534 18058 14306 36677 27234 25356 33331 7594
297 7594 -16691 -10260 1067 3297 -16600 -16256 -4901 8513 1386 2694 17262 26801 16995 8418
283 8418 2088 4430 -5187 3759 10271 25895 17304 20346 31410 19664 18688 36860 32274 32501 39936
268 39936 24742 24560 20863 25121 11836 15200 -4150 -10939 -4264 -1100 16653 11950 21789 29667
254B9667J887k3413N691J1887J0820J2332j9327j6986j7573R722K1261P107M064
241C7139l716k3274o246J5331j940p324L607M698N579j4554p441L610J127K060
227H656L259J891j1599J2091n167j015Q346Q414O250o512p620j8550J9227Q082
213B5753n55R841j3527p208l89J1778K5886j0315k1153l571M515M272J4797j620
199C8504K717o651q363n62J528q477L879Q652l529j0956o573J5634n092k200J1178
184B9689m956J3204n866j1624j4732P276N760r048R816N301k546p787p260L30
170G557k96K0583k3736O383m452R433Q941M866k458j3418J3405o401r912m926
156E569P332J4426M735j6090n378l335J816K3465j4259p361N499O699j0429J6473
$$ plain form
254 29667 31554 8141 13832 25719 36539 48871 29544 12558 -5015 4707 25968 33075 37139
241 37139 33423 10149 3903 19234 17294 9970 13577 18275 23854 9300 1859 5469 6596 8656
227 8656 11915 13806 2207 14298 9131 8116 16462 24876 31126 24614 16994 -1556 17671 25753
213 25753 25198 35039 21512 14304 13915 25693 51579 41264 20111 16540 21055 25327 40124 38504
199 38504 41221 34570 26207 25645 27173 18696 22575 31227 27698 16742 10169 25803 20711 18511 29689
184 29689 24733 37937 32071 20447 5715 12991 18751 9703 19519 24820 22274 14487 7227 7557
170 7557 7261 27844 4108 10491 6039 15472 24413 29279 26821 13403 26808 20407 10495 5569
156 5569 12901 27327 32062 15972 10594 7259 9075 32540 18281 10920 16419 23118 12689 29162
142B9162J3667k1792O55J7578K580j6173L789M351N032p884O543N987L612k4141
128B2966j2129N648j33J0919P915j7827q292J2766J1583K057n369k878Q250j1856
114B3620m341Q350J1187L771q611k0224k310N639K378J738J990Q633n95j0911
100B0314r252o046J0184j6J0465K94N131k2719K208J2744O452P099p950l296m427
85B1185M195Q090j531n684N087K298o461j5266q209P408J4291k087j113k404j0660
70I139K419J514L352J0415O862j0928j0187Q62P875P260N740q000j0908m514m417
55F484N266J0770J1245P65j0929L651N318j1204N024o261P69Q74Q140k260j0433
40A7219O411M310k514R978j0283j4289J3521j0474O480J938J684j0782pk278L417
$$ plain form
142 29162 42829 21037 21692 39270 41850 25677 29466 33817 38849 30965 37508 43495 47107 22966
128 22966 10837 16485 16352 27271 35186 17359 9067 21833 33416 35473 30104 27226 35476 23620
114 23620 19279 27629 38816 42587 33976 13752 11442 17081 19459 21197 23187 31820 31225 20314
100 20314 11062 5016 15200 15184 25649 25943 31074 8355 10563 23307 29759 36858 28908 25612 21185
85 21185 25380 33470 31939 26255 31342 33640 27179 11913 3704 11112 25403 23316 22203 19799 9139
70 9139 11558 13072 16424 26839 33701 22773 12586 13448 21323 28583 34323 26323 15415 10901 6484
55 6484 11750 22520 33765 34530 23601 27252 32570 21366 26390 20129 20898 21772 29912 27652 17219
40 17219 23630 27940 25426 35404 25121 10832 24353 13879 20359 22297 23981 13199 13192 10914 14331
25A4331P513L78K2154o487k301K293j6828j1970J4676J227m117M505P388l457
$$ plain form
25 14331 21844 22222 44376 37889 35588 37881 21053 9083 23759 24986 20869 25374 32762 29305
$$ [...]
##END NTUPLES=NMR SPECTRUM
##END=
