##TITLE=1H_EC-3384(5)-3
 200.13Hz, CDCl3.
 8 sc
 13.8.2026
##JCAMPDX= 6.0         $$ Bruker NMR JCAMP-DX V2.0
##DATA TYPE= NMR SPECTRUM
##DATA CLASS= NTUPLES
##ORIGIN= UXNMR, Bruker Analytische Messtechnik GmbH
##OWNER= pz
$$ XWIN-NMR		Version 3.5
$$ Wed Aug 12 12:24:46 2026 Russian Standard Time (UT+4h)  she@DPX200
##.OBSERVE FREQUENCY= 200.1313
##.OBSERVE NUCLEUS= ^1H
##.ACQUISITION MODE= SIMULTANEOUS
##.ACQUISITION SCHEME= undefined
##.AVERAGES= 8
##.DIGITISER RES= 18
##SPECTROMETER/DATA SYSTEM= spect
##.PULSE SEQUENCE= zg30
##.SOLVENT NAME= CDCl3
##.SHIFT REFERENCE= (INTERNAL, CDCl3, 0, 15.5155)
##AUDIT TRAIL= $$ (NUMBER, WHEN, WHO, WHERE, WHAT)
$$ ##TITLE= Audit trail, XWIN-NMR		Version 3.5
$$ ##JCAMPDX= 5.01
$$ ##ORIGIN= Bruker BioSpin GmbH
$$ ##OWNER= she
$$ F:/spectra/data/she/nmr/H-C/1/pdata/1/auditp.txt
$$ ##AUDIT TRAIL=  $$ (NUMBER, WHEN, WHO, WHERE, WHAT)
(   1,<2026-08-12 12:23:30.31 +0400>,<she>,<DPX200>,
      <created by zg, POWCHK disabled, PULCHK disabled
       configuration hash MD5:
       00 E9 B6 7A A2 85 ED C7 34 08 36 98 17 FE 4E 26
       data hash MD5: 16K
       6E BD 11 59 1D E3 47 97 73 85 C2 3B 39 B2 96 88>)
(   2,<2026-08-12 12:23:32.68 +0400>,<she>,<DPX200>,
      <Start of raw data processing
       efp BC_mod = 2 LB = 0.25 FT_mod = 6 PKNL = 1 PHC0 = -4218.349 PHC1 = 4.792301 SI = 16K 
       data hash MD5: 16K
       10 A6 14 7A 7C 7D 94 61 5E 3A 0C 03 8C BE DC 1D>)
(   3,<2026-08-12 12:23:50.84 +0400>,<she>,<DPX200>,
      <pk PHC0 = 0.1324196 PHC1 = 6.8 
       data hash MD5: 16K
       71 7B A5 C6 A5 A7 1A 2A ED 09 CC 7D 44 A3 C2 0D>)
(   4,<2026-08-12 12:23:54.35 +0400>,<she>,<DPX200>,
      <abs ABSG = 5 
       data hash MD5: 16K
       40 B8 2B 31 A7 5B 24 07 8D 16 73 67 AA 38 D4 4A>)
$$ ##END=
$$ 
$$ hash MD5
$$ 84 BD 37 6F BA 45 ED 7E 1C B0 72 B4 CC 53 2F 8D
##$RELAX= 
##$RELAX= 
##$RELAX= 
##$RELAX= 
##$RELAX= 
##$RELAX= 
$$ Bruker specific parameters
$$ --------------------------
##$DU= <F:/spectra>
##$EXPNO= 1
##$NAME= <H-C>
##$PROCNO= 1
##$TYPE= <nmr>
##$USER= <she>
##$AMP= (0..31)
100 100 100 100 100 100 100 100 100 100 100 100 100 100 100 100 100 100 
100 100 100 100 100 100 100 100 100 100 100 100 100 100 
##$AQSEQ= 0
##$AQ_mod= 1
##$AUNM= <au_zg>
##$AUTOPOS= <>
##$BF1= 200.13
##$BF2= 200.13
##$BF3= 200.13
##$BF4= 200.13
##$BF5= 200.13
##$BF6= 200.13
##$BF7= 200.13
##$BF8= 200.13
##$BYTORDA= 1
##$CFDGTYP= 0
##$CFRGTYP= 5
##$CHEMSTR= <none>
##$CNST= (0..31)
1 1 145 1 1 1 1 1 1 1 1 1 1 1 1 1 1 1 1 1 1 1 1 1 1 1 1 1 1 1 1 1 
##$CPDPRG= <>
##$CPDPRG1= <>
##$CPDPRG2= <>
##$CPDPRG3= <>
##$CPDPRG4= <mlev>
##$CPDPRG5= <mlev>
##$CPDPRG6= <mlev>
##$CPDPRG7= <mlev>
##$CPDPRG8= <mlev>
##$CPDPRGB= <>
##$CPDPRGT= <>
##$D= (0..31)
0 0.7 0 0 0 0 0 0 0 0 0 0.03 0 0 0 0 0 0 0 0 0 0 0 0 0 0 0 0 0 0 0 0 
##$DATE= 1786523009
##$DBL= (0..7)
120 120 120 120 120 120 120 120 
##$DBP= (0..7)
150 150 150 150 150 150 150 150 
##$DBP07= 0
##$DBPNAM0= <>
##$DBPNAM1= <>
##$DBPNAM2= <>
##$DBPNAM3= <>
##$DBPNAM4= <>
$$ [...]
##$SUBNAM3= <"">
##$SUBNAM4= <"">
##$SUBNAM5= <"">
##$SUBNAM6= <"">
##$SUBNAM7= <"">
##$SUBNAM8= <"">
##$SUBNAM9= <"">
##$SW= 18.0517328524113
##$SWIBOX= (0..15)
0 0 2 0 0 0 0 0 0 0 0 0 0 0 0 0 
##$SW_h= 3612.71676300578
##$TD= 16384
##$TD0= 1
##$TE= 0
##$TE2= 300
##$TE3= 300
##$TEG= 300
##$TL= (0..7)
0 120 120 120 120 120 120 120 
##$TP= (0..7)
150 150 150 150 150 150 150 150 
##$TP07= 0
##$TPNAME0= <>
##$TPNAME1= <>
##$TPNAME2= <>
##$TPNAME3= <>
##$TPNAME4= <>
##$TPNAME5= <>
##$TPNAME6= <>
##$TPNAME7= <>
##$TPOAL= (0..7)
0.5 0.5 0.5 0.5 0.5 0.5 0.5 0.5 
##$TPOFFS= (0..7)
0 0 0 0 0 0 0 0 
##$TUNHIN= 0
##$TUNHOUT= 0
##$TUNXOUT= 0
##$USERA1= <user>
##$USERA2= <user>
##$USERA3= <user>
##$USERA4= <user>
##$USERA5= <user>
##$V9= 5
##$VALIST= <valist>
##$VCLIST= <CCCCCCCCCCCCCCC>
##$VD= 0
##$VDLIST= <DDDDDDDDDDDDDDD>
##$VPLIST= <PPPPPPPPPPPPPPP>
##$VTLIST= <TTTTTTTTTTTTTTT>
##$WBST= 1024
##$WBSW= 4
##$XGAIN= (0..3)
0 0 0 0 
##$XL= 0
##$YL= 0
##$YMAX_a= 647533
##$YMIN_a= -725106
##$ZGOPTNS= <>
##$ZL1= 120
##$ZL2= 120
##$ZL3= 120
##$ZL4= 120
##$ABSF1= 15.5045
##$ABSF2= -2.547349
##$ABSG= 5
##$ABSL= 3
##$ALPHA= 0
##$AQORDER= 0
##$ASSFAC= 0
##$ASSFACI= 0
##$ASSFACX= 0
##$ASSWID= 0
##$AUNMP= <proc_1d>
##$AZFE= 0.1
##$AZFW= 0.1
##$BCFW= 0
##$BC_mod= 2
##$BYTORDP= 0
##$COROFFS= 0
##$CY= -3
##$DATMOD= 1
##$DC= 0
##$DFILT= <>
##$DTYPP= 0
##$F1P= 0
##$F2P= 0
##$FCOR= 1
##$FTSIZE= 16384
##$FT_mod= 6
##$GAMMA= 0
##$GB= 0
##$INTBC= 1
##$INTSCL= 3.241238e-09
##$ISEN= 128
##$LB= 0.25
##$LEV0= 0
##$LPBIN= 0
##$MAXI= 10000
##$MC2= 0
##$MEAN= 0
##$ME_mod= 0
##$MI= 1.114404
##$NCOEF= 0
##$NC_proc= -5
##$NLEV= 6
##$NOISF1= 3.799351
##$NOISF2= 2.8
##$NSP= 0
##$NTH_PI= 0
##$NZP= 0
##$OFFSET= 15.51551
##$PC= 1
##$PHC0= -4218.217
##$PHC1= 11.5923
##$PH_mod= 1
##$PKNL= yes
##$PPARMOD= 0
##$PSCAL= 0
##$PSIGN= 0
##$REVERSE= no
##$SF= 200.130001239134
##$SI= 16384
##$SIGF1= 3
##$SIGF2= 2
##$SINO= 0.751879
##$SIOLD= 32768
##$SREGLST= <19F.Aceton>
##$SSB= 0
##$STSI= 16384
##$STSR= 0
##$SW_p= 3612.71676300578
##$SYMM= 0
##$S_DEV= 0
##$TDeff= 16384
##$TDoff= 0
##$TI= <>
##$TILT= no
##$TM1= 0
##$TM2= 0
##$TOPLEV= 0
##$USERP1= <user>
##$USERP2= <user>
##$USERP3= <user>
##$USERP4= <user>
##$USERP5= <user>
##$WDW= 1
##$XDIM= 16384
##$YMAX_p= 469750477
##$YMIN_p= -216107
$$ End of Bruker specific parameters
$$ ---------------------------------
##NTUPLES= NMR SPECTRUM
##VAR_NAME=  FREQUENCY,     SPECTRUM/REAL,   SPECTRUM/IMAG
##SYMBOL=    X,             R,               I
##VAR_TYPE=  INDEPENDENT,   DEPENDENT,       DEPENDENT
##VAR_FORM=  AFFN,          ASDF,            ASDF
##VAR_DIM=   16384,         16384,           16384
##UNITS=     HZ,            ARBITRARY UNITS, ARBITRARY UNITS
##FACTOR=    0.220516191357247, 1,           1
##FIRST=     3105.11895655604, 0,            0
##LAST=      -507.597806449739, 0,           0
##MIN=       -507.597806449739, -216107,     0
##MAX=       3105.11895655604, 469750477,    0
$$ Real data points
##PAGE= N=1
##DATA TABLE= (X++(R..R)), XYDATA
$$ [...]
7098H2644k1320n5574p5338L4548M5817N7605l6428o9158N313o618m4113K1431
$$ 82644 61324 5750 -69588 -35040 10777 68382 31954 -37204 -31891 -38509 -82622 -61191
7086f1191j724L435N0325L6969J0240l7326j18226j2362K7527P0626K4609J7795
$$ -61191 -62915 -59480 -9155 27814 38054 728 -117498 -129860 -102333 -31707 -7098 10697
7074A0697P1010n0135l9965m9397K7098N5022j6101P10m331J4173p4505l2225
$$ 10697 81707 31572 -8393 -57790 -30692 24330 8229 8939 4608 18781 -55724 -87949
7062h7949P0090O3565l1555J6920J1681m1407M0722n6240L3326j0865N9031m1058
$$ -87949 -17859 45706 14151 31071 42752 1345 42067 -14173 19153 8288 67319 26261
7050B6261n1147l793Q0257l8879o0719K1890j3849K8661n7944o1291N2205P4721
$$ 26261 -24886 -28679 51578 12699 -48020 -26130 -39979 -11318 -69262 -130553 -78348 -3627
7038c627L4625j6801l091O0170l7343l214J6579p5445J5603O7509o202p7578J5843
$$ -3627 30998 14197 11106 71276 33933 30719 47298 -28147 -12544 54965 48763 -28815 -12972
7025a2972O9151l921p1642L8321M8551l2597K3010K963n1772m8651N9662l0363
$$ -12972 56179 52258 -19384 18937 67488 34891 57901 60864 9092 -39559 20103 -10260
7013a0260k5284o3558O5826k0526J316L0544k698l2525m0094O0594N6114K3536
$$ -10260 -35544 -99102 -33276 -53802 -52486 -21942 -24640 -57165 -97259 -36665 19449 42985
7001D2985j02998j4709k8157P0553L7402M9618r6837j0438M8807r274N194K5095
$$ 42985 -60013 -74722 -102879 -32326 5076 54694 -42143 -52581 -3774 -13048 -7854 17241
6989A7241j5244N9759R3654n5998r2070k7015l4201J0841M9886n238N4996k6042
$$ 17241 1997 61756 155410 99412 7342 -19673 -53874 -43033 6853 1615 56611 30569
6977C0569q1674m566k3211n8032J396L8594K1637R85L7380K2277K2240K188j0765
$$ 30569 -51105 -55671 -78882 -136914 -135518 -96924 -75287 -74302 -36922 -14645 7595 9783 -982
6964i82k27O46m9633J8986N1582J9051J4055o75J5514k2952r6572J7938J5550
$$ -982 -1209 -563 -50196 -31210 20372 39423 53478 52803 68317 45365 -51207 -33269 -17719
6951a7719J5138J7951J839O954k7591j0665l0886o0384q90O5552K688o4172j2327
$$ -17719 -2581 15370 17209 24163 -3428 -14093 -44979 -105363 -106253 -40701 -38013 -102185 -114512
6938a14512L4760L9060k1948N205j7940p643K8408m3535L1354J3188P802j5988
$$ -114512 -79752 -40692 -62640 -57435 -75375 -83018 -54610 -98145 -66791 -53603 -45801 -61789
6926f1789K2037M9118K3200n7980M405M223l4296j4598K0986K8043k4805p4966
$$ -61789 -39752 9366 32566 -25414 -21009 -16786 -51082 -65680 -44694 -16651 -41456 -116422
6914a16422M2427J08141l7777l3533Q999j8205n419N7783n8348j21085K9500R2854
$$ -116422 -73995 34146 -3631 -37164 -28165 -46370 -51789 5994 -52354 -173439 -143939 -51085
6902e1085l4604J588J00298j0032o4467j388L2321Q585N336J316L2835K6133m0666
$$ -51085 -85689 -84101 16197 6165 -58302 -59690 -27369 -18784 -13448 -12132 20703 46836 6170
6889F170K7456m5339q2321N6392J03968m5108k8916J0168n5321o0493L4382N3900
$$ 6170 33626 -11713 -94034 -37642 66326 21218 -7698 2470 -52851 -113344 -78962 -25062
6877b5062o3965k0018K8853J6058o1476N0926l992j8637N2199k3385L7734n3859
$$ -25062 -89027 -109045 -80192 -64134 -125610 -74684 -78676 -97313 -45114 -68499 -30765 -84624
6865h4624l9634K2093J2506N4079K9382L9496j9297j6473R244L204j7589k8511
$$ -84624 -124258 -102165 -89659 -35580 -6198 33298 14001 -2472 6772 9976 -7613 -36124
6853c6124J5989O1287J9707k6500n5043k5203J1037N2935l508p8546M1360L3692
$$ -36124 -20135 41152 60859 34359 -20684 -45887 -34850 18085 14577 -63969 -22609 11083
6841A1083j6875J5898L8480k7083N098j01904l7615R8726J32557p2752m2160N0188
$$ 11083 -5792 10106 48586 21503 26601 -75303 -112918 -14192 118365 45613 3453 53641
6829E3641K9174m3945o560j1588K5607O8266M3991r0842k3635n6485r6495Q1487
$$ 53641 82815 38870 32310 20722 46329 114595 158586 67744 44109 -12376 -108871 -27384
6817b7384K4503K6107o0572n6539J22762M9444q0582n9969p163j0817j7783P7449
$$ -27384 -2881 23226 -37346 -93885 28877 78321 -2261 -62230 -69393 -80210 -97993 -20544
6805b0544K7957p8951J3501O6496L2491K8111P481m284o6611J8790m2163m2094
$$ -20544 7413 -71538 -58037 8459 40950 69061 76542 72258 5647 24437 -17726 -59820
6793e9820l4429Q0807Q6204J3240n7473l6540l5059k2505J3034J5004O9704q7614
$$ -59820 -94249 -13442 72762 86002 28529 -8011 -43070 -65575 -52541 -37537 32167 -55447
6781e5447n5095N2734j2579j3559k7484k7523q405N8171R9375l1528N6518M762
$$ -55447 -110542 -57808 -70387 -83946 -111430 -138953 -147358 -89187 10188 -21340 35178 39940
6769C9940k8668l2813r277J1082L2310J8047k1485R753q164M2441o0745l2954
$$ 39940 11272 -21541 -30818 -19736 12574 30621 9136 18889 10725 53166 -7579 -40533
6757d0533j7708J3357J3587J8650J2034M064n4267n223k417n3857k549M7202O010
$$ -40533 -58241 -44884 -31297 -12647 -613 3451 -50816 -56039 -58456 -112313 -114862 -67660 -61650
6744f1650N1719N8927m8196N0073J7940r8800P387J8717k5568L6182M2199o3814
$$ -61650 -9931 48996 800 50873 68813 -29987 -22600 -3883 -29451 6731 48930 -14884
6732a4884l0619L4792l248l8242L3264j5956J5322l1268P7975M2762m1556o9158
$$ -14884 -45503 -10711 -13959 -52201 -18937 -34893 -19571 -50839 27136 69898 28342 -40816
6720d0816r483N2559l9167l7577K2019L2187o7709j8712Q1060j7609K1356j6383
$$ -40816 -50299 2260 -36907 -74484 -52465 -20278 -87987 -106699 -25639 -43248 -21892 -38275
6708c8275L4333J4751P878Q289l6591j8788j3105N9261L4187j8647m4005M9742
$$ -38275 -3942 10809 18687 26976 -9615 -28403 -41508 17753 51940 33293 -10712 39030
6696C9030J4406l7292j4761j03827R382R0905O7701P227j98465k5203M2590P6155
$$ 39030 53436 16144 1383 -102444 -93062 -2157 65544 72771 -125694 -150897 -108307 -32152
6684c2152m0411N2123j6821m6462N973J61280q646q1523k4362J0977M6863J9387
$$ -32152 -72563 -20440 -37261 -83723 -77750 83530 74884 -6639 -31001 -20024 26839 46226
6672D6226M4865q152m6150k9550j7552L7664K921L1670M6578j01566k4958L8865
$$ 46226 91091 82939 36789 7239 -10313 27351 30272 61942 108520 6954 -18004 20861
6660B0861p6817p2026Q2234O2636J3674o734m299L478o3069M62K7372n5368N372
$$ 20861 -55956 -127982 -45748 16888 30562 23828 19529 23007 -40062 -39600 -12228 -67596 -62224
6647f2224J14063k4029j14711J01979L2394k6777L9161L5512m3557k6970l597
$$ -62224 51839 27810 -86901 15078 47472 20695 59856 95368 51811 24841 21244
6636B1244n0002M9574L192o9256M952j7564p8831M2233N8908n8711J4995N1695
$$ 21244 -28758 20816 24008 -45248 -40296 -57860 -136691 -94458 -35550 -94261 -79266 -27571
6624b7571P3022k3980p9439J5699K5752k1021n1488O688N7960R582n0437j3886
$$ -27571 45451 21471 -57968 -42269 -16517 -37538 -89026 -82338 -24378 -14796 -65233 -79119
6612g9119N7790L0725n8697m2407K2836L0565O5060K9693k8776n0437p099Q9130
$$ -79119 -21329 9396 -49301 -91708 -68872 -38307 26753 56446 27670 -22767 -29866 59264
6600E9264J1822n5083n9098J6575K1873o9622k5562O8450J7160R523L1989o8883
$$ 59264 71086 16003 -43095 -26520 -4647 -74269 -99831 -31381 -14221 -4698 27291 -41592
6588d1592J8744M345l2087L7631m6706j7079J7813O378L9253L7181l1194M737
$$ -41592 -22848 -18503 -50590 -12959 -59665 -76744 -58931 -52553 -13300 23881 -7313 -2576
6576b576R756k6415J8999O1714p434J7103j5689j2192M2496o129m0324o2168O5646
$$ -2576 7180 -19235 -236 61478 54044 71147 55458 43266 85762 79633 39309 -22859 42787
6563D2787N7742l1604J3538p4046n7350J2966r04o77R944N257m8173N0422j7369
$$ 42787 100529 68925 82463 8417 -48933 -35967 -36871 -37548 -27604 -22347 -70520 -20098 -37467
6550c7467j9164o795L1909L9474J0878j32k9141K9973K1201j758J0269n1065q3386
$$ -37467 -56631 -63426 -31517 7957 18835 18703 -10438 19535 40736 38978 49247 -1818 -85204
6537h5204j5480O3285K7202n0j3415O484m3352q3130K1064M3702k2320n1071P5891
$$ -85204 -100684 -37399 -10197 -10247 -23662 -17178 -60530 -143660 -122596 -78894 -101214 -152285 -76394
6524g6394L7122j07546o9289K0728O1710O4156P2657k5817L74J3974k4731K8073
$$ -76394 -39272 -146818 -216107 -195379 -133669 -69513 3144 -22673 -22299 -8325 -33056 -4983
6512d983K7081K3884l7549n9708J8824K9834L2775r4511j2308N4548L2222K1980
$$ -4983 22098 45982 8433 -51275 -32451 -2617 30158 -64353 -76661 -22113 10109 32089
6500C2089m1056l7877J3586M2271o7921o1885N6327j3725O9387o319n7503l3070
$$ 32089 -8967 -46844 -33258 9013 -58908 -120793 -64466 -78191 -8804 -15123 -72626 -105696
6488a05696J3196J3522l2979R9570M0491j3540J4440j8052j4704R893K5488K2206
$$ -105696 -92500 -78978 -111957 -12387 28104 14564 29004 10952 -3752 6141 31629 53835
6476E3835M0277j3519L9363k5372o1123k0923K9197P456k0444k7792j4495O067
$$ 53835 94112 80593 119956 94584 33461 12538 41735 49191 28747 955 -13540 -7473
6464g473j06o60n3057r4432K3726L7580M6736K5600m1038L6826M7262o995q0788
$$ -7473 -7579 -8239 -61296 -155728 -132002 -94422 -47686 -22086 -63124 -26298 20964 13969 -66819
6451f6819l8090M5071N9071N924O3395q8719P0124j1325K4826p0982m8148O1137
$$ -66819 -104909 -59838 -767 5157 68552 -20167 49957 38632 63458 -7524 -55672 5465
6439E465L7110l2213L9137k2095l8222Q214r047K1895N20L836l8432m8428l4990
$$ 5465 42575 10362 49499 27404 -10818 -2604 -11651 10244 10764 14600 -23832 -72260 -107250
6426a07250N2662m579k2188n6395K1383M0736O588M9729n588K5804M6391k5768
$$ -107250 -54588 -59167 -81355 -137750 -116367 -75631 -69043 -19314 -24902 902 47293 21525
6414B1525j6620L7450o0243l4734M7183r133p32O729j13226K5446K1327N1114
$$ 21525 4905 42355 -17888 -52622 -5439 -14572 -15304 -8575 -121801 -96355 -75028 -23914
6402b3914K706k0811N436p019K4365o454J4022k255n743n9478J9222L4889J307
$$ -23914 -21208 -42019 -36583 -43602 -19237 -25691 -11669 -13924 -19667 -79145 -59923 -25034 -23727
6389b3727k2986Q4552K2212j8057k7142m5015R800K7609L3417l0613J3176n3249
$$ -23727 -46713 37839 60051 41994 14852 -30163 -20363 7246 40663 10050 23226 -30023
6377c0023R3823J7263N590q2865q4621L9798M1126Q4028k9780j6261N427m0954
$$ -30023 63800 81063 86653 3788 -80833 -41035 91 84119 54339 38078 43505 2551
6365B551j767j504p3407Q2737p5022j9082M8966M8852L0174J1175l0933j05549
$$ 2551 784 -720 -74127 8610 -66412 -85494 -36528 12324 42498 53673 22740 -82809
6353h2809R5950L8004q5343K8257r129M1324n5868k4961l5471J9664K6812M8791
$$ -82809 13141 51145 -34198 -5941 -15070 26254 -29614 -54575 -90046 -70382 -43570 5221
6341E221k7004m0236K8624K3345j1806p364M4778o1069k7521R5304j0279m93J3409
$$ 5221 -21783 -62019 -33395 -10050 -21856 -29220 15558 -45511 -73032 22272 11993 11500 24909
6328B4909M8097J4076m3365J1486k9877K635k1679N1134K5519k4456r131l5420
$$ 24909 73006 87082 43717 55203 25326 27961 6282 57416 82935 58479 49348 13928
6316A3928N1072j537o8383J1793n3824L3353K4210L9596n1012n0156K6506q134
$$ 13928 65000 63463 -4920 6873 -46951 -13598 10612 50208 -804 -50960 -24454 -32588
6304c2588M2945o9206L5612l2806K0154N9123j8656P2763P973l4851l735K7378
$$ -32588 10357 -58849 -23237 -56043 -35889 23234 4578 77341 85314 50463 46728 74106
6292G4106L1879o5642O167J3781k7828k6653J1182N1112n3364j7422N0030m450
$$ 74106 105985 40343 46510 60291 32463 5810 16992 68104 14740 -2682 47348 42898
6280D2898n2887j5453N6459k807l2497j2213j5105k7632j1548M2139M5179j5365
$$ 42898 -9989 -25442 31017 28210 -4287 -16500 -31605 -59237 -70785 -28646 16533 1168
6268A168r024k664m0980N4055J6252j6515m3372j9040K0345J13945k1700l3507
$$ 1168 -7856 -10520 -51500 2555 18807 2292 -41080 -60120 -39775 74170 52470 18963
6256A8963Q882m2306j0360N8611O169j398j963P4641p2841j14741M2499q461J9949
$$ 18963 27845 -14461 -24821 33790 39959 38561 36598 111239 38398 -76343 -33844 -42305 -22356
6243b2356K0319m0893m8590K1776O2705k7711J2626m4945k71K6467j2699K8804
$$ -22356 -2037 -42930 -91520 -69744 -7039 -34750 -22124 -67069 -67340 -40873 -53572 -24768
6231b4768J9505N638L7393q5404K7766P1701m0904J259M2716l2051r560L0398
$$ -24768 -5263 375 37768 -47636 -19870 51831 10927 12186 54902 22851 13291 43689
6219D3689q2064j3579N116M4936l5880j9384L3179J5074k6608K5577M9275j1717
$$ 43689 -38375 -51954 -46838 -1902 -37782 -57166 -23987 -8913 -35521 -9944 39331 27614
6207B7614r466P6875l5649l5851j7656l0984l2020N3556M7709P737l209q4427
$$ 27614 18148 95023 59374 23523 5867 -25117 -57137 -3581 44128 51865 48656 -35771
6195c5771j2667o2632K4312O4582L3069K4154k5998j5901j410p514p6726L89J5475
$$ -35771 -48438 -111070 -86758 -22176 10893 35047 9049 -6852 -8262 -15776 -92502 -92113 -76638
6182g6638N8353N4025l5243n3943n9358J9272N9721r686O2271P3621l8558p2561
$$ -76638 -18285 35740 497 -53446 -112804 -93532 -33811 -43497 18774 92395 53837 -18724
6170a8724K0000l3188o7514O3177N9901q79j0704k5L0392p5673m1850k5386R7112
$$ -18724 1276 -31912 -99426 -36249 23652 22773 12069 12044 42436 -33237 -75087 -100473 -3361
6157c361L6692J307J2178l7557L4123n7227K2597j2313M949k5692K8101P187Q0862
$$ -3361 33331 34638 46816 9259 43382 -13845 8752 -3561 1388 -24304 3797 10984 91846
6144I1846k8165o5692k0017J2177q0846J4199J29430m3261n7828J2016J04400
$$ 91846 63681 -2011 -22028 -9851 -90697 -76498 52932 9671 -48157 -36141 68259
6133F8259P058p7001Q828l0256K0734K9217O606N9662l5260j6181k0427m082l6050
$$ 68259 75317 -1684 7144 -23112 -2378 26839 33445 93107 57847 41666 21239 17157 -18893
6120a8893Q1986m6324o8871M2799M6923m0118m7945O8704J8395o3278L0653m298
$$ -18893 63093 16769 -52102 -9303 37620 -2498 -50443 18261 36656 -26622 4031 -267
6108b67Q85N1909k2825m320J3143p082l3017k432k6441N4039L9437l669k0359
$$ -267 618 52527 29702 25382 38525 31443 -1574 -4006 -30447 23592 63029 59360 39001
6095C9001K2204q186p0628j8886m6092L0699N7254J1519J0457J8238k6008o4122
$$ 39001 61205 53019 -17609 -36495 -82587 -51888 5366 16885 27342 45580 19572 -44550
6083d4550O1851m527k1631k6271l8381J2810J17451o065l4160L9826m7638J15
$$ -44550 17301 12774 -8857 -35128 -73509 -60699 56752 50687 16527 56353 8715 8830
6071H830J8008J5429J2469J6782J2964j5213k8291q376o049J560n7750N4284K5418
$$ 8830 26838 42267 54736 71518 84482 69269 40978 32602 26553 28113 -29637 24647 50065
6058E0065o9406k0710K3929N7732J7343o0395l13m6413M0421J2123P9778N8092
$$ 50065 -19341 -40051 -16122 41610 58953 -1442 -1755 -48168 -7747 4376 84154 142246
6046A42246m5527l9073K5982j3187p6812N6080O7628n6283j5687O1676P116J5349
$$ 142246 96719 57646 83628 70441 -6371 49709 117337 61054 45367 107043 114159 129508
6034A29508k2682J1652n2783K0326K0464j4196n7465j7080K1433J4305J9663J7619
$$ 129508 106826 118478 65695 86021 106485 92289 34824 17744 39177 53482 73145 90764
6022I0764n4769m9746N0184k233K904m6206J3825p226M7604m2580K8093M1761
$$ 90764 35995 -13751 36433 34200 37104 -9102 4723 -2503 45101 2521 30614 72375
6010G2375m0723P849R318N562j7028M3564M403k9069q5988M6896o4862O7496Q0216
$$ 72375 31652 39501 48819 54381 37353 80917 85320 56251 -29737 17159 -47703 19793 100009
5997A00009k02q3161n9926O3148J2614l8405L8425N9097q3711l2684O2581j0797
$$ 100009 99807 16646 -43280 19868 32482 -5923 32502 91599 7888 -24796 37785 26988
5985B6988p8070L0706j5138q4388K7653J64220q8499m1605L7930K1403m7766O0976
$$ 26988 -51082 -20376 -35514 -119902 -92249 71971 -16528 -58133 -20203 1200 -46566 14410
5973A4410Q4133n5836j9039n496Q1050j25210m3905J7849M1969K5783J554m434
$$ 14410 98543 42707 23668 18172 99222 -25988 -69893 -52044 -10075 15708 17262 12828
5961A2828j25552j9439J14886k7828l6169J9604Q8752R9200l1984q650k4060o3226
$$ 12828 -112724 -132163 -17277 -45105 -81274 -61670 27082 126282 94298 85648 61588 -1638
5949a638k715O1522J4057p3254M2461l6243k1388j1307J4203N0602j9290k345
$$ -1638 -4353 57169 71226 -2028 40433 4190 -17198 -28505 -14302 36300 17010 14665
5937A4665P9239M084n8808o3414M0163K1080m1925M1835l5678o9097K3463J25174
$$ 14665 93904 97988 39180 -24234 15929 37009 -4916 36919 1241 -67856 -44393 80781
5925H0781l6183k6930L6033k0124j0580Q9250j3492n6567k4484M3590K5752L9349
$$ 80781 44598 17668 53701 33577 22997 112247 98755 42188 17704 61294 87046 126395
5913A26395n6k7653K2225k9811J0669m7055j3214O4773N2981N3010n1169K7291
$$ 126395 126339 98686 120911 91100 101769 54714 41500 106273 159254 212264 161095 188386
5901A88386O7017o9427k6721R967q786J1218K4663L0547j8898j03087m004R0481
$$ 188386 255403 185976 159255 169222 160436 171654 196317 226864 207966 104879 100875 191356
5889A91356k5618n644o9575Q6341P674l4301n408p5038m211J5659p6130o4383
$$ 191356 165738 160094 90519 176860 184534 150233 144825 69787 65576 81235 5105 -59278
5877e9278M216j5887J06521M4277n0209n562o8389l2076n341K1728L3844L4288
$$ -59278 -55062 -70949 35572 79849 29640 24078 -44311 -76387 -81728 -60000 -26156 8132
5865H132M1285J7366K1109m5259j5759L1426j797k9314o775K0417K3710o4615
$$ 8132 49417 66783 87892 42633 26874 58300 56503 27189 20414 40831 64541 -74
5853g4M3683L1245L2382M8731j10535L8628O2379m3189K5918m4432n7260J3457
$$ -74 43609 74854 107236 155967 45432 84060 146439 103250 129168 84736 27476 40933
5841D0933R2826J3236o3509o7131q76M9194l5067m3712l4123N5877O8566M1612
$$ 40933 133759 146995 83486 16355 15479 64673 29606 -14106 -48229 7648 76214 117826
5829A17826m2601r2772o62J45302K858k4333m1597J0093P8538r3339P6365M7546
$$ 117826 75225 -17547 -18209 127093 129951 105618 64021 74114 152652 59313 135678 183224
5817A83224J5225o2561p5855j5815l4977M6948Q040p0319p4450R8696M9790K0462
$$ 183224 198449 135888 60033 44218 9241 56189 64229 -6090 -80540 18156 67946 88408
5805H8408K6406j5501r120m5516O8951m2205r2373j1668Q1400O9946k3379J5680
$$ 88408 114814 99313 90193 44677 113628 71423 -20950 -32618 48782 118728 95349 111029
5793A11029P0501j9741j7834o0233m8429K2205R0187m3010p1144L7364K894M3725
$$ 111029 181530 161789 143955 83722 35293 57498 147685 104675 33531 70895 73789 117514
5781A17514j0562q0403l924l3685P1049O4112l0288p1941O2487R7953m7429m3021
$$ 117514 106952 26549 22625 -11060 59989 124101 93813 21872 84359 182312 134883 91862
5769I1862K608K302m4992J3105J9495R952l5261P7538J0898k4736k125M9988J3363
$$ 91862 94470 96772 51780 64885 84380 94332 59071 136609 147507 122771 120646 170634 183997
5756A83997J1116J6670l8134R374P9405o871n1471M00R2237n2385j11945j1036
$$ 183997 195113 211783 173649 183023 262428 255557 204086 204486 296723 244338 132393 121357
5744A21357L8645Q947m2501J4368k6418m614Q8210K5223n2872K5045J8435L8352
$$ 121357 160002 168949 126448 140816 114398 109784 197994 223217 170345 195390 213825 252177
5732B52177q5519j6222L0593L7454M2659J3507m3642K4786J28414L3590L9574
$$ 252177 166658 150436 181029 218483 261142 274649 231007 255793 384207 417797 457371
5721D57371M3419J3255P8455J60796N2680p1126o791K6329p143K0788O3517L8937
$$ 457371 500790 514045 592500 753296 805976 734850 728059 754388 747245 768033 831550 870487
5709H70487Q9420K14631N1181k8399j3875L1373j08149j59382j00362j11164n8548
$$ 870487 959907 1174538 1225719 1197320 1183445 1214818 1106669 947287 846925 735761 677213
5698F77213q5844k9315r0870n962N1438k2554N311j1035J6776m3906R760K2622
$$ 677213 591369 562054 471184 465222 516660 494106 499417 488382 505158 461252 471012 493634
5686D93634l5809m0011M8370P6604L3662P4572J51926K79132K79721K48651K07268
$$ 493634 457825 417814 466184 542788 576450 651022 802948 1082080 1361801 1610452 1817720
5675A817720R0907p7176j60086j26367j26550j55076j35705j67520j81541o9640
$$ 1817720 1908627 1831451 1671365 1544998 1418448 1263372 1127667 960147 778606 708966
5665G08966L1059k6865p4169k2796k2733k3920K6149J6277o1027q762O5245P6960
$$ 708966 740025 713160 638991 616195 593462 569542 595691 611968 550941 542179 607424 684384
5653F84384k2956J02604J55714R4522J93854L33140L47339L87196L14499J56241
$$ 684384 661428 764032 919746 1014268 1208122 1541262 1888601 2275797 2590296 2746537
5643B746537m4696p7100K2125j29916k25353j82309j19792n2073j36173j06238
$$ 2746537 2701841 2624741 2646866 2516950 2291597 2109288 1989496 1937423 1801250 1695012
5633A695012j32599j67875q2749q0360l7794j13891j32084j50086J0808n1636
$$ 1695012 1562413 1394538 1311789 1231429 1193635 1079744 947660 797574 808382 756746
5623G56746o1699k8552K3226r5320l0761L0099K2062N5922J02833J05275N2929
$$ 756746 695047 666495 689721 594401 563640 593739 615801 671723 774556 879831 932760
5612I32760K8652Q6973q932p7972j30726p4329j50760p8322O4918k7003k6917
$$ 932760 961412 1048385 1039453 961481 830755 756426 605666 527344 592262 565259 538342
5601E38342j1947M4821j04336l7419K6821R703n4153K5556J7529n7907l3777k7677
$$ 538342 526395 571216 466880 429461 456282 465985 411832 437388 454917 397010 363233 335556
5589C35556K7525M6740m346L4537j2579j7600j0985L000M810K1380K2330l2776
$$ 335556 363081 409821 405475 440012 427433 409833 398848 401848 406658 428038 450368 417592
5577D17592n4997P4635N7538p5648p6963L9063K5307l9269l8789J8231l157n381
$$ 417592 362595 437230 494768 419120 342157 381220 406527 367258 328469 346700 343543 338162
5565C38162K2950J8535r654j8367L1308N1104j5759Q610P371j7677M3401P6673
$$ 338162 361112 379647 369993 351626 382934 434038 418279 426889 434260 416583 459984 536657
5553E36657k280m9588K5097L6941N461N6944O7395q854l5268k8902l0926M3964
$$ 536657 534377 484789 509886 546827 552288 609232 676627 667773 632505 603603 572677 616641
5541F16641J6723k4661j4077o1901j6765K5888j0186j3659L734j4193J9372l326
$$ 616641 633364 608703 594626 532725 515960 541848 531662 518003 521737 507544 526916 523590
5529E23590q8921L4556R0928M6480j3665Q320L2150J11599O6988J8389k1535K2318
$$ 523590 434669 469225 560153 606633 592968 601288 633438 745037 812025 830414 808879 831197
5517H31197J14677j9514J05431P7248k8044r2144m514N5104R6614o509j8740m1209
$$ 831197 945874 926360 1031791 1109039 1080995 988851 984337 1039441 1136055 1129546 1110806 1069597
5505A069597j688K27L0579M9477L2521j0644J1526o216r5356J1561O7494J9930
$$ 1069597 1067909 1068136 1098715 1148192 1180713 1170069 1181595 1175379 1080023 1091584 1159078 1179008
5493A179008Q2707Q4059o4579l729Q8746R6565O3994P1363O7694n259K7093Q6574
$$ 1179008 1261715 1345774 1281195 1277466 1366212 1462777 1526771 1598134 1665828 1660569 1687662 1774236
5481A774236j7350o8102M3700o021P785J160P0316q586J7329J41503N4181o189
$$ 1774236 1756886 1688784 1732484 1726463 1734248 1735408 1805724 1797138 1814467 1955970 2010151 2003962
5469B003962o5474Q299L3284n5863L7402J17878j6809J0671J07929Q3087m5219
$$ 2003962 1938488 1946787 1980071 1924208 1961610 2079488 2062679 2073350 2181279 2264366 2219147
5458B219147O0706O8871R3584R9019J16215J38558O9387P6501J18071O2823P0880
$$ 2219147 2279853 2348724 2442308 2541327 2657542 2796100 2865487 2941988 3060059 3122882 3193762
5447C193762J38931J1804N1487P7709J35206J20744M4777R3090P6094P4142J85774
$$ 3193762 3332693 3344497 3395984 3473693 3608899 3729643 3774420 3867510 3943604 4017746 4203520
5436D203520J56794J47724K46623M17026N09967O61572Q95833P72889N36518L78399
$$ 4203520 4360314 4508038 4754661 5171687 5681654 6343226 7239059 8011948 8548466 8926865
5426H926865L37072K58294J60272J18050K30997L69022M95036O73743R75778J225904
$$ 8926865 9263937 9522231 9682503 9800553 10031550 10400572 10895608 11569351 12545129 13771033
5416A3771033J487716J822068K225343K782329M078573O270446J0198075J4363163
$$ 13771033 15258749 17080817 19306160 22088489 26167062 32437508 42635583 56998746
5408E6998746J7034270J6386217J1149143M889410K90918k691431n049639o386338
$$ 56998746 74033016 90419233 101568376 106457786 106748704 104057273 99007634 92621296
5400I2621296n508654j611746L808383Q150518R856827P375567K180451k655325
$$ 92621296 87112642 85500896 89309279 97459797 107316624 114692191 116872642 114217317
5392A14217317n839613q379861j0904479j2246469j1603429j0213245q967556
$$ 114217317 108377704 99997843 89093364 76846895 65243466 55030221 46062665
5385D6062665p884169o575934n063706l631146k666748k217928j811549j538219
$$ 46062665 38178496 31602562 26538856 22907710 20240962 18023034 16211485 14673266
5377A4673266j411623j071789q83296p45370o27333n28384m82457m95044m17451
$$ 14673266 13261643 12189854 11306558 10561188 9933855 9405471 8923014 8427970 8010519
5368H010519m32147l63974l17426k40001k82768k23513l21089k52594k25094j38131
$$ 8010519 7578372 7214398 6896972 6656971 6374203 6150690 5829601 5577007 5351913 5213782
5358E213782k29227j46279j64336k05548j69577j03628j34354j26267r0766k07240
$$ 5213782 4984555 4838276 4673940 4468392 4298815 4195187 4060833 3934566 3843800 3636560
5348C636560j50264r9301j74488j87024l2170j9945p3401r7771r0011j74342j33091
$$ 3636560 3486296 3386995 3212507 3025483 2993313 2973368 2899967 2802196 2712185 2537843 2404752
5337B404752j5447l2137n7389q4560l7163o1691r6102R961q7753j8658n1150j02916
$$ 2404752 2389305 2357168 2299779 2215219 2178056 2116365 2020263 2030224 1942471 1923813 1872663 1769747
5325A769747m537k8139L7442k4707p6227o2182l7099l209n4801m8898j01406j8886
$$ 1769747 1765210 1737071 1774513 1749806 1673579 1611397 1574298 1571089 1516288 1467390 1365984 1347098
5313A347098m914K4577k2944q3418r1031q7018n552n3575J6169m2658N843m9728
$$ 1347098 1342184 1366761 1343817 1260399 1169368 1082350 1076798 1023223 1039392 996734 1002577 952849
5301I52849m3457m6292q0746l4004R6334k8851r5109J8023L5050N5655o4900K6917
$$ 952849 909392 863100 782354 748350 844684 815833 720724 738747 773797 829452 764552 791469
5289G91469K7061M4545p1845n0576j253O197l2276n3136K6966M9786L1840k3008
$$ 791469 818530 863075 791230 740654 739401 745598 713322 660186 687152 736938 768778 745770
5277G45770k3933l7823m2426M314K7626O4925q8083q3810o0564K3802J638o8191
$$ 745770 721837 684014 641588 645902 673528 738453 650370 566560 505996 529798 531436 463245
5265D63245K5164P5351K2295k6673k3660j6984K5987L8531j1443p1669k8885m005
$$ 463245 488409 563760 586055 559382 535722 518738 544725 583256 571813 500144 471259 467254
5253D67254l314R827n5917l6570M6827j5997l1368N506j3350J2424M0209p1152
$$ 467254 463940 473767 417850 381280 428107 412110 380742 386248 372898 385322 425531 354379
5241C54379l4350J1082k6653o550N9397p4936j5028J0047k8726n3549o3919J07305
$$ 354379 320029 331111 304458 297908 357305 282369 267341 277388 248662 195113 131194 238499
5229B38499J50564r83r8290m7995N5091J606N286m2357j94O538J0661M7785j0015
$$ 238499 389063 388080 289790 241795 296886 298492 303778 261421 261227 267765 278426 326211 316196
5216C16196L610j0503q4384J8060Q843m0052K5675k8853o916J7043r675p7296
$$ 316196 319806 309303 224919 242979 251822 211770 237445 208592 201676 218719 209044 131748
5204A31748J4676O39p5701R2631J0414j7204o519m9717L6818o8526M4790K8104
$$ 131748 146424 147063 71362 163993 174407 157203 150684 100967 137785 69259 114049 142153
5192A42153K8431K8002k1592m7365M1818J2760J4785L5666J4079o5455j5494O3492
$$ 142153 170584 198586 176994 129629 171447 184207 198992 234658 248737 183282 167788 231280
5180B31280O5150q8703q0489k4454k9146J02801j2462m4661m5104L5783R808l2611
$$ 231280 296430 207727 127238 102784 73638 176439 163977 119316 74212 109995 119803 87192
5168H7192J3103J8787Q88m5443l1661L4818n0199R0616Q56R541j7278J735J25337
$$ 87192 100295 119082 119970 74527 42866 77684 27485 118101 118957 128498 111220 112955 238292
5155B38292r0233m4533k4730R9337K2838L774j2904r1251j4027J1616K8747n9469
$$ 238292 148059 103526 78796 178133 200971 204745 191841 100590 86563 98179 126926 67457
5143F7457j2891P910J3795L6267J9208o8878n6626L3519K2319j1222o6156J5401
$$ 67457 54566 62476 76271 112538 131746 62868 6242 39761 62080 50858 -15298 103
5131A03O1297m4632k072J6401j3536O251K2675n1547l100Q2873J09295N7575j12910
$$ 103 61400 16768 14696 31097 17561 23812 46487 -5060 -8160 74713 184008 241583 128673
5118A28673k451N6196M0783n6483m1234m0293L6432m915k9658J5235j8960K0708
$$ 128673 126222 182418 223201 166718 125484 85191 121623 116708 87050 102285 83325 104033
5106A04033M2292l1500m2472q1N5082L8100j04368O7885Q906k1189L0759M1757
$$ 104033 146325 114825 72353 72272 127354 165454 61086 128971 137877 116688 147447 189204
5094A89204L6001J05270J59630R7021K7573l0138j7240K5090j08040k9515J12
$$ 189204 225205 330475 490105 587126 614699 584561 567321 592411 484371 454856 454968
5083D54968l1888O1897Q4602J2231n6432j560O8796j7609q1146m9807o8300l2111
$$ 454968 423080 484977 569579 581810 525378 523818 592614 575005 493859 444052 375752 343641
5071C43641r7858q5728r4109R1786O6923j37119m1533N3316l0082L6310O617j7264
$$ 343641 245783 160055 65946 157732 224655 87536 46003 99319 69237 105547 112164 94900
5059I4900l926j1429M4823q36J1106l5685j5373L0718L94l1595K4659r385O232
$$ 94900 90974 79545 124368 123532 134638 98953 83580 114298 114692 83097 107756 98371 104603
5046A04603j1418j08031J7760N0692j3458o1422n5752Q5031R6515j1148l1189
$$ 104603 93185 -14846 2914 53606 40148 -21274 -77026 8005 104520 93372 62183
5035F2183p5899K6862M1685N071N7249q4912j9365L3858J2751k8132N1450N4605
$$ 62183 -13716 13146 54831 59902 117151 32239 12874 46732 59483 31351 82801 137406
5023A37406m679m5794j1647k1501l8564M8053l4778l4060M4933j2439J3589o8755
$$ 137406 132727 86933 75286 53785 15221 63274 28496 -5564 39369 26930 40519 -28236
5011b8236k180M9792K5128M202k9258J2170k840K7227J3347K3886n9688n6694
$$ -28236 -30416 19376 44504 48706 19448 31618 28778 56005 69352 93238 33550 -23144
4999b3144k1186J20407J8564l0411J16936O7474J5977m7911n4926r694L6161Q5730
$$ -23144 -44330 76077 94641 64230 181166 248640 264617 216706 161780 152086 188247 273977
4987B73977J2312j13776o1344R3574O5m5089l946o256k5119q969k0189j6193j3057
$$ 273977 286289 172513 111169 204743 204808 159719 155773 149517 124398 115429 95240 79047 65990
4974F5990O0070N1063j06908n6827N2289J4314O837R26q004J2222P741l6307k5600
$$ 65990 126060 177123 70215 13388 65677 79991 86828 87754 79750 91972 99713 63406 37806
4961C7806K5785L5839L2146o553m3294J2488K425J1161j2320O791J3375m0209
$$ 37806 63591 99430 131576 125023 81729 94217 96642 107803 95483 102274 115649 75440
4949G5440Q5126M1938o5445j38568N2242J42118n7269j7057k2349l5670M5406
$$ 75440 160566 202504 137059 -1509 50733 192851 135582 118525 96176 60506 105912
4938A05912O1255o4823q9056N9821Q2834j53905j1436Q6132K8502o5922K7746
$$ 105912 167167 102344 13288 73109 155943 2038 -9398 76734 105236 39314 67060
4927F7060R5002m187J4829P1062o433k5187L893K4862m1197o9942k2905r376P5863
$$ 67060 162062 157875 172704 243766 237333 212146 216039 240901 199704 129762 106857 97481 173344
4914A73344k7542n9194n6405J22488J1070r7122m9222l0126M7249J04519p8666
$$ 173344 145802 86608 30203 152691 163761 66639 17417 -12709 34540 139059 60393
4903F0393m1033J7613M3585l4731J6658K4223r7937O6587P0118l2835r2674L6038
$$ 60393 19360 36973 80558 45827 62485 86708 -11229 55358 125476 92641 -33 36005
4891C6005K9257l1817L1515j4854r30O547O8675Q224m5583l2718n94J9318Q659
$$ 36005 65262 33445 64960 50106 49176 55723 124398 132622 87039 54321 53727 73045 81704
4878H1704l6202J6181J9282J00149m799m3188m1151k9986N7007m044k6328J8129
$$ 81704 45502 61683 80965 181114 176315 133127 91976 61990 118997 114953 88625 106754
4866A06754M0952M2568L1045m2630L3261Q6424N3575q5268n4932L6333L0166K4251
$$ 106754 147706 190274 221319 178689 211950 298374 351949 266681 211749 248082 278248 302499
4854C02499O2528N1087O0692K0476l3670j5143q5667o2063m1710L0289L2346p753
$$ 302499 365027 416114 476806 497282 463612 448469 362802 300739 259029 289318 321664 313911
4842C13911k9691J7456n7761q1663r738O6491q957r0588K0032N1081m4874m5078
$$ 313911 284220 301676 243915 162252 152514 219005 210048 119460 139492 190573 145699 100621
4830A00621Q254N7525j4777j0921j7282J4079q286k1664L6534o412l1106k8991
$$ 100621 108875 166400 151623 140702 123420 137499 129213 107549 144083 137671 106565 77574
4818G7574J47169m7112J8598m7008N3077k5728L9186K5517j63550j184J05716
$$ 77574 224743 177631 196229 149221 202298 176570 215756 241273 77723 76539 182255
4807A82255K2102Q245m9092L518l1604k7973p326N016R153n3875m6274O3875N9312
$$ 182255 204357 212602 163510 167028 135424 107451 100125 105141 114294 60419 14145 78020 137332
4794A37332L1537j7797p3637O5549K6100l924R1024Q5547l8229l819O501N82l0208
$$ 137332 168869 151072 77435 142984 169084 165160 256184 341731 303502 299683 306184 306766 276558
4781B76558q7926J3607K9326Q76l5428L1517j3872p5102j9010l8030O364l1030
$$ 276558 188632 202239 231565 232441 197013 228530 214658 139556 120546 82516 88880 57850
4769E7850J02997O2220l5379l3806j081o1074K8112M4636J8589k8434j8552j0156
$$ 57850 160847 223067 187688 153882 152801 91727 119839 164475 183064 154630 136078 125922
4757A25922k74R9064L5229j04309L76P684M4475K8196o4102m2316n1713J437Q3323
$$ 125922 125648 224712 259941 155632 156008 163692 208167 236363 172261 129945 78232 79669 162992
4744A62992K8758j34519m029l1460J5381J50334l2881j21818o0296N1975Q2795
$$ 162992 191750 57231 53202 21742 37123 187457 154576 32758 -27538 24437 107232
4733A07232m4620m5342Q504M4602M3124k279k2465L4589O5857n1314n7476N1874
$$ 107232 62612 17270 25774 70376 113500 111221 88756 123345 189202 137888 80412 132286
4721A32286k1521L0175j2048L4022J2419N7L2604j21536J306j0223K601k9453
$$ 132286 110765 140940 128892 162914 175333 175390 207994 86458 87764 77541 80142 50689
4709E0689n092N2504M1427M0457j7824r5112n333m197K6634O5654l6235K2618
$$ 50689 45597 98101 139528 179985 162161 67049 61716 57519 84153 149807 113572 136190
4697A36190o9253J2096M2041m6684L4713K3060K0043j8023K2387L2533j04780
$$ 136190 66937 79033 121074 74390 109103 132163 152206 134183 156570 189103 84323
4686H4323n3000N4513M1401p517M3449Q635k4768N443m8870l3727L6323K04q0893
$$ 84323 31323 85836 127237 119720 163169 171804 147036 152479 103609 69882 106205 106409 25516
4673B5516k6521K5708J11483m0406m5982P3972R845j3707K224j8049O280K9198
$$ 25516 -1005 24703 136186 95780 49798 123770 133615 119908 122132 104083 110363 139561
4661A39561R8017L774r5261l4287k7092R0995N360L9840K2248o5422l0636m0437
$$ 139561 237578 241352 146091 111804 84712 175707 181067 220907 243155 177733 147097 106660
4649A06660K9542k206N528k0355J7720m276L3863j2918k3655m2806K1836P4633
$$ 106660 136202 133996 139524 119169 136889 132613 166476 153558 129903 87097 108933 183566
4637A83566K1002k3280k2755k9943l397R1817o424q0264k1281O5439Q5895J2962
$$ 183566 204568 181288 158533 128590 125193 217010 210586 130322 109041 174480 260375 273337
4625B73337m5681r9217P2792O2544n0906n712R068j2030Q890J0473J9274k1965
$$ 273337 227656 128439 201231 263775 212869 207157 216225 204195 213085 223558 242832 220867
4613B20867M2446P0357j13686M4447J1669o5042n6344j0218O6897N7327l3255
$$ 220867 263313 333670 219984 264431 276100 211058 154714 144496 211393 268720 235465
4602B35465R929o4434n8930P9012P5999o9854l2371j2056O0972N0863M2347k9143
$$ 235465 245394 180960 122030 201042 277041 207187 174816 162760 223732 274595 316942 287799
4590B87799j02076n0239O9379O8748J2494P792O2060K969q0646q3467N3769K4738
$$ 287799 185723 135484 204863 273611 286105 293897 355957 358926 278280 194813 248582 273320
4578B73320j0507k1156j2590n4670k3167J01418P626n7682Q6707Q0630l0218m5027
$$ 273320 262813 241657 229067 174397 151230 252648 260274 202592 289299 369929 339711 294684
4566B94684J1139r379o805M5735m2332k5976Q6554L7316o2423j22485k9203J3727
$$ 294684 305823 296444 289639 335374 293042 267066 353620 390936 328513 206028 176825 190552
4554A90552J44015N7236o1546J0683o691L6920L187L332l3417j6757M0259J9827
$$ 190552 334567 391803 330257 340940 334249 371169 374356 377688 344271 327514 367773 387600
4542C87600m9441j0711K919O7930L0502J2950J6407n6972j6300O9437l0276j6503
$$ 387600 338159 327448 330367 398297 428799 441749 458156 401184 384884 454321 424045 407542
4530D07542L1195l4733j19692P5111O0199l2547R686P0866K2396j9908K9388Q0041
$$ 407542 438737 404004 284312 359423 419622 387075 396761 467627 490023 470115 499503 579544
4518E79544j23363L8019Q7538j8469K0956l0631L1725K2705N0819L5840K7404
$$ 579544 456181 494200 581738 563269 584225 553594 585319 608024 658843 694683 722087
4507G22087J043m6735M9675O0910r924K1485Q9618m3917O7829m6934M6027N7887
$$ 722087 723130 676395 726070 786980 777056 798541 888159 844242 912071 865137 911164 969051
4495I69051L3502J0047m5894N0767K8878j5926n8181r6925M895J13463N3504K1712
$$ 969051 1002553 1012600 966706 1017473 1046351 1030425 972244 875319 880214 993677 1047181 1068893
4483A068893n9348o600L808N1622k7749n2186P2176J09557r0793P516j1257M2745
$$ 1068893 1009545 1002945 1006753 1058375 1030626 978440 1050616 1160173 1069380 1076896 1065639 1108384
4471A108384J9814L3519K3817j8166K0340n1731L3107j01139n6064m3496L5497
$$ 1108384 1128198 1161717 1185534 1167368 1187708 1135977 1169084 1067945 1011881 968385 1003882
4460A003882K9141l1885q048K4809K3856n3792J3643l177q3513n2716J1112J3129
$$ 1003882 1033023 1001138 993090 1017899 1041755 987963 1001606 998429 914916 862200 873312 886441
4448H86441P4630K3516L0673j11897m9011J49523j0559o5378M8044J9041q9709
$$ 886441 961071 984587 1015260 903363 854352 1003875 993316 927938 975982 995023 905314
4437I05314J1139O6987j03492m7267j8097M4392j6213K581p524k4077k2681l7192
$$ 905314 916453 983440 879948 832681 814584 858976 842763 845344 837820 813743 791062 753870
4425G53870o560o6856P3322M4876j7150J7251K6970O0774Q18K317L6972M9880
$$ 753870 747310 680454 753776 798652 781502 798753 825723 886497 887315 889632 926604 976484
4413I76484R0031R038L9027k2512l3563M2479P3177l1429K0373J09589J578M4653
$$ 976484 1066515 1075553 1114580 1092068 1058505 1100984 1174161 1142732 1163105 1272694 1274272 1318925
4401A318925M4541J0017l4072o459L1555p193o0073o6297j2286K5664P7473O5235
$$ 1318925 1363466 1373483 1339411 1332952 1364507 1357314 1297241 1230944 1218658 1244322 1321795 1387030
4389A387030j3838o8636N9416M0355j4326L0423J0141l034l612J9426K876K3970
$$ 1387030 1373192 1304556 1363972 1404327 1390001 1420424 1430565 1427531 1423919 1443345 1446221 1470191
4377A470191N7333L7740k5366j0578J9095R3886O655P328K2117N5784J6J6840
$$ 1470191 1527524 1565264 1539898 1529320 1548415 1642301 1648956 1656284 1678401 1734185 1734201 1751041
4365A751041M7867m6600j0085R6667N6948K08224R3030j9519L9282o7066l2296
$$ 1751041 1798908 1752308 1742223 1838890 1895838 2104062 2197092 2177573 2216855 2149789 2117493
4354B117493P2150L2435n553M0171N7830Q286J5236J4647O9441J01034M9579N4161
$$ 2117493 2189643 2222078 2216525 2256696 2314526 2322812 2338048 2352695 2422136 2523170 2572749 2626910
4342B626910l9824P1200J41783J02260M8526n682n0773R3221R6575Q0722k5349
$$ 2626910 2587086 2658286 2800069 2902329 2950855 2945173 2894400 2987621 3084196 3164918 3139569
4331C139569J07327L6484J8968J47653Q617N3745O5858J63006J42171M7083R6049
$$ 3139569 3246896 3283380 3302348 3450001 3458618 3512363 3578221 3741227 3883398 3930481 4026530
4320D026530K24669J84001K52103K30830J59049K64385L21241M25238M39629M64797
$$ 4026530 4251199 4435200 4687303 4918133 5077182 5341567 5662808 6088046 6527675 6992472
4310F992472M87079O29541Q17112J260189K066361L297584M444278M798015L910469
$$ 6992472 7479551 8109092 8926204 10186393 12252754 15550338 19994616 24792631 28703100
4301B8703100K197451P98271k6341m73361q53448o99642M35634L098520N542208
$$ 28703100 30900551 31698822 31672481 31199120 30345672 29646030 30081664 33180184 38722392
4292C8722392P007852O576895L446050L41955j459203k529907l882296m741602
$$ 38722392 45730244 52307139 55753189 56095144 54635941 52106034 48223738 43482136
4284D3482136m307398k768145j057837J65123P02937J29451q19190j546349k110731
$$ 43482136 39174738 36406593 35348756 35513879 36216816 36346267 35527077 33980728 31869997
4275C1869997k584555l101910l131016k882679k409389k102463j790845j385445
$$ 31869997 29285442 26183532 23052516 20169837 17760448 15657985 13867140 12481695
4267A2481695j018437o88602m50365l72699k95051k37985j46445j31839j16077
$$ 12481695 11463258 10774656 10324291 9951592 9656541 9418556 9272111 9140272 9024195
4258I024195p4957k6530k6510j5793N3074K3721Q9932Q8516J07487Q2347R7387
$$ 9024195 8949238 8922708 8896198 8880405 8933479 8957200 9047132 9135648 9243135 9325482 9422869
4247I422869J37550J07812J10704J49521P5210K35543L12606J88391J80669K60045
$$ 9422869 9560419 9668231 9778935 9928456 10003666 10239209 10551815 10740206 10920875 11180920
4237A1180920K83764L68104M42862M21788L96265N74371N44642N49388O51934
$$ 11180920 11464684 11832788 12275650 12697438 13093703 13668074 14212716 14762104 15414038
4228A5414038O68713Q18908R32973J018336J086604J042547J165638J378135J448355
$$ 15414038 16082751 16901659 17834632 18852968 19939572 20982119 22147757 23525892 24974247
4219B4974247J648298J647944J722840J879925J972396K005391K032966K171778
$$ 24974247 26622545 28270489 29993329 31873254 33845650 35851041 37884007 40055785
4211D0055785K236589K369139K496440K624042K685024K742397K810591K884830
$$ 40055785 42292374 44661513 47157953 49781995 52467019 55209416 58020007 60904837
4203F0904837K933944K896230K940035K916380K734309K839836K881042K754170
$$ 60904837 63838781 66735011 69675046 72591426 75325735 78165571 81046613 83800783
4195H3800783K749464K708956K582696K530835K537881K459530K288585K168823
$$ 83800783 86550247 89259203 91841899 94372734 96910615 99370145 101658730 103827553
4187A03827553J946947J736382J506942J337296J116694J007005R61838P13865
$$ 103827553 105774500 107510882 109017824 110355120 111471814 112478819 113440657 114154522
4179A14154522N86753L71816J96546q2214k73730m12125o27778q80346r95960
$$ 114154522 114741275 115113091 115309637 115227423 114953693 114541568 113913790 113033444 112037484
4170A12037484j137071j248586j393671j609702j650525j812749j872203k049522
$$ 112037484 110900413 109651827 108258156 106648454 104997929 103185180 101312977 99263455
4162I9263455k147329k299581k548222k480595k439551k533544k400875k568375
$$ 99263455 97116126 94816545 92268323 89787728 87348177 84814633 82413758 79845383
4154G9845383k478657k380584k488876k519724k566142k624925k557478k612303
$$ 79845383 77366726 74986142 72497266 69977542 67411400 64786475 62228997 59616694
4146E9616694k624130k619595k636630k436506k410887k264451k223689k002884
$$ 59616694 56992564 54372969 51736339 49299833 46888946 44624495 42400806 40397922
4138D0397922j990580j902347j811414j786984j736253j713847j541738j512311
$$ 40397922 38407342 36504995 34693581 32906597 31170344 29456497 27914759 26402448
4130B6402448j572842j459101j302668j319762j228998j030057j015042r79968
$$ 26402448 24829606 23370505 22067837 20748075 19519077 18489020 17473978 16494010
4122A6494010q90159p59181p05197o33742o19206o53138o15273m71994m90641
$$ 16494010 15603851 14844670 14139473 13505731 12886525 12233387 11618114 11146120 10655479
4113A0655479n22289l75359m11023l65199k98422k81991k89335k79595l10365
$$ 10655479 10133190 9757831 9346808 8981609 8683187 8401196 8111861 7832266 7521901
4104G521901j59506j22581j60888p5261q2537j10233q621m2426n0621o9081k9724
$$ 7521901 7362395 7239814 7078926 7003665 6921128 6810895 6802274 6759848 6709227 6640146 6610422
4093F610422L0189P6442L1555l9116L1393O2713j0984j1813m9483m205q9168q907
$$ 6610422 6640611 6717053 6748608 6709492 6740885 6803598 6792614 6780801 6731318 6727113 6637945 6629038
4081F629038n4365m7055n2424q3911j2532r1428j8860n1577j09846r5969j62561
$$ 6629038 6574673 6527618 6475194 6391283 6378751 6287323 6268463 6216886 6107040 6011071 5848510
4070E848510n9986m0107q5456n0214j01184l1784l3175m7837p6231n8886n0621
$$ 5848510 5788524 5748417 5662961 5612747 5511563 5479779 5446604 5398767 5322536 5263650 5213029
4059E213029O757m7286j15181k00421q2908j37966N403j2581o2483o9511k4800
$$ 5213029 5219786 5172500 5057319 4856898 4773990 4636024 4641427 4628846 4566363 4496852 4472052
4048D472052n193n520o9085o9914j23995K789j21844q7166o6055j13605o1662
$$ 4472052 4466859 4461339 4392254 4322340 4198345 4201134 4079290 3992124 3926069 3812464 3750802
4037C750802O1993J6396J8298K5279j9734J8174L0023N7471k729p915K9941L3103
$$ 3750802 3812795 3829191 3847489 3872768 3853034 3871208 3901231 3958702 3955973 3948058 3977999 4011102
4025D011102K2223O0763n4120r844k3164K4681k0392k8241J5495k3967p7803J4130
$$ 4011102 4033325 4094088 4039968 4030124 4006960 4031641 4011249 3983008 3998503 3974536 3896733 3910863
4013C910863M8368n3511o9742M8150j7222q5898J8627Q64N0171l3450r6647R9590
$$ 3910863 3959231 3905720 3835978 3884128 3866906 3781008 3799635 3800499 3850670 3817220 3720573 3820163
4001C820163M8976P3186K8459J622Q2286L5894L666L2419L9923j064Q3376K9526
$$ 3820163 3869139 3942325 3970784 3972406 4054692 4090586 4094252 4126671 4166594 4165530 4248906 4278432
3989D278432J4953J08046r297R7213J65393R2467J39890J47157J49444J67142
$$ 4278432 4293385 4401431 4392134 4489347 4654740 4747207 4887097 5034254 5183698 5350840
3979E350840L0379m6296j9187P458m9030N9675O9689J6527P8238P5851J5692J03031
$$ 5350840 5381219 5334923 5315736 5323194 5274164 5333839 5403528 5420055 5498293 5574144 5589836 5692867
3967E692867P7208O7221Q0279R1126p9028j2149o9268o8298p0827J3016J6943
$$ 5692867 5770075 5837296 5917575 6008701 5929673 5917524 5848256 5779958 5709131 5722147 5739090
3956E739090L1582O6029o9070j8245Q2120P7911J0022N7388N647k1667K7224N3015
$$ 5739090 5770672 5836701 5767631 5749386 5831506 5909417 5919439 5976827 5982474 5960807 5988031 6041046
3944F041046k424l0206p1772J1762L0305p2535j4371k2437m6368N8503P7481k3476
$$ 6041046 6038622 6008416 5936644 5948406 5978711 5906176 5891805 5869368 5823000 5881503 5958984 5935508
3932E935508M2666L5150k4982J14574R8720J6357O2860Q5824K8278K3426J43179
$$ 5935508 5978174 6013324 5988342 6102916 6201636 6217993 6280853 6366677 6394955 6418381 6561560
3921F561560K28456J62368R7190N7965J61280J83249K25422J95052J42850K08483
$$ 6561560 6790016 6952384 7049574 7107539 7268819 7452068 7677490 7872542 8015392 8223875
3911H223875Q2816J57268J66037J22381J16773J55624J96678K02873J99980J73140
$$ 8223875 8306691 8463959 8629996 8752377 8869150 9024774 9221452 9424325 9624305 9797445
3901I797445K20894J39325J69190J48304K63367K64084K19881J60369K10368L03470
$$ 9797445 10018339 10157664 10326854 10475158 10738525 11002609 11222490 11382859 11593227 11896697
3891A1896697K31450K38678K65075L03158L40436M13993L97516L87791N31619
$$ 11896697 12128147 12366825 12631900 12935058 13275494 13689487 14087003 14474794 15006413
3882A5006413N36703N67444O02331O77044P80099Q69432R36604R86575J120600
$$ 15006413 15543116 16110560 16712891 17389935 18170034 19039466 19976070 20962645 22083245
3873B2083245J199375J377636J363774J204063J250232J179145J143377J024061
$$ 22083245 23282620 24660256 26024030 27228093 28478325 29657470 30800847 31824908
3865C1824908J002412R20170R81614J164351J304766J297673J347468J385661
$$ 31824908 32827320 33747490 34729104 35893455 37198221 38495894 39843362 41229023
3857D1229023J380763J388535J168395J088661R19485P01928N69936L34134J60129
$$ 41229023 42609786 43998321 45166716 46255377 47174862 47876790 48446726 48780860 48940989
3848D8940989O9836J14076N9718J18472K00867J78451K52710K76706L32153L10488
$$ 48940989 49010825 49124901 49184619 49303091 49503958 49682409 49935119 50211825 50543978 50854466
3838E0854466L01457K50544J06274J44189J52232J81856K54964M09259N88173
$$ 50854466 51155923 51406467 51512741 51656930 51809162 51991018 52245982 52655241 53243414
3829E3243414P33428J053065J471578J677890K193890K661613L077125L605797
$$ 53243414 53976842 55029907 56501485 58179375 60373265 63034878 66112003 69717800
3821F9717800M207926M967204N665293O429959P501143Q666971R939646J1657176
$$ 69717800 73925726 78892930 84558223 90988182 98489325 107156296 117095942 128753118
3813A28753118J3692479J6370001J9820355K3385138K6849431K9406608L0334852
$$ 128753118 142445597 158815598 178635953 202021091 228870522 258277130 288611982
3806B88611982K9669426K7747595K4695630K0536715J5968470J1519497P633619
$$ 288611982 318281408 346029003 370724633 391261348 407229818 418749315 426382934
3799D26382934M593511K632859J509745J543559K269284L481081M834519O108585
$$ 426382934 430976445 433609304 435119049 436662608 438931892 442412973 447247492 453356077
3791D53356077O770564O036282L587554q32037o437091j1607802j5744369j8494333
$$ 453356077 460126641 466162923 469750477 468918440 462481349 450873547 435129178 416634845
3783D16634845k0012849k0277226j9319814j7657039j5648404j3540740j1566422
$$ 416634845 396621996 376344770 357024956 339367917 323719513 310178773 298612351
3776B98612351r826568q359197p284001o547956o155251n979469n943734n871904
$$ 298612351 288785783 280426586 273142585 266594629 260439378 254459909 248516175 242644271
3768B42644271n786270n766128n620504n508836n177575n030163m871285m792699
$$ 242644271 236858001 231091873 225471369 219962533 214784958 209754795 204883510 200090811
3760B00090811m762218m719232m678910m685527m686385m504154m193815l706169
$$ 200090811 195328593 190609361 185930451 181244924 176558539 172054385 167860570 164154401
3752A64154401k832505j492389J90294K342616M437926O156564P545500Q527862
$$ 164154401 161321896 159829507 160019801 162362417 166800343 172956907 180502407 189030269
3744A89030269Q610421P767286O184583M194276J984409j44838j727832k846096
$$ 189030269 197640690 205407976 211592559 215786835 217771244 217626406 215898574 213052478
3736B13052478l335691l154817k618997j679463o21809m6221k6743p37574j982987
$$ 213052478 209716787 206561970 203942973 202263510 201641701 201595480 201568737 200831163 198848176
3727A98848176l622507n558388p512271r161087j0487530j1257916j1482199j1136106
$$ 198848176 195225669 189667281 182155010 172993923 162506393 151248477 139766278 128630172
3719A28630172j0493825r725531q688139p666159o626383n850111n142025m382022
$$ 128630172 118136347 108410816 99722677 92056518 85430135 79580024 74437999 70055977
3711G0055977l770152l172325k712174k392420k032442j847932j607269j549365
$$ 70055977 66285825 63113500 60401326 58008906 55976464 54128532 52521263 50971898
3703E0971898j572839j608886j665884j722641j797022j658218j757095j699283
$$ 50971898 49399059 47790173 46124289 44401648 42604626 40946408 39189313 37490030
3695C7490030j556917j503882j444777j303018j213611j082724j015784r89549
$$ 37490030 35933113 34429231 32984454 31681436 30467825 29385101 28369317 27379768
3687B7379768r43531j021906q90676r00262j013211q99048p92161p67168p35437
$$ 27379768 26436237 25414331 24523655 23623393 22610182 21711134 20918973 20151805 19416368
3678A9416368o41134o18574o57587m93540m36424m62750m14980l08280l54383
$$ 19416368 18775234 18156660 17499073 17005533 16569109 16106359 15691379 15383099 15028716
3669A5028716l06532k94127l37554l28852k23871k64198j83665k52630k60517
$$ 15028716 14722184 14428057 14090503 13761651 13537780 13273582 13089917 12837287 12576770
3660A2576770j83429j98249k09337q9701j91207j79902j62844j75072k64929j60764
$$ 12576770 12393341 12195092 11985755 11896054 11704847 11524945 11362101 11187029 10922100 10761336
3650A0761336j25296j98691r5325j53502n1590q4195j89192j15071j17428p7269
$$ 10761336 10636040 10437349 10342024 10188522 10136932 10052737 9863545 9748474 9631046 9553777
3640I553777n3957p7893q6706o4386P051j21828j05502j7478o3751l8098M2134
$$ 9553777 9499820 9421927 9335221 9270835 9277886 9156058 9050556 9033078 8969327 8931229 8973363
3629H973363n2269l8090l1327k4411J8692j8291o0359P0498j2461k0206L1600
$$ 8973363 8921094 8883004 8851677 8827266 8845958 8827667 8767308 8837806 8825345 8805139 8836739
3618H836739p150k3681k7122J09479n101l1262m9269N5274Q3606Q2165P9950q5671
$$ 8836739 8829589 8805908 8778786 8888265 8883164 8851902 8802633 8857907 8941513 9023678 9103628 9017957
3606I017957l5512J8990Q673P0626R2275P6005J19102M4830R681m1540J9046Q4735
$$ 9017957 8982445 9001435 9010108 9080734 9173009 9249014 9368116 9412946 9422627 9381087 9400133 9484868
3594I484868R9840Q1336M3458K3345R4853J36210R2980k4882R0417J31317R0775
$$ 9484868 9584708 9666044 9709502 9732847 9827700 9963910 10056890 10032008 10122425 10253742 10344517
3583A0344517J42922J62531J59221Q8790J85463J36877J12034J37763J86427K81707
$$ 10344517 10487439 10649970 10809191 10897981 11083444 11220321 11332355 11470118 11656545 11938252
3573A1938252J75354J21661J64190K11797K06612J47465J71580J89209K21474
$$ 11938252 12113606 12235267 12399457 12611254 12817866 12965331 13136911 13326120 13547594
3564A3547594K33712K55005K44139K39251K82525K62638K74523K17862K56041
$$ 13547594 13781306 14036311 14280450 14519701 14802226 15064864 15339387 15557249 15813290
3555A5813290K89437K99342L24663K76156K92958L53493L36314L38068L13469
$$ 15813290 16102727 16402069 16726732 17002888 17295846 17649339 17985653 18323721 18637190
3546A8637190L50321L47574L85829K94433L42365M27907M26007L53984M55592
$$ 18637190 18987511 19335085 19720914 20015347 20357712 20785619 21211626 21565610 22021202
3537B2021202L31227L29353M24718L54528M58653N17554M36455M64781M37830
$$ 22021202 22352429 22681782 23106500 23461028 23919681 24437235 24873690 25338471 25776301
3528B5776301L57468M00587N21111M02396L36215M46565M20003M48969M05460
$$ 25776301 26133769 26534356 27055467 27457863 27794078 28240643 28660646 29109615 29515075
3519B9515075L07507L75066L45364L48099L07382J87833K41674J99220J20849
$$ 29515075 29822582 30197648 30543012 30891111 31198493 31386326 31628000 31827220 31948069
3510C1948069N5709K0781r0693j3482k980m8586l7087j27415j05458j81607k78416
$$ 31948069 32003778 32024559 31933866 31920384 31917404 31868818 31831731 31704316 31598858 31417251 31138835
3499C1138835k84279l16588k79760l46577k82769l64470l42825m50989m83761
$$ 31138835 30854556 30537968 30258208 29911631 29628862 29264392 28921567 28470578 27986817
3490B7986817m06810m52265m46086l76684m06157m60186m81331m00857m32642
$$ 27986817 27580007 27127742 26681656 26304972 25898815 25438629 24957298 24556441 24123799
3481B4123799l73547m03791m54885l39201l65926l82072l63499l88354l46533
$$ 24123799 23750252 23346461 22891576 22552375 22186449 21804377 21440878 21052524 20705991
3472B0705991l60647l42816m24220l40835l24650l54966k43714k66184k79987
$$ 20705991 20345344 20002528 19578308 19237473 18912823 18557857 18314143 18047959 17767972
3463A7767972k79709k54048j41097r338j01842n0444R5446K34843J32696Q155
$$ 17767972 17488263 17234215 17093118 17083780 16981938 16931494 17026940 17261783 17394479 17402634
3453A7402634p1821k73233k42649l31799l09146m23928m16038l23417l54066l62279
$$ 17402634 17330813 17057580 16814931 16483132 16173986 15750058 15334020 15010603 14656537 14294258
3443A4294258l03153k59865k25242k46630k81883k58313k69628k77734l42173
$$ 14294258 13991105 13731240 13505998 13259368 12977485 12719172 12449544 12171810 11829637
3434A1829637k93159k35474k51787l24801l03302k14629j15606m2000R9363K28332
$$ 11829637 11536478 11301004 11049217 10724416 10421114 10206485 10090879 10048879 10148242 10376574
3424A0376574M12179M08564K08963l0974k97793l22963l69825n26922m41140m73010
$$ 10376574 10788753 11197317 11406280 11375306 11077513 10754550 10384725 9857803 9416663 8943653
3414H943653m23871l09323l43976k76205k55571j55462j06402j36309k09864k06782
$$ 8943653 8519782 8210459 7866483 7590278 7334707 7179245 7072843 6936534 6726670 6519888
3404F519888r9649j85283j59349j05453o4821o3234k3850j04061k1391o2000J52195
$$ 6519888 6420239 6234956 6075607 5970154 5905333 5842099 5818249 5714188 5692797 5630797 5782992
3393E782992K36674K88324J34081o9695m0204m4413r9623k20571k29167k37759
$$ 5782992 6019666 6307990 6442071 6372376 6332172 6287759 6188136 5967565 5738398 5500639
3383E500639l7847k15113k98490j83558j43607p8448j32678j19635p8874j12796
$$ 5500639 5462792 5247679 4949189 4765631 4622024 4543576 4410898 4291263 4212389 4099593
3373D099593q9727o3670r7480P838k9356j64585k3275p0883n3464l0462q7575
$$ 4099593 4009866 3946196 3848716 3856554 3827198 3662613 3639338 3568455 3514991 3484529 3396954
3362C396954n5629n8731L2989J857q7320o2004N3629n7698l9348j8049o5566j46016
$$ 3396954 3341325 3282594 3315583 3317440 3230120 3168116 3221745 3164047 3124699 3106650 3041084 2895068
3350B895068L0815K9904n2243m0974q1620J0127L338k9116p0192o6755j20213
$$ 2895068 2925883 2955787 2903544 2862570 2780950 2791077 2794415 2765299 2695107 2628352 2508139
3339B508139N2346l3904q4349L3845o347J4847l6539o0583l6468n6821K5039k8507
$$ 2508139 2560485 2526581 2442232 2476077 2469730 2484577 2448038 2387455 2350987 2294166 2319205 2290698
3327B290698j9200q3510k2177M6431j9832q9610m5607M8495j5721l7342j5861
$$ 2290698 2271498 2187988 2165811 2212242 2192410 2102800 2057193 2105688 2089967 2052625 2036764
3316B036764K1256J0590j5604q1406n3826m8658L7134n610o0659N324j6583j8382
$$ 2036764 2058020 2068610 2053006 1971600 1917774 1869116 1906250 1900640 1839981 1845305 1828722 1810340
3304A810340k9653k7799j86770M0092O6260l9383k1858j1381k9612m723O2690
$$ 1810340 1780687 1752888 1566118 1606210 1672470 1633087 1611229 1599848 1570236 1565513 1628203
3293A628203K2116j12912l1008N0721j4535k9057K1752j2689K0970l1006l3186
$$ 1628203 1650319 1537407 1506399 1557120 1542585 1513528 1535280 1522591 1543561 1512555 1479369
3282A479369l2451j4314j1952k1749j4239p1287N9071O651o5990k8167k7986j0586
$$ 1479369 1446918 1432604 1420652 1398903 1384664 1313377 1372448 1379099 1313109 1284942 1256956 1246370
3270A246370L3155l7781p6668j8354N2227L8562m2862k9738k4915J377J04332
$$ 1246370 1279525 1241744 1165076 1146722 1198949 1237511 1194649 1164911 1139996 1141373 1245705
3259A245705R906p1727p7806O9065M4951o35k5209j5634k5995k9813o5181n422
$$ 1245705 1255611 1183884 1106078 1175143 1220094 1219459 1194250 1178616 1152621 1122808 1057627 1052205
3247A052205N4584L2769j6130p528p4103J1156K8410l3556p5303r5386M4854L1816
$$ 1052205 1106789 1139558 1123428 1115900 1041797 1052953 1081363 1047807 972504 877118 921972 953788
3235I53788k5894r63j7116k6574m8026j8282P901K7558O6724J4434J6631m5096
$$ 953788 927894 926931 909815 883241 835215 816933 824834 852392 919116 933550 950181 905085
3223I05085m3375l1809K2975O922j4718L2187j0428k1712k0847n263l5614K924
$$ 905085 861710 829901 852876 859798 845080 877267 866839 845127 824280 819017 783403 786327
3211G86327L7522n6326r542M8097l9087k6731r1958L709L6364L4997k5023m5642
$$ 786327 823849 767523 757981 806078 766991 740260 648302 652011 688375 723372 698349 652707
3199F52707k8546p407N6439L2509j7840J1695m7446p9287J24326O2043n0365l8766
$$ 652707 624161 616754 673193 705702 687862 699557 652111 572824 697150 759193 708828 670062
3187F70062L0938j4546L5596M7182j3028k0648m0073Q181R901q0665l0944l4642
$$ 670062 701000 686454 722050 769232 756204 735556 695483 703664 713565 632900 601956 567314
3175E67314J8234l8007j2892J602K976L6005P8283Q766o4103o9895o2392Q6018
$$ 567314 585548 547541 534649 536251 539227 575232 653515 662281 598178 528283 465891 551909
3163E51909O6586j0718K385K476M6273j2085j91j3943M6252o1671l6550l5736
$$ 551909 618495 607777 610162 612638 658911 646826 646635 632692 678944 617273 580723 544987
3151E44987k5343n317N4725J19832p542Q5921j7843n7599k1994N7739J426J0098
$$ 544987 519644 514327 569052 688884 681342 767263 749420 691821 669827 727566 728992 739090
3139G39090O3094P9979N5132k1189m827K6714R205M4216l5371l6936j5866N3243
$$ 739090 802184 882163 937295 916106 911279 937993 947198 991414 956043 919107 903241 956484
3127I56484o0160k7717M6794O7084m696j1319M0799l6614o2212k3626P4818m8764
$$ 956484 896324 868607 915401 982485 977789 966470 1007269 970655 908443 884817 959635 910871
3115I10871j3912Q6252M8733j1169j3426L065R5317J57528P7040J00009K3447
$$ 910871 896959 983211 1031944 1020775 1007349 1010414 1105731 1263259 1340299 1440308 1463755
3104A463755K6042K3120m101J2800o3365q5816j35666p0231r9412o3199o0812
$$ 1463755 1489797 1512917 1508816 1521616 1458251 1372435 1236769 1166538 1067126 1003927 943115
3093I43115n0219o0727o901L4068J4245n2703o7452l4410m335N1159m3372m7546
$$ 943115 892896 832169 825268 859336 873581 820878 753426 719016 714681 765840 722468 674922
3081F74922J0594M0011R7764j4135r9633m774J02267N3521k9372M6711o0003l1304
$$ 674922 685516 725527 823291 809156 709523 704749 807016 860537 831165 877876 817873 786569
3069G86569o572o8560l9233L854L9933L7304l6671l1023l1282m8531l1970j3490
$$ 786569 779997 711437 672204 676058 715991 753295 716624 685601 654319 605788 573818 560328
3057E60328M0841J89j5417q5651k0848K4705P40m0126p9922k0837K6454p1219
$$ 560328 601169 601358 585941 500290 479442 504147 504887 464761 384839 364002 390456 319237
3045C19237P6132L2341o9844J0935K6081o572j1413N140j4057m9719K2923O242
$$ 319237 395369 427710 357866 368801 394882 388310 376897 382037 367980 318261 341184 347426
3033C47426J6395l9327m5075J3105K8486M3882m3548J7524j9743P0055l6985m0278
$$ 347426 363821 324494 279419 292524 321010 364892 321344 338868 319125 389180 352195 311917
3021C11917k1177J2334j5424l1606O2808n8879p9806N2590N2811o5010k0260N2857
$$ 311917 290740 303074 287650 256044 318852 259973 180167 232757 285568 220558 200298 253155
3009B53155M3187j8843m0426j8786M095L3671k7087Q3767k7631j6070k2284k2828
$$ 253155 296342 277499 237073 218287 222382 256053 228966 312733 285102 269032 246748 223920
2997B23920O4361l1094n4996l1160k4128N0098o0245K6955Q7328k8252r7531k416
$$ 223920 288281 257187 202191 171031 146903 197001 136756 163711 251039 222787 125256 122840
2985A22840P6474m6948l5832N1940j4363m0253K9398k0621N3202K0027P7094j5164
$$ 122840 199314 152366 116534 168474 154111 113858 143256 122635 175837 195864 272958 257794
2973B57794L116J4050o1129k9308K1461j6638N6095M1315M2241k1942j9816L8354
$$ 257794 260910 274960 213831 184523 205984 189346 245441 286756 328997 307055 287239 325593
2961C25593q8376o2392J0052p396k1679K2249l6178o3340J7592J00961L9455o8544
$$ 325593 237217 174825 184877 177481 155802 178051 141873 78533 96125 197086 236541 167997
2949A67997l4753J8779p554N6124m8200r6153K3764J33527O9176J5902n9319k8858
$$ 167997 133244 152023 144469 200593 152393 56240 80004 213531 282707 298609 239290 210432
2937B10432j3949k8068J6995K3481N8902j27377q021J3393o9937N710J6123O0300
$$ 210432 196483 168415 185410 208891 267793 140416 132395 145788 75851 81561 97684 157984
2925A57984k5598n8957m1323K9513p276r767J9506k0699K9008l9493N1364J1610
$$ 157984 132386 73429 32106 61619 54343 44576 64082 43383 72391 32898 84262 95872
2913I5872L1894M7636o7549M3259R669n6195J7781P6828O617L8393N503j26263
$$ 95872 127766 175402 107853 151112 160781 104586 122367 199195 205812 244205 249708 123445
2901A23445p5612J25576J2409k0679p0j6239q89J125R274m227q3678m1398O4379
$$ 123445 47833 173409 185818 165139 165069 148830 147941 149066 158340 154113 70435 29037 93416
2888I3416m9077l8401N8936K5608o5731N5222k307M0606m0246m446J8160M7373
$$ 93416 44339 5938 64874 90482 24751 79973 77666 118272 78026 73580 91740 139113
2876A39113J04982m582r9010k7132N3626k2401J5700O3658K6161n0706K8747p3272
$$ 139113 244095 239513 140503 113371 166997 144596 160296 223954 250115 199409 228156 154884
2864A54884q5290o3947q9460Q7475N3315O5578n5378j4661j5001m24k2233j738
$$ 154884 69594 5647 -83813 3662 56977 122555 67177 52516 37515 37091 14858 13120
2852A3120M5036L7200l0750K0816j4784j6143J2055N1016j6148o562K6203n9457
$$ 13120 58156 95356 64606 85422 70638 54495 66550 117566 101418 94856 121059 61602
2840F1602L0923m2539p287K2420J8344l8375k0430K117L5125j7832M1671l0864
$$ 61602 92525 49986 42699 65119 83463 45088 24658 26775 61900 44068 85739 54875
2828E4875o1320M1004j994j413k8152j5013K8659K0969j5850m8003q129J9235
$$ 54875 -6445 34559 32565 31152 3000 -12013 16646 37615 21765 -26238 -34367 -15132
2816a5132J47024Q5230k0317m5887n5852o5714P6185N0840m3358o951L8592J4042
$$ -15132 131892 217122 196805 150918 95066 29352 105537 156377 113019 106068 144660 158702
2804A58702q038j406l3780l0425l067l5474J1331m0633j5302n4454J8471L1788
$$ 158702 150664 149258 115478 85053 81986 46512 57843 17210 1908 -52546 -34075 -2287
2792b287N7763j409j2596M013J8061M2798R203n2935o3741J9460N0004j8347L786
$$ -2287 55476 54067 41471 45484 63545 106343 115546 62611 -1130 18330 68334 49987 53773
2779E3773K6561J8051O1515l0642j3807r399J0120O8286k4871k8457r1492o4656
$$ 53773 80334 98385 159900 129258 115451 106052 116172 184458 159587 131130 39638 -25018
2767b5018O8923J9208m2469L0718M875j00792J2413M6260J9071K5383m3837j17128
$$ -25018 43905 63113 20644 51362 56237 -44555 -32142 14118 33189 58572 14735 -102393
2755a02393Q0755M7983J03939J3490j18521J043l3071O7699M1152m7544p3573
$$ -102393 -21638 26345 130284 143774 25253 26296 -6775 60924 102076 54532 -19041
2744a9041p951J03998p60n9780j9763K7531j0332P6695o361n3265M0611k1733
$$ -19041 -26992 77006 76246 16466 -3297 24234 13902 90597 84236 30971 71582 49849
2732D9849n3648Q819j1246K8965m5359o848N8885Q6959Q248m7576k4221o2567
$$ 49849 -3799 5020 -6226 22739 -22620 -29468 29417 116376 124624 77048 52827 -9740
2720i740l9782K2282N435N16N8203N0937L5766L192q2389n1635R277j367q9572
$$ -9740 -49522 -27240 -21805 -21289 36914 87851 123617 126809 44420 -7215 2062 695 -88877
2707h8877Q2424J6627j595k1059k6436n625q672M7859j453J3287L2693O7817k5230
$$ -88877 -6453 10174 8579 -12480 -38916 -44541 -53213 -5354 -6807 6480 39173 106990 81760
2694H1760k6992R149k6294j95R642j4835k0983J9004M9133j03194M3035L6758
$$ 81760 54768 63917 37623 37428 47070 32235 11252 30256 79389 -23805 19230 55988
2682E5988O577n8176j7313O0357l7881q6662j8329M8320N5454L8460K2669m3941
$$ 55988 62565 4389 -12924 47433 9552 -77110 -95439 -47119 8335 46795 69464 25523
2670B5523m0378k1211L3423l322n0092l665P5623R2061j19287p9504P2746K8014
$$ 25523 -14855 -36066 -2643 -5965 -56057 -59722 15901 107962 -11325 -90829 -18083 9931
2658I931k5466M2904J6130n647J1848P1651p1951n3976P7455n4309r8486Q408
$$ 9931 -15535 27369 43499 37852 49700 121351 49400 -4576 72879 18570 -79916 -71508
2646g1508O4205j6281L282p234l8894p3609J29465K5791O727O129J7176m046P2612
$$ -71508 -7303 -23584 -20302 -27536 -66430 -140039 -10574 15217 21944 28073 45249 41203 113815
2633A13815P002j20131m781l8080Q4866K3016J2025k3600K9218m9565p73k9843
$$ 113815 120817 686 -4095 -42175 42691 65707 77732 54132 83350 33785 33012 3169
2621C169L4018r346q7079p850N9986M2153J6672k9591k1082o4676k056J13846
$$ 3169 37187 27841 -59238 -67088 -7102 35051 51723 22132 1050 -63626 -65682 48164
2609D8164l276o9416R969K8110O7262p651j08105J2408L7103K1852j5818k5003
$$ 48164 44888 -24528 -14559 13551 80813 73162 -34943 -22535 14568 36420 20602 -4401
2597d401L1448L4276m7023j2948m3495m301J1744N8653p655J2015k2466k8206
$$ -4401 27047 61323 14300 1352 -42143 -46444 -34700 23953 16298 28313 5847 -22359
2585b2359R393n273j8894l2414O6028J6606n8958J7541O4111R891L8085L5432
$$ -22359 -12966 -18239 -37133 -69547 -3519 13087 -45871 -28330 35781 45672 83757 119189
2573A19189M653R9975q331j6053M723L5189j2618o6376k9226j5540N864P649o2150
$$ 119189 123842 223817 215486 199433 204156 239345 226727 160351 131125 115585 121449 129098 66948
2560F6948p2266M273j7011Rm607j6555O5923l7723J0454O1334P710k3026j8153
$$ 66948 -5318 -1045 -18056 -18047 -22654 -39209 26714 -11009 -555 60779 68489 45463 27310
2547B7310o9420K1927L1349K7464J0766j28285N6660j7199L9019M0014M5175l3926
$$ 27310 -42110 -20183 11166 38630 49396 -78889 -22229 -39428 -409 39605 84780 50854
2535E0854k6071q158l4444M0740M908J5131k3531K6077j0105k5380j2943k6235
$$ 50854 24783 16625 -17819 22921 27829 42960 19429 45506 35401 10021 -2922 -29157
2523b9157j0370M7062J4186m2653m7078M3584J02723k1516k0373p97n1317J8930
$$ -29157 -39527 7535 21721 -20932 -68010 -24426 78297 56781 36408 35611 -15706 3224
2511C224N2286J7183r4473L4727N947L707J3188J794L3810k9441l5309M678K5848
$$ 3224 55510 72693 -21780 12947 18894 22601 35789 37583 71393 41952 6643 11321 37169
2498C7169m1086l9906j4537J1464M7531J4270j02541R2251j2943k8515J17232
$$ 37169 -3917 -43823 -58360 -46896 635 14905 -87636 4615 -8328 -36843 80389
2487H0389J3611r5345o5429Q4157K0091J2503l4728J7345k3720J1129N7603o2121
$$ 80389 94000 -1345 -66774 17383 37474 49977 15249 32594 8874 20003 77606 15485
2475A5485o0532K4798J7558m1296O2082k1161n3255K6461P3612o1019j8243K3147
$$ 15485 -45047 -20249 -2691 -43987 18095 -3066 -56321 -29860 43752 -17267 -35510 -12363
2463a2363M3932j9785L5925P879J8342J8789k330p1819M4220k3606N2015o810
$$ -12363 31569 11784 47709 55588 73930 92719 90389 18570 62790 39184 91199 84389
2451H4389q849K1316N504j5461L0937J02858j208m7383m701n7460o7077L82p322
$$ 84389 75540 96856 102360 86899 117836 220694 219486 172103 167402 109942 42865 43247 35925
2438C5925J9052q7792J7330Q9583j17085m0731q338k878O1453M2535J2961m2093
$$ 35925 54977 -32815 -15485 74098 -42987 -83718 -92056 -94934 -33481 9054 22015 -20078
2426b0078Q5371K6077j6387m3567P4573L5928k1682M2782N1582o3156L49l5312
$$ -20078 65293 91370 74983 31416 105989 141917 120235 163017 214599 151443 151792 116480
2414A16480l291J0656q442k3200O7343L0520m7031m9015p4238j541Q2232k0371
$$ 116480 113189 123845 115403 92203 159546 190066 143035 94020 19782 18241 100473 80102
2402H0102Q443J6795L8041m7629M9939M4383m4294J2637N5789q340J8873K860
$$ 80102 88545 105340 143381 95752 145691 190074 145780 158417 214206 205866 224739 227599
2390B27599N5606j4665l7884K2970p3300L9978O5823j4458j22690J1971M3742
$$ 227599 283205 268540 230656 253626 180326 220304 286127 271669 148979 160950 204692
2379B04692l6057N7466J2036l2388k4572L0333K3771o5299l0174L4692P1060l0732
$$ 204692 168635 226101 238137 205749 181177 211510 235281 169982 139808 174500 245560 214828
2367B14828M4484l1476k5184k9798J12076M1925j2228K1196L0578L8787M3848
$$ 214828 259312 227836 202652 172854 284930 326855 314627 335823 366401 405188 449036
2356D49036M3559K3556K9904m5478L2722l5997P042J6191M6995N7720P683j1062
$$ 449036 492595 516151 546055 500577 533299 497302 504344 520535 567530 625250 632933 621871
2344F21871l095m1871j3631K1903M8065L6614j7387l7837k9166L1204L6764L8528
$$ 621871 618776 576905 563274 585177 633242 669856 652469 614632 585466 616670 653434 691962
2332F91962R6732j154N3563J02953O4901P6265J71327J22075J11094J76395K20512
$$ 691962 788694 787540 841103 944056 1008957 1085222 1256549 1378624 1489718 1666113 1886625
2321A886625K41432L57429L13916K54006J48133J64694K60207K62243K65834M64010
$$ 1886625 2128057 2485486 2799402 3053408 3201541 3366235 3626442 3888685 4154519 4618529
2311D618529P28426J111552J727613L475953N792026P287285P785707N091543
$$ 4618529 5346955 6458507 8186120 11662073 17454099 24741384 32527091 37618634
2303C7618634J656430o10397j897767k939651m291930m792649m275062l618439
$$ 37618634 39275064 38664667 36766900 33827249 29535319 24742670 20467608 16849169
2295A6849169l283380k909104k188629j448932p96620n80675l95359m82396n19725
$$ 16849169 13565789 10656685 8468056 7019124 6222504 5641829 5246470 4764074 4244349
2286D244349l67059l63635l31999l08416k64613k30065k00705k08098j13239j02765
$$ 4244349 3877290 3513655 3181656 2873240 2608627 2378562 2177857 1969759 1856520 1753755
2276A753755j14389k022r8830j61956m6114j1484o5486k6872k2926k3753j30863
$$ 1753755 1639366 1637344 1538514 1376558 1330444 1318960 1253474 1226602 1203676 1179923 1049060
2265A049060j9005K1467m0418m8813r764O028j9165k1565n9123m1198o4749J0934
$$ 1049060 1030055 1051522 1011104 962291 952527 958555 939390 917825 858702 817504 752755 763689
2253G63689o2707j5646q4578k1283K2926J8657n5505K3787l3802l6366J7216p339
$$ 763689 700982 685336 600758 579475 602401 621058 565553 589340 555538 519172 536388 529049
2241E29049J8421q4540l1803j9848M2039K9459q6845l2850J6972O338N2775K2283
$$ 529049 547470 462930 431127 411279 453318 482777 395932 363082 380054 386392 439167 461450
2229D61450j3119o4647l8421L0385K0781L078m4225m3682J7766Q3468o7312o3630
$$ 461450 448331 383684 345263 375648 396429 399507 355282 311600 329366 412834 345522 281892
2217B81892o260j7940J9026l8786m8236J2144m6142K1496M161q2010L578l937
$$ 281892 275632 257692 276718 237932 189696 201840 155698 177194 181355 99345 102923 98986
2205I8986R1200l8962m0180L5240J9773J3212M0456m5008q1032m535K8059M9687
$$ 98986 190186 151224 111044 146284 166057 179269 219725 174717 93685 89150 117209 166896
2193A66896K2884o4543M3918j9998n9167j3000M6303j6168k8661J06420l2250
$$ 166896 189780 125237 169155 149157 89990 76990 123293 107125 78464 184884 152634
2182A52634p1925p231K9967m0393L8587L5426p764O287o0056r973P9502k232K2097
$$ 152634 80709 73478 103445 63052 101639 137065 129301 135588 75532 65559 145061 142829 164926
2169A64926l4856o8271l4778P2029M682l024p5183K2189R715q086J6803n260j9397
$$ 164926 130070 61799 27021 99050 103732 100708 25525 47714 57429 49343 66146 60886 41489
2156D1489M2408n64m5855J4536M0045m7834p4185M0818Q5474o328r632L7003K1915
$$ 41489 83897 83333 37478 52014 92059 44225 -29960 10858 96332 90004 80372 117375 139290
2143A39290q8441P515M1230k8517m786l7129M905Q343p910k6244J4411l164j1030
$$ 139290 50849 58364 99594 71077 66291 29162 34067 42410 34500 8256 22667 19503 8473
2130H473K8876J3549l6140K6147p662m2307l6207k9833R132M9988k0143K998R3688
$$ 8473 37349 50898 14758 40905 33243 -9064 -45271 -75104 -65972 -15984 -36127 -33129 60559
2117F0559M4767j4128j5482n8330m059M058M9971p433j9763n8967K1873P8103
$$ 60559 105326 91198 75716 17386 13327 17385 67356 59923 40160 -18807 3066 81169
2105H1169J0021J3225p0641p5010K8777K3331n4794p9548O8687J5495m716k9788
$$ 81169 91190 104415 33774 -41236 -12459 10872 -43922 -123470 -54783 -39288 -44004 -73792
2093g3792j7192K6619P7059o453k4918J4308K9869J3721K4793n8461m7349O2836
$$ -73792 -90984 -64365 12694 6241 -18677 -4369 25500 39221 64014 5553 -41796 21040
2081B1040O993K9445M709j1122k7210J1821n3648q0849M173M4953J15768n710
$$ 21040 28033 57478 62187 51065 23855 35676 -17972 -98821 -94648 -49695 66073 60363
2069F0363o9512p1319L2305K6750p7843J0688N8829P3162m0324m4225Q890M955
$$ 60363 -9149 -80468 -48163 -21413 -99256 -88568 -29739 43423 3099 -41126 -32236 -27281
2057b7281L4319N0644q3679r147L2186J2942P9535r4054J2289O5861L58R632l9491
$$ -27281 7038 57682 -25997 -35144 -2958 9984 89519 -4535 7754 73615 73973 83605 44114
2044D4114J363J800l725p3636m2401O3751J7107L3649K4384O689K2912P248N1579
$$ 44114 45477 47277 43552 -30084 -72485 -8734 8373 42022 66406 73095 96007 103255 154834
2031A54834m5282L136o3633n943m3363R89N3027O009L8087J3242m7083p0828J2692
$$ 154834 109552 112688 49055 43112 -251 738 53765 59774 97861 111103 64020 -6808 5884
2018E884K7884O876k4256K1422l5774K7941L6762j7663k1199p863k3189l6789
$$ 5884 33768 40644 16388 37810 2036 29977 66739 49076 27877 20014 -3175 -39964
2006c9964k3278Q8685K1072q4452m5626l619L6281o1435L0705Q8027m041k9647
$$ -39964 -63242 25443 46515 -37937 -83563 -87182 -50901 -112336 -81631 6396 2355 -27292
1994b7292Q461k3684N5304J5821J2029j1433m916j0234K0538L6009O1688K1448
$$ -27292 -18831 -42515 12789 28610 40639 29206 24290 14056 34594 70603 132291 153739
1982A53739r4184r9049L972M5777k0034k2148j1178n43O6923J8417o0999q9293
$$ 153739 59555 -39494 -35522 10255 -9779 -31927 -43105 -43648 23275 41692 -19307 -108600
1970a08600j9347J716L2060J3478M582j6354O4612O2605j39369L8218n903M3141
$$ -108600 -127947 -126231 -94171 -80693 -76111 -92465 -27853 34752 -104617 -66399 -72302 -29161
1958b9161N1186N545q048N1357M0959j2444m9529l1025J8760o691n3860n9474
$$ -29161 22025 27570 19522 70879 111838 99394 49865 18840 37600 30909 -22951 -82425
1946h2425M1597M0981R60K0401o5377o7362N5234K3546p1533Q8335k1086J1309
$$ -82425 -40828 153 1113 21514 -43863 -111225 -55991 -32445 -103978 -15643 -36729 -25420
1934b5420O9339R38m4796q9199P0256O7587J0973k2157l9172L6470k9959n0088
$$ -25420 43919 44857 61 -89138 -18882 48705 59678 37521 -1651 34819 4860 -45228
1922d5228L9073M5390L936m7724M418n3109L1796N1034k0986m9810m2455k4325
$$ -45228 -6155 39235 43171 -4553 -135 -53244 -21448 29586 8600 -41210 -83665 -107990
1910a07990L5907K0001o9929M8391K826K6833K9384m2146Q325J1360K4360J4088
$$ -107990 -72083 -52082 -122011 -73620 -70794 -43961 -14577 -56723 -48398 -37038 -12678 1410
1898A410o0747l1298L5564L6103r427l7197M716K8745J4463q2789Q2641L0591
$$ 1410 -59337 -90635 -55071 -18968 -28395 -65592 -60876 -32131 -17668 -100457 -17816 12775
1886A2775j5406J2557m3473k1136m2041M6902O5910l1844j00844O7223J09464
$$ 12775 -2631 9926 -33547 -54683 -96724 -49822 16088 -15756 -116600 -49377 60087
1875F0087j0082m431q1160k5912L6251M8477l3770k9702L5487O8880l8963j085
$$ 60087 50005 45574 -35586 -61498 -25247 23230 -10540 -40242 -4755 64125 25162 24077
1863B4077L4857P275p2551L1953J4551j5184M5972K865r727o8829o0793r7624
$$ 24077 58934 66209 -6342 25611 40162 24978 70950 73815 64088 -4741 -65534 -163158
1851a63158O5337R5256J7187n9583l6078M6251N2175j17688K4802M3398q098M0831
$$ -163158 -97821 -2565 14622 -44961 -81039 -34788 17387 -100301 -75499 -32101 -40199 632
1839F32K4440J4047l4553m1180j777O428Q661N8830n1097j9893L2063l6494k1754
$$ 632 25072 39119 4566 -36614 -38391 -31963 -23302 35528 -15569 -35462 -3399 -39893 -61647
1826f1647P6828J1108o1745k3835O8850K1430J761k9976m3873L1797o2427l1157
$$ -61647 15181 26289 -35456 -59291 9559 30989 32750 2774 -41099 -9302 -71729 -102886
1814a02886L720L2872L6374M3255J6847J6652J169j9827J4541q3596j01244M2490
$$ -102886 -99166 -66294 -29920 13335 30182 46834 48003 28176 42717 -40879 -142123 -99633
1802i9633J7152P655j5452K8717L0008k5598J1173L8703k2238m5233N7176J2509
$$ -99633 -82481 -74826 -90278 -61561 -31553 -57151 -45978 -7275 -29513 -74746 -17570 -5061
1790e061r3422k6999O5364K5023K1776m0240p479j2657k8404Q4007L270m7036
$$ -5061 -98483 -125482 -60118 -35095 -13319 -53559 -61038 -73695 -102099 -18092 -14822 -61858
1778f1858K1359R9253q2021n1749N342M177M8458M3082L1875n1247K1714M5461
$$ -61858 -40499 58754 -23267 -75016 -69674 -65497 -17039 26043 57918 6671 28385 73846
1766G3846k5430q0086k2632l4001N1088k2141N2428O1584n6671p657J7786p057
$$ 73846 48416 -31670 -54302 -88303 -37215 -59356 -6928 54656 -2015 -9672 8114 1057
1754A057l7485n4951N6699l4260m8462J21305k785l2572o480J4953j3438J259
$$ 1057 -36428 -91379 -34680 -68940 -117402 3903 1118 -31454 -37934 -22981 -36419 -35160
1742c5160J1951P8937l6803O460Q043p4764j4022J10666L2488o8685m6518J9415
$$ -35160 -23209 55728 18925 25385 33428 -41336 -55358 55308 87796 19111 -27407 -7992
1730g992l8104J8702O3772q2330k7228k0908O7808M0697l2704j6904j0557J5748
$$ -7992 -46096 -27394 36378 -45952 -73180 -94088 -26280 14417 -18287 -35191 -45748 -30000
1718c0000J1855j8135j1345J9080Q8527O1770l2978n5941K8601l2176n1501J2320
$$ -30000 -18145 -36280 -47625 -28545 59982 121752 88774 32833 61434 29258 -22243 -9923
1706i923P3395o5663k4629M9891k4478P425L6677r403J1604m1544p7437n4214
$$ -9923 63472 -2191 -26820 23071 -1407 6018 42695 33292 44896 3352 -74085 -128299
1694a28299N5389J9071J8510q65l9752K5868J7532K7863j269m2093M825L5497
$$ -128299 -72910 -53839 -35329 -36194 -75946 -50078 -32546 -4683 -5952 -48045 -43220 -7723
1682g723Q587l1851j6088k018O8515l3908k5538k0463L3575J10556q2746q6138
$$ -7723 864 -30987 -47075 -49093 19422 -14486 -40024 -60487 -26912 83644 898 -85240
1670h5240j4619K8650o0937M1582M4641n0047N0969j487N5380o752o1054L3669
$$ -85240 -99859 -71209 -132146 -90564 -45923 -95970 -45001 -46488 8892 2140 -58914 -25245
1658b5245m6161j4201M3485J51869m3512n7047n4568J7868r930N3988K2319j05786
$$ -25245 -71406 -85607 -42122 109747 66235 9188 -45380 -27512 -37442 16546 38865 -66921
1646f6921J0457Q8632l153p9520q223l507L7164j0909o9123j1735L0125N9040
$$ -66921 -56464 32168 29015 -50505 -58728 -62235 -25071 -35980 -105103 -116838 -86713 -27673
1634b7673K4105l7569J9204m7187K7569l4631o6151R462O3423j1870J0862N6193
$$ -27673 -3568 -41137 -21933 -69120 -41551 -76182 -142333 -132871 -69448 -81318 -70456 -14263
1622a4263L4853L9845l1329R828m2318l0533r176O5229M6945j00162K6152k8662
$$ -14263 20590 60435 29106 38934 -3384 -33917 -43093 22136 69081 -31081 -4929 -33591
1610c3591n6878R1867j2914l167l8266m0014Q8279l6819k1265J3803m0027M053
$$ -33591 -90469 1398 -11516 -14683 -52949 -92963 -4684 -41503 -62768 -48965 -88992 -84939
1598h4939L6643L6733p7897K3679J4887J4839M62p360P194K3805o0820J3228k7560
$$ -84939 -48296 -11563 -89460 -65781 -50894 -36055 -35593 -42953 -35759 -11954 -72774 -59546 -87106
1585h7106O5509N6972J7168n5993p7444K2669N6359k828j21471N8391r894j0060
$$ -87106 -21597 35375 52543 -3450 -80894 -58225 -1866 -4694 -126165 -67774 -77668 -87728
1573h7728R334L6079l1462P332P1459l4731R773M3876m5664j2816R721j3002l1802
$$ -87728 -78394 -42315 -73777 -66445 5014 -29717 -19944 23932 -21732 -34548 -24827 -37829 -69631
1560f9631L1077L1777l9242R939K5512J5450K8128l6544m506m8095l6553o7039
$$ -69631 -38554 -6777 -46019 -36080 -10568 4882 33010 -3534 -8040 -56135 -92688 -159727
1548a59727M4957J3732N6901J4193k0146L4675J0697j3133k6098k460J6886K1581
$$ -159727 -114770 -101038 -44137 -29944 -50090 -15415 -4718 -17851 -43949 -46409 -29523 -7942
1536g942M949O2232l6475k4595M4742O322O0054j9382p9701n729j5160O8406l5283
$$ -7942 -2993 59239 22764 -1831 42911 49233 109287 89905 10204 4475 -10685 57721 22438
1523B2438m4980J2173M9498l4953m2319l9057R181p38L2721J1599l8786l6971
$$ 22438 -22542 -10369 39129 4176 -38143 -77200 -68019 -68757 -36036 -24437 -63223 -100194
1511a00194L7110k9444m5702J09409O8124Q549r2885J1396N0301j2532o9836N1437
$$ -100194 -63084 -92528 -138230 -28821 39303 47852 -45033 -33637 16664 4132 -65704 -14267
1499a4267K9980M4191l4281J0837p1914P6318N4376n9325k015j07233k622m006
$$ -14267 15713 59904 25623 36460 -35454 40864 95240 35915 33900 -73333 -75955 -79961
1487g9961N1846L4798n1733Q946J2414o8967l3364K3359J5609n1613K3512O0212
$$ -79961 -28115 6683 -45050 -36104 -23690 -92657 -126021 -102662 -87053 -138666 -115154 -54942
1475e4942M1984m5977M5280J3609q2212J2869L5311L5915n1657L1N563m3334k4630
$$ -54942 -12958 -58935 -13655 -46 -82258 -69389 -34078 1837 -49820 -49789 -44226 -87560 -112190
1462a12190R4366o556R75J1648M073k6012p0518M0632P535K4906m1829L7143m1779
$$ -112190 -17824 -24380 -23405 -11757 -7684 -33696 -104214 -63582 -56047 -31141 -72970 -35827 -77606
1449g7606L6162j0144J0893M3299j976m8163j082P577J9000j6473l2048Q3113
$$ -77606 -41444 -51588 -40695 2604 628 -47535 -48617 -41040 -22040 -38513 -70561 12552
1437A2552O5270p6314L3555N1787L107k3247J0666M2832j05744j8648O049n380
$$ 12552 77822 1508 35063 86850 89957 66710 77376 120208 14464 -4184 1865 -3515
1425c515m2218N0964j5676n881m336K2960l7220k9239o799J6386K957L9431L4123
$$ -3515 -45733 5231 -10445 -16326 -20662 2298 -34922 -64161 -70960 -54574 -51617 -12186 21937
1412B1937j615m4791o8206N0184n06R4601m1353p807R238J7427P8025o5000n6174
$$ 21937 20322 -24469 -92675 -42491 -42997 51604 10251 2444 11682 29109 107134 42134 -14040
1399a4040M5545L8194n6085N003J3603j8832p476k5825j3476m7497L6388M4899
$$ -14040 31505 69699 13614 18617 32220 13388 5912 -19913 -33389 -80886 -44498 401
1387D01o8760j0431N4924J1943r238R92o7337l0522L821N4542L1078K1583j1781
$$ 401 -68359 -78790 -23866 -11923 -21161 -20169 -87506 -118028 -114207 -59665 -28587 -7004 -18785
1374a8785M1447K3456k5345Q833J1232K9773o7866k8025o352L6335r629m0035
$$ -18785 22662 46118 20773 29606 40838 70611 2745 -25280 -31632 4703 -4926 -44961
1362d4961n7557k6594O7794N4328n5355k6461L2313M1046O209m7869m0439K9710
$$ -44961 -102518 -129112 -61318 -6990 -62345 -88806 -56493 -15447 -9238 -57107 -97546 -67836
1350f7836K3871j499L9332J6810p657p056K5471l0971p0542L533O3551o8739p448
$$ -67836 -43965 -45464 -6132 10678 3021 -4035 21436 -9535 -80077 -76544 -12993 -81732 -89180
1337h9180Q1623M1988m4704N81O6968n5610n5379J6332K3923N508J6187J4172
$$ -89180 -7557 34431 -10273 -9692 57276 1666 -53713 -37381 -13458 -7950 8237 22409
1325B2409m8473j4400k452L2291k9335k4377j2747M2057K2298M927j5360m028
$$ 22409 -26064 -40464 -42916 -10625 -39960 -64337 -77084 -35027 -12729 -7802 -23162 -27190
1313b7190J0481L413k6248k3798N9684O8614n7933l1476k3120J4560P990j4436
$$ -27190 -16709 -13296 -39544 -63342 -3658 64956 7023 -24453 -47573 -33013 -25023 -39459
1301c9459N1931J2794l5443n824J9273q3J9081j7891n503J6474K1840J0870k7674
$$ -39459 12472 25266 -10177 -16001 3272 3189 22270 4379 -1124 15350 37190 48060 20386
1288B0386o1313N5034k2843j699M7432l7583L3805k2237j9435q37P109m8193J3613
$$ 20386 -40927 14107 -8736 -10435 36997 -586 33219 10982 -8453 -9290 -2181 -50374 -36761
1275c6761M1559l7993k4541k0447J02711N7504O0571l6484j06488M543R4767j09671
$$ -36761 4798 -33195 -57736 -78183 24528 82032 142603 106119 -369 4174 98941 -10730
1263a0730j8830L3551R7058n2159k575m882r5908p5319N6992P5108j5481m8769
$$ -10730 -29560 3991 101049 48890 46315 41433 -54475 -129794 -72802 2306 -13175 -61944
1251f1944N0323J8592m7660j0130L8723L4823N723M834m2970J0832l842O1373
$$ -61944 -11621 6971 -40689 -50819 -12096 22727 28450 33284 -9686 1146 -2696 58677
1239E8677p1957P01L8059p245p1309N6298L192n0786L1195K8475O090k0079j0090
$$ 58677 -13280 -12579 25480 18235 -53074 3224 6416 -44370 -13175 15300 21390 1311 -8779
1226h779j9175m3999j6499J6679M3104L7417M0615J3708q4969l2706L439L1763
$$ -8779 -27954 -71953 -88452 -71773 -28669 8748 49363 63071 -21898 -54604 -51165 -19402
1214a9402J0301l337L5098M5479J1137j7669J375j01639O1212l416k1811L8773
$$ -19402 -9101 -12438 22660 68139 79276 61607 62982 -38657 22555 19139 -2672 36101
1202C6101l5167k6110M3m7774Q349N7590m5573n4663k0069Q1403O8316l9011l6911
$$ 36101 934 -25176 -25133 -72907 -64558 -6968 -52541 -107204 -127273 -45870 22446 -16565 -53476
1189e3476J5020K7829m3786m6057L0948O2018L8646L6653R497r2066o7964O6947
$$ -53476 -38456 -10627 -54413 -100470 -69522 -7504 31142 67795 77292 -14774 -82738 -15791
1177a5791J6108m6731K7404J2616J2948P0113l6310J1689l984l9425l8935k9983
$$ -15791 317 -46414 -19010 -6394 6554 76667 40357 52046 48062 8637 -30298 -60281
1165f0281J3108K3687n8184j7464Q8586k8372k1787L7573j248j6682m943m1535
$$ -60281 -47173 -23486 -81670 -99134 -10548 -38920 -60707 -23134 -24382 -41064 -46007 -87542
1153h7542O8328K5241J1856J789k938j3532P87k6188J2905n5771K0502O5706p8157
$$ -87542 -19214 6027 17883 19672 16734 3202 3989 -22199 -9294 -65065 -44563 21143 -57014
1140e7014k2140M0404J00681l8525m6012L564L841M4120l9193n9574l9546N329
$$ -57014 -79154 -38750 61931 23406 -22606 -19042 -15201 28919 -10274 -69848 -109394 -104065
1128a04065O5290K3944l0204J1264N7076r88p320l7799j9919L7420L2508J1549
$$ -104065 -38775 -14831 -45035 -33771 23305 22317 14997 -22802 -42721 -5301 27207 38756
1116C8756j6225j0299M1648M2331l3987j2117o1022l1007K6471Q0087k3642Q521
$$ 38756 22531 12232 53880 96211 62224 50107 -10915 -41922 -15451 64636 40994 49515
1104D9515j9000Q8079l7239j10796K4254p6954M7947n6461K1549N7093L5889L0790
$$ 49515 30515 118594 81355 -29441 -5187 -82141 -34194 -90655 -69106 -12013 23876 54666
1092E4666N67n7610l7784L404J3510l2947m1180Q8037L7469m6631l9634K8973
$$ 54666 55233 -2377 -40161 -36757 -23247 -56194 -97374 -9337 28132 -18499 -58133 -29160
1080b9160K8970k6019Q7936M0235m3269K9795o6720K065k1039m7796j0317L5408
$$ -29160 -190 -26209 61727 101962 58693 88488 21768 23833 2794 -45002 -55319 -19911
1068a9911Q029j6015j0243j9527P364J4144l0358m8812k21L9253O8811m7418o0409
$$ -19911 -11882 -27897 -38140 -57667 -50303 -36159 -66517 -115329 -115550 -76297 -7486 -54904 -115313
1055a15313M7350j858k9911Q6926J355m5135M8589O2810j04386k5797K6527L9475
$$ -115313 -67963 -69821 -99732 -12806 -11451 -56586 -7997 54813 -49573 -75370 -48843 -9368
1043i368M1076L751n7465M481M1525l6827J5351P759K4338J9948l156p923j6323
$$ -9368 31708 35459 -22006 -17525 24000 -12827 2524 10283 34621 54569 51413 43490 27167
1030B7167l6189K0626j2467j7470l2396L4483j9143j3347j5199l7242N5617J9396
$$ 27167 -9022 11604 -863 -18333 -50729 -16246 -35389 -48736 -63935 -101177 -45560 -26164
1018b6164J4741o4123N5420R937M9353p000n9484K5040M5576N2235l5448m8740
$$ -26164 -11423 -75546 -20126 -10189 39164 32164 -27320 -2280 43296 95531 60083 11343
1006A1343n222J8917n2814j00073l2779M3625N5596J8071m193L4671J718J7986
$$ 11343 6121 25038 -27776 -127849 -160628 -117003 -61407 -43336 -47529 -12858 -11140 6846
994F846m965j8321o668j9759p282M7817j09868M209L1977L8390M8014o902J8344
$$ 6846 1881 -16440 -23108 -42867 -50149 -2332 -112200 -107991 -76014 -37624 10390 3488 21832
981B1832l7994L7747J0960j00819j9341O2125P2018n2000o4835P3843L1228j4555
$$ 21832 -16162 21585 32545 -68274 -87615 -25490 46528 -5472 -70307 3536 34764 20209
969B0209P23n5847k1034M1663O138K9865L5428k3020n6154j5382O5122J4146l7409
$$ 20209 20932 -34915 -55949 -14286 -8148 21717 57145 34125 -22029 -37411 27711 41857 4448
956D448L2123j9405m1107j7693O8301J0521l6658r295j0168j3744Q2318k0619
$$ 4448 36571 17166 -23941 -41634 26667 37188 530 -8765 -18933 -32677 49641 29022
944B9022j2712q800J9850K8917j2901q994l7509L1354M411m5426p3247n28N4229
$$ 29022 16310 7510 27360 56277 43376 34382 -3127 28227 32638 -12788 -86035 -86563 -32334
931c2334N4455n2877n8142o743Q474N7176r453j0044M2000K1194K863j6815m6713
$$ -32334 22121 -30756 -88898 -95641 -87167 -29991 -39444 -49488 -7488 13706 16569 -246 -46959
918d6959p9486J0885L6873J4773P98L5973N5995K2193k8303j3457k7335K4755
$$ -46959 -126445 -115560 -78687 -63914 -63116 -27143 28852 51045 22742 9285 -18050 6705
906F705K4311l1800N0568o411o404J5989k2779p829R056M2673M6715K127m2020
$$ 6705 31016 -784 49784 43373 36969 52958 30179 22350 31406 74079 120794 122921 80901
893H0901m4485j1400R756r2611o3234K8605J16055k0492n9076J8908Q2638m519
$$ 80901 36416 25016 34772 -57839 -121073 -92468 23587 3095 -55981 -37073 45565 41046
881D1046q023J1878k1875R70l9647O2597q3288l6806J24404O8494r5059p1124
$$ 41046 33023 44901 23026 23996 -15651 46946 -36342 -73148 51256 119750 24691 -46433
869d6433j6376N2875K7487O8320L9098o2786n2477M664j2940r4446m3177N2510
$$ -46433 -62809 -9934 17553 85873 124971 62185 9708 14372 1432 -93014 -136191 -83681
857h3681O9214M6657k0925n9324L5457N0654m8366K0109r143n1887M9037L4295
$$ -83681 -14467 32190 11265 -48059 -12602 38052 -10314 9795 652 -51235 -2198 32097
845C2097l8237L7826k5868K7942K0663L6604k3900N002p080K090P0602o8402m203
$$ 32097 -6140 31686 5818 33760 54423 91027 67127 72129 65049 67139 137741 69339 65136
832F5136N843n3164q2747M9283K7688K9751J826K2745O592r4202n6847o93J9160
$$ 65136 70979 17815 -64932 -15649 12039 41790 43616 66361 72953 -21249 -78096 -78789 -59629
819e9629J9877N6617O8157p4936k2670k7728N7091J3313M9228M487n6167N615
$$ -59629 -39752 16865 85022 10086 -12584 -40312 16779 30092 79320 83807 27640 33255
807C3255O8286L0689l0363n2736o9781p673o2621K7921J9585J8869k520n948J5917
$$ 33255 101541 132230 101867 49131 -20650 -28323 -90944 -63023 -43438 -24569 -27089 -33037 -17120
794a7120k3570k4717J9499J7174l8033K6039K6485L1559K9286n2742n3743O3319
$$ -17120 -40690 -65407 -45908 -28734 -66767 -40728 -14243 17316 46602 -6140 -59883 3436
782C436J8885l1644j9324M5840N2479K2628r8069l8603L6155L7826r062p0267
$$ 3436 22321 -9323 -28647 17193 69672 92300 -5769 -44372 -8217 29609 20547 -49720
770d9720M1081L9698M5647m3804n5740M728O9442l6922p8221l8517P5893J8718
$$ -49720 -8639 31059 76706 32902 -22838 -18110 51332 14410 -63811 -102328 -26435 -7717
758g717k2546l4194J1366L619K2551k8305l9686O2696J04270Q3815p6836K0049
$$ -7717 -30263 -64457 -53091 -49472 -26921 -55226 -94912 -32216 72054 155869 79033 99082
746I9082K65l2127j2089J8840m5246P8337K3913j1139k3138p6704r9679K6184
$$ 99082 99347 67220 55131 73971 28725 107062 130975 119836 96698 19994 -79685 -53501
734e3501Q7438o920Q547l2305M8985m1566q2693K4035l1254J2737p314J0462j7658
$$ -53501 33937 27017 35564 3259 52244 10678 -72015 -47980 -79234 -66497 -73811 -63349 -81007
721h1007O560M9535J1536J4592o1698p776J7591M3025L1550k6744M5812N1407
$$ -81007 -74447 -24912 -13376 1216 -60482 -68258 -50667 -7642 23908 -2836 42976 94383
709I4383J4344m1981p9047J113q603J8162J6749L1259l6843K4636j9631N7320
$$ 94383 108727 66746 -12301 -11188 -19791 -1629 15120 46379 9536 34172 14541 71861
697G1861k5538M074l3453J1132l3320l330j1218n0246m0980N6896Q7173j7132
$$ 71861 46323 50397 16944 28076 -5244 -8574 -19792 -70038 -111018 -54122 33051 15919
685A5919j6275K8940j1431J9211K1551J0004M1250L987j7778Q705j6770k2921
$$ 15919 -356 28584 17153 36364 57915 67919 109169 113156 95378 104083 87313 64392
673F4392p804k8326N7480M495m7164k9061k5122k8658L9910k9034k2035q7687
$$ 64392 56588 28262 85742 90237 43073 14012 -11110 -39768 142 -28892 -50927 -138614
661a38614J1732L6737N242J4199K9362l3176M7076O5371l6575N4541P8145j09077
$$ -138614 -126882 -90145 -84903 -70704 -41342 -74518 -27442 37929 1354 55895 134040 24963
649B4963n1305K6739l5323O6742P2428N1858m7643m7995P5603m8107n4797o2637
$$ 24963 -26342 397 -34926 31816 104244 156102 108459 60464 136067 87960 33163 -29474
637b9474P0888j0944n3055j9242J766J03851K3588o4008K2984j16483o234J14979
$$ -29474 41414 30470 -22585 -41827 -40061 63790 87378 23370 46354 -70129 -76363 38616
625C8616m3619L542j2737j3921N5030j5377j4223M6965K897p71K9236k3113p427
$$ 38616 -5003 -1461 -14198 -28119 26911 11534 -2689 44276 47173 46402 75638 52525 45098
612D5098M8637j9932o336j1588L1758l5617k8608N2325o1197k0427M3628J0443
$$ 45098 93735 73803 67467 55879 87637 52020 23412 75737 14540 -5887 37741 48184
600D8184q0347p7019m185N9426K5790K2853l9837k3230L8171n284J6287j4131
$$ 48184 -32163 -109182 -113367 -53941 -28151 -5298 -45135 -68365 -30194 -35478 -19191 -33322
588c3322O532R5136m7710q3069M3527N2109q1608j4851J12926l6184K0953m8469
$$ -33322 -26790 68346 20636 -62433 -18906 33203 -48405 -63256 49670 13486 34439 -14030
576a4030j6790M765O6254K6110K0296n5399j021l8002j1806j6961Q105Q4294o8438
$$ -14030 -30820 -26055 40199 66309 86605 31206 30185 -7817 -19623 -36584 -28479 55815 -12623
563a2623k9617N5951J8640m0986K5320L173l675N3627p755n9404O6214M2306l7902
$$ -12623 -42240 13711 32351 -8635 16685 19858 16183 69810 62055 2651 68865 111171 73269
550G3269n820L3088p015m7327j2860J9267K531j8191N3367Q4440J0709o5541q016
$$ 73269 67449 100537 93522 46195 33335 52602 55133 36942 90309 174749 185458 119917 111901
537A11901L4100o4333k0034O413m3816j2905O673o7849o4206O8211K0446o7263
$$ 111901 146001 81668 61634 68047 24231 11326 17999 -49850 -114056 -45845 -25399 -92662
525i2662Q014q609m875O0913K769n454O6297J1246K671J0723Q4931o2993m9680
$$ -92662 -84648 -93257 -98132 -37219 -34450 -39904 26393 37639 40310 51033 135964 72971 23291
512B3291K6021p090K6366J5763m0874o2784J0099K855M340o4360O7348J3050N3508
$$ 23291 49312 42222 68588 84351 43477 -19307 -9208 -6353 -2013 -66373 975 14025 67533
499F7533M4139p9496r206j2765j3187q170P698J114J714K3863L0411l4872K1122
$$ 67533 111672 32176 22970 10205 -2982 -11152 -3454 -2340 -626 23237 53648 18776 39898
486C9898Q342k7248Q106L9101P0900l8864m9659o15J3613M879j0895J5050q2470
$$ 39898 48240 20992 29098 68199 139099 100235 50576 49961 63574 68453 57558 72608 -9862
473i862o2812J14318N5241n5687k1344L1414l7355n4260N9555n449p4973m556
$$ -9862 -72674 41644 96885 41198 19854 51268 13913 -40347 19208 13759 -61214 -65770
461f5770J8892L821R403K9560J4168P9025l1210M1072k7724m4943M8372J3341
$$ -65770 -46878 -43057 -33654 -4094 10074 89099 57889 98961 71237 26294 74666 88007
449H8007k8751K9783R735k9694k1745K4640L4885N6565j04051l5952N7167o6425
$$ 88007 59256 89039 98774 69080 47335 71975 106860 163425 59374 23422 80589 14164
437A4164K2456M0983J748k0880L385m1304m96m7841m0797k859R6753r955M3472
$$ 14164 36620 77603 79351 58471 61856 20552 20056 -27785 -68582 -71441 25312 15357 58829
424E8829o2555k4118P0117N2646J88n719n765m1963J955Q958k3633n634L8096
$$ 58829 -3726 -27844 42273 94919 95107 89388 83623 41660 43615 52573 28940 23306 61402
411F1402k2418k0366Q7163K0926n3000m9409k3006N2705M4188j3593m1322j6812
$$ 61402 38984 18618 105781 126707 73707 24298 1292 53997 98185 84592 43270 26458
$$ [...]
##END NTUPLES=NMR SPECTRUM
##END=
