##TITLE=1H_EC-3384(5)-2
 200.13Hz, CDCl3.
 8 sc
 13.8.2026
##JCAMPDX= 6.0         $$ Bruker NMR JCAMP-DX V2.0
##DATA TYPE= NMR SPECTRUM
##DATA CLASS= NTUPLES
##ORIGIN= UXNMR, Bruker Analytische Messtechnik GmbH
##OWNER= pz
$$ XWIN-NMR		Version 3.5
$$ Wed Aug 12 12:31:09 2026 Russian Standard Time (UT+4h)  she@DPX200
##.OBSERVE FREQUENCY= 200.1313
##.OBSERVE NUCLEUS= ^1H
##.ACQUISITION MODE= SIMULTANEOUS
##.ACQUISITION SCHEME= undefined
##.AVERAGES= 8
##.DIGITISER RES= 18
##SPECTROMETER/DATA SYSTEM= spect
##.PULSE SEQUENCE= zg30
##.SOLVENT NAME= CDCl3
##.SHIFT REFERENCE= (INTERNAL, CDCl3, 0, 15.5067)
##AUDIT TRAIL= $$ (NUMBER, WHEN, WHO, WHERE, WHAT)
$$ ##TITLE= Audit trail, XWIN-NMR		Version 3.5
$$ ##JCAMPDX= 5.01
$$ ##ORIGIN= Bruker BioSpin GmbH
$$ ##OWNER= she
$$ F:/spectra/data/she/nmr/H-C/1/pdata/1/auditp.txt
$$ ##AUDIT TRAIL=  $$ (NUMBER, WHEN, WHO, WHERE, WHAT)
(   1,<2026-08-12 12:29:32.59 +0400>,<she>,<DPX200>,
      <created by zg, POWCHK disabled, PULCHK disabled
       configuration hash MD5:
       00 E9 B6 7A A2 85 ED C7 34 08 36 98 17 FE 4E 26
       data hash MD5: 16K
       03 AD 31 B7 57 07 C2 FA 92 E6 8A 70 8E A6 37 B8>)
(   2,<2026-08-12 12:29:35.34 +0400>,<she>,<DPX200>,
      <Start of raw data processing
       efp BC_mod = 2 LB = 0.25 FT_mod = 6 PKNL = 1 PHC0 = -4218.217 PHC1 = 11.5923 SI = 16K 
       data hash MD5: 16K
       D6 19 27 23 DC D0 0E 50 45 32 D6 10 6C 4C FF 22>)
(   3,<2026-08-12 12:29:59.84 +0400>,<she>,<DPX200>,
      <pk PHC0 = 1.41552 PHC1 = -2.6 
       data hash MD5: 16K
       F3 80 40 9A CD 9C 7C 64 3D 28 6E B2 CA 3F BB B8>)
(   4,<2026-08-12 12:30:03.62 +0400>,<she>,<DPX200>,
      <abs ABSG = 5 
       data hash MD5: 16K
       47 4B 14 66 80 D6 93 E8 1E 75 54 7D 40 56 99 A5>)
$$ ##END=
$$ 
$$ hash MD5
$$ 1C D4 3D 81 95 00 7D 82 84 E8 14 7B CB D7 E5 39
##$RELAX= 
##$RELAX= 
##$RELAX= 
##$RELAX= 
##$RELAX= 
##$RELAX= 
$$ Bruker specific parameters
$$ --------------------------
##$DU= <F:/spectra>
##$EXPNO= 1
##$NAME= <H-C>
##$PROCNO= 1
##$TYPE= <nmr>
##$USER= <she>
##$AMP= (0..31)
100 100 100 100 100 100 100 100 100 100 100 100 100 100 100 100 100 100 
100 100 100 100 100 100 100 100 100 100 100 100 100 100 
##$AQSEQ= 0
##$AQ_mod= 1
##$AUNM= <au_zg>
##$AUTOPOS= <>
##$BF1= 200.13
##$BF2= 200.13
##$BF3= 200.13
##$BF4= 200.13
##$BF5= 200.13
##$BF6= 200.13
##$BF7= 200.13
##$BF8= 200.13
##$BYTORDA= 1
##$CFDGTYP= 0
##$CFRGTYP= 5
##$CHEMSTR= <none>
##$CNST= (0..31)
1 1 145 1 1 1 1 1 1 1 1 1 1 1 1 1 1 1 1 1 1 1 1 1 1 1 1 1 1 1 1 1 
##$CPDPRG= <>
##$CPDPRG1= <>
##$CPDPRG2= <>
##$CPDPRG3= <>
##$CPDPRG4= <mlev>
##$CPDPRG5= <mlev>
##$CPDPRG6= <mlev>
##$CPDPRG7= <mlev>
##$CPDPRG8= <mlev>
##$CPDPRGB= <>
##$CPDPRGT= <>
##$D= (0..31)
0 0.7 0 0 0 0 0 0 0 0 0 0.03 0 0 0 0 0 0 0 0 0 0 0 0 0 0 0 0 0 0 0 0 
##$DATE= 1786523372
##$DBL= (0..7)
120 120 120 120 120 120 120 120 
##$DBP= (0..7)
150 150 150 150 150 150 150 150 
##$DBP07= 0
##$DBPNAM0= <>
##$DBPNAM1= <>
##$DBPNAM2= <>
##$DBPNAM3= <>
##$DBPNAM4= <>
$$ [...]
##$SUBNAM3= <"">
##$SUBNAM4= <"">
##$SUBNAM5= <"">
##$SUBNAM6= <"">
##$SUBNAM7= <"">
##$SUBNAM8= <"">
##$SUBNAM9= <"">
##$SW= 18.0517328524113
##$SWIBOX= (0..15)
0 0 2 0 0 0 0 0 0 0 0 0 0 0 0 0 
##$SW_h= 3612.71676300578
##$TD= 16384
##$TD0= 1
##$TE= 0
##$TE2= 300
##$TE3= 300
##$TEG= 300
##$TL= (0..7)
0 120 120 120 120 120 120 120 
##$TP= (0..7)
150 150 150 150 150 150 150 150 
##$TP07= 0
##$TPNAME0= <>
##$TPNAME1= <>
##$TPNAME2= <>
##$TPNAME3= <>
##$TPNAME4= <>
##$TPNAME5= <>
##$TPNAME6= <>
##$TPNAME7= <>
##$TPOAL= (0..7)
0.5 0.5 0.5 0.5 0.5 0.5 0.5 0.5 
##$TPOFFS= (0..7)
0 0 0 0 0 0 0 0 
##$TUNHIN= 0
##$TUNHOUT= 0
##$TUNXOUT= 0
##$USERA1= <user>
##$USERA2= <user>
##$USERA3= <user>
##$USERA4= <user>
##$USERA5= <user>
##$V9= 5
##$VALIST= <valist>
##$VCLIST= <CCCCCCCCCCCCCCC>
##$VD= 0
##$VDLIST= <DDDDDDDDDDDDDDD>
##$VPLIST= <PPPPPPPPPPPPPPP>
##$VTLIST= <TTTTTTTTTTTTTTT>
##$WBST= 1024
##$WBSW= 4
##$XGAIN= (0..3)
0 0 0 0 
##$XL= 0
##$YL= 0
##$YMAX_a= 641996
##$YMIN_a= -679909
##$ZGOPTNS= <>
##$ZL1= 120
##$ZL2= 120
##$ZL3= 120
##$ZL4= 120
##$ABSF1= 15.51551
##$ABSF2= -2.53634
##$ABSG= 5
##$ABSL= 3
##$ALPHA= 0
##$AQORDER= 0
##$ASSFAC= 0
##$ASSFACI= 0
##$ASSFACX= 0
##$ASSWID= 0
##$AUNMP= <proc_1d>
##$AZFE= 0.1
##$AZFW= 0.1
##$BCFW= 0
##$BC_mod= 2
##$BYTORDP= 0
##$COROFFS= 0
##$CY= -3
##$DATMOD= 1
##$DC= 0
##$DFILT= <>
##$DTYPP= 0
##$F1P= 0
##$F2P= 0
##$FCOR= 1
##$FTSIZE= 16384
##$FT_mod= 6
##$GAMMA= 0
##$GB= 0
##$INTBC= 1
##$INTSCL= 3.241238e-09
##$ISEN= 128
##$LB= 0.25
##$LEV0= 0
##$LPBIN= 0
##$MAXI= 10000
##$MC2= 0
##$MEAN= 0
##$ME_mod= 0
##$MI= 1.114404
##$NCOEF= 0
##$NC_proc= -5
##$NLEV= 6
##$NOISF1= 3.799351
##$NOISF2= 2.8
##$NSP= 0
##$NTH_PI= 0
##$NZP= 0
##$OFFSET= 15.5067
##$PC= 1
##$PHC0= -4216.801
##$PHC1= 8.9923
##$PH_mod= 1
##$PKNL= yes
##$PPARMOD= 0
##$PSCAL= 0
##$PSIGN= 0
##$REVERSE= no
##$SF= 200.130003002639
##$SI= 16384
##$SIGF1= 3
##$SIGF2= 2
##$SINO= 0.751879
##$SIOLD= 32768
##$SREGLST= <19F.Aceton>
##$SSB= 0
##$STSI= 16384
##$STSR= 0
##$SW_p= 3612.71676300578
##$SYMM= 0
##$S_DEV= 0
##$TDeff= 16384
##$TDoff= 0
##$TI= <>
##$TILT= no
##$TM1= 0
##$TM2= 0
##$TOPLEV= 0
##$USERP1= <user>
##$USERP2= <user>
##$USERP3= <user>
##$USERP4= <user>
##$USERP5= <user>
##$WDW= 1
##$XDIM= 16384
##$YMAX_p= 468951361
##$YMIN_p= -1116601
$$ End of Bruker specific parameters
$$ ---------------------------------
##NTUPLES= NMR SPECTRUM
##VAR_NAME=  FREQUENCY,     SPECTRUM/REAL,   SPECTRUM/IMAG
##SYMBOL=    X,             R,               I
##VAR_TYPE=  INDEPENDENT,   DEPENDENT,       DEPENDENT
##VAR_FORM=  AFFN,          ASDF,            ASDF
##VAR_DIM=   16384,         16384,           16384
##UNITS=     HZ,            ARBITRARY UNITS, ARBITRARY UNITS
##FACTOR=    0.220516191357247, 1,           1
##FIRST=     3103.35582991864, 0,            0
##LAST=      -509.360933087139, 0,           0
##MIN=       -509.360933087139, -1116601,    0
##MAX=       3103.35582991864, 468951361,    0
$$ Real data points
##PAGE= N=1
##DATA TABLE= (X++(R..R)), XYDATA
$$ [...]
7031c1953K3274N1350l6018l1618Q956k3752n285J0986M9375Q264m1205L843j699
$$ -31953 -8679 42671 6653 -24965 -16009 -39761 -45046 -34060 15315 23579 -17626 -13783 -15482
7018a5482Q834O671m7015m7277O7117L272k6683J1726K7193p487j126J2365l770
$$ -15482 -6648 23 -46992 -94269 -27152 -23880 -50563 -38837 -11644 -19131 -20257 -7892 -11662
7005a1662J13625K476m2292m511q9568k838l444o011o2023K3696j5912L214N5469
$$ -11662 101963 104439 62147 57636 -31932 -34770 -38214 -44225 -106248 -82552 -98464 -95250 -39781
6992c9781j1513N8318m2507Q209j1749J0432j3832k820n2176l901J10048J5711
$$ -39781 -51294 7024 -35483 -27274 -39023 -28591 -42423 -45243 -97419 -101320 8728 24439
6980B4439m9292l066P807k392j1430m3715J4007O3741j1814k6774j1276L8011
$$ 24439 -24853 -27919 -20112 -22504 -33934 -77649 -63642 99 -11715 -38489 -49765 -11754
6968a1754k1667j5425j1902M5345k0674m5900q614K1698K9156m105L7723j7118
$$ -11754 -33421 -48846 -60748 -15403 -36077 -81977 -90591 -68893 -39737 -43842 -6119 -23237
6956b3237l9877K7100O1493l1354m4867q017j0713J1045P157N5076n6160k6301
$$ -23237 -63114 -36014 25479 -5875 -50742 -58759 -69472 -58427 -51270 3806 -52354 -78655
6944g8655K0578K2326K6707r642m677k7703k3126l591N8350k5273j6880J1137
$$ -78655 -58077 -35751 -9044 -18686 -23363 -51066 -74192 -77783 -19433 -44706 -61586 -50449
6932e0449j4517j124R395K1785K0416l2408j6391N7320k5643m1429Q7953k2676
$$ -50449 -64966 -66090 -56695 -34910 -14494 -46902 -63293 -5973 -31616 -73045 14908 -7768
6920g768j407p71k6680K3447J0996J3052j7294m7382J8997l0089k7123K5478O5535
$$ -7768 -9175 -9946 -36626 -13179 -2183 10869 -6425 -53807 -34810 -64899 -92022 -66544 -1009
6907a009J945r779r501k0815J9846j4159K3485j5851k6926L1773r097j5000k3512
$$ -1009 936 -8843 -18344 -39159 -19313 -33472 -9987 -25838 -52764 -20991 -30088 -45088 -68600
6894f8600J7364R740L656L1321m4020o6904K3077O9542L5080j2968O7418n0999
$$ -68600 -51236 -41496 -37840 -6519 -50539 -117443 -94366 -24824 10256 -2712 64706 13707
6882A3707l1873K7079k0339o432q5957K5565M5356L5692j03435L5553J4357K1443
$$ 13707 -18166 8913 -11426 -17858 -103815 -78250 -32894 2798 -100637 -65084 -50727 -29284
6870b9284L9145m7631j8391J3980O5325l416p156j164p4214j5970m9236L610j3773
$$ -29284 9861 -37770 -56161 -42181 23144 19728 12572 11408 -62806 -78776 -128012 -124402 -138175
6857a38175P917R0641j3513N8182j9495m6940p323K594L2087K4911o3970J0462
$$ -138175 -130258 -39617 -53130 5052 -14443 -61383 -68706 -66112 -34025 -9114 -73084 -62622
6845f2622L5165l2673J5902k552M3625l63J7318k1160j2866K1282k9405j7681
$$ -62622 -27457 -60130 -44228 -46780 -3155 -3518 13800 -7360 -20226 1056 -28349 -46030
6833d6030p2709L0784N466J6739O1026k052l8835l8435K5987k9828K3166R848
$$ -46030 -118739 -87955 -82489 -65750 -4724 -6776 -45611 -84046 -58059 -87887 -64721 -54873
6821e4873k6187j9378N7538P8254k7027k2572J1230J4549n1894K8900k4924J0345
$$ -54873 -81060 -100438 -42900 35354 8327 -14245 -3015 11534 -40360 -11460 -36384 -26039
6809b6039k287K0166k3364j0127M6589l3488J588l4317o482Q8229J695l9785k8558
$$ -26039 -28326 -8160 -31524 -41651 4938 -28550 -26962 -61279 -67761 20468 22163 -17622 -46180
6796d6180j0013K1282J7683l4585Q330N6687Q798j8704l1045l128R629k0165P102
$$ -46180 -56193 -34911 -17228 -51813 -43483 13204 22002 3298 -27747 -30875 -21246 -41411 -34309
6783c4309R938k0458N047K582R968j7832l6157M466K6686j7099j9669K263M3535
$$ -34309 -24371 -44829 -39782 -37200 -27232 -45064 -81221 -76755 -50069 -67168 -86837 -84574 -41039
6770d1039m8959l6820R7209P8704r3421k300O8766r656P109j8438m8367q931J7526
$$ -41039 -89998 -126818 -29609 49095 -44326 -46626 22140 12484 19593 1155 -47212 -56143 -38617
6757c8617K7525r354J6210k1652l474n962m5445K468K0960K4725J2471o4692J5444
$$ -38617 -11092 -20446 -4236 -25888 -29362 -35324 -80769 -78301 -57341 -32616 -20145 -84837 -69393
6744f9393j3689K8945M039k8787J3600K9010j00j7609r695j9953N127l925k717
$$ -69393 -83082 -54137 -50098 -78885 -65285 -36275 -36375 -53984 -63679 -83632 -78505 -82430 -85147
6731h5147j7019P0751m9333j5245J216L2161n344m444K8164k5569J2652J6758
$$ -85147 -102166 -31415 -80748 -95993 -94777 -62616 -67960 -72404 -44240 -69809 -57157 -40399
6719d0399L547N7401p121l6602L4779J8141M3326j9498j6638k3894l8778j948
$$ -40399 -36852 20549 13428 -23174 11605 29746 73072 53574 36936 13042 -25736 -27684
6707b7684L9654M6272j8639K869k1033J2605k5749k4656L211K2964K856p506K8293
$$ -27684 11970 58242 39603 42472 21439 34044 8295 -16361 -13150 9814 12670 5164 33457
6694C3457n8705P553O2928n3124J5842m9766J2762q958j357Q2245N526o3456l2220
$$ 33457 -25248 -17695 45233 -7891 7951 -41815 -29053 -38011 -39368 42877 48403 -15053 -47273
6681d7273j2996N8823m6291m0442L3521j1207K9477L2810K501n048m9080K71n6367
$$ -47273 -60269 -1446 -47737 -88179 -54658 -65865 -36388 -3578 -1077 -6125 -55205 -54934 -111301
6668a11301N2881M7554n8307M2827j0994J4226n5818j805O5057n118p3661k8067
$$ -111301 -58420 -10866 -69173 -26346 -37340 -23114 -78932 -80737 -15680 -20798 -94459 -122526
6656a22526Q7862L0083p1515k809k3777M9516j547J33K2498q903J4190j2571j7911
$$ -122526 -34664 -4581 -76096 -78905 -102682 -53166 -54713 -54580 -32082 -40985 -26795 -39366 -57277
6643e7277N4958L4637O866o0500n6711j8644K6126m7753O0325P7239k3869k9893
$$ -57277 -2319 32318 39184 -21316 -78027 -96671 -70545 -118298 -57973 19266 -4603 -34496
6631c4496K3883l3975j1934L8919j8087l058M2797M9204O770j01907j0946O0644
$$ -34496 -10613 -44588 -56522 -17603 -35690 -38748 4049 53253 60023 -41884 -52830 7814
6619G814m5018o628L4142J0771J2783K224q8k58l753j219j3515M381k9739l7246
$$ 7814 -37204 -43832 -9690 1081 13864 16088 16000 15742 11989 10770 -2745 1636 -28103 -65349
6605f5349K882N1160P632p8660L7100l1R605k8297L1935M810o560o363L3858L4269
$$ -65349 -62467 -11307 -3675 -82335 -45235 -45266 -35661 -63958 -32023 -27213 -33773 -40136 -6278 27991
6591B7991r0701k1764J7385J1286J371L8289K4386m3228n6484L6599L2717N719
$$ 27991 -62710 -84474 -67089 -55803 -54432 -16143 8243 -34985 -91469 -54870 -22153 -16434
6579a6434j1639M7669r508k3479n7400P4958J2059r1547J3661M9449n8398M2621
$$ -16434 -28073 19596 10088 -13391 -70791 4167 16226 -75321 -61660 -12211 -70609 -27988
6567b7988n6945R108P490P2585J8387j9802q596k5660K8832k9345n575j2364J0035
$$ -27988 -84933 -75825 -68335 4250 22637 2835 -5761 -31421 -2589 -31934 -37509 -49873 -39838
6554c9838L1159j3866P330J5987J1291l0713j0712j1398j1666Q8568K3243k8671
$$ -39838 -8679 -22545 -15215 772 12063 -18650 -29362 -40760 -52426 36142 59385 30714
6542C0714k3841N616m9664k5370l8823O417J0053M1525J54P8875n2924k6012K4480
$$ 30714 6873 12489 -37175 -62545 -101368 -94951 -84898 -43373 -43219 35656 -17268 -43280 -18800
6529a8800L6236l1525n3298J6578K7223L2632k3761K397j1860R577j57L2681n1083
$$ -18800 17436 -14089 -67387 -50809 -23586 9046 -14715 -12318 -24178 -14601 -14758 17923 -33160
6516c3160k7709K0324J7998o487l687M9497m2278p4091J3112J4319M7649L47k7086
$$ -33160 -60869 -40545 -22547 -29034 -32721 16776 -25502 -99593 -86481 -72162 -24513 -24166 -51252
6503e1252L2802L1096m7464l7331o0166O1711K6514n649j1557O852K4411N05M3910
$$ -51252 -18450 12646 -34818 -72149 -132315 -70604 -44090 -49739 -61296 -54444 -30033 -29528 14382
6490A4382l8725n3482J3394K7369q2090L3553O5531J2657q26k540J9159O633k1024
$$ 14382 -24343 -77825 -64431 -37062 -119152 -85599 -20068 -7411 -8237 -10777 8382 15015 -6009
6477f009q157j8745R081R791l3703L613l3630M200j243L2509K2511k3848J2993
$$ -6009 -14166 -32911 -23830 -14039 -47742 -44129 -77759 -73559 -74802 -42293 -19782 -43630 -30637
6464c0637r585l0067n2470O589N7812L7621J4261J485O1821k3846n8513J4546
$$ -30637 -40222 -70289 -122759 -116170 -58358 -20737 -6476 -4991 56830 32984 -25529 -10983
6452a0983p16j4478J0019L4837o5198j6264L2208J0705l3741n7201J6947N0674
$$ -10983 -11699 -26177 -16158 18679 -46519 -62783 -30575 -19870 -53611 -110812 -93865 -43191
6440d3191k3826O7468o401j9570j295J1609L2092k1116l536K6979J673n3224j0912
$$ -43191 -67017 451 -5950 -25520 -26815 -15206 16886 -4230 -7766 19213 20886 -32338 -43250
6427d3250k4810R635P7122m4901n9180K2643K7157M2166m1434j0856k8770Q302
$$ -43250 -68060 -58425 18697 -26204 -85384 -62741 -35584 6582 -34852 -45708 -74478 -66176
6415f6176K554l7756N9394n3318M1866L3132K6723j0401J2122K9040l3653n153
$$ -66176 -63622 -101378 -41984 -95302 -53436 -20304 6419 -3982 8140 37180 3527 -1626
6403a626P575N2681q1770n4236N6864j2377K411K7729o137J5806q6611K7494N4168
$$ -1626 5949 58630 -23140 -77376 -20512 -32889 -30478 -2749 -8886 6920 -79691 -52197 1971
6390A971o0316M86N195J9335O865k1380o332k782j156p062L3016L1667m4847J0572
$$ 1971 -58345 -57859 -52664 -33329 -26464 -47844 -54176 -56958 -58114 -65176 -32160 -493 -45340 -34768
6376c4768O1879k824k1089p7279N7101o53J9964K9243p5520L5443N2971O0017
$$ -34768 27111 24287 3198 -74081 -16980 -17633 2331 31574 -43946 -8503 44468 104485
6364A04485k5440k5278L1114k2547p813J9031l2950n2985j6911O137O8918Q373
$$ 104485 79045 53767 84881 62334 54521 73552 40602 -12383 -29294 -23157 45761 54134
6352E4134m9801j2389n682l6634R9462j16593m5348O5012n061L7005l0054J633
$$ 54134 4333 -8056 -13738 -50372 49090 -67503 -112851 -47839 -52900 -15895 -45949 -44316
6340d4316r205L3411p244q412O988m3565J3649Q1094m2525m1688L607j7551J1632
$$ -44316 -53521 -20110 -27354 -35766 -28778 -72343 -58694 22400 -20125 -61813 -58206 -75757 -64125
6327f4125M8986J9968k1074m0587M1116K2229j5096k0156J989M558O0476o6631
$$ -64125 -15139 4829 -16245 -56832 -15716 6513 -8583 -28739 -26750 -22192 38284 -28347
6315b8347J1180j3420p1411q18J3233l7617O0714R6341n6048m8657M3198K7250
$$ -28347 -17167 -30587 -101998 -102816 -89583 -127200 -66486 29855 -26193 -74850 -31652 -4402
6303d402K2412l0683l1410M376k7959K1187L3935K6476o559K8320m4438m4140
$$ -4402 18010 -12673 -44083 -39707 -67666 -46479 -12544 13932 7373 35693 -8745 -52885
6291e2885J85q357M2244k5783n600M1098n3183M5965k1821K3229m3979M3685k1346
$$ -52885 -52700 -61057 -18813 -44596 -50196 -9098 -62281 -16316 -38137 -14908 -58887 -15202 -36548
6278c6548M7317L2851R822n5890L1044K3293M6161j04855k8579K5741k7700L2688
$$ -36548 10769 43620 53442 -2448 28596 51889 98050 -6805 -35384 -9643 -37343 -4655
6266d655m0934J7295m1259M2915n2556J6719O5628O3747n3516l4076m775j5669
$$ -4655 -45589 -28294 -69553 -26638 -79194 -62475 3153 66900 13384 -20692 -25467 -41136
6254d1136L0790N5287p8806n3780R877M1514K3917L4267L2457o0815k3606J9617
$$ -41136 -10346 44941 -33865 -87645 -77768 -36254 -12337 21930 54387 -6428 -30034 -10417
6242a0417m5400j7494P7771k6817j6119K8826l299k1259j503O0400o1291J257
$$ -10417 -55817 -73311 4460 -22357 -38476 -9650 -12949 -34208 -35711 24689 -36602 -35345
6230c5345P599N1279n9190k9652k9432M0190K5614j0537J1870l3827P2293m7193
$$ -35345 -27746 23533 -35657 -65309 -94741 -54551 -28937 -39474 -27604 -61431 10862 -36331
6218c6331M1930K2670n271n751k3982n5250J3456l223l0978k749K38N5095M604
$$ -36331 5599 28269 22998 17247 -6735 -61985 -48529 -51752 -82730 -85479 -85241 -30146 -25542
6205b5542r4875J2683R0055P4601J0778q860n4710l3073J2960l8294K5164l5066
$$ -25542 -120417 -107734 -17679 56922 67700 58840 4130 -28943 -15983 -54277 -29113 -64179
6193f4179O9283k5826o4078P246K9755J9410J2152n3029L146L6560K8998K1141
$$ -64179 5104 -20722 -84800 -77554 -47799 -28389 -16237 -69266 -66120 -29560 -562 20579
6181B0579j7405k226n1141N266N9061k3791l7514L0820L2283J1208m5274K3367
$$ 20579 3174 948 -50193 -44927 14134 -9657 -47171 -16351 15932 27140 -18134 5233
6169E233k245j59n3159L9061J9117k4144J4878j4724J869m675N9192j2979O950
$$ 5233 2988 2829 -50330 -11269 7848 -16296 -1418 -16142 -14273 -18948 40244 27265 34215
6156C4215m1847L3934j0467n911j3357j5333K419l193R799l8122N1666J1021J91
$$ 34215 -7632 26302 15835 9924 -3433 -18766 -16347 -19540 -9741 -47863 3803 14824 15015
6143A5015O928p7392l1990K5762r769L082K1908L6685m380R048q603L2255r1k3396
$$ 15015 21943 -55449 -87439 -61677 -71446 -68364 -46456 -9771 -14151 -5103 -13706 18549 18458 -4938
6129d938o9581K4620K2228K9173J9520m7082J3405L662L2666l8666p4600K7951
$$ -4938 -74519 -49899 -27671 1502 21022 -26060 -12655 -8993 23673 -14993 -89593 -61642
6117f1642k119K2542J7656l0749O467L9251M1330J8757k2440m4620L7741l1898
$$ -61642 -63761 -41219 -23563 -54312 -47845 -8594 32736 51493 29053 -15567 22174 -9724
6105i724j1573k5234p0823M5668P4659q0o4111o9867L6469Q3016j6886q911M3948
$$ -9724 -21297 -46531 -117354 -71686 2973 2893 -61218 -131085 -94616 -11600 -28486 -37397 6551
6092F551K6625K0671j8156j0432k6137J2167J7643r4252L1063m797j6542L1716
$$ 6551 33176 53847 35691 25259 -878 11289 28932 -65320 -34257 -39054 -55596 -23880
6080b3880k4223O582L5624J2898K4492J5581l6596L901o1123j3024q453L610P7811
$$ -23880 -48103 -41521 -5897 7001 31493 47074 10478 14379 -46744 -59768 -68221 -64611 13200
6067A3200m9372m211M1104P6569p182m7900j1994q686j9682L5653O7043M222M3956
$$ 13200 -36172 -40383 721 77290 70108 22208 10214 1528 -18154 17499 84542 88764 132720
6054A32720P1432J4412K3750q912m181p4571L336L6218l6002L3714J452Q8921
$$ 132720 204152 218564 242314 233402 229221 154650 157986 194204 158202 191916 193368 282289
6042B82289K3985n0655p184m0650l8739n6249l8583L7935P825m6391R6090k3371
$$ 282289 306274 255619 248435 207785 169046 112797 74214 112149 119974 73583 169673 146302
6030A46302m0348k5164M6127O5264k5397L0672J3394q386m2431k7104l1044K960
$$ 146302 105954 80790 126917 192181 166784 197456 210850 202464 160033 132929 101885 104845
6018A04845k4936o625J02104L2929p0505K1044J5387J1897m2447j4835n7336j383
$$ 104845 79909 73284 175388 208317 137812 158856 174243 186140 143693 128858 71522 70139
6006G0139L3019N7051k2992k1035O430N4279K967r842J49742P8484L4753k6616
$$ 70139 103158 160209 137217 116182 122612 176891 179858 170016 319758 398242 432995 406379
5994D06379l8000m0796l8241j474p3774k9083n3691L3340K8216j6174j8420l2621
$$ 406379 368379 327583 289342 287868 214094 185011 131320 164660 192876 176702 158282 125661
5982A25661O2375k67J2444M7789O040J7335P124J9492L9675J70618J59244P6399
$$ 125661 188036 187769 200213 248002 254042 271377 278501 297993 337668 508286 667530 743929
5970G43929P0506J56754N0819n149l0266l289l913j45795l7672j2988J2390J306
$$ 743929 814435 971189 1022008 1016859 986593 983304 979391 833596 795924 782936 795326 796632
5958G96632K4661M4543p7105J7466q1854j01866l0324q8117p7849j4851J6891
$$ 796632 821293 865836 788731 806197 724343 622477 592153 504036 426187 411336 428227
5947D28227K3874m1504k6449L1858m6939O7804N7991P0037n0673j0121o8909j4132
$$ 428227 452101 410597 384148 416006 369067 436871 494862 564899 514226 504105 435196 421064
5935D21064m7960m5155J3839o8162j4706l9677j8975K4148j4858k8121L2371l8217
$$ 421064 373104 327949 341788 273626 258920 219243 200268 224416 209558 181437 213808 175591
5923A75591l0758m7404K3278L5945K2143K1614q070M4678L8594j80k1231J0012
$$ 175591 144833 97429 120707 156652 178795 200409 192339 237017 275611 275431 254200 264212
5911B64212M570L4422M9915m4831n3378j1389m8259M3992N914l2127p9955n64
$$ 264212 268782 303204 353119 308288 254910 243521 195262 239254 245168 213041 133086 132522
5899A32522L4700J05038l7119l3097K0833k4749k1337M4387L7978l0463J8895
$$ 132522 167222 272260 235141 202044 222877 198128 176791 221178 259156 228693 247588
5888B47588N0639j1040K7162o59l8829k1908m7606l1086n1478p77J5116L8799
$$ 247588 298227 287187 314349 313690 274861 252953 205347 174261 122783 122006 137122 175921
5876A75921L9712k806l4125J951m3999j6925M1267P1527k1407q130L9245k6905
$$ 175921 215633 212827 178702 180653 136654 119729 160996 232523 211116 202986 242231 215326
5864B15326k1582m4112M2065L3093j9262J5223L8935J2665J5292M0367M6420m56
$$ 215326 193744 149632 191697 224790 205528 220751 259686 272351 287643 328010 374430 373974
5852C73974j09943K1827K6350m9095k455K2518k8915J4021Q5649j455j0018N4020
$$ 373974 264031 285858 312208 263113 260658 283176 254261 268282 353931 352476 342458 396478
5840C96478n4138L9626l8366k7156K7422K4534k0096j0866J5742j0807O7326Q032
$$ 396478 342340 381966 343600 316444 343866 368400 348304 337438 353180 342373 409699 417731
5828D17731M575j6742n9480L3335P1867Q206K2866J8154j8985l6625j7179Q0223
$$ 417731 422306 405564 346084 379419 451286 459492 482358 500512 481527 444902 427723 507946
5816E07946P043q65j5089q546K668o8871M5230P6985J8154k3509N428j7300K0263
$$ 507946 514989 514124 499035 490489 493157 424286 469516 546501 564655 541146 546574 529274 549537
5803E49537L3155J9690m1395J1126J1852J476l8932j6019L3762k2434J6439r51
$$ 549537 582692 602382 560987 572113 583965 585441 546509 530490 564252 541818 558257 557306
5791E57306k1127L7629M3760j1471L6958n6528M8247k0557L72m904K6648J37424
$$ 557306 536179 573808 617568 606097 643055 586527 634774 614217 614589 609685 636333 773757
5779G73757K714j1788L526r14j2781l2544N0587k6R155K8663m1953p2065R1630
$$ 773757 776471 764683 768209 767295 754514 721970 772557 772531 781686 810349 768396 696331 787961
5766G87961K7269q905p006N8800O3710r736J07196k4974J5364j2024o082J5801
$$ 787961 815230 806325 799319 858119 921829 912093 1019289 994315 1009679 997655 991573 1007374
5754A007374N1857L5647J12623R0448O220J0515N4153M261J1958j0216L0840J7433
$$ 1007374 1059231 1094878 1207501 1297949 1304169 1314684 1368837 1373098 1385056 1374840 1405680 1423113
5742A423113P0497N76K9668O8116o1405O5544K0465K3375K1922n3913P9725J74353
$$ 1423113 1493610 1494186 1523854 1591970 1530565 1596109 1616574 1639949 1661871 1607958 1687683 1862036
5730A862036J9286O3772Q9991Q7007R5267R0893O3841Q5231N7531k4298j5242
$$ 1862036 1881322 1945094 2035085 2122092 2217359 2308252 2372093 2457324 2514855 2490557 2475315
5719B475315Q9150L6635K8897R9020Q6146J16831M5994k4333j6781O1444M6944
$$ 2475315 2564465 2601100 2629997 2729017 2815163 2931994 2977988 2953655 2936874 2998318 3045262
5708C045262N2071J590m0519J8511J2062P9256p719J4999J20164N9035P7944J04342
$$ 3045262 3097333 3098923 3058404 3076915 3088977 3168233 3160514 3175513 3295677 3354712 3432656 3536998
5696C536998J01700J00135J17694O9518J88416J51086J59995J26369J41107K27727
$$ 3536998 3638698 3738833 3856527 3926045 4114461 4265547 4425542 4551911 4693018 4920745
5686D920745J63633J11122K02481J08853K47436K66849K00439K95157L22466L74443
$$ 4920745 5084378 5195500 5397981 5506834 5754270 6021119 6221558 6516715 6839181 7213624
5676G213624L87637M82560M95202M80732O18899P86171P90405R46455J047554
$$ 7213624 7601261 8083821 8579023 9059755 9678654 10464825 11255230 12201685 13249239
5667A3249239J217365J520205J758990K143817K717844L483462M738631O535990
$$ 13249239 14466604 15986809 17745799 19889616 22607460 26090922 30829553 37365543
5659C7365543Q781506J1883149J4870738J6651959J5950586J2342982P814821
$$ 37365543 46147049 58030198 72900936 89552895 105503481 117846463 125661284
5652A25661284L923684L73513k157848k314010p03644K031915M641732N627340
$$ 125661284 129584968 129958481 127800633 125486623 124782979 126814894 131456626 137083966
5644A37083966M286541J014326k859040n955153q589694j1379655j2971978j3112198
$$ 137083966 141370507 142384833 139525793 133570640 124980946 113601291 100629313 87517115
5636H7517115j2685965j1669994j0231993q511105o791154n197818l954792l135701
$$ 87517115 74831150 63161156 52929163 44418058 37626904 32429086 28474294 25338593
5628B5338593k525842k106557j702506j552088j351297j135093r90648r33056
$$ 25338593 22812751 20706194 19003688 17451600 16100303 14965210 13974562 13041506
5620A3041506p90223o72882o64725n11292n07947m85878m61245m00646m23145
$$ 13041506 12251283 11578401 10913676 10402384 9894437 9408559 8947314 8546668 8123523
5611H123523k80943k98146l28463k64598j35001k04271k75184k32697j53828k18518
$$ 8123523 7842580 7544434 7215971 6951373 6816372 6612101 6336917 6104220 5950392 5731874
5601E731874j73257j28013j81519k28621r5146q0294j53436j47807j33344j00336
$$ 5731874 5558617 5430604 5249085 5020464 4925318 4845024 4691588 4543781 4410437 4310101
5591D310101j57394j03888m9749j60877j89503l7474p7182p4838r2324j26427
$$ 4310101 4152707 4048819 3999070 3838193 3648690 3611216 3534034 3459196 3366872 3240445
5581C240445l3809p1252j01180l7535j02796k5105L4402j17651r1472J688o4146
$$ 3240445 3206636 3135384 3034204 2996669 2893873 2868768 2903170 2785519 2694047 2695735 2631589
5570B631589p5236k0232j8216n3913k3058q5439m0563K831M297l3434j06771m0436
$$ 2631589 2556353 2536121 2517905 2463992 2440934 2355495 2314932 2317763 2322060 2288626 2181855 2141419
5558B141419k3025R05o9415l9227j3913q3073N679J2654l8424o6113m7890P254
$$ 2141419 2118394 2119299 2049884 2010657 1996744 1913671 1919350 1932004 1893580 1827467 1779577 1786831
5546A786831r491P426l555p2175L1226P9045m6490k9978N2911n4500K1726j8993
$$ 1786831 1777340 1784766 1781211 1709036 1740262 1819307 1772817 1742839 1795750 1741250 1762976 1743983
5534A743983n9206M0623N1873j1722m3658N9532K6812n8968M2312K5115L1516
$$ 1743983 1684777 1725400 1777273 1765551 1721893 1781425 1808237 1749269 1791581 1816696 1848212
5523A848212O037j4991l9470N7662J4767j0388o340L0315P3493J4375q38m24m6593
$$ 1848212 1854249 1839258 1799788 1857450 1872217 1861829 1855489 1885804 1959297 1973672 1972834 1972410 1925817
5510A925817Q5172P0433O197L874K0173O6534M3563J07480J15477K5222J07807
$$ 1925817 2010989 2081422 2087619 2091493 2111666 2178200 2221763 2329243 2444720 2469942 2577749
5499B577749J01438J03916J24094J41563L85775N99409P83652J011106R61647
$$ 2577749 2679187 2783103 2907197 3048760 3434535 4033944 4817596 5828702 6790349
5490F790349O84856L38166M1366m0165k48703l51558k34992p0344L11384N75916
$$ 6790349 7475205 7813371 7854737 7814572 7565869 7214311 6979319 6908975 7220359 7796275
5480G796275N72629L71379J881j30205l71037n57342o29203n69921o11756n56864
$$ 7796275 8368904 8740283 8742164 8611959 8240922 7683580 7054377 6484456 5872700 5315836
5470E315836n09669l88921l30320k34031j23051j94184j18149j3446n4800l2147
$$ 5315836 4806167 4417246 4086926 3852895 3729844 3535660 3417511 3404065 3349265 3317118
5460C317118J6852K0715Q298K4721l4605p257Q4007Q1766O5027R2552P4827R9116
$$ 3317118 3333970 3354685 3362983 3387704 3353099 3345842 3429849 3511615 3576642 3669194 3744021 3843137
5448C843137P4375R2118J65579R6305N9102Q5795J36741J84602J71733J35038
$$ 3843137 3917512 4009630 4175209 4271514 4330616 4416411 4553152 4737754 4909487 5044525
5438E044525K38837L22666L35148L21696K97969L25377L45376L56075M39238N77258
$$ 5044525 5283362 5606028 5941176 6262872 6560841 6886218 7231594 7587669 8026907 8604165
5428H604165N98713P83262R83534J226159J465689J681154J994992K558736L562754
$$ 8604165 9202878 9986140 10969674 12195833 13661522 15342676 17337668 19896404 23459158
5419B3459158N284269Q345495J2127392J4834900J4179534J0046999M725068J055869
$$ 23459158 28743427 37088922 49216314 64051214 78230748 88277747 93002815 94058684
5411I4058684j374022m036579n449026m598739j844631K375347O311974Q119909
$$ 94058684 92684662 88648083 83199057 78600318 76755687 79131034 85443008 93562917
5403I3562917O371967K105787j790798m224676o831999r409851j0272371j0026146
$$ 93562917 99934884 102040671 100249873 96025197 89193198 79783347 69510976 59484830
5395E9484830r288598q457529p385810o018544m272141l139885k381966j902826
$$ 59484830 50196232 41738703 34352893 28334349 24062208 20922323 18540357 16637531
5387A6637531j616056j419057j165651r12273q22779o89322n90171m87128m90244
$$ 16637531 15021475 13602418 12436767 11524494 10701715 10012393 9422222 8935094 8444850
5378H444850m41603m64585l23450l39934l35270k54535k82650k38772k36718k59356
$$ 8444850 8003247 7538662 7215212 6875278 6540008 6285473 6002823 5764051 5527333 5267977
5368E267977j52578j83503j57149k15891j25088j38169j33963j60852j57484r3294
$$ 5267977 5115399 4931896 4774747 4558856 4433768 4295599 4161636 4000784 3843300 3750006
5358C750006q0312j40240p7876r0625j25890k8634p1705j04239n8625j19288j71823
$$ 3750006 3669694 3529454 3451578 3360953 3235063 3206429 3134724 3030485 2971860 2852572 2680749
5347B680749n1847Q022q3117o8614j7721j7108K7318k8485o6136k5617J6763L7760
$$ 2680749 2628902 2636924 2553807 2485193 2467472 2450364 2477682 2449197 2383061 2357444 2374207 2411967
5335B411967N3211k9224p4027k7063o4491n0628M015r382l0902n6374k6501m8797
$$ 2411967 2465178 2435954 2361927 2334864 2270373 2219745 2223760 2214378 2183476 2127102 2100601 2051804
5323B051804o6553j14937k8809m5906l7578q8945j30114n5126n9603j32543o3835
$$ 2051804 1985251 1870314 1841505 1795599 1758021 1669076 1538962 1483836 1424233 1291690 1227855
5312A227855n2005o0751m4451k209l3705N956m984p5710k8553N950n7430J0537
$$ 1227855 1175850 1115099 1070648 1068439 1034734 1040690 1035706 959996 931443 937393 879963 890500
5300H90500p400k7981O7700m7099k9109m9024n0976O347L531j8927k0407J8473
$$ 890500 883100 855119 922819 875720 846611 797587 746611 752958 756489 737562 717155 735628
5288G35628p3854N4680M8522q8189m7377m223L0845J0084J8729K3476k5436m1704
$$ 735628 661774 716454 764976 676787 629410 625187 656032 666116 684845 708321 682885 641181
5276F41181l3509n3815K866j8472l499R814M6817n710q4840O15N9736l5537l1502
$$ 641181 607672 553857 556723 538251 534752 544566 591383 585673 500833 501448 561184 525647 494145
5263D94145m9520K0463M2091n1429L471m6130k0107P497m3998M6500N8051o8548
$$ 494145 444625 465088 507179 455750 459221 413091 392984 400481 356483 402983 461034 392486
5251C92486j8554J0568p348J9345R726n5621M078k2880M4910m101o9111L5760
$$ 392486 373932 384500 377152 396497 406223 350602 354680 331800 376710 372609 303498 339258
5239C39258k7287J7060M5493J8529l0369k0762j5401L9639o5142l2392J555l201
$$ 339258 311971 329031 374524 393053 362684 341922 326521 366160 301018 268626 270181 266980
5227B66980j1602J1800n8587L5645K5996r0182J3941N8912k4888k7484N624M0117
$$ 266980 255378 267178 208591 244236 270232 180050 193991 252903 228015 200531 206155 246272
5215B46272m4879L070L1102Q236L9599l0881m0093o120l4473j3797p760j5717
$$ 246272 201393 204463 235565 243801 283400 252519 212426 206306 171833 158036 150276 134559
5203A34559O900j9824K5108m0373j2113p171Q6004L5400L8698O301Q554k0494
$$ 134559 141459 121635 146743 106370 94257 87086 173090 208490 247188 253489 262043 241549
5191B41549n4359l5987K2730r326M239N7640l7096k8063L8643L1239o1400l754
$$ 241549 187190 151203 173933 164607 168846 226486 189390 161327 199970 231209 169809 166055
5179A66055M2132p4941K793K4170J1687L438n6165j6280M4236K6721m1842L700
$$ 166055 208187 133246 136039 160209 171896 175334 119169 102889 147125 173846 132004 135704
5167A35704P502k9333l0396M6543M7859N9465r322q6032o6015j6458M2300P9537
$$ 135704 143206 113873 83477 130020 177879 237344 228022 141990 75975 59517 101817 181354
5155A81354j9459m0253N9790m726k0258L7166n7603m2176P3767j9901o490l6206
$$ 181354 161895 121642 181432 176706 156448 193614 136011 93835 167602 147701 141211 105005
5143A05005M5182o1692k8058K1202K868m646K1176k8479l6648N1644r453J073
$$ 105005 150187 88495 60437 81639 84507 79861 101037 72558 35910 87554 78101 79174
5131G9174L7733j608p9855m6653O9038j4874J479L2737L3969O2115m5025J9561
$$ 79174 116907 115299 35444 -11209 57829 42955 44434 77171 111140 173255 128230 147791
5119A47791N67o3452k1840L2241n9755L2903J397m7117J5838O9172l0789O4080
$$ 147791 148358 84906 63066 95307 35552 68455 69852 22735 38573 107745 76956 141036
5107A41036K0656K0822k1487M4549l6730N1752J36872P2107K6330K976R2539n450
$$ 141036 161692 182514 161027 205576 168846 220598 357470 429577 455907 458883 551422 545972
5095E45972m0416n0177R927k6680m6231Q02P1380N6859J1641j4180K1316n5057
$$ 545972 505556 455379 465306 438626 392395 393197 464577 521436 533077 518897 540213 485156
5083D85156m2995l4011m4114n8113j3144l1459k2661k0841l7643p0623k3482k8178
$$ 485156 442161 408150 364036 305923 292779 261320 238659 217818 180175 109552 86070 57892
5071E7892l3611m2246L8644L1503l4248K1225L6027L6411j7902k9142M8526l6816
$$ 57892 24281 -17965 20679 52182 17934 39159 75186 111597 93695 64553 113079 76263
5059G6263j7730j2061o966l135k659N5938o8577K875K523K7354l8019N911Q465
$$ 76263 58533 46472 39506 36371 33712 89650 21073 23948 26471 53825 15806 21717 30182
5046C0182l3881K4829K0854k332j8855j3091K0689k2365k1212k1402k8486M2375
$$ 30182 -3699 21130 41984 39652 20797 7706 28395 6030 -15182 -36584 -65070 -22695
5034b2695L7564j0023q480k0681K4504l4948J3662K7305n2763M4314o587M248
$$ -22695 14869 4846 -3634 -24315 189 -34759 -21097 6208 -46555 -2241 -8828 -4580
5022d580K0003L8214k3321q3146K9330M7196k6503j7073L3857K1886L0331j0369
$$ -4580 15423 53637 30316 -52830 -23500 23696 -2807 -19880 13977 35863 66194 55825
5010E5825m0534K355N2955q791n6899n6Q679k1541o336N2377j4911J6833R354
$$ 55825 15291 17646 70601 61810 4911 4855 13534 -8007 -14343 38034 23123 39956 49310
4997D9310K0875N1544k5259L3520o1599p6386L4896n353Q659j853l416j8910L7757
$$ 49310 70185 121729 96470 129990 68391 -7995 26901 21548 30207 28354 24938 6028 43785
4984D3785J0130n6860j7974M9620L8393j3619J665m743M2701P749n9010K5940
$$ 43785 53915 -2945 -20919 28701 67094 53475 55140 50397 93098 100847 41837 67777
4972F7777J2321l960M0484O5413p613l6210m6847l4938R090q0075J5643P4637
$$ 67777 80098 76138 116622 182035 174422 138212 91365 56427 65517 -14558 1085 75722
4960G5722j970k8358l3798L5437k7202r994N9335l1405k1753J0508J2738l1307
$$ 75722 73752 45394 11596 47033 19831 9837 69172 37767 16014 26522 39260 7953
4948G953m6034P5147N6812n1845j9000L7552K380p1908q188Q3026L316j8318l4775
$$ 7953 -38081 37066 93878 42033 23033 60585 62965 -8943 -17131 65895 69211 50893 16118
4935A6118M5052Q5596J559m2832l3082m0310J8755M782q3089j9200J2316L2899
$$ 16118 61170 146766 148325 105493 72411 32101 50856 55638 -27451 -46651 -34335 -1436
4923a436j712J4244K5373p8450L848J914L6777N0865k146j9925l6429J7917j6506
$$ -1436 -3148 11096 36469 -41981 -38133 -36219 558 51423 49277 29352 -7077 10840 -5666
4910e666O1314K104q5734l4911P0518O0456L3882j320L1400l5039M7918o6397
$$ -5666 55648 57752 -27982 -62893 7625 68081 101963 100643 132043 97004 144922 78525
4898G8525l3489P275L7152J7192L6493j2084p4935l6333N9248N6026m9982K1575
$$ 78525 45036 52311 89463 106655 143148 131064 56129 19796 79044 135070 85088 106663
4886A06663j1636l0979Q0487M2398j3509R1309K4779N496K0707O4825j8141j1954
$$ 106663 95027 64048 144535 186933 173424 264733 289512 295008 315715 380540 362399 350445
4874C50445P7895O2139O803K8707l2064j3687n30j8996o353P2197J333O7989l514
$$ 350445 428340 490479 497282 525989 493925 480238 479708 460712 454359 526556 527889 595878 592364
4861E92364n3199L636K7789p249l3509m8919l8045n5910o9976N3851k522r6321
$$ 592364 539165 542801 570590 563341 529832 480913 442868 386958 316982 370833 368311 271990
4849B71990j4269K377L8135k4425k4726n5439o3929j4006J2324j0945J3419j0320
$$ 271990 257721 260098 298233 273808 249082 193643 129714 115708 128032 117087 130506 120186
4837A20186l272R270k0893K1128k3666r245j8657P3393o1610j5655L8257j4174
$$ 120186 116914 126184 105291 126419 102753 93508 74851 148244 86634 70979 109236 95062
4825I5062M1221p3764M1600J1005m0275l2535m7586J01301j2509k3194k5934K6588
$$ 95062 136283 62519 104119 115124 74849 42314 -5272 96029 83520 60326 34392 60980
4813F0980k1697L433J7022L122M0703n4101p026N085O587L577k0748M6056J6346
$$ 60980 39283 42716 59738 62860 103563 49462 42436 47521 54108 57685 36937 82993 99339
4800I9339m8087J2478L6271j3446j022m6797J1356K6279n6884p948l4544N3062
$$ 99339 51252 63730 100001 86555 85533 38736 50092 76371 19487 11539 -23005 30057
4788C0057J1090j8526O984K3738l4824J438N4717m5579M260o238j507K9969m3006
$$ 30057 41147 22621 29605 53343 18519 19957 74674 29095 33355 27117 25610 55579 12573
4775A2573J0626p994l3694Q5114K7911K1486J9709j8502K8508l3107o0595R2697
$$ 12573 23199 15205 -18489 66625 94536 116022 135731 117229 145737 112630 52035 144732
4763A44732p190p8487J5259N0050r9043M491J5419n068J5132m5437k4291R2642
$$ 144732 137542 59055 74314 124364 25321 29812 45231 40163 55295 9858 -14433 78209
4751G8209k5045m2050L0924J8414K3852j9471k5670l3260j9920L5520N5798r95
$$ 78209 53164 11114 42038 60452 84304 64833 39163 5903 -14017 21503 77301 76306
4739G6306k1039K5441J2641m5575J7983P3366J7384q5795m7945M5911P950n365
$$ 76306 55267 80708 93349 47774 65757 139123 156507 70712 22767 68678 76628 71263
4727G1263M9388L4317q7367j9245N0264N848m0000J2298M2502k9639J3388N6546
$$ 71263 120651 154968 67601 48356 98620 104468 64468 76766 119268 89629 103017 159563
4715A59563l570l9832Q5L3394J723m3897L4375o1945l1045M5659o6246n8234J03325
$$ 159563 155993 116161 116246 149640 151363 107466 141841 79896 48851 94510 28264 -29970 73355
4702G3355J942M181M4075n0156l8061M5066k5288R303P31J7483N3494j704l1663
$$ 73355 75297 79478 123553 73397 35336 80402 55114 64417 65148 82631 136125 134421 102758
4689A02758l7850k9753R9794O8648k1772p0897m2737K9716K3858k6926L2805j615
$$ 102758 64908 35155 134949 203597 181825 110928 68191 97907 121765 94839 127644 126029
4677A26029l6540N7655J2430n1552M6806N9734m1078k7863J8425O7220l8826m8150
$$ 126029 89489 147144 159574 108022 154828 214562 173484 145621 164046 231266 192440 144290
4665A44290K7402K1691L050j0562n8612j1036R65p127M915L2363J9255J5557k9300
$$ 144290 171692 193383 196433 185871 127259 116223 117188 110061 114976 147339 166594 182151 152851
4652A52851m2130K5107J6435L1073J6077m6105Q954K6995p7156q86Q1J9652m6405
$$ 152851 110721 135828 152263 183336 199413 153308 162262 189257 112101 111215 111296 130948 84543
4639H4543m003J4159M9989j8470L661j414K5544N548k2843k8698L6730M3971j096
$$ 84543 80540 94699 144688 126218 129879 128465 154009 159557 136714 108016 144746 188717 187621
4626A87621l0376o0668M7190j4652K5553J3666R3007M1185j9973q0399M841m3804
$$ 187621 157245 96577 143767 129115 154668 168334 261341 302526 282553 202154 206995 163191
4614A63191J6697P1095k2147k7559k5822M0962O100n1167M1095j5672O5916M1071
$$ 163191 179888 250983 228836 201277 175455 216417 222517 171350 212445 196773 262689 303760
4602C03760p4642j0668K3756L5073n1838n285K3576K0610m0188k5803J1203L5545
$$ 303760 229118 218450 242206 277279 225441 220156 243732 264342 224154 198351 209554 245099
4590B45099K6223r562P2356L3084j7116o9581l5565n0901M1504j0687P561M268
$$ 245099 271322 261760 334116 367200 350084 280503 244938 194037 235541 224854 232415 236683
4578B36683j633L9839k194m502K1252Q3614o097k1954J3828m7691L1628K3182
$$ 236683 235050 274889 272695 268193 289445 373059 366962 345008 358836 311145 342773 365955
4566C65955L4577l5588k0037o012J1794j1425q749N8074J5676P4035n8327l0045
$$ 365955 400532 364944 344907 338895 350689 339264 330515 388589 404265 478300 419973 389928
4554C89928N2043j8807j482m019K7552K9626J2821O828P32q782J1730K8979j0505
$$ 389928 441971 423164 421682 417663 445215 474841 487662 494490 495222 486440 498170 527149 516644
4541E16644k5497K1526N8193J2104j012O53l5096J951L8932P6223K1992K5847
$$ 516644 491147 512673 570866 582970 581958 582611 547515 549466 588398 664621 686613 712460
4529G12460k804Q29P9440K2328l1218N9753L2030l8725K3403K0923O1805N4077
$$ 712460 709656 710485 789925 812253 781035 840788 872818 834093 857496 878419 940224 994301
4517I94301N6884l4786M505L2864R7222q881N3590J5953O1360J06769J33110J10212
$$ 994301 1051185 1016399 1020904 1053768 1150990 1142109 1195699 1211652 1273012 1379781 1512891 1623103
4505A623103R7349J28771M2489L4173L125K832l8019p0820l2551m0033n8465K1455
$$ 1623103 1720452 1849223 1891712 1925885 1929010 1931842 1893823 1823003 1790452 1750419 1691954 1713409
4493A713409l4197j03461j5611j07386n1911O1290l279K1300J0918j07066n727
$$ 1713409 1679212 1575751 1560140 1452754 1400843 1462133 1458854 1480154 1491072 1384006 1378279
4482A378279p6893n9736M7569l2499L4422n1632r5559J244l913q940J4114o2627
$$ 1378279 1301386 1241650 1289219 1256720 1291142 1239510 1143951 1145195 1141282 1132342 1146456 1083829
4470A083829K8076J2803m855L1932k6061k4139j8108n0513k4247k2456R580r364
$$ 1083829 1111905 1124708 1119853 1151785 1125724 1101585 1083477 1032964 1008717 986261 995841 986477
4458I86477J6942M4825L8979J1563o5895J1254J701J9310J8886M7306m0822o5277
$$ 986477 1003419 1048244 1087223 1098786 1032891 1044145 1045846 1065156 1084042 1131348 1090526 1025249
4446A025249L3514P474j6024K4810j6997O6445O0057K804L9165j012M9820j3022
$$ 1025249 1058763 1066237 1050213 1075023 1058026 1124471 1184528 1187332 1226497 1225485 1275305 1262283
4434A262283R00k7554K2321N1939M8526Q2162M2497M7885l6408N243j2757J05069
$$ 1262283 1263183 1235629 1257950 1309889 1358415 1440577 1483074 1530959 1494551 1499794 1487037 1592106
4422A592106J40576J26293N5209M7137N7189q538N4262n3467K5210K1043Q4562
$$ 1592106 1732682 1858975 1914184 1961321 2018510 2009972 2064234 2010767 2035977 2057020 2141582
4411B141582K5517L4687K0050L6534L4663Q910J2201j594o7615l1358N8202R4143
$$ 2141582 2167099 2201786 2221836 2258370 2293033 2301943 2314144 2312550 2244935 2213577 2271779 2365922
4399B365922J18125r309o958Q2641Q9446Q9040J50764K35632K68462K22569J84867
$$ 2365922 2484047 2474738 2467780 2550421 2639867 2728907 2879671 3115303 3383765 3606334 3791201
4388C791201O8588P144J26690N456J266O8240J10626L38147M04704L87395K38959
$$ 3791201 3859789 3866933 3993623 3999079 4000345 4068585 4179211 4517358 4922062 5309457 5548416
4377E548416J92314Q4823j39155j63456j84014j53707r3534n3448N1021J08271
$$ 5548416 5740730 5825553 5686398 5522942 5338928 5185221 5091687 5038239 5089260 5197531
4367E197531P3833L7616j5054j5064j50426j69716r3329j22999n5901n6529p5481
$$ 5197531 5271364 5308980 5293926 5278862 5128436 4958720 4865391 4742392 4686491 4629962 4554481
4356D554481l324Q6230L1463n0K6108O9123O5132J44959J45515J27412O6049J24373
$$ 4554481 4551157 4637387 4668850 4668800 4694908 4764031 4829163 4974122 5119637 5247049 5313098 5437471
4344E437471J05222J43970J04692J60400K05945J83627K16126J98006K61881K87891
$$ 5437471 5542693 5686663 5791355 5951755 6157700 6341327 6557453 6755459 7017340 7305231
4334G305231L72003L72560M85440N06867O87202P91771J018994J351511J764963
$$ 7305231 7677234 8049794 8535234 9042101 9729303 10521074 11540068 12891579 14656542
4325A4656542K279243K704094L229613L794152M197131L978409L342551K710687
$$ 14656542 16935785 19639879 22869492 26663644 30860775 34839184 38181735 40892422
4317D0892422K321588K252525K774394M013574O098773Q046888Q820701P508853
$$ 40892422 43214010 45466535 48240929 52254503 58353276 66400164 75220865 82729718
4309H2729718M573613J865934Q8246j866493l567127l635903k396203K36723L059612
$$ 82729718 87303331 89169265 89257511 87391018 83823891 80187988 77791785 78028508 81088120
4300H1088120M620253L512108N72074k198321l485283m924624o999898p432326
$$ 81088120 85708373 89220481 89792555 87594234 84108951 79184327 72184429 64752103
4292F4752103o673328n415010l604140j991620j231193j422308k081531k401581
$$ 64752103 58078775 52663765 49059625 47068005 45836812 44414504 42332973 39931392
4284C9931392k512312l162398l517163l384220k984797k693439k410878j943202
$$ 39931392 37419080 34256682 30739519 27355299 24370502 21677063 19266185 17322983
4276A7322983j493434r20682p04441m94665m53742m63471l47824k16487j49833
$$ 17322983 15829549 14908867 14204426 13709761 13256019 12792548 12444724 12228237 12078404
4267A2078404j52753m6068J42j7911l437R492J00126J12526J32223J00257J22026
$$ 12078404 11925651 11879583 11879725 11861814 11858377 11867869 11967995 12080521 12212744 12313001 12435027
4256A2435027K83060K77884K56992K59483L17746M10902M49918N16021M54509
$$ 12435027 12718087 12995971 13252963 13512446 13830192 14241094 14691012 15207033 15661542
4247A5661542O56575P13336P56372Q56740Q51160R23329J079213J245314J258694
$$ 15661542 16318117 17031453 17787825 18644565 19495725 20419054 21498267 22743581 24002275
4238B4002275J407143J490367J538947J704426J722570J843816K090743K182400
$$ 24002275 25409418 26899785 28438732 30143158 31865728 33709544 35800287 37982687
4230C7982687K301546K419931K583614K710265K833463L030703L028753L075193
$$ 37982687 40284233 42704164 45287778 47998043 50831506 53862209 56890962 59966155
4222E9966155L232484L187513L189993L261209L167021L163296L115653L205572
$$ 59966155 63198639 66386152 69576145 72837354 76004375 79167671 82283324 85488896
4214H5488896L248285L282057L163284L164979L059890L022022K899703K622897
$$ 85488896 88737181 92019238 95182522 98347501 101407391 104429413 107329116 109952013
4206A09952013K358870K063256J824405J443761J290898J136395J021948Q33811
$$ 109952013 112310883 114374139 116198544 117642305 118933203 120069598 121091546 121925357
4198A21925357O57494M03913J61059N653l66284p23038r77210j319511j597021
$$ 121925357 122582851 122986764 123147823 123153476 122787192 122064154 121086944 119767433 118170412
4189A18170412j912370k080997k245509k444754k566386k603248k708761k758316
$$ 118170412 116258042 114177045 111931536 109486782 106920396 104317148 101608387 98850071
4181I8850071k900655l045930l110686l255429l365537l362417l347141l407178
$$ 98850071 95949416 92903486 89792800 86537371 83171834 79809417 76462276 73055098
4173G3055098l315833l331992l244080l139357l108658k962608k902751k754963
$$ 73055098 69739265 66407273 63163193 60023836 56915178 53952570 51049819 48294856
4165D8294856k617801k539911k473483k391154k201842k263487k148755j997542
$$ 48294856 45677055 43137144 40663661 38272507 36070665 33807178 31658423 29660881
4157B9660881j801673j623932j674215j506483j328565j259825j089983j073165
$$ 29660881 27859208 26235276 24561061 23054578 21726013 20466188 19376205 18303040
4149A8303040r34790q77199r06249p41822p30144o35933n28429n19703m90768
$$ 18303040 17368250 16491051 15584802 14842980 14112836 13476903 12948474 12428771 11938003
4140A1938003l95829m61527l19756k70182l23877k40137l38765k68553k59414
$$ 11938003 11542174 11080647 10760891 10490709 10166832 9926695 9587930 9319377 9059963
4131I059963j83336j54317k32509j63974k24769k04091j06219j60086j58639j47955
$$ 9059963 8876627 8722310 8489801 8325827 8101058 7896967 7790748 7630662 7472023 7324068
4121G324068r2994r7815r6404j55531j85115q4117m4687j14376r3062n0857r2658
$$ 7324068 7231074 7133259 7036855 6881324 6696209 6612092 6567405 6453029 6359967 6309110 6216452
4110F216452k1300l2610P737k4949m762N2855P5587N3781R0388M8714Q6305P4258
$$ 6216452 6195152 6162542 6170279 6145330 6140568 6193423 6269010 6322791 6413179 6461893 6548198 6622456
4098F622456J30475R3014J6406J3214K9747K9993N8350K6800l0648k9618K930
$$ 6622456 6752931 6845945 6862351 6875565 6905312 6935305 6993655 7020455 6989807 6960189 6963119
4087F963119L7962R8832K3980J05177J02476J8807J8425L3277k8100l7645j18958
$$ 6963119 7001081 7099913 7123893 7229070 7331546 7350353 7368778 7402055 7373955 7336310 7217352
4076G217352q1598j10733o3210L5950q0314q4418k7263o7838m2556J3021j05809
$$ 7217352 7135754 7025021 6961811 6997761 6917447 6833029 6805766 6737928 6695372 6708393 6602584
4065F602584r9691k9587r7518r9175k6904L730o0758j41303j5592J6417q6629
$$ 6602584 6502893 6473306 6375788 6276613 6249709 6253439 6192681 6051378 6035786 6052203 5965574
4054E965574o4726N5929j7856l0370J4140L0581J6754k7565M0338j7741n244O0322
$$ 5965574 5900848 5956777 5938921 5908551 5922691 5953272 5970026 5942461 5982799 5965058 5959814 6020136
4042F020136K2269P1850K0599j3318M1056J9816J8432Q5054k539M3286J04329
$$ 6020136 6042405 6114255 6134854 6121536 6162592 6182408 6200840 6285894 6283355 6326641 6430970
4031F430970P8777N2277O1406Q0885J01593P9877J37063P9177J37106J05899J46893
$$ 6430970 6509747 6562024 6623430 6704315 6805908 6885785 7022848 7102025 7239131 7345030 7491923
4020G491923J31847J59229J53660J96156J44249K36366K54894K38844L03937L12907
$$ 7491923 7623770 7782999 7936659 8132815 8277064 8513430 8768324 9007168 9311105 9624012
4010I624012L40490L26422L48374L55541L26497L86540L99141L69682M42032M65365
$$ 9624012 9964502 10290924 10639298 10994839 11321336 11707876 12107017 12476699 12918731 13384096
4000A3384096M62343N37911N58797O89881P76093R85517J048266J198987J427986
$$ 13384096 13846439 14384350 14943147 15633028 16409121 17394638 18442904 19641891 21069877
3991B1069877J706142J955064K289179K786846L280879L854455M754954N910765
$$ 21069877 22776019 24731083 27020262 29807108 33087987 36942442 41697396 47608161
3983D7608161P386281R116086J1041846J2799633J3970193J4542374J3907957
$$ 47608161 54994442 64110528 75152374 87952007 101922200 116464574 130372531
3976A30372531J2372136J0139959P423045M704406K171320J02967j306973k018686
$$ 130372531 142744667 152884626 160307671 165012077 167183397 167286364 165979391 163960705
3968A63960705k034519j674733p44452K30402J079779J558491J273507K14147
$$ 163960705 161926186 160251453 159507001 159737403 160817182 162375673 163649180 163863327
3960A63863327j574504l797921o174116q411311j0224991j1411534j1924100j1903701
$$ 163863327 162288823 158490902 152316786 143905475 133680484 122268950 110344850 98441149
3952I8441149j1349941j0388619r280055q098662o893745n716365m806798m013065
$$ 98441149 87091208 76702589 67422534 59323872 52430127 46713762 41906964 37893899
3944C7893899l326922k828648k347370j989530j675764j512897j231518j096921
$$ 37893899 34566977 31738329 29390959 27401429 25725665 24212768 22981250 21884329
3936B1884329r16669q06928p30368o14076m72731n38300m38384l40879l19506
$$ 21884329 20967660 20160732 19430364 18816288 18343557 17805257 17366873 17025994 16706488
3927A6706488k91671k69574k53186j87298k06087j71778j58587n3308n6397j18812
$$ 16706488 16414817 16145243 15892057 15704759 15498672 15326894 15168307 15114999 15058602 14939790
3917A4939790r0990r136K0012q4016n1080N1740K234O3153Q7839R929L4447Q1105
$$ 14939790 14848800 14839664 14859676 14775660 14724580 14776320 14778554 14841707 14929546 14939475 14973922 15055027
3905A5055027R6800J09281N2407J448Q7121J33396P0361Q0917J15850R2087J52667
$$ 15055027 15151827 15261108 15313515 15314963 15402084 15535480 15605841 15686758 15802608 15894695 16047362
3894A6047362J42960J47524J93879K47527K94665L59330L06476M21294N89236
$$ 16047362 16190322 16337846 16531725 16779252 17073917 17433247 17739723 18161017 18750253
3885A8750253N38376O18868P38811P92134P99640Q15046Q48169Q23577Q35778
$$ 18750253 19288629 19907497 20646308 21438442 22238082 23053128 23901297 24724874 25560652
3876B5560652P90650P55440P39169P64715Q81948Q51084R20590J036029J068532
$$ 25560652 26351302 27106742 27845911 28610626 29492574 30343658 31264248 32300277 33368809
3867C3368809J106022J051623J020889R02212P48397O35057M51149K45333K01520
$$ 33368809 34474831 35526454 36547343 37449555 38197952 38833009 39284158 39529491 39731011
3858C9731011J64292M6490J01800J55617J94506K20073K24609J95256J08369J01766
$$ 39731011 39895303 39941793 40043593 40199210 40393716 40613789 40838398 41033654 41142023 41243789
3848D1243789L9104n2011n9286m3580Q377l6576J02398K75025L77571M87543O11801
$$ 41243789 41282893 41230882 41171596 41128016 41136393 41099817 41202215 41477240 41854811 42342354 42954155
3837D2954155Q36217J094618J325068J621822J994728K298056K772356L313666
$$ 42954155 43790372 44884990 46210058 47831880 49826608 52124664 54897020 58210686
3829E8210686L886162M554702N341439O159523P121868Q066997R242140J0664211
$$ 58210686 62096848 66651550 71992989 78152512 85274380 93341377 102583517 113247728
3821A13247728J2444458J4737552J7641532K1038769K4360667K7017932K8359765
$$ 113247728 125692186 140429738 158071270 179110039 203470706 230488638 258848403
3814B58848403K8096609K6823348K4408950K1154936J7217074J3169667R692750
$$ 258848403 286945012 313768360 338177310 359332246 376549320 389718987 399411737
3807C99411737O967798N039719M168093M128857M820105N847186O954613Q007565
$$ 399411737 406379535 411419254 415587347 419716204 424536309 430383495 437338108 445345673
3799D45345673Q609553Q014217N623205J358713l913826r068682j3231974j6415735
$$ 445345673 453955226 461969443 467592648 468951361 465037535 455968853 442736879 426321144
3791D26321144j8309174j8929050j8521646j7321643j5816989j4102785j2301792
$$ 426321144 408011970 389082920 370561274 353239631 337422642 323319857 311018065
3784C11018065j0849932r755214r215388q991044r131328r520808j0045525j0347640
$$ 311018065 300168133 290412919 281197531 272206487 263075159 253554351 243508826 233161186
3776B33161186j0593820j0654301j0462250j0089920r589624r068132q595478
$$ 233161186 222567366 211913065 201450815 191360895 181771271 172703139 164107661
3769A64107661q217706p781790p533844p490347p616696p536349p564831p531206
$$ 164107661 155889955 148108165 140574321 133083974 125467278 117930929 110366098 102834892
3761A02834892p299469p155448o795782o170314n680318m980517m437577l869385
$$ 102834892 95535423 88379975 81584193 75413879 69733561 64753044 60315467 56446082
3753E6446082l299441k782806k344850j920931j535850j157252q27085n92601
$$ 56446082 53146641 50363835 48018985 46098054 44562204 43404952 42577867 41985266
3745D1985266l45849k49761k31303k14170k49043k24653k63553l53957l82702
$$ 41985266 41639417 41389656 41158353 40944183 40695140 40470487 40206934 39852977 39470275
3736C9470275k63460j66730J1569J15441K31279K75893L76584J59943J15897N5688
$$ 39470275 39206815 39040085 39051654 39167095 39398374 39674267 40050851 40210794 40326691 40382379
3726D0382379j26762l81736m92303p15371q40403j014144j043776j134111j090881
$$ 40382379 40255617 39873881 39381578 38666207 37825804 36811660 35767884 34633773 33542892
3717C3542892r60664r59686q69393q71611q41322q63139q51922r74853r75316
$$ 33542892 32582228 31622542 30753149 29881538 29040216 28177077 27325155 26350302 25374986
3708B5374986r17619j081845j098036r73734j088998j020692q79379q96181q27406
$$ 25374986 24457367 23375522 22277486 21303752 20214754 19194062 18314683 17418502 16591096
3699A6591096p73973o28402n39662n17944m94544m20769l29556l35273k91342
$$ 16591096 15817123 15188721 14649059 14131115 13636571 13215802 12886246 12550973 12259631
3690A2259631k40646k51063k59134j97553k07615j89535j80860k62479j17707
$$ 12259631 12018985 11767922 11508788 11311235 11103620 10914085 10733225 10470746 10353039
3681A0353039k09553k11764j42378j36770j30271k00303j73086j80878j00064
$$ 10353039 10143486 9931722 9789344 9652574 9522303 9322000 9148914 8968036 8867972
3672H867972q7053j08228j24926j41623r8368j10440r5119j35739j55570j05198
$$ 8867972 8780919 8672691 8547765 8406142 8307774 8197334 8102215 7966476 7810906 7705708
3662G705708j92491j11771j09374j49698j05590j14829j57512j14728p1952q2591
$$ 7705708 7513217 7401446 7292072 7142374 7036784 6921955 6764443 6649715 6577763 6495172
3652F495172r9888n7506j11191p0354j03786k5716m0674m4877q5159m6536j01040
$$ 6495172 6395284 6337778 6226587 6156233 6052447 6026731 5986057 5941180 5856021 5809485 5708445
3641E708445q1500l6550n4382m4942n4264j23779k8879l0425P66o8814o7607K440
$$ 5708445 5626945 5590395 5536013 5491071 5436807 5313028 5284149 5253724 5254490 5185676 5118069 5120509
3629E120509m1645j1191m6861n5963r4602j9111l1603N4942j3105j08566l9494
$$ 5120509 5078864 5067673 5020812 4964849 4870247 4851136 4819533 4874475 4861370 4752804 4713310
3618D713310n3530m4075J7597L9500j11994j4046j2129k3207q787Q507l9676Q898
$$ 4713310 4659780 4615705 4633302 4672802 4560808 4546762 4534633 4511426 4502639 4511146 4471470 4480368
3606D480368o2803J6998Q8375l1126n2658R0257M0773l5323J5963K7445J8291
$$ 4480368 4417565 4434563 4522938 4491812 4439154 4529411 4570184 4534861 4550824 4578269 4596560
3595D596560l2511M50M489Q9703J7428j8102N640J18084m6428j3216M6010L8185
$$ 4596560 4564049 4564499 4568988 4658691 4676119 4658017 4663657 4781741 4735313 4722097 4768107 4806292
3583D806292M5650q436L264O0923N1405N2039O771j0001K5501M2696L193K149
$$ 4806292 4851942 4843506 4846770 4907693 4959098 5011137 5017908 5007907 5033408 5076104 5079297 5081446
3571E081446M7792o0192N0435N2293j1675N9263k2705j0505P4701J2224j9490
$$ 5081446 5129238 5069046 5119481 5171774 5160099 5219362 5196657 5186152 5260853 5273077 5253587
3560E253587Q956N1715P4129P0647k5259k5827j4061P5912j9053K5681R7218J5637
$$ 5253587 5262543 5314258 5388387 5459034 5433775 5407948 5393887 5469799 5450746 5476427 5573645 5589282
3548E589282J9868j9331N7258p41P7298L8444J7370J1468J13884J09130J10914
$$ 5589282 5609150 5589819 5647077 5646336 5723634 5762078 5779448 5790916 5904800 6013930 6124844
3537F124844L4865J34247J22410N9030J03736R9545J02858J28107J92306J63065
$$ 6124844 6159709 6293956 6416366 6475396 6579132 6678677 6781535 6909642 7101948 7265013
3527G265013J13345P1846J83457J83625J13952J24515M1603J31960J01970N3981
$$ 7265013 7378358 7450204 7633661 7817286 7931238 8055753 8097356 8229316 8331286 8385267
3517H385267J41254R4082j8902L7275O5920P1928Q6992N5437L7048M0623L0732
$$ 8385267 8526521 8620603 8601701 8638976 8704896 8776824 8863816 8919253 8956301 8996924 9027656
3506I027656J245L6305J3366o1219o0748j34487q8961K778j02445j4474p2387
$$ 9027656 9028901 9065206 9078572 9017353 8956605 8822118 8733157 8735935 8633490 8619016 8546629
3495H546629l6112j2678n073k2257p1076k1355p7362n1158l2977l4451m4935n8803
$$ 8546629 8510517 8497839 8492766 8470509 8399433 8378078 8300716 8249558 8216581 8182130 8137195 8078392
3483H078392q5955L6525k5806k5750L6665m2363m0671n9389j1995O707J0535M8090
$$ 8078392 7992437 8028962 8003156 7977406 8014071 7971708 7931037 7871648 7859653 7866360 7876895 7924985
3471G924985l4394K0056N7169K3819N5711l5178O3090M9420N3031L0385J7985
$$ 7924985 7890591 7910647 7967816 7991635 8047346 8012168 8075258 8124678 8177709 8208094 8226079
3460H226079N8342O2525n0045n0842n8756l0163j21008m5111m3805j914m8448
$$ 8226079 8284421 8346946 8296901 8246059 8187303 8157140 8036132 7991021 7947216 7945302 7896854
3449G896854o4305l0990q4283n3637j14372j88808j12793n4351q1149j34257j21483
$$ 7896854 7832549 7801559 7717276 7663639 7549267 7360459 7247666 7193315 7112166 6977909 6856426
3438F856426j29558j31104K4529l1538j8353K4213l5008m63M0812N3877J77235
$$ 6856426 6726868 6595764 6620293 6588755 6570402 6594615 6559607 6559144 6599956 6653833 6831068
3427F831068M03591O66682P69491O42979K88618q7192j09608l16806m55167m62303
$$ 6831068 7234659 7901341 8670832 9313811 9602429 9515237 9405629 9088823 8633656 8171353
3417H171353n38331m17323m71657l61937k85092j80575j96392j30444k1629m3742
$$ 8171353 7633022 7215699 6744042 6382105 6097013 5916438 5720046 5589602 5567973 5524231
3407E524231m8218l9743j03278l3408J8916K9750O8083K34018N30297O95926P12823
$$ 5524231 5476013 5436270 5332992 5299584 5318500 5348250 5416333 5650351 6180648 6876574 7589397
3396G589397N71676K08268j08821j92774l41792m62807m84120m80030m33908m28525
$$ 7589397 8161073 8369341 8260520 8067746 7725954 7263147 6779027 6298997 5865089 5436564
3386E436564l64882l04679j61190j57788j19290o1201j21855p3000n7520j28226
$$ 5436564 5071682 4767003 4605813 4448025 4328735 4267534 4145679 4072679 4015159 3886933
3376C886933n9769o9055j02333k8725j2372L102o9608n5603k1005m4366q8816
$$ 3886933 3827164 3758109 3655776 3627051 3614679 3617781 3548173 3492570 3471565 3427199 3338383
3365C338383j2483o8413o4803M0812J0078j06746r3369J1502j3728j3542m5522
$$ 3338383 3325900 3257487 3192684 3233496 3243574 3136828 3043459 3054961 3041233 3027691 2982169
3354B982169l3455m1967j0521J3585k6485o7983o8540k2332J4407l1071q0365
$$ 2982169 2948714 2906747 2896226 2909811 2883326 2815343 2746803 2724471 2738878 2707807 2627442
3343B627442n7447j00052J6619M3439p5587K4783K3886K9089j28688p3979R192
$$ 2627442 2569995 2469943 2486562 2530001 2454414 2479197 2503083 2532172 2403484 2329505 2338697
3332B338697m1869j8456l2104N8797M9540l1643o8558j9679o4166k3509N3861
$$ 2338697 2296828 2278372 2246268 2305065 2354605 2322962 2254404 2234725 2170559 2147050 2200911
3321B200911N928p2652n8555n6508j9192k430j4123L3435k9674o8669j2435p9489
$$ 2200911 2206839 2134187 2075632 2019124 1999932 1997502 1983379 2016814 1987140 1918471 1906036 1826547
3309A826547K658m115J9202M5520l6932m5144k2328n2269K2078k6200m2653j3120
$$ 1826547 1829205 1825090 1844292 1889812 1852880 1807736 1785408 1733139 1755217 1729017 1686364 1673244
3297A673244l6853k6044n2909P872Q4602m5159m9987N4335o473m9067J5374n9880
$$ 1673244 1636391 1610347 1557438 1565310 1649912 1604753 1554766 1609101 1602628 1553561 1568935 1509055
3285A509055J5721L253q1064L3796Q2318l1938n2159k6660k7699n4897N740N7709
$$ 1509055 1524776 1528029 1446965 1480761 1563079 1531141 1478982 1452322 1424623 1369726 1375466 1433175
3273A433175j5294k3575l3397P0377P929j23259n797J5582q517n2434J6978J2833
$$ 1433175 1417881 1394306 1360909 1431286 1439215 1315956 1310159 1325741 1317224 1264790 1281768 1294601
3261A294601o061J0535n2911l2244O3402P027k1780J7628n2440l0718k8040m0862
$$ 1294601 1288540 1299075 1246164 1213920 1277322 1284349 1262569 1280197 1227757 1197039 1168999 1128137
3249A128137N1631j5957r256o8509l1417M3129o6627j1425K7804N0794K8333n6693
$$ 1128137 1179768 1163811 1154555 1086046 1054629 1097758 1031131 1019706 1047510 1098304 1126637 1069944
3237A069944p4714P1036K7262Q995q3983M84j1880l8934k9111K1666l480K0350
$$ 1069944 995230 1066266 1093528 1102523 1018540 1019024 1007144 968210 939099 960765 957285 977635
3225I77635j858J3579l2105l4547J5615K086r69l8564l6975L0618j784L247M5001
$$ 977635 975777 989356 957251 922704 938319 940405 939436 900872 863897 894515 892731 895978 940979
3212I40979j7102k6854K1245J8059L9695j1914j2876o0400N87k7181j5270m966
$$ 940979 923877 897023 918268 936327 976022 964108 951232 890832 891419 864238 848968 844002
3200H44002m875M0489o308p8777L9935J9646j6151k5414k0892m5374M4220M0821
$$ 844002 839127 879616 873308 794531 834466 854112 837961 812547 791655 746281 790501 831322
3188H31322l5339R545o0172J8171P0843N4771r5344n185K7994l7964L2817p973
$$ 831322 795983 805528 745356 763527 834370 889141 793797 788612 816606 778642 811459 803486
3176H03486j9849q428J4841K6727O8237N7604l4470k6433l1924j4638L8555K385
$$ 803486 783637 775209 790050 816777 885014 942618 908148 881715 849791 835153 873708 876093
3164H76093l8754k1141K0379P8611l0129K5570L1572N9057j2007j3904O054k618
$$ 876093 837339 816198 836577 915188 885059 910629 942201 1001258 989251 975347 981401 978783
3152I78783L1285R521l2856N317N8738l5624o658M3609O8312K4570m6267L0645
$$ 978783 1010068 1019589 986733 992050 1050788 1015164 1008506 1052115 1120427 1144997 1098730 1129375
3140A129375M3135k6261K5445J02521j9863K6300l2327o3544p7275N729O589M1535
$$ 1129375 1172510 1146249 1171694 1274215 1254352 1280652 1248325 1184781 1107506 1113235 1119824 1161359
3128A161359K3957l2578K6917L8598j6836l630j5563L5045L792j9537L8902P774
$$ 1161359 1185316 1152738 1179655 1218253 1201417 1197787 1182224 1217269 1221061 1201524 1240426 1248200
3116A248200R0154J36612O9125P065M6055O6655q0742o4176p9333j35929n2439
$$ 1248200 1338354 1474966 1544091 1551156 1597211 1663866 1583124 1518948 1439615 1303686 1251247
3105A251247m1915q4989q7176k9955q273p8404j7997l3733j4871J3390K214O31
$$ 1251247 1209332 1124343 1037167 1007212 998939 920535 902538 868805 853934 867324 869538 870169
3093H70169J299k8709L4606n4658j009K0312j0225K5830n164n888N5P9464l8930
$$ 870169 871468 842759 877365 822707 821698 842010 831785 857615 852451 846563 846618 926082 887152
3080H87152k8435K9874k2246k8485M152k0596j2345k6991k8833r1488l9636j2774
$$ 887152 858717 888591 866345 837860 842012 821416 809071 782080 753247 661759 622123 609349
3068F09349R8581P8103n2131j890k4334j3166j6184l4572K2427l2276j8093n1267
$$ 609349 707930 786033 733902 732012 707678 694512 678328 643756 666183 633907 615814 564547
3056E64547l4317l1095J2731l5426k4678m8280j0449J2580O070l9676M0330j9500
$$ 564547 530230 499135 511866 476440 451762 403482 393033 405613 411683 372007 412337 392837
3044C92837j0069K3117j6031m5479J4495K0472K8645K74o7966O9040L4102L4784
$$ 392837 382768 405885 389854 344375 358870 379342 407987 408261 340295 409335 443437 478221
3032D78221J4983q1338J6170J02494j9113r7718O499k751m7056k9669k6172m597
$$ 478221 493204 411866 428036 530530 511417 413699 420198 417447 370391 340722 314550 309953
3020C09953K26r670L815P8720r1183m7951m0680J8846L8861K0352n437j7863q947
$$ 309953 310179 300509 304324 383044 291861 243910 203230 222076 260937 281289 275852 257989 249042
3007B49042p0969N0790K7702k975K828n642o854j0638K0843L8722n768m9192k1050
$$ 249042 178073 228863 256565 253590 256418 250776 243922 233284 254127 292849 287081 237889 216839
2994B16839Q129J7912o0295k8209K0117M939L3447n7835p3266M6227K2822n0849
$$ 216839 224968 242880 182585 154376 174493 179432 212879 155044 81778 128005 150827 99978
2982I9978M8885M0135J6428j8920k5744o5911K2394O2840k2316L7883K1195m7869
$$ 99978 148863 188998 205426 186506 160762 94851 117245 180085 157769 195652 216847 168978
2970A68978O0968Q754j3918j6189n4557j7778M2858j4353j4857N9056p3709N3197
$$ 168978 229946 238700 224782 208593 154036 136258 179116 164763 149906 208962 135253 188450
2958A88450K703n0102j3030R137q315l885K3788k6366J0348n654j6677k4885j2764
$$ 188450 191153 141051 128021 137158 128843 124958 148746 122380 132728 127074 110397 85512 72748
2945G2748J3398j3411P032j7325J7174P8488P3332l7642k2534q833r5527m9067
$$ 72748 86146 72735 79767 62442 79616 158104 231436 193794 171260 162427 66900 17833
2933A7833O2847P2033m4873l442N7903M402k5733j3519K4805k2440l6868R203
$$ 17833 80680 152713 107840 104398 162301 166703 140970 127451 152256 129816 92948 102151
2921A02151J7534L7574k5990J6336M204l4537k9374k9001q884Q3355J3287r551
$$ 102151 119685 157259 131269 147605 151809 117272 87898 58897 50013 133368 146655 137104
2909A37104l6693j3250L9502J4493j0945J4621K5531l0614j0941o6632J827M7734
$$ 137104 100411 87161 126663 141156 130211 144832 170363 139749 128808 62176 64003 111737
2897A11737M437L8174J0200n6102n1767j1434N0543k1131M7590L4134j10704q1001
$$ 111737 116174 154348 164548 108446 56679 45245 95788 74657 122247 156381 45677 -35324
2885c5324Q9143K2800l4723j171M7156j320l8823q763k5449j6978Q0241J428j617
$$ -35324 53819 76619 41896 40725 87881 86561 47738 38975 13526 -3452 76789 78217 76600
2872G6600R5322n0028p6811L0738K529K0806m7692l3233j071M5499p50k4212K9827
$$ 76600 171922 121894 45083 75821 78350 99156 51464 18231 17160 62659 61909 37697 67524
2859F7524m3855O6466K9586R132p661j9527m015L069O323m7771K7895k9696N8849
$$ 67524 23669 90135 119721 128853 121192 101665 97650 100719 107042 59271 87166 57470 116319
2846A16319P210n759k1791k2710k599L0959m4191L8019l1395m7957N2508m7668
$$ 116319 123529 117770 95979 73269 70670 101629 57438 95457 64062 16105 68613 20945
2834B0945j7056P465k5862K3648R9494N3388r0949p4308O3729j8559k0588N6570
$$ 20945 3889 11354 -14508 9140 108634 162022 71073 -3235 60494 41935 21347 77917
2822G7917J0757n5609q848K2903j000n107j733l2835N3762n9728k298K2151k0152
$$ 77917 88674 33065 24217 47120 46120 41013 39280 6445 60207 479 -1819 20332 180
2809A80K9983k2459J7802R6486l8078l2638M7521N2382n451Q684L398r8869n6251
$$ 180 30163 7704 25506 121992 83914 51276 98797 151179 145728 154412 157810 58941 2690
2796B690J1753Q975J9164n1652N3560o7m6180M8992O94p1244k380J1711O4839
$$ 2690 14443 23418 42582 -9070 44490 44423 -1757 47235 47929 -23315 -25695 -13984 50855
2783E0855k1943q936q415M1007J7652N1895k7970l1667o630o648L3388j6219n4914
$$ 50855 28912 19976 11561 52568 70220 122115 94145 62478 55848 49200 82588 66369 11455
2770A1455q794J7490j8176k3381M5562N0486n0281j5437K0417N466r965o534N171
$$ 11455 2661 20151 1975 -21406 24156 74642 24361 8924 29341 34807 24842 18308 23479
2757B3479K5175n6693R986J3477J0502r028m3052L2268k7331n433l6342r685m9076
$$ 23479 48654 -8039 1947 15424 25926 16898 -26154 6114 -21217 -26650 -62992 -72677 -121753
2744a21753N1109O8978J7052N667p0371J8851K857L1824L4572k1899j5264k8042
$$ -121753 -70644 -1666 15386 21053 -49318 -30467 -27610 4214 38786 16887 1623 -26419
2732b6419K0224L7707q63K3125j3119J509k5451J3407j756n3115l5387Q2506l3816
$$ -26419 -6195 31512 30649 53774 40655 42164 16713 30120 28364 -24751 -60138 22368 -11448
2719a1448N833l3407m374O1192l571J0666p7987L8497M8939p1700O697M8380j7537
$$ -11448 -5615 -39022 -43396 17796 14225 24891 -53096 -14599 34340 -37360 -30663 17717 180
2706A80j7993L0196l888j0881q352N943m0200N42N5132J3412k8682j5381M014
$$ 180 -17813 12383 8495 -2386 -10738 -4795 -44995 -44453 10679 24091 -4591 -19972 -15958
2693a5958M1894K9069r634K0246J3981p7142l4029K3122K2716K4897j1653l835
$$ -15958 25936 55005 45371 65617 79598 2456 -31573 -8451 14265 39162 27509 23674
2681B3674l2929l7751R8027L1638l2019k2604k9747o1168j0260K4379o146m6785
$$ 23674 -9255 -47006 51021 82659 50640 28036 -1711 -62879 -73139 -48760 -54906 -101691
2669a01691n7413Q1870Q8603o4624m8361Q2863P7510k8692k4240n8603j9748J3419
$$ -101691 -159104 -77234 11369 -53255 -101616 -18753 58757 30065 5825 -52778 -72526 -59107
2657e9107J709J6906L4212l1189k0743k0841O1193K2838j7528j2795L2349J108
$$ -59107 -57398 -40492 -6280 -37469 -58212 -79053 -17860 4978 -12550 -25345 7004 8112
2645H112j8604n9271O362J4418N0312K0345k9891K2230O3499l5818j01213M938
$$ 8112 -10492 -69763 -63401 -48983 1329 21674 -8217 14013 77512 41694 -59519 -54581
2633e4581J3114R0636L9109K2254k9458l9457l0229K9945p1213p221N580L1584
$$ -54581 -41467 49169 88278 110532 81074 41617 11388 41333 -29880 -37101 -31521 63
2621F3o6132P4690N8718k8005L895m5829l8157Q6435J8286j1643N3895l8825q9804
$$ 63 -66069 8621 67339 39334 43229 -2600 -40757 45678 63964 52321 106216 67391 -22413
2608b2413k5956J05403n5531n5567L6459j6276k977P0788j5910J9407l3800R686
$$ -22413 -48369 57034 1503 -54064 -17605 -33881 -36858 33930 18020 37427 3627 13313
2596A3313J8199l6453K512k7111j1739l710O7318J6279k7487j9877n744n615L9028
$$ 13313 31512 -4941 -2429 -29540 -41279 -44989 22329 38608 11121 -8756 -14500 -20115 18913
2583A8913P9918L9074j2970L6855J265J6701K8156k835J2065q6654j3041L9300
$$ 18913 98831 137905 124935 161790 163055 179756 207912 205077 217142 130488 117447 156747
2571A56747k9204k6119J8889o50m9962K3221l5368M429K4613L2556n5694l0676
$$ 156747 127543 101424 120313 119663 69701 92922 57554 61983 86596 119152 63458 32782
2559C2782J3000k3410n9348M5341N477l5903K068o211k551q879N5709L9875K3018
$$ 32782 45782 22372 -36976 8365 13842 -22061 -19993 -26204 -28755 -37634 18075 57950 80968
2546H0968j8562p7876n2948k1553k593k2553M3698K4417M1049L3263Q962J5509
$$ 80968 62406 -15470 -68418 -89971 -92564 -115117 -71419 -47002 -5953 27310 36272 51781
2534E1781k4834J769m9367q043j9985M0364N08o2253K1911L2328P8435K0478k3795
$$ 51781 26947 28716 -20651 -28694 -48679 -8315 -7807 -70060 -48149 -15821 62614 83092 59297
2521E9297k849r2195j7262O0970O5370k5689m284L0073o494N6550j0796p7412
$$ 59297 56448 -35747 -53009 7961 73331 47642 43358 73431 66937 123487 112691 35279
2509C5279q491K7290J5554k0976j2784J6476n2543j6554J3965M3615k547K6971
$$ 35279 26788 54078 69632 48656 35872 52348 -195 -16749 -2784 40831 38284 65255
2497F5255m2725J2606K6435l5740l8973M9924K7374j6379o516l6550m2688l3578
$$ 65255 22530 35136 61571 25831 -13142 36782 64156 47777 41261 4711 -37977 -71555
2485g1555p139N3320L6131k5112L8699K6470J2258J8563L187j6948O59j643n0484
$$ -71555 -78694 -25374 10757 -14355 24344 50814 63072 81635 84822 67874 68533 66890 16406
2472A6406J2317J8972j9740K2704m2914P0549o8726M2697M5517l2654O5224m98
$$ 16406 28723 47695 27955 50659 7745 78294 9568 52265 97782 65128 130352 129854
2460A29854o5213k2835n8519L3394O6142M6501L7039o7122p0513J9837L3315L4039
$$ 129854 64641 41806 -16713 16681 82823 129324 166363 99241 28728 48565 81880 115919
2448A15919j2848l620l5336J2743k6225L3206M565q29j6601O385J7208L8194L5498
$$ 115919 103071 99451 64115 76858 50633 83839 88404 87575 70974 77359 94567 132761 168259
2435A68259K741j20591O3215m3540K0091j7176k1893j5266l1032P8258j7813j8448
$$ 168259 171000 50409 113624 70084 90175 72999 51106 35840 4808 83066 65253 46805
2423D6805K8962K9826K5043M0338k9193p9738j0584K4576M1056M0279k4252O4350
$$ 46805 75767 105593 130636 170974 141781 62043 51459 76035 117091 157370 133118 197468
2411A97468o2322j8951O8635L9522k680Q755J4289r2627p2321O1506J9410M245
$$ 197468 135146 116195 184830 224352 221672 230427 244716 152089 79768 141274 160684 164929
2399A64929R186K6507j2324Q311m2224K7091K6351J4809l5926J176J0909K0092
$$ 164929 174115 200622 188298 196609 154385 181476 207827 222636 186710 187886 198795 218887
2387B18887L3194R659r816j0989l6750K7885k9739M9060L1843M4080K1334J6264
$$ 218887 252081 261740 251924 240935 204185 232070 202331 251391 283234 327314 348648 364912
2375C64912p018j9433L657J2537n8701R6618L4677M895N152k4122K0116J9224
$$ 364912 357894 338461 342118 354655 295954 392572 427249 432144 437296 413174 433290 452514
2363D52514l9744M2546J7884J0120j8253o638L6877M9815O8516j0399M057M0847
$$ 452514 412770 455316 473200 483320 465067 458429 495306 545121 613637 603238 607295 648142
2351F48142K4456J7943k0039J5139L0027N7569P5792l3716k3431N1784L1392P1923
$$ 648142 672598 690541 670502 685641 715668 773237 849029 815313 791882 843666 875058 946981
2339I46981M8595j6706j4057N6049J01943J00173N5262P9858J58181K53350L13123
$$ 946981 995576 978870 964813 1020862 1122805 1222978 1278240 1358098 1516279 1769629 2082752
2328B082752L92311L27666K32724J87226K68068K31513L34508M17768N17282P07475
$$ 2082752 2475063 2802729 3035453 3222679 3490747 3722260 4056768 4474536 4991818 5699293
2318E699293J000773J626642L098161N461937P675886P956544N029534J558521
$$ 5699293 6700066 8326708 11424869 16886806 24562692 32519236 37548770 39107291
2310C9107291o37283j038282l150968m618183m477420m267277l910679l531627
$$ 39107291 38470008 37431726 34280758 29662575 25185155 20917878 17007199 13475572
2302A3475572l130156k259129j347064p14421m66707n09436m92589m61574l49771
$$ 13475572 10345416 8086287 6739223 6024802 5558095 5048659 4556070 4094496 3744725
2293C744725k89141k91075k75037k93521k44374j75057k12446r4496j45974j07340
$$ 3744725 3455584 3164509 2889472 2595951 2351577 2176520 1964074 1869578 1723604 1616264
2283A616264p6921r8945l5307n2329j06367j9768k2300r0169n3702K8516k2631
$$ 1616264 1539343 1440398 1405091 1352762 1246395 1226627 1204327 1114158 1060456 1088972 1066341
2272A066341p6451p6539o0942j0635N346o9642N4300m6246o4274O926k0083r009
$$ 1066341 989890 913351 852409 841774 847120 777478 831778 785532 721258 728184 708101 699092
2260F99092l0236j15159K6826j3909m93l4591l9060K2885N7519n6601l7875K7133
$$ 699092 668856 553697 580523 566614 566121 531530 492470 515355 572874 516273 478398 505531
2248E05531j4366l8067m6302M38J3838K3102m8715k2272j9656l6840J0497l9591
$$ 505531 491165 453098 406796 407234 421072 444174 395459 373187 353531 316691 327188 287597
2236B87597J3862N6872R149J3258r2451m8693P303j3406m0369J0411J00473M628
$$ 287597 301459 358331 367480 380738 288287 239594 246897 233491 193122 203533 304006 308634
2224C08634n6541m6805p698J8485j169N0439o6270J1210j4822j5893o937l4091
$$ 308634 252093 205288 197590 216075 214906 265345 199075 210285 195463 179570 172633 138542
2212A38542K8557m4766L283k3140j8167m056o043j110J1037o0287L8424N9706
$$ 138542 167099 122333 125616 102476 84309 80253 74210 73100 84137 23850 62274 121980
2200A21980m1725K2973L0898J8583k2089P2992l973k930o9289o9921L4936L3873
$$ 121980 80255 103228 134126 152709 130620 203612 199639 196709 127420 57499 92435 126308
2188A26308J6098m2423k2818L8063M141j376M7914j05165j000N8932J6832n981
$$ 126308 142406 99983 77165 115228 119369 117993 165907 60742 59742 118674 135506 129525
2176A29525j9733P802m6524l8814O6764j7511m4680K7056n7243L1030q316l9702
$$ 129525 109792 117594 71070 32256 99020 81509 36829 63885 6642 37672 29356 -10346
2164a0346R2791N0544l2993q2806M9671M0673k9230l0776j3988L4245J64k6056
$$ -10346 82445 132989 99996 17190 66861 107534 78304 47528 33540 67785 67949 41893
2152D1893m634j5156l2614j3472L080K3508L0598K023o4599L1266l1033K7257
$$ 41893 37259 22103 -10511 -23983 -20903 2605 33203 35226 -29373 1893 -29140 -1883
2140a883J3779l6831l7018k1533J2926L209N5179K3943M5209N011j7103j1930
$$ -1883 11896 -24935 -61953 -83486 -70560 -67351 -12172 11771 56980 61991 44888 32958
2128C2958k8561N80k8886N0624j763q367l7763J2074O7160j7970o984l7373j9051
$$ 32958 4397 4977 -23909 26715 24952 16585 -21178 -9104 58056 40086 33102 -4271 -23322
2115b3322p9670O717Q9365n88R390l4278J7222M6380l6285o4888M2133O5399j09613
$$ -23322 -102992 -96275 -6910 -7498 1892 -32386 -15164 31216 -5069 -69957 -27824 37575 -72038
2102g2038P5508K4271j0741O233p5315K8091j4638j9672Q4040k6567l0111R926
$$ -72038 3470 27741 17000 23233 -52082 -23991 -38629 -58301 25739 -828 -30939 -21013
2090b1013j7902L7781J6125k6033m5118o9013N5781L2421K9990J1954m939j6565
$$ -21013 -38915 -1134 14991 -11042 -56160 -125173 -69392 -36971 -6981 4973 34 -16531
2078a6531n3063J583O962l5314K7948m7862n7771K6165N9001L5372M641K8285
$$ -16531 -69594 -68011 -61049 -96363 -68415 -116277 -174048 -147883 -88882 -53510 -48869 -20584
2066b0584J1464J698Q025j432m9115l9555M0099l17k7074K861J8079j6984K3360
$$ -20584 -9120 -7422 603 -829 -49944 -89499 -49400 -49717 -76791 -73930 -55851 -72835 -49475
2053d9475O5786R956L1418n4346L560O3423M0085o0656K4243M4799l2995M3290
$$ -49475 16311 26267 57685 3339 6899 70322 110407 49751 73994 118793 85798 129088
2041A29088l714L072q248k1878j569k446m486M154q2468q737J6180m4641j0305
$$ 129088 125374 128446 120198 98320 96751 94305 89819 93973 11505 2768 18948 -25693 -35998
2028c5998j5551r421P969N3839J8147l2489Q562K3965m0742k7615l858n16j267
$$ -35998 -51549 -60970 -53001 838 18985 -13504 -4942 19023 -21719 -49334 -53192 -53708 -54975
2015e4975n6326J6139R8707N0065J8199k3489k9109k9674j577j4746P745m9092
$$ -54975 -111301 -95162 3545 53610 71809 48320 19211 -10463 -12040 -26786 -19041 -68133
2003f8133M3883K9149j5321p6345N1931N2387r2868j0649O5020p4779J9338O7204
$$ -68133 -24250 4899 -10422 -86767 -34836 17551 -75317 -85966 -20946 -95725 -76387 -9183
1991i183l4051l7745N0658Q2949o4397m2089Q230l4751j698M6888K5000k6152
$$ -9183 -43234 -80979 -30321 52628 -11769 -53858 -45628 -80379 -82077 -35189 -10189 -36341
1979c6341m151J8507r033l9881o508K0165J2077J1476j528L2888j1171p4109K0954
$$ -36341 -40492 -21985 -31018 -70899 -77407 -57242 -45165 -33689 -35217 -2329 -13500 -87609 -66655
1966f6655M7212l0148K4274n0243m8702M0185j2876j5237N5692Q2654J8506j5734
$$ -66655 -19443 -49591 -25317 -75560 -124262 -84077 -96953 -112190 -56498 26156 44662 28928
1954B8928L5484k7389m3339L5985o0608n8729J4892O292j8825M4558K8567k3044
$$ 28928 64412 37023 -6316 29669 -30939 -89668 -74776 -68484 -87309 -42751 -14184 -37228
1942c7228k8147P167J4472j608j8691P0154K4403j9997L7297o3253j1893l6882
$$ -37228 -65375 -58208 -43736 -45344 -64035 6119 30522 10525 47822 -15431 -27324 -64206
1930f4206n108n27L0079M0076K2866O0344o1524j0897P381m6525O6411p4164p869
$$ -64206 -69314 -69841 -39762 314 23180 83524 22000 11103 18484 -28041 38370 -35794 -43663
1917d3663K4748J7591N696R394k2552p818o4835L2379J9999P854l0606n9885M540
$$ -43663 -18915 -1324 4372 13766 -8786 -16604 -81439 -49060 -29061 -21207 -51813 -111698 -107158
1904a07158K99K5266J2333M604p23M1254K9322k2651m2443N6132M7290Q858n9862
$$ -107158 -106859 -81593 -69260 -64656 -65379 -24125 5197 -17454 -59897 -3765 43525 52383 -7479
1891g479k7684l4429l511M1666J9628J3919l2337L6176l4318j9271N2567j3897
$$ -7479 -35163 -69592 -73103 -31437 -11809 2110 -30227 5949 -28369 -47640 4927 -8970
1879h970k8515l5850k6761O8473J8276l8080J8966m1939k3940l518L7721J1878
$$ -8970 -37485 -73335 -100096 -31623 -13347 -51427 -32461 -74400 -98340 -101858 -64137 -52259
1867e2259L0019k7457k3290J4329l9922N4299Q3395n8139k9692N6234k4809j6466
$$ -52259 -22240 -49697 -72987 -58658 -98580 -44281 39114 -19025 -48717 7517 -17292 -33758
1855c3758p1352l91N2526N7010l3052M2071j381n3934Q3265l7771k8449m7821
$$ -33758 -105110 -105501 -52975 4035 -29017 13054 11673 -42261 41004 3233 -25216 -73037
1843g3037J7110r373j9213O7934q867j6702L0037q17k5786k1226l2362J0639O8491
$$ -73037 -55927 -65300 -84513 -16579 -25446 -42148 -12111 -12928 -38714 -59940 -92302 -81663 -13172
1830a3172N4099O313k0764p4415n3566R26j1526R420J078N0762Q210O7327J3743
$$ -13172 40927 47240 26476 -47939 -101505 -100579 -112105 -102685 -101607 -50845 -42635 24692 38435
1817C8435m9594m9102K9020K3465j00373M4167K9594p213p705K1935N4153p104
$$ 38435 -11159 -60261 -31241 -7776 -108149 -63982 -34388 -41601 -49306 -27371 26782 19678
1805A9678K6931o1964o2827M7018N0694N0450K1549k1828m1365n6242n750j5196
$$ 19678 46609 -15355 -78182 -31164 19530 69980 91529 69701 28336 -27906 -33656 -48852
1793d8852k1029k638M5329L6781m3942j5211r0406M6180P5873j9670k7796M0444
$$ -48852 -69881 -72519 -27190 9591 -34351 -49562 -139968 -93788 -17915 -37585 -65381 -24937
1781b4937J6139N522o8226K2636j6377o6824j474o648Q8873J8667P6471k6229
$$ -24937 -8798 -3276 -71502 -48866 -65243 -132067 -133541 -140189 -51316 -32649 43822 17593
1769A7593l9941j0155l528Q7205o5261n1258L3037l6439Q450J133k5053l777L3753
$$ 17593 -22348 -32503 -36031 51174 -14087 -65345 -32308 -68747 -60297 -59164 -84217 -87994 -54241
1756e4241J4153J1555l6258J2592K0194Q387j1907L9806k1477m9461l4646m6712
$$ -54241 -40088 -28533 -64791 -52199 -32005 -23618 -35525 4281 -17196 -66657 -101303 -148015
1744a48015L6330M2642o580O9663k7109k6902M1467J6541J7029j2507k807l8675
$$ -148015 -111685 -69043 -75623 -5960 -33069 -59971 -18504 -1963 15066 2559 -248 -38923
1732c8923l4479J6634l5815k3617O6516O564m8615M0354j5721J9363J096n258
$$ -38923 -73402 -56768 -92583 -116200 -49684 -43120 -91735 -51381 -67102 -47739 -46643 -51901
1720e1901M8099k7239k1455k0022N7154p588r4044K9667M8748l2882K4404L4244
$$ -51901 -3802 -31041 -52496 -72518 -15364 -22952 -116996 -87329 -38581 -71463 -47059 -12815
1708a2815L2428l8154j5581k7607M7897j9899J4099J0077n4417m5613n1042K0476
$$ -12815 19613 -18541 -34122 -61729 -13832 -33731 -19632 -9555 -63972 -109585 -160627 -140151
1696a40151M6081K383m515j9647o16K5526J8453M9477q365l3253m9406K5364L7390
$$ -140151 -94070 -91687 -96202 -115849 -116465 -90939 -72486 -23009 -31374 -64627 -114033 -88669 -51279
1683e1279o5171L0532K2709p830l088N365L9425j1864l166m8044R581j651o882
$$ -51279 -116450 -85918 -63209 -71039 -74127 -68762 -29337 -41201 -44367 -92411 -82830 -84481 -91363
1670i1363K1588j5158K3749K5740K7107p593l7026J6942k4747k1486o535L1632
$$ -91363 -69775 -84933 -61184 -35444 -8337 -15930 -52956 -36014 -60761 -82247 -88782 -57150
1658e7150M4898m51n1031L9165O7510m0614l3166L8846k6889j7975J5288j7588
$$ -57150 -12252 -12703 -63734 -24569 42941 2327 -30839 8007 -18882 -36857 -21569 -39157
1646c9157J6141l4641J1399o308o601j9143K9095j919Q554j1884l5257J1765M1396
$$ -39157 -23016 -57657 -46258 -52566 -59167 -78310 -49215 -51134 -42580 -54464 -89721 -77956 -36560
1633c6560m9250J0360P7702J0423o0708K2643l8801K3745J3257l8497M7871l8281
$$ -36560 -85810 -75450 2252 12675 -48033 -25390 -64191 -40446 -27189 -65686 -17815 -56096
1621e6096q371M1409j9500n6034Q651L3277o522K2018J3453l5268M9825J8736
$$ -56096 -64467 -23058 -42558 -98592 -89941 -56664 -63186 -41168 -27715 -62983 -13158 5578
1609E578k1268k6L3189r762o1430m6360J8038K6295L4556J1591k247l6461j3281
$$ 5578 -15690 -15716 17473 7711 -53719 -100079 -82041 -55746 -21190 -9599 -11846 -48307 -61588
1596f1588L8998k6634J2587L7717k2796k3757o378l7969L3395k8226J2725L5313
$$ -61588 -22590 -49224 -36637 1080 -21716 -45473 -51851 -89820 -56425 -84651 -71926 -36613
1584c6613k1140M2065M693r282j1944O7536l4019j0998j9471J9701l4936n7360
$$ -36613 -57753 -15688 -10995 -20277 -32221 35315 1296 -9702 -29173 -9472 -44408 -101768
1572a01768K6351J952K9536M4264k4880R436M3556J9729M4354p8777n4070n0460
$$ -101768 -75417 -73465 -43929 335 -24545 -15109 28447 48176 92530 13753 -40317 -90777
1560i0777N1511l7788K7750M4070o4396q269M4465N8723o9763J753j7571L0102
$$ -90777 -39266 -77054 -49304 -5234 -69630 -77899 -33434 25289 -44474 -42721 -60292 -30190
1548c0190l5990o7878N8939P8444o5662K5599K2991m8094j228j5405K8182K1932
$$ -30190 -66180 -134058 -75119 3325 -62337 -36738 -13747 -61841 -63069 -78474 -50292 -28360
1536b8360o8908K4126j7805N3636J18459m3890m5150K0184l0017L2819m5322j7238
$$ -28360 -97268 -73142 -90947 -37311 81148 37258 -7892 12292 -17725 15094 -30228 -47466
1524d7466K2804k2110N609N0730o9187O524L8426J6449l6351j0408K4136p1611
$$ -47466 -24662 -46772 -41163 9567 -59620 -53096 -14670 1779 -34572 -44980 -20844 -92455
1512i2455J05160k5172m1254M97J0537L8842R357p8635K9518M1374j0947K05r790
$$ -92455 12705 -12467 -53721 -53224 -42687 -3845 5512 -73123 -43605 -2231 -13178 -12973 -22763
1499b2763l7272q656l3200L5832L8928j0798o8254N991M3777j6084K9112k0644
$$ -22763 -60035 -68691 -101891 -66059 -27131 -37929 -106183 -100192 -56415 -72499 -43387 -64031
1487f4031K2699j6585J2832M8358m7288J2592n5155K7247K8338k1910K0273k4265
$$ -64031 -41332 -57917 -45085 3273 -44015 -31423 -86578 -59331 -30993 -52903 -32630 -56895
1475e6895l7636j3856M5689K0021M0637k6505l7198L0188J4072N651l1470K3470
$$ -56895 -94531 -108387 -62698 -42677 -2040 -28545 -65743 -35555 -21483 -15832 -47302 -23832
1463b3832m63K3029L0260o9489n4446J4620N6727k1906M2593k4792q4739K6541
$$ -23832 -24295 -1266 28994 -40495 -94941 -80321 -23594 -45500 -2907 -27699 -112438 -85897
1451h5897P514M8022N0J9897J4627R666R569l330o2525p364L7886J4215J3187
$$ -85897 -78383 -30361 -30311 -10414 4213 13879 23448 20118 -42407 -49771 -11885 2330 15517
1438A5517R037n3382o3531j4778J2269N350L879j7499M427O7533R921N223j3706
$$ 15517 24554 -28828 -92359 -107137 -94868 -89518 -85639 -103138 -98711 -31178 -21257 -16034 -29740
1425b9740K3429N2500m7424l6401k7114J6907K1441P2590m9797J601K6495r9342
$$ -29740 -6311 46189 -1235 -37636 -64750 -47843 -26402 46188 -3609 -2008 24487 -74855
1413g4855N2329p658L4930L098k4734j8061O7462n8133m0398l213L3753l8701
$$ -74855 -22526 -30184 4746 7844 -16890 -34951 32511 -25622 -66020 -69233 -35480 -74181
1401g4181M2524O7028L657M4965l9887j4173j9042n5008l7763M7466L4739o0295
$$ -74181 -31657 35371 39028 83993 44106 29933 10891 -44117 -81880 -34414 325 -59970
1389e9970J2385J1704o034J0523j1980n111l6422M1556J7102n6613L866M1094
$$ -59970 -47585 -35881 -41915 -31392 -43372 -48483 -84905 -43349 -26247 -82860 -78994 -37900
1377c7900j6535L626N3339M0758j3824K0787p2552k5730n465K4210L3629n3424
$$ -37900 -54435 -50809 2530 43288 29464 50251 -22301 -48031 -53496 -29286 4343 -49081
1365d9081j5209L0678m3429K6881K7720j109j6266J4997j7266M4802K0583l9016
$$ -49081 -64290 -33612 -77041 -50160 -22440 -23549 -39815 -24818 -42084 2718 23301 -15715
1353a5715P915k1563K6313n9381k6590R2233L4705m6670l7551L1937j0115M80
$$ -15715 -7800 -29363 -3050 -62431 -89021 3212 37917 -8753 -46304 -14367 -24482 -24002
1341b4002k8721p1635O891L2478K8336n995J7257J5893j073n7147K8811L2331
$$ -24002 -52723 -124358 -117467 -84989 -56653 -62648 -45391 -29498 -30571 -87718 -58907 -26576
1329b6576P26N7021m8347k3079P3515L1851J6663l0430j7526l9017L2434J6256
$$ -26576 -25850 31171 -17176 -40255 33260 65111 81774 51344 33818 -5199 27235 43491
1317D3491K1073J7893m0272J2300n2401l0902l5968J3232L7135K1935m0927M9379
$$ 43491 64564 82457 42185 54485 2084 -28818 -64786 -51554 -14419 7516 -33411 15968
1305A5968J6117m6767J0125j3993L0595m1305k5524K9459Q2839k9971M2948j7807
$$ 15968 32085 -14682 -4557 -18550 12045 -29260 -54784 -25325 57514 27543 70491 52684
1293E2684r2417k888j315N0652K9081o5507M476o232J9853n2104O1098o079J1256
$$ 52684 -39733 -42621 -43936 6716 35797 -29710 -25234 -31466 -11613 -63717 -2619 -8698 2558
1280B558O5379j7675p8051j5210M167J8945k0253k2645q785K5391j1194q5688
$$ 2558 67937 50262 -27789 -42999 -38832 -19887 -40140 -62785 -71570 -46179 -57373 -143061
1268a43061L7796L4714j7073M4346K1330q7624P1571N2723L2740m9131k3863K1231
$$ -143061 -105265 -70551 -87624 -43278 -21948 -109572 -38001 14722 47462 -1669 -25532 -4301
1256d301N88j344j2448j3407M896m0278L3033l4107n2579J8139M6148k9744n32
$$ -4301 -3713 -5057 -17505 -30912 -26016 -66294 -33261 -67368 -119947 -101808 -55660 -85404 -85936
1243h5936P0935j7300m944L9829K3170k28j9475l0571P31K9056n3707O1078O5928
$$ -85936 -15001 -32301 -37245 2584 25754 25526 6051 -24520 -23789 5267 -48440 12638 78566
1230G8566p4827J583N1386o4079l8478M9284P74j2173j2619m7041O3999J0676
$$ 78566 3739 5322 56708 -7371 -45849 3435 4209 -7964 -20583 -67624 -3625 7051
1218G051k6183K6471j7749L3285k5470k2045j9611J2011J0347O3334M4334r348
$$ 7051 -19132 7339 -10410 22875 -2595 -24640 -44251 -32240 -21893 41441 85775 76427
1206G6427q1434n5228k0873Q126O9300n9866p16j8382K9957L3544M0711M380K8804
$$ 76427 -5007 -60235 -81108 -72982 -3682 -63548 -64264 -82646 -52689 -19145 21566 25946 54750
1193E4750j8377l8645j6685k7438k0148K2907m6403J3057J1513K5129l368P17
$$ 54750 36373 -2272 -18957 -46395 -66543 -43636 -90039 -76982 -65469 -40340 -43708 -42991
1181d2991K3163k4657M9361k354m7853N9449l6233m7413P6970j1329n6658K9259
$$ -42991 -19828 -44485 4876 2522 -45331 14118 -22115 -69528 7442 -3887 -60545 -31286
1169c1286J6129k345r415j0221k0335j8676M3158Q685Q2272m7863L287l6714k8558
$$ -31286 -15157 -17502 -26917 -37138 -57473 -76149 -32991 -24306 57966 10103 13390 -23324 -51882
1156e1882L4332P776L956m5345M7772m3140n977J6808m9569Q2566j0255o3763
$$ -51882 -17550 -9774 -5818 -51163 -3391 -46531 -52508 -35700 -85269 -2703 -12958 -76721
1144g6721j8953O7803K0291l7247p536O5202p204k8997p3633K3752L3507L4800
$$ -76721 -95674 -27871 -7580 -44827 -52363 12839 5635 -23362 -96995 -73243 -39736 -4936
1132d936P915M8510k5540k3206O68l1351J6809M895R816J0351k6293k3312R226
$$ -4936 2979 51489 25949 2743 3411 -27940 -11131 -6236 3580 13931 -12362 -35674 -26448
1119b6448m1046k1727L886P0685j1515j7668K4946j9203M4093J9346K5487k3596
$$ -26448 -67494 -89221 -85335 -14650 -26165 -43833 -18887 -38090 6003 25349 50836 27240
1107B7240j4384j5237m3539M8716m242R465r80O524l967j0632m1479K5808n7090
$$ 27240 12856 -2381 -45920 2796 -1446 8019 7039 13563 9596 -1036 -42515 -16707 -73797
1094g3797N5997j847q678J4537K0907k504o7574J8297m346M9336l6533J3539L1918
$$ -73797 -17800 -19647 -28325 -13788 7119 4615 -62959 -44662 -49008 328 -36205 -22666 9252
1081I252M080K5031J006m5678R788n5722j7949K0338k4419J3895L6339N593l2928
$$ 9252 13332 38363 39369 -6309 3479 -52243 -70192 -49854 -74273 -60378 -24039 -18446 -51374
1068e1374Q0065K8708k5567m3546m4285p853K3989J26802m0257j00402K0243K0336
$$ -51374 28691 57399 31832 -11714 -55999 -63852 -39863 86939 46682 -53720 -33477 -13141
1056a3141J2891J0722O6400k1539m4945n5921j497P3580L4369k4933k7394K7018
$$ -13141 -250 10472 76872 55333 10388 -45533 -47030 26550 60919 35986 8592 35610
1044C5610l5743j4822j0246m920L99K2499p185R577k7715J6240K8727L2276j043
$$ 35610 -133 -14955 -25201 -30121 -29722 -7223 -14408 -4831 -32546 -16306 12421 44697 43654
1031D3654m4669M3991K9228q77o7334J6965m7863m0167N0401l7356N4512r80N9247
$$ 43654 -1015 42976 72204 71327 3993 20958 -26905 -67072 -16671 -54027 485 -495 58752
1018E8752J9008n4534k0601J5515l9301m308N2341N1223R12j25365K1339J0598
$$ 58752 77760 23226 2625 18140 -21161 -25469 26872 78095 79007 -46358 -25019 -14421
1006a4421j0963n1440P4041J0523j1852L4790j629q6635N7033N1111j3898N3135
$$ -14421 -25384 -76824 -2783 7740 -4112 30678 29049 -57586 -553 50558 36660 89795
994H9795n2814l8597j581k940K0656K2878j4042k4770n3703K6605N269n2688p831
$$ 89795 36981 -1616 -3197 -6137 14519 37397 23355 -1415 -55118 -28513 -23244 -75932 -83763
981h3763L7876N6726p315O4408j1613k2384K702m683m4291L8834O7999n3521n6780
$$ -83763 -45887 10839 3524 67932 56319 33935 36637 31954 -12337 26497 94496 40975 -15805
968a5805l2159K3597L81K1998K2849m4762N6943n0139M1281L4271j10449M5642
$$ -15805 -47964 -24367 -23986 -1988 20861 -23901 33042 -17097 24184 58455 -51994 -6352
956f352j2607m4749m292M8619m235K7970k6005J0111J6289Q2210j120p025m3389
$$ -6352 -18959 -63708 -68000 -19381 -23616 4354 -21651 -11540 4749 86959 85839 78814 35425
943C5425q3093j2349J7937K6070J2861k9949o74J20670o6039n0684k062O6154
$$ 35425 -47668 -60017 -42080 -16010 -3149 -33098 -33772 86898 20859 -29825 -31887 34267
931C4267l5142o1781J9797O1980K2636l9213K8782j1058j6560K7956k1446J1826
$$ 34267 -875 -62656 -42859 19121 41757 2544 31326 20268 3708 31664 10218 22044
919B2044k3740k0617j0190K0121k1177L3784K6673j8802j5636j2671l1165K5004
$$ 22044 -1696 -22313 -32503 -12382 -33559 225 26898 8096 -7540 -20211 -51376 -26372
907b6372O6975n6069l5477R159K1996m4866P5681J251k3360J4876J1602l8248
$$ -26372 40603 -15466 -50943 -41784 -19788 -64654 11027 12278 -11082 3794 15396 -22852
895b2852K989k78O242j3686k801k6699N4010J5253r097j64J6846r202j5633L1493
$$ -22852 -19863 -20141 -13899 -27585 -30386 -57085 -3075 12178 3081 2917 19763 10561 -5072 26421
881B6421J2653o1105N3430P597o569j0846l6820l10J589L3778k3151N710L111
$$ 26421 39074 -22031 31399 38996 32427 21581 -15239 -15549 -13960 19818 -3333 2377 5488
868E488J1344J6149k3070l011k9800m1559M2088N7430n4120j267K8651q982J0074
$$ 5488 16832 32981 9911 6900 -22900 -64459 -22371 35059 -19061 -20328 8323 -659 9415
855I415j9091K1888j3547P035K4584k090j5820k1624m7729N9492L8702L6652p7085
$$ 9415 -9676 12212 -1335 5700 30284 28194 12374 -9250 -56979 2513 41215 77867 782
842G82j401L504L8582k1445J0592K4948k1188K4244L0065j9677K6418j9331l1855
$$ 782 -619 2885 41467 20022 30614 55562 34374 58618 88683 69006 95424 76093 44238
829D4238p1171k0250O8375m232j1756L4697k2038l4276N4247k1489o2345J1000
$$ 44238 -26933 -47183 21192 16960 5204 39901 17863 -16413 37834 16345 -46000 -35000
817c5000J2926N8737j1184j01102N9467J10451k5288o9928M2532R045j807k4539
$$ -35000 -22074 36663 25479 -75623 -16156 94295 69007 -921 41611 50656 48849 24310
805B4310L4701K1536k7101j8100R169k5209M08R138o3580K7112j730M6775L2875
$$ 24310 59011 80547 53446 35346 44515 19306 19714 28852 -34728 -7616 -9346 37429 70304
792G0304l0663L0961j4383k4426M215J1975m1123j020Q744j4683k5180O5518l0173
$$ 70304 39641 70602 56219 31793 36008 47983 6860 5840 14584 -99 -25279 40239 10066
779A0066M425m922Q679J5653J1991k2335M866k033m1030k625K177P1969J1761
$$ 10066 14491 9569 18248 33901 45892 23557 28423 26390 -14640 -17265 -15088 56881 68642
766F8642k9007j8490L8771n9265M0019O756k9651j702J6740K7603k9428M6897
$$ 68642 39635 21145 59916 651 40670 47426 17775 16073 32813 60416 30988 77885
754G7885j7519o30p7229M2542l1807m1444N2619j7849L773N915L2045j0320J2527
$$ 77885 60366 59736 -17493 25049 -6758 -48202 4417 -13432 -9659 -3744 28301 17981 30508
741C0508J7413k7152L2843N116n0887L7039r017l6262j6864K2202p504k8061M974
$$ 30508 47921 20769 53612 58728 7841 44880 35863 -399 -17263 4939 -2565 -30626 -25652
728b5652P3452N91j176k4671j9304J9305n1290R091j43L6404J7489j1677l3135
$$ -25652 47800 48391 47215 22544 3240 22545 -28745 -19654 -19797 16607 34096 22419 -10716
715a0716K4688j8561k0873M6925J2583j185q9676j858j3443O2369P059k1485O4956
$$ -10716 13972 -4589 -25462 21463 34046 32861 -56815 -58673 -72116 -9747 -2688 -24173 40783
702D0783Q656J5126k1999l7424L862P419n032o0747r719j649J0407N628J0457
$$ 40783 49439 64565 42566 5142 9004 16423 11391 -49356 -59075 -60724 -50317 -44689 -34232
689c4232K9795m0279J3782L2303k0066l0036j9708M8962L5315K164l6592m999
$$ -34232 -4437 -44716 -30934 1369 -18697 -48733 -68441 -19479 15836 18000 -18592 -23591
677b3591M822N8034O0491j5219l1028l7272N977j8227K0299j3537Q212M8166m3629
$$ -23591 -18769 39265 99756 84537 53509 16237 22214 3987 24286 10749 18961 67127 23498
664B3498l8344L6126m3067j1909q760k2699L9795L5236o759r399p306o9615M4905
$$ 23498 -14846 21280 -21787 -33696 -42456 -65155 -25360 9876 3117 -6282 -13588 -83203 -38298
651c8298L9874K1412o0064j0045R72m782P6913J6527K218J3015n8341J3731N7385
$$ -38298 1576 22988 -37076 -47121 -46149 -50931 25982 42509 44727 57742 -599 13132 70517
638G0517o0754l2435N4100j9524M47K5649J0734J6455p6602j2244j4677K5244
$$ 70517 9763 -22672 31428 11904 12351 38000 48734 65189 -11413 -23657 -38334 -13090
626a3090L1754P8654l0999o4956n1512J2340j3812K2623M6670P6361R625p8991
$$ -13090 18664 97318 66319 1363 -50149 -37809 -51621 -28998 17672 94033 103658 24667
614B4667K1068N0486K1185k5632n8495j3113r517J2618L4391K0056m9495j5472
$$ 24667 45735 96221 117406 91774 33279 20166 10649 23267 57658 77714 28219 12747
602A2747m039k7405k1140j9489M7644M4223n999J9862M2205j4788k2769J5175
$$ 12747 8708 -18697 -39837 -59326 -11682 32541 26542 46404 88609 73821 51052 66227
590F6227j4738q1356L2753N6525k092l7401q63j7935k501j4255J5526N3290m5700
$$ 66227 51489 -29867 2886 59411 57319 19918 19055 1120 -1381 -15636 -110 53180 7480
577G480p9075O5609O799N4037L3635m1325j3197k1239K601j4394L036n933n8905
$$ 7480 -71595 -5986 813 54850 88485 47160 33963 12724 15325 931 3967 -1966 -60871
564f0871J6853n2334L9765Q2697j9484j0256P245J4925r201L1522M916K9332r99
$$ -60871 -44018 -96352 -56587 26110 6626 -3630 3615 18540 9339 40861 45777 75109 74110
551G4110j4908q57J0433n0614j9948l0224N1232L9063K2810j2134J1168l8372
$$ 74110 59202 58345 68778 18164 -1784 -32008 19224 58287 81097 68963 80131 41759
539D1759M698L4847m3530M2824k0369k8049j257K5723J3803l9010k1980n936N0997
$$ 41759 46457 81304 37774 80598 60229 32180 30923 56646 70449 31439 9459 3523 54520
526E4520K9128o5808L8862J9449o0798l2916J1051O9637L4238L1015o2047n4772
$$ 54520 83648 17840 56702 76151 15353 -17563 -6512 63125 97363 128378 66331 11559
514A1559q236L702K416K9601M6687j3419O598m1329l1865M5559J2362k5180K2314
$$ 11559 3323 7025 9441 39042 85729 72310 78908 37579 5714 51273 63635 38455 60769
501F0769M899K7480m6049K1227J6650r7822j4785O1972K43M4144n9292K6605j3371
$$ 60769 65668 93148 47099 68326 84976 -12846 -27631 34341 34584 78728 19436 46041 32670
488C2670L4200m6254K092N8222n4827J2224O4463l3512j3307M1156l1307P432
$$ 32670 66870 20616 22708 80930 26103 38327 102790 69278 55971 97127 65820 73252
476G3252n1767K9438l2592J2593K8337R917K8081n1295l3126L2682k818J5222
$$ 73252 21485 50923 18331 30924 59261 69178 97259 45964 12838 45520 42702 57924
464E7924n4735p147K4200L7524J5941k849K9884l9499j3642L2760l2563J8131
$$ 57924 3189 -3958 20242 57766 73707 70858 100742 61243 47601 80361 47798 65929
452F5929O0984k4866n9065M4041j4831j7557L0434n3247j0970L768p6384n105
$$ 65929 126913 102047 42982 87023 72192 54635 85069 31822 20852 24620 -51764 -56869
440e6869N0160j8346P5056j8597M3928M9272j4588o848R70k493r5319j473m1776
$$ -56869 -6709 -25055 50001 31404 75332 124604 110016 103168 104138 101645 6326 4853 -36923
427c6923J2825K9231M392L3125Q2K286k440L5961J4260r479P000r9181M7875O7581
$$ -36923 -24098 5133 9525 42650 42732 45018 42578 78539 92799 83320 90320 -8861 39014 106595
413A06595l1554m0244j5319L6217j6412L5078j7212o3976M8218M0334m9090P3396
$$ 106595 75041 34797 19478 55695 39283 74361 57149 -6827 41391 81725 32635 106031
401A06031P5478K1495o6757p1050p745k4503N2716J8206j1659K0197m687Q102
$$ 106031 181509 203004 136247 65197 57452 32949 85665 103871 92212 112409 107722 115824
389A15824j6723p4169L3801M9395l3523l1372K1524J6528k5312M729j3519l583
$$ 115824 99101 24932 58733 108128 74605 43233 64757 81285 55973 60702 47183 43600
377D3600j1143O2244J9719p3667Q873k7327M8946O899j5625J5322K1322k8604
$$ 43600 32457 94701 114420 40753 49626 22299 71245 78144 62519 77841 99163 70559
$$ [...]
##END NTUPLES=NMR SPECTRUM
##END=
