##TITLE=1H_EC-3361(II-26)
 200.13MHz, CDCl3,
 8 sc
 
 12.9.2025
##JCAMPDX= 6.0         $$ Bruker NMR JCAMP-DX V2.0
##DATA TYPE= NMR SPECTRUM
##DATA CLASS= NTUPLES
##ORIGIN= UXNMR, Bruker Analytische Messtechnik GmbH
##OWNER= pz
$$ XWIN-NMR		Version 3.5
$$ Fri Sep 12 13:55:07 2025 Russian Standard Time (UT+4h)  she@DPX200
##.OBSERVE FREQUENCY= 200.1313
##.OBSERVE NUCLEUS= ^1H
##.ACQUISITION MODE= SIMULTANEOUS
##.ACQUISITION SCHEME= undefined
##.AVERAGES= 8
##.DIGITISER RES= 18
##SPECTROMETER/DATA SYSTEM= spect
##.PULSE SEQUENCE= zg30
##.SOLVENT NAME= CDCl3
##.SHIFT REFERENCE= (INTERNAL, CDCl3, 0, 15.4968)
##AUDIT TRAIL= $$ (NUMBER, WHEN, WHO, WHERE, WHAT)
$$ ##TITLE= Audit trail, XWIN-NMR		Version 3.5
$$ ##JCAMPDX= 5.01
$$ ##ORIGIN= Bruker BioSpin GmbH
$$ ##OWNER= she
$$ F:/spectra/data/she/nmr/H-C/1/pdata/1/auditp.txt
$$ ##AUDIT TRAIL=  $$ (NUMBER, WHEN, WHO, WHERE, WHAT)
(   1,<2025-09-12 13:53:31.75 +0400>,<she>,<DPX200>,
      <created by zg, POWCHK disabled, PULCHK disabled
       configuration hash MD5:
       00 E9 B6 7A A2 85 ED C7 34 08 36 98 17 FE 4E 26
       data hash MD5: 16K
       09 B9 1D 41 DB 19 91 1B E7 62 C9 DA E9 10 C3 23>)
(   2,<2025-09-12 13:53:34.51 +0400>,<she>,<DPX200>,
      <Start of raw data processing
       efp BC_mod = 2 LB = 0.25 FT_mod = 6 PKNL = 1 PHC0 = -1718.884 PHC1 = 13.19226 SI = 16K 
       data hash MD5: 16K
       66 15 BC 31 E7 67 FB DF 42 4A B2 ED 0B 02 BF D8>)
(   3,<2025-09-12 13:54:00.12 +0400>,<she>,<DPX200>,
      <pk PHC0 = 0.1035718 PHC1 = 0.6 
       data hash MD5: 16K
       FB A2 B1 FF F8 CB 2B 49 73 60 13 B6 1C F5 10 E7>)
(   4,<2025-09-12 13:54:04.79 +0400>,<she>,<DPX200>,
      <abs ABSG = 5 
       data hash MD5: 16K
       9E C1 C4 54 5E F4 71 1F 3E D6 BD BE 35 03 77 44>)
$$ ##END=
$$ 
$$ hash MD5
$$ EE 80 BF 91 37 63 C1 ED D6 E8 08 10 B7 35 84 2F
##$RELAX= 
##$RELAX= 
##$RELAX= 
##$RELAX= 
##$RELAX= 
##$RELAX= 
$$ Bruker specific parameters
$$ --------------------------
##$DU= <F:/spectra>
##$EXPNO= 1
##$NAME= <H-C>
##$PROCNO= 1
##$TYPE= <nmr>
##$USER= <she>
##$AMP= (0..31)
100 100 100 100 100 100 100 100 100 100 100 100 100 100 100 100 100 100 
100 100 100 100 100 100 100 100 100 100 100 100 100 100 
##$AQSEQ= 0
##$AQ_mod= 1
##$AUNM= <au_zg>
##$AUTOPOS= <>
##$BF1= 200.13
##$BF2= 200.13
##$BF3= 200.13
##$BF4= 200.13
##$BF5= 200.13
##$BF6= 200.13
##$BF7= 200.13
##$BF8= 200.13
##$BYTORDA= 1
##$CFDGTYP= 0
##$CFRGTYP= 5
##$CHEMSTR= <none>
##$CNST= (0..31)
1 1 145 1 1 1 1 1 1 1 1 1 1 1 1 1 1 1 1 1 1 1 1 1 1 1 1 1 1 1 1 1 
##$CPDPRG= <>
##$CPDPRG1= <>
##$CPDPRG2= <>
##$CPDPRG3= <>
##$CPDPRG4= <mlev>
##$CPDPRG5= <mlev>
##$CPDPRG6= <mlev>
##$CPDPRG7= <mlev>
##$CPDPRG8= <mlev>
##$CPDPRGB= <>
##$CPDPRGT= <>
##$D= (0..31)
0 0.7 0 0 0 0 0 0 0 0 0 0.03 0 0 0 0 0 0 0 0 0 0 0 0 0 0 0 0 0 0 0 0 
##$DATE= 1757670811
##$DBL= (0..7)
120 120 120 120 120 120 120 120 
##$DBP= (0..7)
150 150 150 150 150 150 150 150 
##$DBP07= 0
##$DBPNAM0= <>
##$DBPNAM1= <>
##$DBPNAM2= <>
##$DBPNAM3= <>
##$DBPNAM4= <>
$$ [...]
##$SUBNAM3= <"">
##$SUBNAM4= <"">
##$SUBNAM5= <"">
##$SUBNAM6= <"">
##$SUBNAM7= <"">
##$SUBNAM8= <"">
##$SUBNAM9= <"">
##$SW= 18.0517328524113
##$SWIBOX= (0..15)
0 0 2 0 0 0 0 0 0 0 0 0 0 0 0 0 
##$SW_h= 3612.71676300578
##$TD= 16384
##$TD0= 1
##$TE= 0
##$TE2= 300
##$TE3= 300
##$TEG= 300
##$TL= (0..7)
0 120 120 120 120 120 120 120 
##$TP= (0..7)
150 150 150 150 150 150 150 150 
##$TP07= 0
##$TPNAME0= <>
##$TPNAME1= <>
##$TPNAME2= <>
##$TPNAME3= <>
##$TPNAME4= <>
##$TPNAME5= <>
##$TPNAME6= <>
##$TPNAME7= <>
##$TPOAL= (0..7)
0.5 0.5 0.5 0.5 0.5 0.5 0.5 0.5 
##$TPOFFS= (0..7)
0 0 0 0 0 0 0 0 
##$TUNHIN= 0
##$TUNHOUT= 0
##$TUNXOUT= 0
##$USERA1= <user>
##$USERA2= <user>
##$USERA3= <user>
##$USERA4= <user>
##$USERA5= <user>
##$V9= 5
##$VALIST= <valist>
##$VCLIST= <CCCCCCCCCCCCCCC>
##$VD= 0
##$VDLIST= <DDDDDDDDDDDDDDD>
##$VPLIST= <PPPPPPPPPPPPPPP>
##$VTLIST= <TTTTTTTTTTTTTTT>
##$WBST= 1024
##$WBSW= 4
##$XGAIN= (0..3)
0 0 0 0 
##$XL= 0
##$YL= 0
##$YMAX_a= 186232
##$YMIN_a= -151443
##$ZGOPTNS= <>
##$ZL1= 120
##$ZL2= 120
##$ZL3= 120
##$ZL4= 120
##$ABSF1= 15.49678
##$ABSF2= -2.555069
##$ABSG= 5
##$ABSL= 3
##$ALPHA= 0
##$AQORDER= 0
##$ASSFAC= 0
##$ASSFACI= 0
##$ASSFACX= 0
##$ASSWID= 0
##$AUNMP= <proc_1d>
##$AZFE= 0.1
##$AZFW= 0.1
##$BCFW= 0
##$BC_mod= 2
##$BYTORDP= 0
##$COROFFS= 0
##$CY= -3
##$DATMOD= 1
##$DC= 0
##$DFILT= <>
##$DTYPP= 0
##$F1P= 0
##$F2P= 0
##$FCOR= 1
##$FTSIZE= 16384
##$FT_mod= 6
##$GAMMA= 0
##$GB= 0
##$INTBC= 1
##$INTSCL= 3.241238e-09
##$ISEN= 128
##$LB= 0.25
##$LEV0= 0
##$LPBIN= 0
##$MAXI= 10000
##$MC2= 0
##$MEAN= 0
##$ME_mod= 0
##$MI= 1.114404
##$NCOEF= 0
##$NC_proc= -8
##$NLEV= 6
##$NOISF1= 3.799351
##$NOISF2= 2.8
##$NSP= 0
##$NTH_PI= 0
##$NZP= 0
##$OFFSET= 15.49678
##$PC= 1
##$PHC0= -1718.781
##$PHC1= 13.79226
##$PH_mod= 1
##$PKNL= yes
##$PPARMOD= 0
##$PSCAL= 0
##$PSIGN= 0
##$REVERSE= no
##$SF= 200.130004988312
##$SI= 16384
##$SIGF1= 3
##$SIGF2= 2
##$SINO= 0.751879
##$SIOLD= 32768
##$SREGLST= <19F.Aceton>
##$SSB= 0
##$STSI= 16384
##$STSR= 0
##$SW_p= 3612.71676300578
##$SYMM= 0
##$S_DEV= 0
##$TDeff= 16384
##$TDoff= 0
##$TI= <>
##$TILT= no
##$TM1= 0
##$TM2= 0
##$TOPLEV= 0
##$USERP1= <user>
##$USERP2= <user>
##$USERP3= <user>
##$USERP4= <user>
##$USERP5= <user>
##$WDW= 1
##$XDIM= 16384
##$YMAX_p= 506567109
##$YMIN_p= -620104
$$ End of Bruker specific parameters
$$ ---------------------------------
##NTUPLES= NMR SPECTRUM
##VAR_NAME=  FREQUENCY,     SPECTRUM/REAL,   SPECTRUM/IMAG
##SYMBOL=    X,             R,               I
##VAR_TYPE=  INDEPENDENT,   DEPENDENT,       DEPENDENT
##VAR_FORM=  AFFN,          ASDF,            ASDF
##VAR_DIM=   16384,         16384,           16384
##UNITS=     HZ,            ARBITRARY UNITS, ARBITRARY UNITS
##FACTOR=    0.220516191357247, 1,           1
##FIRST=     3101.37073785575, 0,            0
##LAST=      -511.346025150026, 0,           0
##MIN=       -511.346025150026, -620104,     0
##MAX=       3101.37073785575, 506567109,    0
$$ Real data points
##PAGE= N=1
##DATA TABLE= (X++(R..R)), XYDATA
$$ [...]
7509A455731p2533n7121k14840M9159J27315j66327K0351k9947r0779P8206K73557
7498A372772o1351l21434J688o9086K26184k6873j52689m6394q537r4851p7895
7487G41534M40227J81377o2204j58955j08142J4527j500l0956J47608K8050j70846
7476A020720M1785n0359K8897P0009J86247j88537j66054J41724K8805J2324J67037
7465A292598j22031j15802j67198j11399K00284J07240K03580j6539l89716r882
7455H71135Q4729j36064Q8497l2300K04282j87725K5324J13035j61729K08111
7445A077295k4570M14020m6519k4366O9684k71618q8012k75120P1155J3122K60891
7434A175962j04500r0842M0307k3487M0285p6259K53261K34560k2810k22578N6789
$$ plain form
7509 1455731 1383198 1326077 1111237 1160396 1287711 1121384 1141735 1111788 1021009 1099215 1372772
7498 1372772 1311421 989987 991675 922589 1148773 1121900 969211 922817 914280 819429 741534
7487 741534 1181761 1363138 1300934 1141979 1033837 1048364 1046864 1015908 1163516 1191566 1020720
7476 1020720 1062505 1012146 1041043 1111052 1297299 1108762 942708 1084432 1113237 1125561 1292598
7465 1292598 1170567 1054765 887567 776168 976452 1083692 1287272 1270733 881017 871135
7455 871135 955864 819800 908297 875997 1080279 892554 917878 1030913 869184 1077295
7445 1077295 1052725 1466745 1420226 1395860 1465544 1193926 1105914 830794 901949 915071 1175962
7434 1175962 1071462 980620 1020927 997440 1037725 961466 1214727 1449287 1426477 1203899 1260688
7423A260688j50216J23903J42303j45132R9637P6840o8217j37761J33138j8986
7413A316197J14352n3435j3604R035K52414n5660J80457K3851j60499M79529k20113
7402A872524j02920K03878K54595J09266n6024L88965J94535J85243K91989L89496
7392C731547K25286L50978N01438L56894N55915N33255L46592J52293p2343p46493
7382E935362l60825k12070n14590k96633j24156l79173l27465k44849j17104j03787
7372C254710l74187L5843j04591k56579m5838j656l5461l28726o1571M3852o1637
7361B064159j01500j73157K3000K1597Q1126M3493O8580k51334j58304K33740
7351A851400k80943K19712L84517m17278j01046J65797N9625K27360l0299R532
$$ plain form
7423 1260688 1110472 1234375 1376678 1231546 1331183 1408023 1339806 1202045 1335183 1316197
7413 1316197 1430549 1377114 1363510 1372545 1624959 1569299 1749756 1773607 1613108 2092637 1872524
7402 1872524 1769604 1973482 2228077 2337343 2281319 2670284 2864819 3050062 3342051 3731547
7392 3731547 3956833 4307811 4809249 5166143 5722058 6255313 6601905 6754198 6681855 5935362
7382 5935362 5574537 5362467 4847877 4551244 4427088 4047915 3720450 3475601 3358497 3254710
7372 3254710 2880523 2916366 2811775 2555196 2509358 2507702 2472241 2143515 2081944 2125796 2064159
7361 2064159 1962659 1789502 1812502 1834099 1915225 1958718 2027298 1775964 1617660 1851400
7351 1851400 1570457 1790169 2174686 1757408 1656362 1822159 1881784 2109144 2078845 2088377
7341B088377k75524k5421P4821J92265j4683J45106j77124j54582N00663j0308
7331B343590l3536j8706j02315m9125J40573j33684j28616J93599J40147p5745
7321B276182J14138j51618J59983N4666J59846j04048o3687K67733K50218P5749
7311C039162n9430J43873P7176K29298j4296J07560o6357J01076q6979L6983J96614
7300C704680K14338M4742K52517O5727Q7025J10049q554J67985J23682J17800
7290D879991M22696K76795K33881L86007J99295J73565Q3843M28820J26624M29771
7280G641288L90072M19142K23675O11297M53967L70921N80859M59039L13365R26064
7270A2389689M50334M70580P28013Q18937R52711R37530J014144J015550J089777
$$ plain form
7341 2088377 1812853 1787432 1862253 2054518 2039835 2184941 2007817 1853235 2353898 2343590
7331 2343590 2310054 2291348 2189033 2139908 2280481 2146797 2018181 2211780 2351927 2276182
7321 2276182 2390320 2238702 2398685 2453351 2613197 2509149 2445462 2713195 2963413 3039162
7311 3039162 2979732 3123605 3200781 3430079 3415783 3523343 3456986 3558062 3471083 3508066 3704680
7300 3704680 3919018 3963760 4216277 4282004 4369029 4479078 4470524 4638509 4762191 4879991
7290 4879991 5302687 5579482 5813363 6199370 6398665 6572230 6656073 7084893 7211517 7641288
7280 7641288 8031360 8450502 8674177 9285474 9739441 10110362 10691221 11150260 11463625 12389689
7270 12389689 12840023 13310603 14038616 14857553 15810264 16747794 17761938 18777488 19867265
7261A9867265J153182J165628P21391J134761J202261J750942R14290J043265
7253B8952985J367854J184461J047718J065696Q94667J162537R91526M49993P40469
7244C7857906L90402K12766k6604o4087l92140o18036n41259q26097p69281r35546
7234C4288024r15069r64364j267886j058657j368828j321074j190063j396233
7226B4805850j317968j046124j060180j249699j022230q82912q32566r18459q11073
7217A5664639p69105o86398o48060m94551n85083n18243k07682m97033n10225
7208A0748259n16512j98064m10063m26550n9607j74706l33999n09149k36305M0720
7198G924024k45363j19974p69844l71858m8797p1050k633k86413m45147k87882
$$ plain form
7261 19867265 21020447 22186075 22907466 24042227 25244488 26995430 27909720 28952985
7253 28952985 30320839 31505300 32553018 33618714 34513381 35675918 36667444 37117437 37857906
7244 37857906 38248308 38461074 38434470 38370383 37978243 37360207 36818948 35992851 35223570 34288024
7234 34288024 33372955 32408591 31140705 30082048 28713220 27392146 26202083 24805850
7226 24805850 23487882 22441758 21381578 20131879 19109649 18226737 17394171 16475712 15664639
7217 15664639 14895534 14209136 13561076 13066525 12481442 11963199 11755517 11258484 10748259
7208 10748259 10231747 10033683 9623620 9197070 9137463 8962757 8628758 8119609 7883304 7924024
7198 7924024 7678661 7558687 6788843 6416985 6368188 6297138 6294505 6008092 5562945 5275063
7188E275063M26229l29338m43936P063l8333o4606K06814q4925j85188l36239
7178D432604l42409j03285N7842j03647L7632J68073l6267l06772k9955l12152
7168C461664k81728K49827j15593K4321J0233o4695j43047r2515K26685J07816
7158C382968K65k69800l42684J34746j14561J48182j05994J35291q6684m18875
7148B462854J05551J70476K80708l2190m30921q1432L23969k44559k73999J45379
7138B425836j6151m4282L626l7111o6880K744l49658j80797R9066O6909R8284
7127B001586R8265K69327J13454M3810l45249j50215J00193o2296k50304K59704
7117B078275j91165J06099L70588j61321l4074n4205R159L84186n4565j25839
$$ plain form
7188 5275063 5701292 5371954 4928018 4935081 4896748 4832142 5038956 4954031 4768843 4432604
7178 4432604 4090195 3986910 4044752 3941105 3978737 4146810 4110543 3803771 3773816 3461664
7168 3461664 3179936 3429763 3314170 3338491 3348724 3284029 3140982 3048467 3275152 3382968
7158 3382968 3383233 3113433 2770749 2905495 2790934 2939116 2833122 2968413 2881729 2462854
7148 2462854 2568405 2738881 3019589 2987399 2556478 2475046 2799015 2554456 2280457 2425836
7138 2425836 2409685 2365403 2369029 2331918 2265038 2267782 1918124 1737327 1836393 1903302 2001586
7127 2001586 2099851 2369178 2482632 2526442 2181193 2030978 2131171 2068875 1818571 2078275
7117 2078275 1887110 1993209 2363797 2202476 2168402 2114197 2123356 2507542 2452977 2327138
7107B327138J30541Q0074o9651J78546M2480M9363M87688j64270k05642l2483
7097B823784j09287O9600L52345M0693p9342j8171J01787j53381J08901j31049
7087C005880j90146J76046k94575l67237j1461l09651J38920J64726j70036k58734
7077A883732R6265j20292l5447J43612K6066J3198k28521J70355J33411j53022
7067A929357l15307l364J19273M6286l4820J27787K04248J25653m0181k82755
7057A876177j0473l0245K7858K8389k45480J7437j57254j88681K39541O445l7128
7046A526586k20378q0774J17085o6963P7715R5522q1509p2544Q0987j80713p1567
7035A123447k05172k4763L13823j973O9972m826k4849M9041P2639J00134j27519
$$ plain form
7107 2327138 2457679 2537753 2468102 2646648 2689128 2738491 3226179 3061909 2856267 2823784
7097 2823784 2714497 2784097 3136442 3177135 3097793 3079622 3181409 3028028 3136929 3005880
7087 3005880 2815734 2991780 2697205 2329968 2318507 2008856 2147776 2312502 2142466 1883732
7077 1883732 1979997 1859705 1824258 1967870 1993936 2007134 1778613 1948968 2082379 1929357
7067 1929357 1614050 1610686 1729959 1776245 1741425 1869212 2073460 2199113 2158932 1876177
7057 1876177 1865704 1835459 1863317 1891706 1646226 1663663 1506409 1317728 1557269 1563714 1526586
7046 1526586 1306208 1225434 1342519 1275556 1353271 1448793 1367284 1294740 1375727 1195014 1123447
7035 1123447 918275 893512 1207335 1205362 1275334 1270508 1245659 1294700 1367339 1467473 1339954
7024A339954j47026Q4427j02679j19141J16849o5810R647J51676Q7474k29435
7014A125936n6189n7432J8220j17477j07948P6635O9485l2488P3469P5986K53829
7003A322026k16880P0873R5448j66783N6440j91201m0094j13841K94947o4793
6993A046142k20775O6917M4933q5277o5697j44212Q5032J29202m7887j25872j0379
6982F72127J14421K59955j32311J24602M4416k54002j43402K07989n4679k74770
6972E64346J70476j01300M0722L5994Q7639L1768p5639K40833O333N8654j11801
6961I48025n9240n3039k17974J6621l6625J42497k4067K5161r4765O4468J73685
6950H84747o6866k08344M05603j59922k02j70984J41893R3186r6863R7336k5476
$$ plain form
7024 1339954 1192928 1277355 1174676 1055535 1172384 1106574 1116221 1267897 1355371 1125936
7014 1125936 1069747 1012315 1030535 913058 805110 881745 951230 918742 992211 1068197 1322026
7003 1322026 1105146 1176019 1271467 1104684 1161124 969923 929829 815988 1110935 1046142
6993 1046142 825367 892284 937217 851940 786243 642031 727063 856265 808378 682506 672127
6982 672127 786548 1046503 914192 1038794 1083210 829208 685806 893795 839116 564346
6972 564346 734822 633522 674244 710238 797877 829645 754006 994839 1001172 1059826 948025
6961 948025 888785 835746 617772 634393 597768 740265 716198 741359 646594 711062 884747
6950 884747 817881 609537 1015140 855218 855016 684032 825925 919111 822248 919584 894108
6939H94108J72409k75941k60252R1864L47945j68009L4692l4996N1031p4445j43215
6928F35191L46102j2565J24949l3981j22336j99979J19622j21789n0603J76766
6918H61377j2646J25277J28972q6735K9412K18048J58212P4345m00799j04110
6908I91353O4544n0727R5409O4942J16497K50128j80409j22678k3650j81576k35888
6897G87945J4229j14044K76897J46130m0967j09500j84033r4700Q3313J30059
6887H95329L7889K09058j52638J02818L84063j62989l51058m7141q5995k26311
6877F03025J4931J91425K09591M3619k12751j77092k1990j97758K04439K5350
6867F82789L7927M1611j85752P0315J16654j51170n0107k73504K52216k7264J63242
$$ plain form
6939 894108 1066517 790576 530324 622188 970133 802124 836816 801820 852851 778406 635191
6928 635191 981293 968728 1093677 1059696 937360 737381 857003 735214 684611 861377
6918 861377 848731 974008 1102980 1016245 1045657 1263705 1421917 1496262 1095463 991353
6908 991353 1055897 1005170 1100579 1165521 1282018 1532146 1351737 1229059 1205409 1023833 787945
6897 787945 802174 688130 965027 1111157 1070190 960690 776657 681957 765270 895329
6887 895329 933218 1142276 989638 1092456 1476519 1313530 962472 915331 829336 603025
6877 603025 617956 809381 1018972 1062591 849840 672748 650758 453000 657439 682789
6867 682789 720716 762327 576575 646890 763544 612374 562267 288763 540979 513715 676957
6856F76957J68798j02435k27134K6479P4070j39482L7919k3923K66755R7827J92432
6845A048263j53370r1087P217o8653q3667p4511m6726n875J97760J44272J14043
6834I87666j27609j12912o7219j63193J40479o0913J01327j41186J5039J20944
6824F92423r0394k19378R1820R5291o325L14093j69700J52152r3400n9831n728
6813G01023O4836k20648o9959L67906K8718j34281j67075P6234p9218r91l8732
6802E27813N4131j6151L82588j12581k88987j97324K081K00626J94023j79241
6792E66978N0876K78082p9410k81347K39645Q7653m7642l02630J45326J47887
6782H05418M4204r642n1835J97151o1113r8145l557l5847M9114j54122j50290
$$ plain form
6856 676957 845755 743320 516186 542665 616735 477253 515172 491249 758004 855831 1048263
6845 1048263 894893 803806 811023 742370 658703 584192 537466 531591 729351 873623 987666
6834 987666 860057 747145 679926 516733 657212 596299 697626 556440 571479 692423
6824 692423 602029 382651 474471 569762 563437 877530 707830 859982 766582 706751 701023
6813 701023 765859 545211 475252 843158 871876 737595 570520 646754 567536 566545 527813
6802 527813 581944 565793 948381 835800 546813 349489 351570 552196 746219 566978
6792 566978 617854 895936 816526 535179 774824 862477 814835 512205 657531 805418
6782 805418 849622 839980 788145 985296 924183 826038 822481 786634 835748 681626 531336
6771E31336K27960k9983L8266J15125P6855l71038K8473J22819k39252J76540
6761F77101p3290k55604Q1854K65331L4084N3462j49716O4364L43191k41058m13297
6750C86422J70083L01403j6013Q6128j09540j18251K24520k60677J24184K02754
6740I91013k57255P3755K01740j81669l90111J96798J80811q949k68623L98399
6730I35909J28191k45741J00878J57654L51J50182m6570J14110p6468j26792J02035
6719A193739J85712j64093O5944J15966Q1210n1673j08898q895k9403J08556j41597
6708A246568k18404R6793N9821L1320j1545q2986J35437j6313k96062J23050J76016
6697A243695K0751p7825L34584Q2210j71488J57335k14157j94207K09425K09200
$$ plain form
6771 531336 759296 729313 767579 882704 959559 588521 616994 739813 500561 677101
6761 677101 603811 348207 430061 695392 729476 782938 633222 697586 1040777 799719 386422
6750 386422 556505 857908 841895 928023 818483 700232 924752 664075 788259 991013
6740 991013 733758 807513 1009253 827584 437473 634271 815082 806133 537510 935909
6730 935909 1064100 818359 919237 1076891 1077242 1227424 1180854 1294964 1218496 1091704 1193739
6719 1193739 1379451 1215358 1281302 1397268 1478478 1426805 1317907 1309012 1279609 1388165 1246568
6708 1246568 1028164 1124957 1184778 1216098 1204553 1121567 1257004 1240691 944629 1067679 1243695
6697 1243695 1264446 1186621 1521205 1603415 1431927 1589262 1375105 1180898 1390323 1599523
6687A599523k31861k50502l22683L16799P4519K05171N1785q7989k3717j24233
6677A206812K58327j16614K39192N2323K6144j360J1512j46552K07114K70613
6667B007511R1110J42758R1247M3658m27594O1807K7418j76588K4320N5006j77065
6656A763588q9544o1801j58380J77735L43087l7155m6438j2587L6096N6793l2589
6645A938805M13969M0190l52816K59996P8990j04479j70791j10604o1279J76992
6635B108973n9496J01523j00493l33307J70876K45453j2082l34987O1585L02510
6625B150555o0234K12099k02664m48184P1229J33167L50843k38848m8315q688
6615A910960J43201J40779j15551j93665m9236J18008r0173m1131j03168J30491
$$ plain form
6687 1599523 1367662 1117160 794477 1111276 1185795 1390966 1442751 1354762 1331045 1206812
6677 1206812 1465139 1348525 1587717 1640040 1666184 1664824 1676336 1529784 1736898 2007511
6667 2007511 2098621 2241379 2332626 2376284 1948690 2010497 2037915 1861327 1885647 1940653 1763588
6656 1763588 1674044 1612243 1453863 1631598 1974685 1937530 1891092 1878505 1914601 1971394 1938805
6645 1938805 2352774 2392964 2040148 2300144 2379134 2274655 2103864 1993260 1931981 2108973
6635 2108973 2049477 2151000 2050507 1717200 1888076 2133529 2121447 1786460 1848045 2150555
6625 2150555 2090321 2302420 2099756 1651572 1722801 1855968 2206811 1967963 1919648 1910960
6615 1910960 2054161 2194940 2079389 1885724 1836488 1954496 1864323 1823192 1720024 1850515
6605A850515m5818P97r4452n0381J45536O1562J15978j3912r9820o8703J17000
6594A918302k6728N2053K41518k48388J32358j35742J41192K07437j66001j05733
6584B010268J17834N7427L41966l8268k12345M8526J19259N6391j14437L726K27325
6573B617672j56922R202L49474J6554j22286K949j38337j40926J23188j72393
6563B388175j72020J43445J52791m1266J17831k3351K66444K39042q8451O6565
6553C049205J52917O4412R8987M77P3078k12968l9206J36048L73476k55767J03347
6542C544006J02554N3579P0727K2544j32765K8016j53123K53026K6203n2306K08333
6531C970794o6095K99809R4687K52098k10558j73003r7400J10323j28111k52616
$$ plain form
6605 1850515 1804697 1805494 1711042 1660661 1806197 1867759 1983737 1969825 1870005 1801302 1918302
6594 1918302 1891574 1943627 2185145 1936757 2069115 1933373 2074565 2282002 2116001 2010268
6584 2010268 2128102 2185529 2527495 2489227 2276882 2325408 2444667 2501058 2386621 2390347 2617672
6573 2617672 2460750 2469952 2819426 2835980 2713694 2716643 2578306 2437380 2560568 2388175
6563 2388175 2216155 2359600 2512391 2471125 2588956 2565605 2832049 3071091 2982640 3049205
6553 3049205 3202122 3266534 3365521 3365998 3439076 3226108 3186902 3322950 3696426 3440659 3544006
6542 3544006 3646560 3700139 3770866 3793410 3660645 3688661 3535538 3788564 3814767 3762461 3970794
6531 3970794 3904699 4204508 4299195 4551293 4340735 4167732 4070332 4180655 4052544 3799928
6521C799928J25751j51425j66994J52528K06678r0650N7997K61690r3952j87901
6511C913650k03751n4193M5675L4501k81157j66291O5766J11994J10337o9268
6501C507263j11234O686j87429K5046k5181J17676Q8966n6765J188O5039o6473
6490C364782l29278j7982J47344k74209k76463J51315L5116K71660J03754J62058
6480C338097j65451k39847j9553m6286P8000K10741k75732K45415k94812q2906
6470B747666K73043n1465L31226P9242p4983j1414K09617r3952K34467l6585q6949
6459C519913o5211k6493J17276k37234P1338M46053J15490l3665j33649K5242
6449C799060r359J72460k22180L4459J40789M7080K6267j9598L12289K32473Q1045
$$ plain form
6521 3799928 3925679 3774254 3607260 3759788 3966466 3875816 3933813 4195503 4101551 3913650
6511 3913650 3709899 3655706 3701381 3735882 3454725 3288434 3354200 3466194 3576531 3507263
6501 3507263 3396029 3402715 3215286 3240332 3215151 3332827 3421793 3365028 3366216 3431255 3364782
6490 3364782 3035504 3017522 3164866 2890657 2614194 2765509 2800625 3072285 3176039 3338097
6480 3338097 3172646 2932799 2913246 2866960 2944960 3155701 2879969 3125384 2830572 2747666
6470 2747666 3020709 2969244 3300470 3379712 3304729 3293315 3502932 3408980 3643447 3606862 3519913
6459 3519913 3454702 3428209 3545485 3308251 3379589 3825642 3941132 3907467 3773818 3799060
6449 3799060 3789701 3962161 3739981 3774440 3915229 3962309 3988576 3968978 4281267 4513740 4594785
6438D594785p1778L9933K5974j97359k69691K81003L62248Q3726J81567O5374
6428E095782q9862K91571K81288j29150l68649j20958M55308o130q9715J55965
6418E475450l1572j50168j41468K43204L70130K14505j70708j0993K57221J16214
6408F171815J13706J68918J76866M71704K01290J1953O7184L3234P3579j35291
6398G354958j27188j56082K84783L73675J72352J45014M8245L72707K49922K3878
6388H742264K47624K15657K67843j00643n2528M82499L96505K45986L54654K43152
6378A1043013M42194N03347M28656O42806O76562N00546N07336M87489P30177
6369A5962126J430253J215269J157722J581033J708448J582458J970651K336183
$$ plain form
6438 4594785 4523007 4562940 4588914 4391555 4121864 4402867 4765115 4848841 5030408 5095782
6428 5095782 5005920 5297491 5578779 5449629 5080980 4960022 5415330 5409200 5319485 5475450
6418 5475450 5443878 5293710 5152242 5395446 5765576 5980081 5809373 5798380 6055601 6171815
6408 6171815 6285521 6454439 6631305 7103009 7304299 7316252 7383436 7416670 7490249 7354958
6398 7354958 7227770 7071688 7356471 7730146 7902498 8047512 8095757 8468464 8718386 8742264
6388 8742264 8989888 9205545 9473388 9372745 9320217 9802716 10199221 10445207 10799861 11043013
6378 11043013 11485207 11988554 12417210 13060016 13736578 14237124 14744460 15231949 15962126
6369 15962126 17392379 18607648 19765370 21346403 23054851 24637309 26607960 28944143
6361B8944143K342511J895731J633539J415237R03440J166100J296718J258416
6353D0855835J981675K233075J931235J636211J757654J643592J269492J197731
6345E4506500J352102J644933J712288J634411J708446J866594J877208J687595
6337F7990077J653946K234812L249086M403050N947871P069233Q113353Q651677
6329A09313105Q425656P099469M827200J947092j202917l995180n622219o087382
6321A14704824n205267l549136k557089j211960M80872J917026L122587M570141
6313A12271998N820113O907531P762010P481557O759812N085162K566242n0945
6305A54603480k735173m493814o557430q098036q124303p084209o555506n222208
$$ plain form
6361 28944143 31286654 33182385 34815924 36231161 37134601 38300701 39597419 40855835
6353 40855835 42837510 45070585 47001820 48638031 50395685 52039277 53308769 54506500
6345 54506500 55858602 57503535 59215823 60850234 62558680 64425274 66302482 67990077
6337 67990077 69644023 71878835 75127921 79530971 85478842 92548075 100661428 109313105
6329 109313105 117738761 124838230 129665430 131612522 130409605 126414425 120792206 114704824
6321 114704824 109499557 105950421 103393332 102181372 102662244 104579270 107701857 112271998
6313 112271998 118092111 124999642 132761652 140243209 147003021 152088183 154654425 154603480
6305 154603480 151868307 147374493 140817063 132719027 124594724 117510515 110955009 105732801
6297A05732801m483550l301707k211610j488519p41594k02494Q01441J241895
6289I5346663K180893L227934M319600N466754O474976P588254P979308P854642
6281A40439024O561186M501123K649408j10250k484473m154223n555475o730583
6273A35115737o736605n873732n172984m385863k669808j408181J51738J401390
6265A10421692K704073M311571M709461N113251M804103L610465J173355j534197
6257A35313774l932192n659624p610397p539541o681160n737394m488586l907627
6249H9757253l046373k609769k287513k136361k100236k279910k006882j792589
6241G1497620j759038j716883j423693j279319j444915j828056j641025j519021
$$ plain form
6297 105732801 101249251 97947544 95735934 94247415 93505821 93303327 94104768 95346663
6289 95346663 97527556 100755490 105075090 110541844 117016820 124605074 132584382 140439024
6281 140439024 147000210 151501333 154150741 154040491 151556018 147401795 141846320 135115737
6273 135115737 128379132 122505400 117332416 112946553 110276745 108868564 109020302 110421692
6265 110421692 113125765 117437336 122146797 127260048 132064151 135674616 136847971 135313774
6257 135313774 131381582 125721958 118111561 110572020 103890860 98153466 93664880 89757253
6249 89757253 86710880 84101111 81813598 79677237 77577001 75297091 73290209 71497620
6241 71497620 69738582 68021699 66598006 65318687 63873772 62045716 60404691 58885670
6233E8885670k030141k258711j705176j536172j299878j163942r10096j293014
6225D6688540j676773k100971k553832k320914j851373j923414k036740j626584
6217C0597939j425732j129989j347062j355491r44246j095281q46290q04827o04441
6208B1044580o18030n05569p74200p92922n98215m41038m88049n05517l88167
6199A5932873j48298J24776m90413o05494n71873k93392l06941k14224O1474k62454
6189A3226034j24788k96455m44833K2595j52630j85681n29122L20653j12544k54903
6179A1468326n6618k30819j33917j54767j1849k34262J81017j37744l57264m38545
6169I893558k22255P8494K9848k15254r6715R0332j60844l5509j09522j00038
$$ plain form
6233 58885670 56855529 54596818 52891642 51355470 50055592 48891650 47981554 46688540
6225 46688540 45011767 42910796 40356964 38036050 36184677 34261263 32224523 30597939
6217 30597939 29172207 28042218 26695156 25339665 24395419 23300138 22453848 21649021 21044580
6208 21044580 20426550 19920981 19146781 18353859 17755644 17314606 16826557 16321040 15932873
6199 15932873 15784575 15909351 15418938 14813444 14241571 13948179 13641238 13427014 13488488 13226034
6189 13226034 13101246 12804791 12359958 12382553 12229923 12044242 11515120 11835773 11723229 11468326
6179 11468326 11411708 11180889 11046972 10892205 10880356 10646094 10827111 10689367 10332103 9893558
6169 9893558 9671303 9749797 9779645 9564391 9467676 9558008 9397164 9361655 9252133 9152095
6159I152095k16471j72115k14173N4320P5383k17051k82588j831J57812O6561
6149H401942l20660m7364l208j71762k70122j393Q7083l0927J33755K37327J5511
6138H030182j85228j24864n0431j56043p7771j0687K85148j13507k40419n1420
6128G304960J8299j64582r3095k81208j30145O2245l33757K01359K0087j15415
6118F488748j26750p2226J16445Q3641l41002k59702j83689M8099j77446p174
6108E568944K45980Q7700k52421p0645K35951q7370m24308p3692K8159N59474
6098E817772k34192j43235J07461R975j86914n6267M63666l4669k7056r4189J00035
6087E722387P23k51605J83252J9227J53632j02590o9074M2484j31764k16763j54591
$$ plain form
6159 9152095 8935624 8763509 8549336 8603656 8679039 8461988 8179400 8177569 8335381 8401942
6149 8401942 8081282 8033918 8030710 7858948 7588826 7587433 7674516 7643589 7777344 8014671 8030182
6138 8030182 7844954 7720090 7669659 7513616 7435845 7425158 7710306 7596799 7356380 7304960
6128 7304960 7323259 7158677 7065582 6784374 6654229 6716474 6382717 6584076 6604163 6488748
6118 6488748 6361998 6289772 6406217 6489858 6148856 5889154 5705465 5753564 5576118 5568944
6108 5568944 5814924 5902624 5650203 5579558 5815509 5728139 5303831 5230139 5258298 5817772
6098 5817772 5583580 5440345 5547806 5557781 5370867 5314600 5778266 5743597 5716541 5622352 5722387
6087 5722387 5723110 5471505 5654757 5673984 5827616 5725026 5655952 5698436 5566672 5349909 5195318
6076E195318K32833k7407O1209j3355j13392J8362K35349k62427K55101J26951
6066E708542k98671J27474L0223J77537K8632L4787J84160K78045J17990k20257
6056F168462j24858N7228J97719k60076K35292L12313K3699j07063q9801J06957
6046F519872R2482J56429N760M4827k40797k01067k04681j47567J18702P0859
6036F214819L6295K325L65357l8475j61633P3060M2773o3421J60729K03433L8031
6025F873293J42461J40301O1395J51549k66803l5221L5444m25390k37601J30170
6015F569598N7726k6424k3122k47744J37325R0925J61646L17840J54739k19048
6005F973461q4672J06843J52234l8059q2706R4626n2440M1800M1321k88293j68513
$$ plain form
6076 5195318 5428151 5400744 5461953 5448598 5335206 5353568 5588917 5326490 5581591 5708542
6066 5708542 5409871 5537345 5567568 5745105 5773737 5808524 5992684 6270729 6388719 6168462
6056 6168462 6043604 6100832 6298551 6038475 6273767 6586080 6609779 6502716 6412915 6519872
6046 6519872 6612354 6768783 6774543 6819370 6578573 6377506 6172825 6025258 6143960 6214819
6036 6214819 6251114 6253439 6618796 6580321 6418688 6491748 6534521 6471100 6631829 6835262 6873293
6025 6873293 7015754 7156055 7217450 7368999 7102196 7066975 7102419 6677029 6439428 6569598
6015 6569598 6627324 6600900 6577778 6330034 6467359 6558284 6719930 7037770 7192509 6973461
6005 6973461 6888789 6995632 7147866 7109807 7027101 7121727 7069287 7111087 7152408 6864115 6695602
5994F695602j85713j53964j08412j356J7433Q229L69609J67186j816O1928J19425
5983F988151j90776l6523Q5033J34087p0460P5280K30426q6782k75904l53645
5973F498887j3761k10992j44418J27r7833O0919J21161j42634j61208p5744P3999
5962E908503O8107O5836R8767j48206N9962k70091l0468J34510j33655j5092J9882
5951E758055k12188K15667M55412l6763j10572L93859K72411j13313N20768j72484
5941F970852k34152L1115K31307m2306k17919J76398J76860j19970J46834j66297
5931F952722j49993n8881L45423j62528k59334L99141K71618R6490r8978L28775
5921G664455N0573R4071J13867l768o5750j2657k7437l75m0544K89677K40497
$$ plain form
5994 6695602 6509889 6355925 6247513 6246157 6263590 6271819 6641428 6808614 6806798 6868726 6988151
5983 6988151 6797375 6760852 6845885 6979972 6909512 6984792 7215218 7128436 6852532 6498887
5973 6498887 6485126 6274134 6129716 6129843 6032010 6092929 6214090 6071456 5910248 5834504 5908503
5962 5908503 5976610 6042446 6141213 5993007 6052969 5782878 5752410 5886920 5753265 5738173 5758055
5951 5758055 5545867 5761534 6216946 6180183 6069611 6463470 6735881 6622568 7143336 6970852
5941 6970852 6736700 6767815 6999122 6956816 6738897 6915295 7092155 6972185 7119019 6952722
5931 6952722 6802729 6743848 7089271 6926743 6667409 7066550 7338168 7434658 7335680 7664455
5921 7664455 7715028 7809099 7922966 7919198 7853448 7840791 7813354 7812979 7772435 8062112 8302609
5910H302609j91302K46164Q0550L81011J04625j46813K04817K22083M26518o6739
5900I563523L09108L88408J60915j18646j13819J09990M82057J27820K84977k3855
5890A1170478r5318L88508J84139Q6158K5587M261j74064k4439m5283n5050K1732
5879A1486709k6836j73225l01879M1532j96875j45378Q4426L683J16743j5094
5869A0873806j32603p1236M5571n7091k02901j87704p7639m4460j08255p7752
5859I959736o501M4829l72318o9068R6859n2480j96345K55516J41255l40941L05891
5848I766433j0822J46032K2766k36320j27230j17487J71224n6946l18316j15504
5838I123830L79191J58505n4574J71228K94686L89330k820J42231N82813K64138
$$ plain form
5910 8302609 8111307 8357471 8438021 8819032 8923657 8776844 8981661 9203744 9630262 9563523
5900 9563523 9872631 10261039 10421954 10303308 10189489 10299479 10781536 10909356 11194333 11170478
5890 11170478 11075160 11463668 11647807 11733965 11759552 11763813 11589749 11565310 11520027 11464977 11486709
5879 11486709 11459873 11286648 10984769 11026301 10829426 10684048 10768474 10772157 10888900 10873806
5869 10873806 10741203 10669967 10715538 10658447 10455546 10267842 10190203 10145743 10037488 9959736
5859 9959736 9953235 9998064 9625746 9556678 9653537 9601057 9404712 9660228 9801483 9460542 9766433
5848 9766433 9755611 9901643 9924409 9688089 9560859 9443372 9614596 9557650 9239334 9123830
5838 9123830 9503021 9661526 9606952 9778180 10072866 10462196 10459376 10601607 11184420 11448558
5828A1448558N77374L80940L1183L22356P1832N43957M16008M73583K54783J86396
5818A4706970O921j32399K05807j0703n80306j09028k31283j65101j10866j96022
5808A3383990j81341k24081l18705p47251k05863j49860l85990k42001Q6600j23076
5798A0892422l47197l58653m06369k82163J50947p2106l26251l20557n7175L80830
5788I253728J34133j82527J48661L07823P6812L08393j72906j24522J17884K54548
5778A0122027R1926j71810K71246l2395j81902J48377K16478p8960k45315k95848
5768I843824q737n3626K7949L6591L5190M6309J78092M6368K80972r0898l94177
5757I947857j7651p3830J72952N7659q8j8349L11254J28286L59360R7592L68J04495
$$ plain form
5828 11448558 12025932 12406872 12438055 12760411 12832243 13376200 13792208 14265791 14520574 14706970
5818 14706970 14713891 14581492 14787299 14776596 14196290 14087262 13855979 13690878 13580012 13383990
5808 13383990 13202649 12978568 12659863 11912612 11706749 11556889 11170899 10928898 11015498 10892422
5798 10892422 10545225 10186572 9780203 9498040 9648987 9576881 9250630 8930073 8872898 9253728
5788 9253728 9387861 9205334 9353995 9661818 9738630 10047023 9874117 9749595 9867479 10122027
5778 10122027 10213953 10042143 10313389 10280994 10099092 10247469 10463947 10384987 10139672 9843824
5768 9843824 9835087 9781461 9809410 9846001 9881191 9927500 10105592 10151960 10432932 10342034 9947857
5757 9947857 9930206 9856376 10029328 10086987 10086899 10068550 10379804 10508090 10867450 10965042 10965410 11069905
5745A1069905k5725j45404p00849n13696J8274l54865k27274j98028l40337N3592
5735H635593J6505l04456l23412j07422k48615K02185J47998l4880j6247J84345
5725H151594j03203R0272L1457O7142j38460J43340N9850J27874L38299K35996
5715I004161J34457J75818K45561J26976K01810P50913O47056L0651J49926J96348
5705A1663677L61328M34088K03652R0033P1012p6351q7232j1497J59294J17859
5695A2925863K65955m0683j64005J5295R9990k4852K35982K22769M33945L17329
5685A4287588K01774K56411K92097M14813M24929K80044M21963L66660P01053
5676A7647332N22254N20689J75326r3074L41963j85122k13463n91272m93954m06198
$$ plain form
5745 11069905 11044180 10898776 10197927 9684231 9702505 9347640 9120366 8922338 8582001 8635593
5735 8635593 8652098 8347642 8024230 7916808 7668193 7870378 8018376 7983496 7967249 8151594
5725 8151594 8048391 8138663 8170120 8237262 8098802 8242142 8301992 8429866 8768165 9004161
5715 9004161 9138618 9314436 9559997 9686973 9888783 10639696 11286752 11317403 11467329 11663677
5705 11663677 12025005 12459093 12662745 12752778 12823790 12747439 12660207 12648710 12808004 12925863
5695 12925863 13191818 13151135 12987130 13002425 13102415 13077563 13313545 13536314 13970259 14287588
5685 14287588 14489362 14745773 15037870 15452683 15877612 16157656 16579619 16946279 17647332
5676 17647332 18169586 18690275 18865601 18772527 19114490 18929368 18715905 18124633 17630679 17224481
5666A7224481o4020L6716k68361m4921J45264K04221N8730Q3311J362K23861J25117
5655A7725761K77633N65560M6181J05501M03356O14034L62239L17429R57338P67303
5645B2142335O58020O82584K64508L63851N70956K40589R8928J8710K55129o4431
5635B5231179J56369L02618J63742M19603L7068K88304J31590L26762N28162K79845
5625B7865242N68972N65384P55175O18488P88757J270705J051637Q68994J249367
5616C5602721J246727J481191J696214J806182J934356J709415K000274K315870
5608D9792950K515740K368123K694216K736975L103827L514683M029796M735122
5600G5491432N041993N763550O554915P526794Q788120R680715J0865977J1888547
$$ plain form
5666 17224481 17160461 17197177 16928816 16883895 17029159 17233380 17292110 17375421 17376783 17600644 17725761
5655 17725761 18003394 18568954 18615135 18720636 19123992 19738026 20100265 20417694 21375032 22142335
5645 22142335 22800355 23482939 23747447 24111298 24682254 24922843 25021771 25040481 25295610 25231179
5635 25231179 25387548 25690166 25853908 26273511 26310579 26598883 26730473 27057235 27585397 27865242
5625 27865242 28434214 28999598 29754773 30373261 31162018 32432723 33484360 34353354 35602721
5616 35602721 36849448 38330639 40026853 41833035 43767391 45476806 47477080 49792950
5608 49792950 52308690 54676813 57371029 60108004 63211831 66726514 70756310 75491432
5600 75491432 80533425 86296975 92851890 100378684 109166804 118847519 129713496 141602043
5592A41602043J2624062J3332290J3507253J3400721J2910207J1223926Q757487
5585B27357989O405615L398614m36532l507152o166156q039865r483037j0078611
5577A99450865j1013371j1247719j1185977j1542338j1440358j0724347r561751
5570A22735004q964269q242216p254098o310186n813896n152545m794650m419513
5562G1783631l874744l711337l230434k897571k685183k524653k474690j956379
5554D8428640k105305j905426j783311j778492j684344r60381j278211j325415
5546C5607755j091089j109948r93481j052671q76801p40424p65969p47681q91992
5537B7337699r27587r16428p88411n43427n31028m09907o94315q72086m72369
$$ plain form
5592 141602043 154226105 167558395 181065648 194466369 207376576 218600502 227357989
5585 227357989 233763604 237162218 236725686 233218534 227052378 219012513 209529476 199450865
5577 199450865 188437494 177189775 166003798 154461460 143021102 132296755 122735004
5570 122735004 113770735 105528519 98274421 91964235 86150339 80997794 76203144 71783631
5562 71783631 67908887 64197550 60967116 58069545 55384362 52859709 50385019 48428640
5554 48428640 46323335 44417909 42634598 40856106 39171762 38211381 36933170 35607755
5546 35607755 34516666 33406718 32413237 31360566 30483765 29743341 28977372 28229691 27337699
5537 27337699 26410112 25493684 24705273 24161846 23630818 23220911 22526596 21654510 21182141
5528B1182141j14602o32252o55465k50738m98117m53568k85959l36856n06082
5519A7448502l65992m51571n15932n20287J48313k98843k54059k85180l17626
5510A4587325J8530k17318q5255l61853J5806q4769n7660p9619j44345j74485
5500A3416357J68905J02079J63121j22285M440K1430L67246n5920j69664P2663
5490A3968372J7779J25448j04252j32938k5980p6458l29770k57169k05759k15953
5480A2763320j61102m10513k67689R1646j4101j38433j53939k15631k11932j23376
5470A1158250j96435k26944j71405n8776l09316k48074l06645j54005n7950J12458
5460I541158j64214j5528r8578q4453k52561j86403j49464Q2200J41209k10736
$$ plain form
5528 21182141 21067539 20435287 19779822 19529084 19030967 18577399 18291440 17954584 17448502
5519 17448502 17082510 16630939 16115007 15594720 15743033 15444190 15190131 14904951 14587325
5510 14587325 14605855 14388537 14303282 13941429 13957235 13872466 13814806 13735187 13590842 13416357
5500 13416357 13585262 13687341 13850462 13728177 13732617 13754047 14121293 14065373 13895709 13968372
5490 13968372 13986151 14111599 14007347 13874409 13848429 13771971 13442201 13185032 12979273 12763320
5480 12763320 12602218 12191705 11924016 12015662 12001561 11863128 11709189 11493558 11281626 11158250
5470 11158250 10961815 10734871 10563466 10504690 10195374 9947300 9640655 9486650 9428700 9541158
5460 9541158 9376944 9361416 9262838 9178385 8925824 8739421 8589957 8672157 8813366 8602630
5450H602630K72306J93933m2920m05162J06180L83425J38505N0658o2876q8187
5440I148492N7542J4982L12955p6509J77208J76462J24831O30166M10084L76069
5430A1352282J72292L93592J52281M8761l7481l97735k98199m84611m48812K8094
5420A0480464m11153k15270k13951J31438k22625l72017k45511j75709K61172
5411I016838J3648j17921q6870M7675k8732l56323k0437j42311j93386K78396
5401H410577j06278J01897j00070k16984L06444N040j15596l06427k98623l5963
5391G644017j79586R2144j64062l8712j9445K8721l1877j18062K02328q9970l05959
5380G019537L7217j13031m8953j29826L2809p5403m220m5475k51094k07879M7623
$$ plain form
5450 8602630 8874936 9068869 9025949 8620787 8726967 9110392 9248897 9299555 9236679 9148492
5440 9148492 9206034 9221016 9533971 9457462 9634670 9811132 9935963 10566129 10976213 11352282
5430 11352282 11524574 11918166 12070447 12119208 12081727 11683992 11385793 10901182 10452370 10480464
5420 10480464 10069311 9854041 9640090 9771528 9548903 9176886 8931375 8755666 9016838
5411 9016838 9030486 8912565 8825695 8873370 8844638 8488315 8467878 8325567 8132181 8410577
5401 8410577 8304299 8406196 8306126 8089142 8395586 8400626 8285030 7978603 7679980 7644017
5391 7644017 7464431 7556575 7392513 7353801 7334356 7363077 7331200 7213138 7415466 7325496 7019537
5380 7019537 7056754 6943723 6894770 6764944 6797753 6722350 6718130 6672655 6421561 6213682 6261305
5369F261305L28257k87359r1416k7056l03951J70011N4858k02953K1927J24996
5359F048619k06814j05563m5708j7503p044N5907j95025k30685R2568J28274J37605
5348E654631j82521l1190k97242l11892N9344J05910K14332O6276Q3640P7847
5338E439135p3446K09202k17262m20506m6736j79177J57540K56772J19424P8767
5328E323713r1567j61769j42366l9887J21193k617K4546Q0302J43276K8599J2283
5317E295706m8207k59887q5348R3846J25084J94896q7414l7436Q6131O9775N1619
5306E398765k99476m7791m2861J40819q6166J41297n4367j04417k9073K72511
5296E289241k04414m178J20926l7260K7142J60443J67471j03869J43908J28127
$$ plain form
5369 6261305 6589562 6302203 6210787 6183731 5879780 6049791 6104649 5901696 5923623 6048619
5359 6048619 5841805 5736242 5690534 5673031 5665987 5721894 5526869 5296184 5388752 5517026 5654631
5348 5654631 5472110 5440920 5143678 4831786 4891130 4997040 5211372 5277648 5361288 5439135
5338 5439135 5365689 5574891 5357629 4937123 4890387 4711210 4868750 5125522 5244946 5323713
5328 5323713 5232146 5070377 4928011 4888124 5009317 5006700 5031246 5111548 5254824 5283423 5295706
5317 5295706 5247499 4987612 4902264 4996110 5121194 5316090 5228676 5191240 5277371 5347146 5398765
5306 5398765 5099289 5051498 5008637 5149456 5063290 5204587 5150220 5045803 5016730 5289241
5296 5289241 5084827 5080649 5201575 5164315 5191457 5351900 5519371 5415502 5559410 5687537
5286E687537K2490j51242J30867K17631j06987K21460L30331Q7483k304r9950
5276F337316M3922K06548R4277L5836J47593k6055N6195K08608r3326J76796J57619
5265G345329J70968L70896K71180J45996M72397L92071L33236O77174O00058N71061
5255A1350366O61184Q17355Q11781R33820M96821L45636k9919o51238p91188m85036
5245A3459582p98888m45688j01582m48296m84229k90490n81106l06990k36894
5236I765419k69174o6032M9694o3075J57968r9285J03926k0810k29560K0761J80464
5225I530296J30719J10259O04301J13326l0167K49577L41495K74525M52105N44545
5215A2320981P03168J036430Q36228Q15489Q26199Q63988J068007R62473R90967
$$ plain form
5286 5687537 5710027 5558785 5689652 5907283 5800296 6021756 6352087 6439570 6437266 6337316
5276 6337316 6381238 6587786 6682063 6717899 6865492 6839437 6895632 7104240 7010914 7187710 7345329
5265 7345329 7516297 7887193 8158373 8304369 8776766 9168837 9502073 10179247 10779305 11350366
5255 11350366 12011550 12828905 13640686 14574506 15071327 15416963 15387044 14735806 13944618 13459582
5245 13459582 12660694 12215006 12113424 11665128 11180899 10890409 10309303 10002313 9765419
5236 9765419 9496245 9430213 9479907 9416832 9574800 9475515 9579441 9558631 9329071 9349832 9530296
5225 9530296 9661015 9771274 10375575 10488901 10458734 10708311 11049806 11324331 11776436 12320981
5215 12320981 13024149 14060579 14896807 15712296 16538495 17402483 18470490 19432963 20423930
5206B0423930Q41887M77331M82564K42690J21348j16674J13840p6506k74163J15680
5196B2351927O01186M04316N04399O96106M45744M84582M45531j10369j50099
5187B5673323m18550m81106m04533m46177o82794p24053l12022k43971l47595
5178B1612522k83490N7242k2787J75687L65306O53529L58205O61976R73245J228471
5168B5779906R70823J350472J346912R18997J014008J188636R25724J237742J498780
5159C6232000J254116J277020J429014J522942J124800J155557Q14751K26257
5151D5036457k91999p09156r36701j455991j470123k025744j679583j923945j564204
5142C2979011j259330j042191j072633o67787j18770k17386n0568L85966Q26893
$$ plain form
5206 20423930 21265817 21743148 22225712 22468402 22589750 22473076 22586916 22510410 22236247 22351927
5196 22351927 22953113 23357429 23861828 24557934 25003678 25488260 25933791 25823422 25673323
5187 25673323 25254773 24773667 24369134 23922957 23240163 22516110 22204088 21960117 21612522
5178 21612522 21329032 21386274 21363487 21539174 21904480 22558009 22916214 23578190 24551435 25779906
5168 25779906 26750729 28101201 29448113 30367110 31381118 32569754 33495478 34733220 36232000
5159 36232000 37486116 38763136 40192150 41715092 42839892 43995449 44810200 45036457
5151 45036457 44744458 44035302 43098601 41642610 40172487 38146743 36467160 34543215 32979011
5142 32979011 31719681 30677490 29604857 28937070 28818300 28600914 28550346 28936312 29763205
5133B9763205O89736J239215J212217J189309J532136R70607Q89646N01874l26746
5124C7661199n32965p57869j166680j550596j865841j861334j327534j358089
5116B7240291j290895j136941r77938p70431o71178n55504o60964r71571n22194
5107A9682675k61726n34898m78573l51403n3730k38793r5734K62338k58434o6665
5097A7605057M1449K7023k5168p633k40411n2878R3828L10669j55194M9142l1081
5086A7614803o813k25397n60132k8344n3228m76498l03435o964o25852l81989
5076A4946151J31303j3741k96507r1197M4207j08408J8281l11273j38575K24932
5066A4405173p5297R8267J15307o6960Q7987N8567P7182K15371J28154J84375
$$ plain form
5133 29763205 30452941 31692156 32904373 34093682 35625818 36596425 37486071 37987945 37661199
5124 37661199 37128234 36370365 35203685 33653089 31787248 29925914 28598380 27240291
5116 27240291 25949396 24812455 23834517 23064086 22392908 21837404 21176440 20204869 19682675
5107 19682675 19420949 18886051 18407478 18056075 18002345 17763552 17667818 17930156 17671722 17605057
5097 17605057 17646506 17673529 17648361 17640728 17400317 17347439 17441267 17751936 17596742 17645884 17614803
5086 17614803 17607990 17382593 16822461 16794117 16740889 16264391 15960956 15953992 15328140 14946151
5076 14946151 15077454 15063713 14767206 14676009 14720216 14611808 14630089 14318816 14180241 14405173
5066 14405173 14329876 14428143 14543450 14476490 14564477 14623044 14700226 14915597 15043751 15228126
5056A5228126Q9038R116N178J93555K8383J36189K95709j63078L06387K78391
5046A6406994J26017n9012j37467K00100P7006O9555L36856L01672J07963K13765
5036A7643449L36903P48647L23835J556M58360L81646K29185J60539k20081j65642
5026A9898397L66398N31468K32337L25299L79302K38216K93418Q4466n7767l09283
5016B1982251j9961J76245j6661o0791j3620J94409q3277P3839N30430M27429
5006B3190293M50093K74236L22227K81840K43538M14910N28139P20663Q82409
4997B7308348M89961K64661O28809N77956K41386K06988Q6926J85103J61258J78691
4987C0330087L75035P1528J5845P0390O68190M35876L42534Q20461P91538P00317
$$ plain form
5056 15228126 15317164 15326280 15331458 15525013 15553396 15689585 15985294 15822216 16128603 16406994
5046 16406994 16533011 16473999 16336532 16536632 16613638 16683193 17020049 17321721 17429684 17643449
5036 17643449 17980352 18728999 19052834 19054390 19512750 19894396 20123581 20284120 20064039 19898397
5026 19898397 20264795 20796263 21028600 21353899 21733201 21971417 22264835 22349301 22291534 21982251
5016 21982251 21962290 22138535 22121874 22061083 22047463 22241872 22158595 22232434 22762864 23190293
5006 23190293 23640386 23914622 24236849 24518689 24762227 25177137 25705276 26425939 27308348
4997 27308348 27798309 28062970 28691779 29269735 29511121 29718109 29805035 29990138 30151396 30330087
4987 30330087 30705122 30776650 30792495 30862885 31531075 31966951 32309485 33129946 33921484 34621801
4977C4621801Q60328P16550R54974N34707N66449Q42099Q46971P69659J123291
4968D1836829Q58125O26943O56699P84407P97800L02486L42706L95666R52231
4959D7553892N43199O57121R46076J201430J221573R27797R61897J280183J604587
4950E6897755J626851J483347J555630J669482J313112J656563J972899J972806
4942G0148445J803032K980741L223551L215787L621840L920206M816332N418542
4934I9148476N321399O146621P017029P208220P686152Q332124Q905457R468305
4926A59233783J0585361J1551992J2841235J3613082J4697710J5732984J6802907
4919B55059054J8070633J8603410J9187799J9591570J8805655J7785991J4826491
$$ plain form
4977 34621801 35482129 36198679 37153653 37688360 38254809 39096908 39943879 40713538 41836829
4968 41836829 42694954 43321897 43978596 44763003 45560803 45863289 46205995 46601661 47553892
4959 47553892 48097091 48754212 49700288 50901718 52123291 53051088 54012985 55293168 56897755
4950 56897755 58524606 60007953 61563583 63233065 64546177 66202740 68175639 70148445
4942 70148445 71951477 74932218 78155769 81371556 84993396 88913602 93729934 99148476
4934 99148476 104469875 110616496 117633525 124841745 132527897 140860021 149765478 159233783
4926 159233783 169819144 181371136 194212371 207825453 222523163 238256147 255059054
4919 255059054 273129687 291733097 310920896 330512466 349318121 367104112 381930603
4912C81930603J1205054O570140J511798k971154o923797r776175j1909306j2652277
4904C56984886j2492180j3211332j2934370j3027179j3993667j4063273j4786892
4897B62475993j4099350j3370531j2528772j1565342j1342482j0518960r689518
4890A79361038r598748r152953q364590p714190p252950o697197o056063n243954
4882A19280393m665815l971217l893892l512558l184700k565547k569377k795627
4874I2121660k358827k264261k197392k165453k161859j716524j268223j420321
4866G6568800j040239r10265m68001K56638J14485M70411J089344J207415J844705
4857G9133293K125427K235232K170059K114496J733063J436138O94106k17592
$$ plain form
4912 381930603 393135657 399705797 401217595 398246441 391322644 381546469 369637163 356984886
4904 356984886 344492706 331281374 318347004 305319825 291326158 277262885 262475993
4897 262475993 248376643 235006112 222477340 210911998 199569516 189050556 179361038
4890 179361038 169762290 160609337 152244747 144530557 137277607 130580410 124524347 119280393
4882 119280393 114614578 110643361 106749469 103236911 100052211 97486664 94917287 92121660
4874 92121660 89762833 87498572 85301180 83135727 80973868 79257344 77989121 76568800
4866 76568800 75528561 74618296 74150295 74406933 74521418 74991829 76081173 77288588 79133293
4857 79133293 81258720 83493952 85664011 87778507 89511570 90947708 91641814 91424222
4849I1424222r55851j170210k586712k901243l337947l285186l435449l437825
4841G0313799k830143k836563k415619k112524k079545j834999j726424j402160
4833E3075822p96577j059402p96047p37589r11522q55095p65648m47414m93683
4824D6212845o35597o59819o26992o35364p35602p85282o86550m84222n94486
4815D0368931k06986k51131m24869n12630m28095J5584r1818j71225j87087P4247
4805C8184921J16777l12851n6366k471j25408L31450K66934m0617J70253J25513
4795C8658135J55198N0042k8361J77427O5723m37581k00733P3083K51626L46409
4785C9110968M28389M52147M68113O02716J001104R06468J069340N52794q7762
$$ plain form
4849 91424222 90468371 89298161 86711449 83810206 80472259 77187073 73751624 70313799
4841 70313799 67483656 64647093 62231474 60118950 58039405 56204406 54477982 53075822
4833 53075822 52279245 51219843 50423796 49686207 48774685 47919590 47153942 46706528 46212845
4824 46212845 45577248 44917429 44290437 43655073 42919471 42134189 41447639 40963417 40368931
4815 40368931 40161945 39910814 39485945 38973315 38545220 38560804 38468986 38297761 38110674 38184921
4805 38184921 38301698 37988847 37932481 37930010 37804602 38136052 38402986 38362369 38532622 38658135
4795 38658135 38813333 38863375 38835014 39012441 39078164 38640583 38439850 38512933 38764559 39110968
4785 39110968 39539357 39991504 40459617 41062333 42063437 42969905 44039245 44592039 44504277
4776D4504277j48215j95398m83841l00478j63507j88836j46938o2818j35688J2873
4766D2691431m52469l17762m46242n65888k40998m79138j50705L24788N31966
4757D0894983J35529K08434M16570M11405L31938N61473J45212K18820M75964
4748D3800328J82959L77122K29356K88125K8456K32515N10580N59319O35926Q65564
4738D7710250J027005P88067N42218J020949J290906J251366J349683J804456
4730E6784900K167072K307355K646637K886330L733222M419189M172394N698071
4722H4815170O789817P142259P756662Q858464R959136J1343206J3191158J5775806
4714A65631678K0051847K6105749L4611068M3927315M7977716M7445344N1539565
$$ plain form
4776 44504277 44356062 44160664 43676823 43376345 43212838 43024002 42877064 42814246 42678558 42691431
4766 42691431 42238962 41921200 41474958 40909070 40668072 40188934 40038229 40363017 40894983
4757 40894983 41030512 41238946 41655516 42066921 42398859 42960332 43105544 43324364 43800328
4748 43800328 43983287 44360409 44589765 44877890 44906346 45138861 45649441 46208760 46844686 47710250
4738 47710250 48737255 49525322 50067540 51088489 52379395 53630761 54980444 56784900
4730 56784900 58951972 61259327 63905964 66792294 70525516 74944705 79117099 84815170
4722 84815170 91604987 98747246 106503908 115362372 125321508 136664714 149855872 165631678
4714 165631678 185683525 211789274 246400342 290327657 338305373 385750717 437290282
4707D37290282M4199268K0724780M352779k0016615n1072541n2913380m2644142
4700C39920431l5287932k9353345k4207558k0035651j6912425j4538602j3513595
4693A86071323j2706604j0439155r068043p646858o726246o166384n618505m592960
4685A23106568l137919k923746j793938j371440k39309P45216J311736K115698
4677A17812866K554780K765944J902217J088983N13233n13094o78720r03432q71003
4668A23671774p19647l22434J00750J249273K432172L224884M294885N249138
4660A39180795N605803N909592N347893M467072K986011J931553J474780J295535
4652A68199034K207921L685315N412184O883615Q104313R659976J1756682J3603253
$$ plain form
4707 437290282 481489550 502214330 506567109 486550494 435477953 382564573 339920431
4700 339920431 304632499 275279154 251071596 231035945 214123520 199584918 186071323
4693 186071323 173364719 162925564 153857521 146210663 139484417 133318033 127699528 123106568
4685 123106568 119968649 117044903 115250965 113879525 113640216 114385432 115697168 117812866
4677 117812866 120367646 123133590 125035807 126124790 126638023 126124929 125446209 124542777 123671774
4668 123671774 122952127 122629693 122730443 123979716 126411888 129636772 133931657 139180795
4660 139180795 144786598 150696190 156044083 160511155 163497166 165428719 166903499 168199034
4652 168199034 170406955 174092270 179504454 186388069 194492382 204152358 215909040 229512293
4644B29512293J6905046K0897471K5833887L1452883L4653464L5784902L4658363
4637D29698309K8853201J6972557K439727j3118137k8142475l5316728l4278515
4630C67107939l0680716k7005448k2853776j9698572j6710826j4614310j2909478
4623B22634813j1722071j0010100p833650o356548m878293l515694k421974k155506
4615A73740977k600419l055704l886862m805325m792784n036674m463453l817086
4607A41282670l556221l142875l015752l412927l464602m113192m204707l937381
4599A12435013l998862m112600m083906l760624k867562k973416k885118k709326
4591H5043599k042116j830394j568133j520761j094196r34366j035657m28914
$$ plain form
4644 229512293 246417339 267314810 293148697 324601580 359255044 395039946 429698309
4637 429698309 458551510 475524067 477963794 464845657 436703182 401386454 367107939
4630 367107939 336427223 309421775 286567999 266869427 250158601 235544291 222634813
4623 222634813 210912742 200902642 193068992 186712444 181834151 178318457 175896483 173740977
4615 173740977 171140558 168084854 164197992 159392667 154599883 149563209 145099756 141282670
4607 141282670 137726449 134583574 131567822 128154895 124690293 120577101 116372394 112435013
4599 112435013 108436151 104323551 100239645 96479021 93611459 90638043 87752925 85043599
4591 85043599 83001483 81171089 79602956 78082195 76987999 76053633 75017976 74589062
4583G4589062q3742K81612P14734O92443N99917P35105M59189J75147K94974n31202
4573G7927239k45189l2323j30451J12566L03168Q41751J169248J449086J644305
4564H3039400K286597K781543K638660K667809J835775N67177o48050k425626
4556I2743285l853113m996705m803248l951113l445033l207906k068123k366307
4548F4051737k130469j842115j528052j029441j006715p44073p4321n7819l97417
4539E5241315J93913O24586O68940R23751J537181J301745J841098K274897K217188
4530F6824614K758595K784774K635850K806490K572691K013889J507079J231685
4522H5135667J505633J080275J364165J762256J597940K029149K364632K504452
$$ plain form
4583 74589062 74505320 74786932 75501666 76194109 76794026 77529131 77988320 78163467 78458441 77927239
4573 77927239 77682050 77649727 77519276 77631842 77935010 78776761 79946009 81395095 83039400
4564 83039400 85325997 88107540 90746200 93414009 95249784 95816961 95168911 92743285
4556 92743285 88890172 83893467 79090219 75139106 71694073 68486167 66418044 64051737
4548 64051737 61921268 60079153 58551101 57521660 56514945 55770872 55696551 55638732 55241315
4539 55241315 55435228 56059814 56728754 57652505 59189686 60491431 62332529 64607426 66824614
4530 66824614 69583209 72367983 75003833 77810323 80383014 82396903 83903982 85135667
4522 85135667 86641300 87721575 89085740 90847996 92445936 94475085 96839717 99344169
4514I9344169L410496L699326M359710M734582N359894N824149O701333Q282321
4506A41715980R874272J2000508J4817831J8510170K2402633K6271949K7987747
4499B73581090K7269282K5832078K0490120R526569j864563j4750383k6406262
4492C13677931l0588489k8483425k5002636k1348073j8030362j5740158j3447437
4485A61037351j2351703j1102475j0146717r112440q269534p030768o060606n653624
4477I1309484n029394m387808l954569l538378l152126k382231k766923k307738
4469F3790317j640517k157234j573277r57198j016446q86802k89579J30416L55042
4460E5754722P99246J037833J108353J070265O64825M02049k49800r08241j778388
$$ plain form
4514 99344169 102754665 106453991 110813701 115548283 120908177 126732326 133433659 141715980
4506 141715980 151590252 163590760 178408591 196918761 219321394 245593343 273581090
4499 273581090 300850372 326682450 347172570 356699139 354834576 340084193 313677931
4492 313677931 283089442 254606017 229603381 208255308 190224946 174484788 161037351
4485 161037351 148685648 137583173 127436456 118324016 110054482 103023714 96963108 91309484
4477 91309484 86280090 81892282 77937713 74399335 71247209 68864978 66098055 63790317
4469 63790317 62149800 59992566 58419289 57462091 56445645 55558843 55269264 55399680 55754722
4460 55754722 56553968 57591801 58700154 59770419 60435244 60837293 60587493 59679252 57900864
4451E7900864k084026j888626j756920j808314j396434o16145l4210M3967K91238
4442D8651394K80072L04689l87654r61838j619413j821346k265739k228936j821521
4433C8129708j464191j277353j128534j220744p14032o20520q51844n95038p30796
4424B9526656k51075j49108k99570K10539L52964J41036O31139Q54685N03775
4415C1521041J83473p029N1257p40100q94287o54702q68267p37693k01765J67384
4405B7819312J33496J31777K32512K47668J01799K31113N127j55098j039729j212478
4395B6495499r40657n32755o72159m55716l69476o08299l13651o69566n24091
4386B1409129m81032r74446n85794p43524l35502o92054l43535p5508j51333K8629
$$ plain form
4451 57900864 55816838 53928212 52171292 50362978 48966544 48350399 48316189 48360156 48651394
4442 48651394 48931466 49236155 48848501 47886663 46267250 44445904 42180165 39951229 38129708
4433 38129708 36665517 35388164 34259630 33038886 32324854 31704334 30852490 30257452 29526656
4424 29526656 29275581 29126473 28826903 29037442 29390406 29531442 30162581 31017266 31521041
4415 31521041 31704514 31697485 31748742 31008642 30114355 29459653 28591386 27853693 27651928 27819312
4405 27819312 27952808 28084585 28317097 28564765 28666564 28897677 28902804 28747706 27707977 26495499
4395 26495499 25554842 25022087 24349928 23894212 23524736 22916437 22602786 21933220 21409129
4386 21409129 20928097 19953651 19367857 18624333 18288831 17596777 17253242 17177734 17026401 17055030
4376A7055030m13889k4615j60222m31108j80646j93121k10429l62076j94422j24036
4366A4760466j20303J78786k02491m65532k45778M8072J3479q659j60746p6370
4356A3720924j72580k72230l75443o0737n07430m24590R7971p8325k93860j94364
4346A1439336j0312K9477l42438O2829j43049R0966k4639l23854K1075R0920J03124
4335A0993435N8345j3109M5596j3694j17662k2182j62383k48078l88335l52732
4325I779201M2478l42878k08109j35465j42603o68k22073j67379l54275k33463
4315H014766J94499j13143j96142J28211L80038R445j59917j39356j43149Q1149
4305H056401M6387k01063k93884j99501J67157M03718k44323L6942k50643L4346
$$ plain form
4376 17055030 16641141 16616526 16456304 16025196 15844550 15651429 15441000 15078924 14884502 14760466
4366 14760466 14640163 14818949 14616458 14150926 13905148 13953220 13966699 13958040 13797294 13720924
4356 13720924 13548344 13276114 12900671 12839934 12332504 11907914 12005885 11927560 11633700 11439336
4346 11439336 11429024 11458501 11116063 11178892 11035843 11126809 11102170 10778316 10799391 10890311 10993435
4335 10993435 11051780 11038671 11084267 11070573 10952911 10930729 10768346 10520268 10131933 9779201
4325 9779201 9821679 9478801 9270692 9135227 8992624 8991956 8769883 8602504 8248229 8014766
4315 8014766 8209265 8096122 7899980 8028191 8408229 8417674 8257757 8118401 7975252 8056401
4305 8056401 8102788 7901725 7607841 7408340 7575497 7979215 7734892 7771834 7521191 7555537
4295G555537J49041P2858k55017m227J42951P7398q0503Q9902k96513j16866N9881
4284G394442j44581j69663j9383j72921j16656j3553p4011j5582M7847j49619
4274F566320k9083k03640k03821J22205N4985l0890k03774Q6497J35254q0362
4264F213691K33189j04940j96389K62885L8202N0611j09021j06197J64415J89664
4254F636110k01247j63091K78396J13734Q6846Q046j53442j05159k16409R0391
4244F374175J66580M2697j01729J44703J98335k583M4127K44441k36111j10705
4234F763930n5021j5549K30194J76972J22982L26004M10956M00254M40910M86437
4224I288069L30662K16818L48925L92519J39831L86610J14224m4512j09439l35325
$$ plain form
4295 7555537 7704578 7777436 7522419 7518192 7661143 7738541 7658038 7747940 7451427 7334561 7394442
4284 7394442 7249861 7080198 7060815 6887894 6771238 6757685 6683674 6668092 6715939 6566320
4274 6566320 6537237 6333597 6129776 6251981 6306966 6276076 6072302 6158799 6294053 6213691
4264 6213691 6446880 6341940 6145551 6408436 6446638 6497249 6388228 6282031 6446446 6636110
4254 6636110 6434863 6271772 6550168 6663902 6750748 6758794 6605352 6500193 6283784 6374175
4244 6374175 6540755 6583452 6481723 6626426 6824761 6822178 6866305 7110746 6874635 6763930
4234 6763930 6708909 6693360 6923554 7100526 7223508 7549512 7960468 8360722 8801632 9288069
4224 9288069 9618731 9835549 10184474 10576993 10716824 11103434 11217658 11173146 11063707 10728382
4214A0728382j53051m24625n18859l39076j11989j10534o2445r6502o92789r1903
4204H126609K85128J03107J45092o5035r2697J97411M51819M05366L55545K36644
4194A0148989N72636K44794P05700O05364M43698Q09970K84673M73571L56055
4185A4645450Q14015P40267J91972P88617M41608J64132m01815m5433m16985m00670
4175A6521158k57690k96442j9098k35446L16980L9954M25813N60536Q46969J049308
4165A8952042J029604J513113J421255J742709J700747J397305J555858R42813
4157C0255446P53073l31958m87217r48520j129757j226286j531388j397864j159546
4148B2795983j228336q76444r31491m66613R1588j52225K9307L83160N11184L18314
$$ plain form
4214 10728382 10575331 10150706 9631847 9292771 9180782 9070248 9007803 8911301 8218512 8126609
4204 8126609 8411737 8514844 8659936 8594901 8502204 8699615 9151434 9556800 9912345 10148989
4194 10148989 10721625 10966419 11672119 12277483 12721181 13531151 13815824 14289395 14645450
4185 14645450 15459465 16199732 16391704 17180321 17621929 17786061 17384246 17338813 16921828 16521158
4175 16521158 16263468 15967026 15947928 15712482 16029462 16069416 16495229 17055765 17902734 18952042
4165 18952042 19981646 21494759 22916014 24658723 26359470 27756775 29312633 30255446
4157 30255446 31008519 30676561 30189344 29240824 28111067 26884781 25353393 23955529 22795983
4148 22795983 21567647 20691203 19759712 19293099 19384687 19232462 19261769 19644929 20156113 20474427
4138B0474427N70369L45413M42575K33397J10694J35628q4436j28181j85534m91901
4128B1422451M8813J81138M64982M74591N05804L23808k5006j174J96725n6278
4118B3535854o82270k05284n27972k42495m38231o52602p53697l66718k76496
4109A9390089l45160k00149n64714k97608r1481J78072O1428K96254Q994L44010
4099A8779735K12070k52575l53814k30211m89267r96758m61485p18888r07825
4090A4580982m02392p63442o01803o66022l47353m3249k43332n24582L06049N3917
4080A1348773p3363L7537k31310J46588J24114J55698J18913K14451J31709K35864
4070A2208974O06004J42930J66835J33484L43776K99343k06693r1899k89520j86655
$$ plain form
4138 20474427 21044796 21390209 21832784 22066181 22176875 22312503 22228067 22099886 21914352 21422451
4128 21422451 21471264 21652402 22117384 22591975 23097779 23421587 23396581 23395407 23592132 23535854
4118 23535854 22853584 22648300 22120328 21877833 21439602 20787000 20033303 19666585 19390089
4109 19390089 19044929 18844780 18280066 17982458 17890977 18069049 18130477 18426731 18435725 18779735
4099 18779735 18991805 18739230 18385416 18155205 17665938 16669180 16207695 15488807 14580982
4090 14580982 14178590 13415148 12813345 12147323 11799970 11756721 11513389 10988807 11294856 11348773
4080 11348773 11275410 11312947 11081637 11228225 11352339 11508037 11626950 11841401 11973110 12208974
4070 12208974 12814978 12957908 13124743 13258227 13602003 13901346 13694653 13602754 13313234 13126579
4060A3126579p44387n89262l98899r04808n39584m14139l76841n21683l09076
4051H327900m19578l47452J29687k31631n09378O7012j51705m14244p3856J1784
4041F388539j9409j51016k61701r7045m1303l27404j31164J68890K19801j05054
4031E643134j40021O9473l05633n4494J17649j50186o7130k01587N8485r566R2951
4020E053075j78295k79670k35972j5846k13273J61614j35176k4205L19439O1916
4010D513607k33657j45556L08425j66739k51509K4544J40745J48002J34465k48589
4000D223738p2592J18277j69398j82063J74038L8137p4965O2381k72563q6417
3990C758573J28038K27866k04898Q2125M4967j52713j89978o3916k65j80485Q842
$$ plain form
4060 13126579 12382192 11792930 11394031 10489223 9949639 9535500 9158659 8636976 8327900
4051 8327900 7908322 7560870 7690557 7458926 6949548 7016560 6864855 6450611 6376755 6388539
4041 6388539 6369130 6218114 5956413 5859368 5818065 5490661 5359497 5528387 5748188 5643134
4031 5643134 5503113 5572586 5266953 5212459 5330108 5179922 5112792 4911205 4969690 4960124 5053075
4020 5053075 4874780 4595110 4359138 4343292 4130019 4291633 4156457 4132252 4451691 4513607
4010 4513607 4279950 4134394 4442819 4276080 4024571 4049115 4189860 4337862 4472327 4223738
4000 4223738 4151146 4269423 4100025 3917962 4092000 4130137 4055172 4117553 3844990 3758573
3990 3758573 3886611 4114477 3909579 3991704 4036671 3883958 3693980 3630064 3629799 3449314 3458156
3979C458156L711l1309Q0171r1154J10166L17869k08210p6488J2681l54458k3717
3968C197418l0020J15573r2246j895K29592l4813j86517p381l2101M4568J2718
3957C214896j20373m3378J3517J28969J01416J82512q4411j60224j03657q7874
3947C041393O8403J11489N5165P965j90888J39726J4890k89145O7141J73146P9009
3936C278294J8951j74979k11486k2150n6179r5427K64624J27553J7812K2481r0291
3925C079203L676m1598J77136m2814j60249L23120j45603K27871n160j20856n5342
3914C239384j50959n4711K99473J88228j18943J423j90204j45458M19242K71011
3904C758486l04045j76366Q1327o7036K35262L5024k30405j09437J50279N1851
$$ plain form
3979 3458156 3461867 3430558 3510729 3419575 3529741 3847610 3639400 3562912 3575593 3221135 3197418
3968 3197418 3167398 3282971 3190725 3188830 3418422 3383609 3197092 3189711 3157610 3202178 3214896
3957 3214896 3094523 3051145 3064662 3193631 3295047 3477559 3393148 3232924 3129267 3041393
3947 3041393 3109796 3221285 3276450 3284415 3093527 3233253 3248143 2958998 3026139 3199285 3278294
3936 3278294 3297245 3122266 2910780 2888630 2832451 2737024 3001648 3129201 3147013 3169494 3079203
3925 3079203 3082879 3041281 3218417 3175603 3015354 3338474 3192871 3420742 3415582 3294726 3239384
3914 3239384 3088425 3033714 3333187 3521415 3402472 3403895 3213691 3068233 3487475 3758486
3904 3758486 3454441 3278075 3359402 3292366 3527628 3562652 3332247 3222810 3373089 3424940
3894C424940K08584k22285N3152L71839j81205j41157K43864L40153j77800j24906
3884C795179M1900o958q109o0574O6773J64530K20752M0620j45700m6783j2914
3873D048716j30119J26856o2202P3507J83173j17931k48106O8777K42038M2821
3863D227530K63452l1251O2166j43660j04633M0545P9528n7086J81665j10539
3853D407717N634q2466J26381l4371J20670J85393L8407R5223J34786j4315j60544
3842D822515P3858J99813k3779J07156J2758l1709M3598k77027m01462L49383
3832D875104P0875l78603O9481J33906n1254m06022P1424K63524j80897m6041
3822D421497O8094j09191K1737j49431K03148K14817O1622l17760P8232K03308
$$ plain form
3894 3424940 3633524 3411239 3464391 3836230 3655025 3513868 3757732 4097885 3920085 3795179
3884 3795179 3837079 3830121 3822012 3761438 3828211 3992741 4213493 4254113 4108413 4061630 4048716
3873 4048716 3918597 4045453 3983251 4056758 4239931 4122000 3873894 3942671 4184709 4227530
3863 4227530 4490982 4459731 4521897 4378237 4273604 4314149 4393677 4336591 4518256 4407717
3853 4407717 4413351 4330885 4457266 4422895 4543565 4728958 4767365 4862588 4997374 4983059 4822515
3842 4822515 4896373 5096186 5072407 5179563 5192321 5160612 5204210 4927183 4525721 4875104
3832 4875104 4945979 4567376 4636857 4770763 4719509 4313487 4384911 4648435 4467538 4421497
3822 4421497 4489591 4380400 4402137 4252706 4455854 4670671 4732293 4414533 4492765 4696073
3812D696073o1224k12150q0852j41115K80011l22734K25227J40472k50867M17055
3802D689896j1621J00687l60890l5990j55471j21288J17591k03513J67750N5459
3792D242610k49286K8333r7195n5740j36956K14818J60651j78052J63825K03695
3782D296703k92250Q6722K20180P3560M3331k00277j36659q9630K45265P0942
3772D317887J10536l4318j64902J78916n3031L28170p2347j40516K43671j93383
3762D520683j0396l9254l77726L9404L91354p5985l38564M77979J99804k99213
3752D488086j53440j80508Q8989M0939Q8072K59315R8807j08220m23883K7296
3742D225453j34630o9601N17467k33136j77209j61440n8050M6109K16413n8981
$$ plain form
3812 4696073 4634849 4422699 4341847 4200732 4480743 4158009 4383236 4523708 4272841 4689896
3802 4689896 4678275 4778962 4418072 4382082 4226611 4105323 4222914 4019401 4187151 4242610
3792 4242610 3993324 4021657 3924462 3868722 3731766 3946584 4107235 3929183 4093008 4296703
3782 4296703 4004453 4091175 4311355 4384915 4428246 4227969 4091310 4001680 4246945 4317887
3772 4317887 4428423 4394105 4229203 4408119 4355088 4683258 4610911 4470395 4714066 4520683
3762 4520683 4510287 4471033 4093307 4132711 4524065 4448080 4109516 4587495 4787299 4488086
3752 4488086 4334646 4154138 4243127 4284066 4372138 4631453 4730260 4622040 4198157 4225453
3742 4225453 4090823 4021222 4538689 4305553 4128344 3966904 3908854 3954963 4171376 4112395
3732D112395R1431q9145K5777J38821m5334k81810k77003K34520J44272k71527
3722C782397K7744l5488j51498r1922n0002p2857l964n3656j08219K12522J25539
3711C580596K12157M5424k80457j64403j21681J22169J82393J72619Q9728R3626
3701C932171Q5149j77981j02701j56142J76766j88864r8895k5405L26698q7392
3691C683404k77745K717R2324k40503o3029r9574j53206K61273p4190j26914L43438
3680C347995J60939j67201R7213R5701k30378n3274J14920j9104J60884r2289
3670C415406j71459L751j99525J63338K19403n1791N630j36686K1915q338K06582
3659C468226j2998l10680k74540K65083J03815l3985K7641J81884J91721j51400
$$ plain form
3732 4112395 4203826 4114681 4140458 4279279 4233945 3952135 3675132 3909652 4053924 3782397
3722 3782397 3810141 3774653 3623155 3531233 3481231 3408374 3404410 3350754 3242535 3455057 3580596
3711 3580596 3792753 3838177 3557720 3393317 3271636 3393805 3576198 3748817 3838545 3932171
3701 3932171 4017320 3839339 3736638 3580496 3757262 3568398 3469503 3444098 3770796 3683404
3691 3683404 3405659 3408376 3500700 3260197 3197168 3097594 2944388 3205661 3131471 3004557 3347995
3680 3347995 3508934 3341733 3438946 3534647 3304269 3250995 3365915 3346811 3507695 3415406
3670 3415406 3243947 3247698 3048173 3211511 3430914 3379123 3384753 3248067 3269982 3261644 3468226
3659 3468226 3455228 3144548 2870008 3135091 3238906 3204921 3232562 3414446 3606167 3454767
3649C454767k43617L31044j16253j74924J0709j01442J76230k11297P7730J17275
3639C320222j47495K3994r2440R6232n7264J45178K57395j11319J65687P8767
3629C678957k85938k96976J63781K14079J2700j96486N4298J64669L66730j91933
3619C683881k68561j26777J08676K07616R6221l07679o9509k0851j87848L88626
3609C503795K6946J11796J32880j71354K26988j50516Q3437k34454r4152J6397
3599C451763J93806Q3845p5717m6726k8740K84431k6368K04927Q31L8084K534
3588D082670O1841j27610K82800j08291l2726o9019J53209K6027J9504R3517O7431
3577D449353n0565K0188J21905k68640K92625M10781j06257j48402l69801J12442
$$ plain form
3649 3454767 3211150 3542194 3425941 3251017 3261726 3160284 3336514 3125217 3202947 3320222
3639 3320222 3172727 3196721 3104281 3200513 3143249 3288427 3545822 3434503 3600190 3678957
3629 3678957 3393019 3096043 3259824 3473903 3486603 3290117 3344415 3509084 3875814 3683881
3619 3683881 3415320 3288543 3397219 3604835 3701056 3393377 3323868 3303017 3115169 3503795
3609 3503795 3530741 3642537 3775417 3604063 3831051 3680535 3763972 3529518 3435366 3451763
3599 3451763 3645569 3729414 3653697 3606971 3578231 3862662 3836294 4041221 4042052 4080136 4082670
3588 4082670 4144511 4016901 4299701 4191410 4158684 4089665 4242874 4268901 4288405 4381922 4449353
3577 4449353 4398788 4418976 4540881 4272241 4564866 4975647 4869390 4720988 4351187 4463629
3567D463629J28898J73616J22596J71438j03481j18362J52133r1951o1261L49575
3557E186830M509N4539L42650k15725o7228J24583L68928J28771K7527J18282
3547F073666o0548k61198O5828K15757K67784q714J70892J8459q5538Q0884m8063
3536F429209n317M53791j19694k9969K96963j4128R9025K11201L03111J69739
3526G793931m13071J01569M72833J55836p9873K54974M91098j4586M33466O2809
3516I258986L7895L70428K50599L69736k76835J22399K87629J26013K06065M9072
3506A0801987J03701L14238M02321L47341J40490n7643J99599N22968N16859K07187
3496A3499048L21657L88119K80350M71899L59514L00058N89118M89234L40993
$$ plain form
3567 4463629 4592527 4766143 4888739 5060177 4956696 4838334 4990467 4898516 4837255 5186830
3557 5186830 5191339 5245878 5588528 5372803 5305575 5430158 5799086 5927857 5955384 6073666
3547 6073666 6013118 5751920 5817748 6033505 6301289 6292575 6463467 6481926 6396388 6477272 6429209
3536 6429209 6423892 6877683 6757989 6728020 7024983 7010855 7109880 7321081 7624192 7793931
3526 7793931 7380860 7482429 7955262 8111098 8031225 8286199 8777297 8762711 9196177 9258986
3516 9258986 9296881 9667309 9917908 10287644 10010809 10133208 10420837 10546850 10752915 10801987
3506 10801987 10905688 11219926 11622247 11969588 12110078 12052435 12252034 12775002 13291861 13499048
3496 13499048 13820705 14208824 14489174 14961073 15320587 15620645 16209763 16698997 17039990
3487A7039990M45946M40662P81627N01114P41050Q32628R56885J073736O46468
3478B3460106R36651J300467J625139J459188J545276J715032J526502J716055
3470C5284416J651409J832263K370199K004630J742507J429707J081338P14183
3462D8110652K06195r637l50027n52326p84211r58335r81259j195496j069716
3453D2415840j441816j597373j593186j603829j191391j174222j108460j081237
3445C1624326q63939q96287r01042k53149m67139l99590n20054o71192n18024
3436B6133910l84622j83574j18602m05090j61349n8421O0365K21034L46166O44168
3426B6093985K63642L85964N66550O8784m30058q94941j144569j138418j029594
$$ plain form
3487 17039990 17485936 17926598 18708225 19209339 19950389 20783017 21739902 22813638 23460106
3478 23460106 24396757 25697224 27322363 28781551 30326827 32041859 33568361 35284416
3470 35284416 36935825 38768088 41138287 43142917 44885424 46315131 47396469 48110652
3462 48110652 48316847 48307210 47957183 47404857 46620646 45662311 44681052 43485556 42415840
3453 42415840 40974024 39376651 37783465 36179636 34988245 33814023 32705563 31624326
3445 31624326 30760387 29864100 28963058 28709909 28242770 27843180 27323126 26651934 26133910
3436 26133910 25749288 25565714 25447112 25042022 24880673 24822252 24882617 25103651 25449817 26093985
3426 26093985 26357627 26743591 27310141 27378925 26948867 26053926 24909357 23770939 22741345
3417B2741345p31617q86905r24414o08088m74464l80046n78442m40675m34310
3408A7282384n07229j99644k40232l74920l79621l74814j42603m8926n7509J65576
3398A5122462j01473N5134L59333J22840J28244R9618Q7605n2431k43244l25183
3388A5252905l43365o41170n85797k56794l19470l07416k74821l19933m1797l31156
3378A1831186k10165j52653K636l27592k32030j10253j74762k54795o9247j86181
3368A0116144m11108O2436j66186r0310k46287j04794M4534J18601l79258o2169
3358H881603J138j10156k61574J70687o668j68067j20152m3379l2335o5647l18904
3347G926546p1697o8778k35599M7258m8861j28177j25496J93017k50460J05155
$$ plain form
3417 22741345 22009728 21122823 20198409 19590321 19115857 18735811 18157369 17716694 17282384
3408 17282384 16775155 16575511 16335279 15960359 15580738 15205924 15063321 15014395 14956886 15122462
3398 15122462 15020989 15076123 15435456 15558296 15686540 15786158 15873763 15821332 15578088 15252905
3388 15252905 14909540 14268370 13682573 13425779 13106309 12798893 12524072 12204139 12162342 11831186
3378 11831186 11621021 11468368 11471004 11143412 10911382 10801129 10626367 10371572 10302325 10116144
3368 10116144 9705036 9767472 9601286 9510976 9264689 9159895 9204429 9323030 8943772 8881603
3358 8881603 8882741 8772585 8511011 8681698 8675030 8506963 8386811 8343432 8311097 8245450 7926546
3347 7926546 7854849 7786071 7550472 7597730 7548869 7420692 7295196 7488213 7237753 7342908
3337G342908p5777r5878M1526J11181L4038N4878l06977j30320l86484n2668K37562
3326F773989j74600O012k68219J14690J08685J10566j35704j18049J85085n1930
3316F550525m2078Q6775k47277j14567K0693o29q173j72377J1381j46955j73009
3305E764309K76559j13842o2498q3270J70219k42859O5968p8081k98764j8565
3295E379176J47229L03086l71676O2009J77489j29612j02423j4979p0350r8967
3285E280982p2451J32776K14565K73108j63842j6420r3871j00859o0406j3660
3275E379922K3327M1330N7116l25819j78022M955J23375o0716J36298j70360j25910
3264D905496k00592k41956R3983M5013P1162o2146j25422P0028l64349K109M5081
$$ plain form
3337 7342908 7267131 7171253 7212779 7323960 7357998 7412876 7105899 6975579 6589095 6536427 6773989
3326 6773989 6599389 6605401 6337182 6451872 6560557 6671123 6535419 6417370 6602455 6550525
3316 6550525 6508447 6595222 6347945 6233378 6254071 6253442 6245269 6072892 6084273 5937318 5764309
3305 5764309 6040868 5927026 5864528 5781258 5951477 5708618 5774586 5696505 5397741 5379176
3295 5379176 5526405 5829491 5457815 5519824 5697313 5567701 5465278 5450299 5379949 5280982
3285 5280982 5208531 5341307 5555872 5828980 5665138 5648718 5554847 5453988 5393582 5379922
3275 5379922 5403249 5444579 5501695 5175876 4997854 5002809 5126184 5065468 5201766 5031406 4905496
3264 4905496 4704904 4462948 4556931 4601944 4673106 4610960 4485538 4555566 4191217 4193326 4238407
3253D238407K22392l0047Q7187K89312p7583J52756k2567q3238k43593J36129
3243D669155k10786j6932l34222k92572N5541n9824M4486K472k8555Q0618j17226
3232C792155k1871k41803n4467p3908j02241N84810j20820N0570k5898p8213J06812
3221C815126J21669j86573j9254n1898K8735L48749k14267k54132j39462J49144
3211C597837J17743O9632l30245J84487J83585p441J22729J55925P3281k02527
3201C965006Q158Q9778j55479j31405Q4568K02085J07797p6071N1316j32993n8786
3190C953974J91407K04635M5362O0822k15640k85870K04004J58418K88493j57844
3180D447761q0667J24376q6332O267m6236L07527K68794j9266L12291q2718L46983
$$ plain form
3253 4238407 4460799 4430752 4517939 4807251 4729668 4882424 4859857 4776619 4533026 4669155
3243 4669155 4458369 4441437 4107215 3814643 3870184 3810360 3854846 3857318 3828763 3909381 3792155
3232 3792155 3770284 3528481 3474014 3400106 3297865 3882675 3761855 3812425 3786527 3708314 3815126
3221 3815126 3936795 3750222 3730968 3679070 3707805 4056554 3842287 3588155 3448693 3597837
3211 3597837 3715580 3785212 3454967 3639454 3823039 3815598 3938327 4094252 4167533 3965006
3201 3965006 3973164 4062942 3907463 3776058 3860626 4062711 4170508 4094437 4145753 4012760 3953974
3190 3953974 4145381 4350016 4395378 4456200 4240560 3954690 4158694 4317112 4605605 4447761
3180 4447761 4367094 4491470 4405138 4411405 4365169 4672696 4941490 4922224 5234515 5151797 5498780
3169E498780j20711M8513O1307J19853L73967J26800l8039K89658O1723l128K46809
3158F665532K08853J44720M05064L16832K23752K38149O4108K42596J63912n7331
3148H616187K61857L96432R8199l4470L0330L11731l5196L67374L61572K10842
3138A0584858k3945L64675J87390J14686L10242M32762J46363N02234N58714M32012
3128A3609991P53182O80810M68566N83895M98283M73158L30583K81032J70835
3119A7850335j03557j09212k91436m45028k56116j76909l16523l40290L94011
3110A6205275j91841m6783J35315J98643K99355L27290J08229M62153M03874J99366
3100A8100876L74230L08739K94383M52190L47820K94461N8217l13132k19812j5285
$$ plain form
3169 5498780 5378069 5426582 5487889 5607742 5981709 6108509 6070470 6360128 6421851 6418723 6665532
3158 6665532 6874385 7019105 7424169 7741001 7964753 8202902 8267010 8509606 8673518 8616187
3148 8616187 8878044 9274476 9372675 9338205 9368535 9680266 9645070 10012444 10374016 10584858
3138 10584858 10560913 10925588 11112978 11227664 11537906 11970668 12117031 12619265 13177979 13609991
3128 13609991 14363173 15043983 15512549 16096444 16594727 17067885 17398468 17679500 17850335
3119 17850335 17746778 17637566 17346130 16901102 16644986 16468077 16151554 15811264 16205275
3110 16205275 16013434 15966651 16101966 16300609 16599964 16927254 17035483 17497636 17901510 18100876
3100 18100876 18475106 18783845 19078228 19530418 19878238 20172699 20230916 19917784 19697972 19682687
3090A9682687l12873m13237m29913l84337m54714m40026n53104k52403n13418
3081A5928662l80872K0944j87172l29590M0455L1965j86922Q9056j64069r6048
3071A4766409j94578j75113k25061j44018n11162l77763j99309m57547k32906
3062A2248952n51452o24056k0299n48479m88001n01878k45477j39076j07560l51938
3052H670736m19106k73346M1412o1779j39308m64684k54342M4162l74612j42526
3042F626607j7347k90999M2345j34043m32437k63769K49881j12951k60006l44307
3032E062974k55994j87493K14611m004k84774m76009O3156j67528J8403p172k22945
3021C753225K48122r1486j57808j06765O783j6055j9905k56480j27887K05998
$$ plain form
3090 19682687 19369814 18956577 18526664 18142327 17687613 17247587 16694483 16442080 15928662
3081 15928662 15547790 15568734 15381562 15051972 15092427 15124392 14937470 15026526 14862457 14766409
3071 14766409 14571831 14396718 14171657 14027639 13516477 13138714 12939405 12481858 12248952
3062 12248952 11697500 11073444 11053145 10504666 10016665 9514787 9269310 9130234 9022674 8670736
3052 8670736 8251630 7978284 8019696 7957917 7818609 7353925 7099583 7143745 6769133 6626607
3042 6626607 6609260 6318261 6360606 6226563 5794126 5530357 5780238 5667287 5407281 5062974
3032 5062974 4806980 4619487 4834098 4830094 4545320 4069311 4132467 3964939 3983342 3976170 3753225
3021 3753225 4001347 3909861 3752053 3645288 3652071 3636016 3616111 3359631 3231744 3437742
3011C437742Q3447O085q440Q1407j33605k35299o7029k42197j33236J69099P6494
3000C034468k6703l94393O2142k24823j5087J92855r792k10067j65612K37958
2990B480946j57445O7030M2507M8319l1601j28911o1067m6825j70529L7240m8491
2979B031173J28668R5357Q3696j46426j31165j4295j08011R586R2775j65253l66427
2968A509678L35449K60515j5415Q7315k57537N7916j15776K6551j62583k04242
2958A521871k41084J55387o2057J90315o1473J73076M6075l02274j8923n234J16865
2947A512544J55787k64807j30316J47412j05000m8076R063j55711M6644J31073
2937A298613R438o7684J72314r971k72231K7874p440M0949Q883j73128j70415
$$ plain form
3011 3437742 3521189 3527274 3518834 3600241 3466636 3231337 3164308 2922111 2788875 2957974 3034468
3000 3034468 3007765 2613372 2675514 2450691 2435604 2628459 2618667 2408600 2242988 2480946
2990 2480946 2323501 2390531 2433038 2481357 2449756 2320845 2259778 2212953 2042424 2079664 2031173
2979 2031173 2159841 2255198 2338894 2192468 2061303 2047008 1938997 1948583 2041358 1876105 1509678
2968 1509678 1845127 2105642 2090227 2177542 1920005 1977921 1862145 1888696 1726113 1521871
2958 1521871 1280787 1436174 1374117 1564432 1502959 1676035 1722110 1419836 1400913 1395679 1512544
2947 1512544 1668331 1403524 1273208 1420620 1315620 1267544 1276607 1120896 1167540 1298613
2937 1298613 1308051 1240367 1412681 1402710 1130479 1158353 1150913 1191862 1200745 1027617 857202
2926H57202J27371J86845k8168j69403p021J97200j01238j92270J74388J40178
2916A185084j70711J06184K06368k29857M3585l02802q8304Q559K7252L58260
2906A143618q5786j6027L6822j48256K6382j45266o3172l09585L6178K07776J81490
2895H64174J66120j53862O3703j2634J81921P525n5220q4414o2765Q7214L4344
2884A036106k61799k675K67056R0319j57563j45637j67744j67678J65743J10406
2874G66534K88377m12152k39881R3250K08769K73641j09914k96512L3453J67439
2864G73004J04031j36793k68809L04938K5834R9717k1725k16610q2751P0958J86289
2853H38083k20025N6096K47844J7936o3698k0471m01251K6313K85133K5170N2846
$$ plain form
2926 857202 984573 1171418 1143250 973847 966826 1164026 1062788 870518 1044906 1185084
2916 1185084 1014373 1120557 1326925 1097068 1140653 837851 749547 758106 785358 1143618
2906 1143618 1057832 1041805 1078627 930371 956753 811487 748315 438730 474908 682684 864174
2895 864174 1030294 876432 940135 927501 1109422 1116947 1061727 977313 914548 1001762 1036106
2884 1036106 774307 771632 1038688 1129007 971444 825807 658063 490385 656128 766534
2874 766534 1054911 642759 402878 496128 704897 978538 868624 572112 605565 773004
2864 773004 877035 740242 471433 776371 802205 901922 880197 663587 580836 651794 838083
2853 838083 618058 674154 921998 939934 876236 855765 454514 480827 765960 791130 843976
2842H43976k59177n6444K40076M4884j27968K7666k3576j31308J06399j23958
2832E40570N8961L5766J18163Q7099j54258j90448L9294n1774n0522J34195J74518
2821G41564j00107j01770N8469J06019r6008j76081J07483J65101O7058j91530
2811E80198N8704K87206j54667K3786K88332j89912m0260J90545q6631k08613
2801G48688r4277J41562j41221j95456L34189j20644l45486J45948J12188K4796
2791F10287j25805l92447K84960K44252P4852k2303k66927K97772l0206k43421
2781D31014O9361P5229K0670j6485P2230K6015k47741m9978N8296P6773R1841
2770F07225K75861q1049l37509j31225q4444K25512M9657P2535r5790j79423J6160
$$ plain form
2842 843976 584799 528355 768431 813315 685347 713013 689437 558129 664528 540570
2832 540570 599531 635297 753460 840559 686301 495853 535147 483373 432851 567046 741564
2821 741564 641457 539687 598156 704175 608167 432086 539569 704670 771728 580198
2811 580198 638902 926108 771441 795227 1083559 893647 853387 1043932 957301 748688
2801 748688 654411 795973 654752 459296 793485 672841 327355 473303 585491 610287
2791 610287 484482 92035 376995 621247 696099 673796 406869 704641 674435 431014
2781 431014 500375 575604 596274 579789 652019 678034 430293 380315 438611 515384 607225
2770 607225 883086 802037 464528 333303 248859 474371 524028 596563 500773 321350 337510
2759C37510O8457O6899O7862l0653j27759p5005J42573J7635p2261j98813k9275
2748A67170m7370K26899J11869L05963l91171m7850J69518l943j620J43385k15061
2737D17789l0287L06163r7907k23553k30022L80417J63906O9323q2780k9045m6070
2726E97934l823j17453P288L47571k33795o4928k6757J74914o1914k14873J26528
2715E30692l07656R1636j07325J16967L7532j5460K17594j12891J21504K1955
2705E94548l65353J18563j74279P9652J10865r7742R7625k0511K89221k66904
2695C65685m8073J97604k40123J09932k01189P12M76267K6105l392j09435k52035
2684C22058j59215R243J77990j04572P8871j94693J47184J1710l450r9345q313
$$ plain form
2759 337510 405967 472866 540728 510075 382316 307311 449884 467519 395258 196445 167170
2748 167170 119800 346699 458568 764531 373360 325510 495028 491085 489465 632850 417789
2737 417789 387502 693665 595758 372205 142183 522600 686506 755829 673049 644004 597934
2726 597934 594111 476658 483946 831517 597722 532794 506037 680951 619037 404164 530692
2715 530692 223036 314672 207347 324314 361846 346386 563980 451089 572593 594548
2705 594548 229195 347758 173479 253131 363996 266254 363879 343368 632589 365685
2695 365685 317612 515216 275093 385025 183836 184548 660815 686920 683528 574093 322058
2684 322058 162843 172086 350076 245504 324375 129682 276866 288576 285126 185781 177468
2673A77468J74432q502k975j5847j01154n8489J03489k75547J6156J28946N8669
2662A96646k9164r2433K91408J6149o9195O6447k28709L9160j01091J78667j53184
2651A14701L42500m0760j40096l3634j38522R1367L4682J09698P2364M1300m58680
2640e080j13496K64262K00149l0002J55384k13478N9860o4539p385J26761j05224
2629B67212l2463l49767Q0872J32026K75347O2024m10410k6057N46860l61129
2619A84515j14480R8601k013j6554j64132L35085j23649n3263J34599n902n6413
2608B16394K39070K34959j820j75573k44687r3271J03631k46219J83777J73119
2598C89380r040j52759j0531J63868o3890J62773K53478o4554o9624k37545j07492
$$ plain form
2673 177468 351900 343398 340423 324576 223422 164933 268422 -7125 9031 137977 196646
2662 196646 167482 75049 366457 382606 313411 379858 151149 190309 89218 267885 114701
2651 114701 457201 416441 276345 242711 104189 195556 230238 339936 412300 453600 -5080
2640 -5080 -118576 145686 345835 315833 471217 257739 317599 253060 245675 372436 267212
2629 267212 234749 -115018 -34146 97880 373227 435251 24841 -1216 545644 184515
2619 184515 70035 168636 166623 150069 -14063 321022 197373 144110 278709 272807 216394
2608 216394 455464 690423 688603 513030 268343 175072 278703 32484 216261 389380
2598 389380 380340 227581 217050 380918 317028 479801 733279 668725 599101 361556 254064
2587B54064J16967N370l43052K18639r189J3829J67323J8279j0153m01045N9842
2576I0874K30899j2448r9374Q2363K22830j25870j41052m4500k57093J91171M3237
2565A81037O3142k52244j28277N2564M0246J36987j26039m6105N1810K7619l43994
2554c43254J10163K5468l7473L60252O5704K26569j52410j65542J62903J80213
2544D32593J2538l99154p0965k8681L7127K85408N9849J60481k64313p4900R1048
2533B41031q0545j73355L7666O3502L90926o1414J89006j3246l82993J52679J87484
2522E50741m13535j38946J8306k38950k19688M25105J21750K3699n2987k57140
2512a81645M04205P1096k93411j43950K78270J08967O284J58083P32l39374N1515
$$ plain form
2587 254064 371031 376401 33349 251988 242799 256628 423951 442230 432077 31032 90874
2576 90874 321773 309325 209951 292314 515144 389274 248222 203722 -53371 137800 181037
2565 181037 244179 -8065 -136342 -83778 -43532 93455 -32584 -78689 -26879 740 -343254
2554 -343254 -233091 -207623 -245096 115156 180860 407429 255019 89477 252380 432593
2544 432593 445131 45977 -24988 -53669 -16542 268866 328715 489196 224883 149983 241031
2533 241031 160486 -12869 24797 88299 479225 417811 606817 593571 210578 363257 550741
2522 550741 137206 -1740 16566 -222384 -442072 -16967 104783 128482 75495 -181645
2512 -181645 222560 293656 245 -143705 134565 243532 249816 407899 408631 69257 120772
2501A20772k0013j52394j2399J28176L55294K40437k37212j56447k745Q2989l8341
2490C08117J30377j56671l28568p3924L25514j56180j17163K19692J68153k04696
2480A14651K41095J65781r4467j16830k02437J8737J41242N7441m9376j22068
2470A53769J36149R9993l8144L9729k83538J36470j56412M7355J48312q1252R62
2459B03393k2010p9172j00434k31512R1427K85945j62244j2978K30927M6703r9165
2448A50880P5401j17690O8105K76295r3604j50858P5736m437k43269K6535L826
2437F6920Q7778K30916J825o1272K61350k57962m15426j8321L89912J82386K75371
2426G43477Q7236j62224l85913l4116R2439o5040K06113k1064j56352m9198O2414
$$ plain form
2501 120772 100759 -51635 -64034 64142 419436 659873 422661 266214 263469 346458 308117
2490 308117 438494 281823 -46745 -120669 204845 48665 -68498 151194 319347 114651
2480 114651 355746 521527 427060 310230 107793 126530 267772 325213 275837 153769
2470 153769 289918 389911 351767 391496 107958 244428 88016 135371 283683 202431 203393
2459 203393 181383 102211 1777 -229735 -138308 147637 -14607 -27585 203342 250045 150880
2448 150880 226281 108591 176696 452991 359387 208529 284265 279828 36559 63094 66920
2437 66920 154698 385614 387439 326167 587517 329555 -85871 -104192 285720 468106 743477
2426 743477 830713 668489 282576 248460 340899 275859 481972 460908 304556 255358 317772
2415C17772L7543j4248j34757K53067K47160j5414l08868J9007k05305J22541
2405C18498J87469L0988K10373p0268k51765J28398j09469L6845J03107k04438
2395C79738p3390J51153R3282P1389m602k30030J58675O5092k50589O5704M31520
2384H57942o2459r1192j06144J40918M403J6141o3946M365J04759j2849K31663
2373A023601j15884P5180Q3971K2514Q0073J40037L5973q4342R3398p8345M3650
2362A319826J41720L5968J92002L06499K2270L2539R3977J66254K99785K43216
2352B854056n77n6620L29449L55303J85846J67803L22994M16492M35609N76003
2342E586358P97299M40631R44303R21949P14598O67016Q16639J385987J456112
$$ plain form
2415 317772 355315 341067 206310 459377 706537 691123 382255 401262 195957 318498
2405 318498 505967 536955 747328 677060 425295 553693 444224 481069 584176 379738
2395 379738 306348 457501 550783 622172 617570 387540 546215 611307 360718 426422 857942
2384 857942 795483 704291 598147 739065 743468 759609 695663 700028 804787 791938 1023601
2373 1023601 907717 982897 1066868 1089382 1169455 1309492 1345465 1261123 1354521 1276176 1319826
2362 1319826 1461546 1497514 1689516 1996015 2018285 2050824 2144801 2311055 2610840 2854056
2352 2854056 2853479 2796859 3126308 3481611 3667457 3835260 4158254 4574746 5010355 5586358
2342 5586358 6383657 6824288 7768591 8690540 9405138 10072154 10888793 12274780 13730892
2333A3730892J246645J325118K064579L155790L692938N044537O408733N727243
2325D2396475O430542O633742L472005Q32904q79837o199571p639656n598789
2317C9447815m822236l862747l249900k684337k131305j705743j717931j825755
2309A7447861j079057j162143j273525q59085j323136j107584p86080n04189o88676
2300H664386m20088m44599n70752l38356j44987l56176m98695o56022j93937N5660
2290E096434j53158p2535j47576l05522m83914q850O7743p4518m35969l31697
2280C150438q9992r1940j01226K05985j92854l35766r4326k46668K63389P9697
2270B546737m39274J9203P316l1905k0028o7324q2182r2403k37201Q4014p4482
$$ plain form
2333 13730892 14977537 16302655 18367234 21523024 25215962 30260499 36669232 42396475
2325 42396475 48827017 55460759 58932764 59765668 58885831 52686260 45046604 39447815
2317 39447815 34625579 30762832 27512932 24828595 22697290 20991547 19273616 17447861
2309 17447861 16368804 15206661 13933136 13074051 11750915 10643331 9857251 9353062 8664386
2300 8664386 8244298 7799699 7228947 6890591 6745604 6389428 5890733 5234711 5040774 5096434
2290 5096434 4943276 4870741 4723165 4417643 3933729 3924879 3992622 3918104 3482135 3150438
2280 3150438 3060446 2968506 2867280 3073265 2880411 2544645 2450319 2203651 2467040 2546737
2270 2546737 2107463 2126666 2133982 2102077 2082049 2014725 1932543 1840140 1602939 1686953 1612471
2259A612471j7066j16828n2160J46808K7821J05418k78610M2713j28237j09552
2249A232778j12159J56485r3830p0079J53546J7618L1952j53455n6034O3456l03959
2238H66319j67134L33197J02859J7640K6143j20499j49302J40665P76n0906J07146
2227A106904j43355K85041n9867k38623M8933k53607k71549J09379J14600m161
2217F93695r0666J28174K06972j40574j46302L8533J91807L7196K870k63298j21641
2206E36766L3616O3821J45896P7162q8201R7152l39069l1170q2070k82972m3659
2195H7272K78397L8641j03865R1685j49459J39482J41572R1912j78644J9598r3542
2184C63049J48323K25871l32340l28537J70918Q1335j17387K0791J04664j36787
$$ plain form
2259 1612471 1595405 1478577 1426417 1573225 1601046 1706464 1427854 1470567 1342330 1232778
2249 1232778 1120619 1277104 1183274 1113195 1266741 1284359 1316311 1162856 1106822 1170278 866319
2238 866319 699185 1032382 1135241 1152881 1179024 1058525 909223 1049888 1050664 999758 1106904
2227 1106904 963549 1248590 1188723 950100 999033 745426 473877 583256 697856 693695
2217 693695 603029 731203 938175 797601 651299 689832 881639 918835 921705 658407 536766
2206 536766 570382 634203 780099 857261 769060 866212 527143 495973 413903 130931 87272
2195 87272 365669 404310 300445 392130 242671 382153 523725 615637 436993 456591 363049
2184 363049 511372 737243 404903 76366 247284 328619 211232 232023 336687 199900
2174A99900J38584q8649J79748j21879j00011K34754N1375K16973j26029j92961
2164C91805l00356K60033J60100k70901m8844P3370K8195M0584K61701k65658
2154C30029M2399P9566j79146L26558R3635j64715j32829l37296J6632K8657p2597
2143C0893K21003K15596j92011o9281j92853J79727M6808J2075O1068k77731p219
2132B8075o6716J20523K3403K27870j7215k07344R1537K85714q1920k05379M3932
2121B42480R8981j87879L15856o5297k07194K38958p9177m7861q02J11885j54854
2110B65096j73683n1777j17549o1911r0577K78048N5115J00329k97371o8450K30795
2099F8065p908r7905J93506p134J25091J03798j90231l3469K29992r924n5345
$$ plain form
2174 199900 338484 249835 429583 307704 207693 442447 493822 710795 584766 391805
2164 391805 91449 351482 511582 240681 191837 265207 293402 333986 595687 330029
2154 330029 372428 451994 272848 599406 693041 528326 395497 58201 74833 103490 30893
2143 30893 251896 467492 275481 206200 13347 193074 239882 251957 313025 35294 28075
2132 28075 -38641 81882 105285 333155 315940 108596 200133 485847 403927 198548 242480
2121 242480 341461 153582 469438 404141 196947 435905 356728 308867 308065 419950 265096
2110 265096 91413 39636 -77913 -139824 -230401 47647 102762 203091 -94280 -162730 68065
2099 68065 60157 -37748 155758 148624 273715 377513 187282 153813 383805 373881 318536
2088C18536k53870J39453m384r6189k5118q1228L15957N9243N0402p1892j87719
2077A63191l9769J27358j17275k72160J45304J23209J09065j58101r3209j46375
2067a58762n634L81337K78811l7343m39654P8106J28658J19277j33846l1428K56454
2056D35976K6619r635J32814K54814m3914l66723P6547k08352j69198q3332M954
2045E0570K35479l9254j81621l3088L15845Q5052k90797J64999P51K65327k63053
2034C10210k10640j69630K94485n6013l40637J17013K399k35456J92627K31725
2024A36083K73774j96163m6371K3412j95271P4060J69707r6751k83519o3806J1961
2013a92884K08196J22959k8053J36020k83246k22165m4359l4687J50649k8897
$$ plain form
2088 318536 64666 204119 199735 103546 78428 -2800 313157 372400 422802 350910 163191
2077 163191 123422 250780 133505 -138655 6649 129858 238923 80822 -12387 -158762
2067 -158762 -164396 216941 495752 458409 18755 96861 225519 344796 210950 179522 435976
2056 435976 462595 452960 585774 840588 796674 429951 506498 298146 128948 45616 50570
2045 50570 286049 246795 65174 32086 347931 432983 142186 307185 307936 573263 310210
2034 310210 99570 -70060 224425 168412 -172225 -55212 -52813 -288269 -95642 136083
2024 136083 409857 213694 167323 190735 -4536 69524 239231 142480 -141039 -204845 -192884
2013 -192884 15312 138271 110218 246238 -37008 -259173 -303532 -338219 -187570 -216467
2003b16467J73431l0007K63531J32578K11624k08959k40497k6991M7900j38846
1993c2703M5178N7010p7414L2273J39613K65226j63466n0297k28423P878K07476
1982B02351j6994j56587p2786J06245J55055L8569l30928J93913j25170p9758
1972h6090J6922M8496j8920j47651L10062J15887M4185k04024p0235J59562k07110
1961c8916j82069K68601L68279n73713r4225O5222J52642L72890O2877j92329
1951B09259K2084k44045P1743m9988J89882k75874N504K86954n0879L0050k32922
1940c8232K87264J36130k58772j41747Q1128R0324k91419J655J0906j44271L36171
1929F9137J30302N7467O2285l8309k00068J2659j64454J341M12890O0357k42369
$$ plain form
2003 -216467 -43036 -73043 190488 323066 534690 325731 85234 58243 106143 -32703
1993 -32703 12475 69485 -7929 24344 163957 429183 265717 215420 -13003 -5125 202351
1982 202351 185357 28770 -44016 62229 217284 255853 -75075 118838 -6332 -86090
1972 -86090 -69168 -20672 -39592 -187243 122819 238706 282891 78867 8632 168194 -38916
1961 -38916 -220985 47616 415895 -157818 -252043 -186821 -34179 338711 401588 209259
1951 209259 231343 -12702 59041 9053 198935 -76939 -71435 215519 164640 194690 -38232
1940 -38232 249032 385162 126390 -15357 65771 156095 -135324 -133669 -122763 -267034 69137
1929 69137 199439 256906 319191 280882 80814 93473 -70981 -69640 343250 403607 161238
1918A61238j54504n1680J78747p7197j21151K41051J79733l75068O6413K42069
1908B89651O3395n3529j89770J49010j03805q9157q5779l45605K13014J22077
1898c0498J08552K59611j22517l69858q6790K81574K65702k48398j41467J23997
1888C9908J83676J75495O6280k40923k14184q2275j0491K57626p0651j74903M23
1877g0019k64078K96160J79216l8022J0937j28241j47016l031P8256j15765J1653
1866a89950j67P1291j84488j5110m418J55039P6038J37622p7030k22650O8889
1855a84934J23803L65317N423j88819k65211J67273O7588J39116J1944k27440
1845A4060K7442L9583r3227R2101K16529K073k43922m1799J91308l3990L00551
$$ plain form
1918 161238 6734 -44946 133801 56604 -64547 176504 356237 -18831 47582 289651
1908 289651 353046 299517 109747 258757 154952 65795 -19984 -365589 -152575 -30498
1898 -30498 78054 337665 215148 -154710 -241500 40074 305776 57378 -84089 39908
1888 39908 223584 399079 465359 224436 10252 -72023 -82514 175112 104461 -70442 -70019
1877 -70019 -334097 -37937 141279 103257 114194 -14047 -161063 -164094 -85838 -201603 -189950
1866 -189950 -190117 -118826 -303314 -318424 -322842 -167803 -91765 45857 -31173 -253823 -184934
1855 -184934 -61131 304186 309609 120790 -144421 22852 90440 229556 241500 14060
1845 14060 41502 81085 -12142 79959 296488 298561 54639 12840 204148 170158 470709
1834D70709K244j27240l49309j11319K2574j74952J66952K05944J2635j22407
$$ plain form
1834 470709 472953 345713 -3596 -114915 -92341 -267293 -100341 105603 118238 -4169
$$ [...]
##END NTUPLES=NMR SPECTRUM
##END=
