##TITLE=1H_EC-3378(3)
 200.13Hz, CDCl3.
 8 sc
 
 23.4.2026
##JCAMPDX= 6.0         $$ Bruker NMR JCAMP-DX V2.0
##DATA TYPE= NMR SPECTRUM
##DATA CLASS= NTUPLES
##ORIGIN= UXNMR, Bruker Analytische Messtechnik GmbH
##OWNER= pz
$$ XWIN-NMR		Version 3.5
$$ Thu Apr 23 14:18:12 2026 Russian Standard Time (UT+4h)  she@DPX200
##.OBSERVE FREQUENCY= 200.131
##.OBSERVE NUCLEUS= ^1H
##.ACQUISITION MODE= SIMULTANEOUS
##.ACQUISITION SCHEME= undefined
##.AVERAGES= 8
##.DIGITISER RES= 18
##SPECTROMETER/DATA SYSTEM= spect
##.PULSE SEQUENCE= zg30
##.SOLVENT NAME= CDCl3
##.SHIFT REFERENCE= (INTERNAL, CDCl3, 0, 16.5513)
##AUDIT TRAIL= $$ (NUMBER, WHEN, WHO, WHERE, WHAT)
$$ ##TITLE= Audit trail, XWIN-NMR		Version 3.5
$$ ##JCAMPDX= 5.01
$$ ##ORIGIN= Bruker BioSpin GmbH
$$ ##OWNER= she
$$ F:/spectra/data/she/nmr/H-C/1/pdata/1/auditp.txt
$$ ##AUDIT TRAIL=  $$ (NUMBER, WHEN, WHO, WHERE, WHAT)
(   1,<2026-04-23 14:16:09.34 +0400>,<she>,<DPX200>,
      <created by zg, POWCHK disabled, PULCHK disabled
       configuration hash MD5:
       00 E9 B6 7A A2 85 ED C7 34 08 36 98 17 FE 4E 26
       data hash MD5: 16K
       EF 50 95 5B 10 41 D7 8C 38 4B 37 CA 24 E2 2A 70>)
(   2,<2026-04-23 14:16:14.79 +0400>,<she>,<DPX200>,
      <Start of raw data processing
       efp BC_mod = 2 LB = 0.25 FT_mod = 6 PKNL = 1 PHC0 = -4060.873 PHC1 = 12.99229 SI = 16K 
       data hash MD5: 16K
       B4 FF 8B 6A 1A 92 7D D4 39 2B 61 25 A2 65 0E 6B>)
(   3,<2026-04-23 14:17:15.59 +0400>,<she>,<DPX200>,
      <pk PHC0 = -163.2431 PHC1 = 1.6 
       data hash MD5: 16K
       47 FE 72 6C D6 0D 34 3E 5D C5 87 2D 14 47 A8 AE>)
(   4,<2026-04-23 14:17:20.29 +0400>,<she>,<DPX200>,
      <abs ABSG = 5 
       data hash MD5: 16K
       08 D8 59 1B DB 91 BE C8 F4 A2 81 36 AE 60 FB F5>)
$$ ##END=
$$ 
$$ hash MD5
$$ D9 60 A3 7C ED CA 9F BF 00 C4 49 5B 59 53 34 28
##$RELAX= 
##$RELAX= 
##$RELAX= 
##$RELAX= 
##$RELAX= 
##$RELAX= 
$$ Bruker specific parameters
$$ --------------------------
##$DU= <F:/spectra>
##$EXPNO= 1
##$NAME= <H-C>
##$PROCNO= 1
##$TYPE= <nmr>
##$USER= <she>
##$AMP= (0..31)
100 100 100 100 100 100 100 100 100 100 100 100 100 100 100 100 100 100 
100 100 100 100 100 100 100 100 100 100 100 100 100 100 
##$AQSEQ= 0
##$AQ_mod= 1
##$AUNM= <au_zg>
##$AUTOPOS= <>
##$BF1= 200.13
##$BF2= 200.13
##$BF3= 200.13
##$BF4= 200.13
##$BF5= 200.13
##$BF6= 200.13
##$BF7= 200.13
##$BF8= 200.13
##$BYTORDA= 1
##$CFDGTYP= 0
##$CFRGTYP= 5
##$CHEMSTR= <none>
##$CNST= (0..31)
1 1 145 1 1 1 1 1 1 1 1 1 1 1 1 1 1 1 1 1 1 1 1 1 1 1 1 1 1 1 1 1 
##$CPDPRG= <>
##$CPDPRG1= <>
##$CPDPRG2= <>
##$CPDPRG3= <>
##$CPDPRG4= <mlev>
##$CPDPRG5= <mlev>
##$CPDPRG6= <mlev>
##$CPDPRG7= <mlev>
##$CPDPRG8= <mlev>
##$CPDPRGB= <>
##$CPDPRGT= <>
##$D= (0..31)
0 0.7 0 0 0 0 0 0 0 0 0 0.03 0 0 0 0 0 0 0 0 0 0 0 0 0 0 0 0 0 0 0 0 
##$DATE= 1776939369
##$DBL= (0..7)
120 120 120 120 120 120 120 120 
##$DBP= (0..7)
150 150 150 150 150 150 150 150 
##$DBP07= 0
##$DBPNAM0= <>
##$DBPNAM1= <>
##$DBPNAM2= <>
##$DBPNAM3= <>
##$DBPNAM4= <>
$$ [...]
##$SUBNAM3= <"">
##$SUBNAM4= <"">
##$SUBNAM5= <"">
##$SUBNAM6= <"">
##$SUBNAM7= <"">
##$SUBNAM8= <"">
##$SUBNAM9= <"">
##$SW= 18.0517599122864
##$SWIBOX= (0..15)
0 0 2 0 0 0 0 0 0 0 0 0 0 0 0 0 
##$SW_h= 3612.71676300578
##$TD= 16384
##$TD0= 1
##$TE= 0
##$TE2= 300
##$TE3= 300
##$TEG= 300
##$TL= (0..7)
0 120 120 120 120 120 120 120 
##$TP= (0..7)
150 150 150 150 150 150 150 150 
##$TP07= 0
##$TPNAME0= <>
##$TPNAME1= <>
##$TPNAME2= <>
##$TPNAME3= <>
##$TPNAME4= <>
##$TPNAME5= <>
##$TPNAME6= <>
##$TPNAME7= <>
##$TPOAL= (0..7)
0.5 0.5 0.5 0.5 0.5 0.5 0.5 0.5 
##$TPOFFS= (0..7)
0 0 0 0 0 0 0 0 
##$TUNHIN= 0
##$TUNHOUT= 0
##$TUNXOUT= 0
##$USERA1= <user>
##$USERA2= <user>
##$USERA3= <user>
##$USERA4= <user>
##$USERA5= <user>
##$V9= 5
##$VALIST= <valist>
##$VCLIST= <CCCCCCCCCCCCCCC>
##$VD= 0
##$VDLIST= <DDDDDDDDDDDDDDD>
##$VPLIST= <PPPPPPPPPPPPPPP>
##$VTLIST= <TTTTTTTTTTTTTTT>
##$WBST= 1024
##$WBSW= 4
##$XGAIN= (0..3)
0 0 0 0 
##$XL= 0
##$YL= 0
##$YMAX_a= 572291
##$YMIN_a= -429343
##$ZGOPTNS= <>
##$ZL1= 120
##$ZL2= 120
##$ZL3= 120
##$ZL4= 120
##$ABSF1= 16.55125
##$ABSF2= -1.500645
##$ABSG= 5
##$ABSL= 3
##$ALPHA= 0
##$AQORDER= 0
##$ASSFAC= 0
##$ASSFACI= 0
##$ASSFACX= 0
##$ASSWID= 0
##$AUNMP= <proc_1d>
##$AZFE= 0.1
##$AZFW= 0.1
##$BCFW= 0
##$BC_mod= 2
##$BYTORDP= 0
##$COROFFS= 0
##$CY= -3
##$DATMOD= 1
##$DC= 0
##$DFILT= <>
##$DTYPP= 0
##$F1P= 0
##$F2P= 0
##$FCOR= 1
##$FTSIZE= 16384
##$FT_mod= 6
##$GAMMA= 0
##$GB= 0
##$INTBC= 1
##$INTSCL= 3.241238e-09
##$ISEN= 128
##$LB= 0.25
##$LEV0= 0
##$LPBIN= 0
##$MAXI= 10000
##$MC2= 0
##$MEAN= 0
##$ME_mod= 0
##$MI= 1.114404
##$NCOEF= 0
##$NC_proc= -6
##$NLEV= 6
##$NOISF1= 3.799351
##$NOISF2= 2.8
##$NSP= 0
##$NTH_PI= 0
##$NZP= 0
##$OFFSET= 16.55125
##$PC= 1
##$PHC0= -4224.116
##$PHC1= 14.59229
##$PH_mod= 1
##$PKNL= yes
##$PPARMOD= 0
##$PSCAL= 0
##$PSIGN= 0
##$REVERSE= no
##$SF= 200.129493965575
##$SI= 16384
##$SIGF1= 3
##$SIGF2= 2
##$SINO= 0.751879
##$SIOLD= 32768
##$SREGLST= <19F.Aceton>
##$SSB= 0
##$STSI= 16384
##$STSR= 0
##$SW_p= 3612.71676300579
##$SYMM= 0
##$S_DEV= 0
##$TDeff= 16384
##$TDoff= 0
##$TI= <>
##$TILT= no
##$TM1= 0
##$TM2= 0
##$TOPLEV= 0
##$USERP1= <user>
##$USERP2= <user>
##$USERP3= <user>
##$USERP4= <user>
##$USERP5= <user>
##$WDW= 1
##$XDIM= 16384
##$YMAX_p= 524253479
##$YMIN_p= -581730
$$ End of Bruker specific parameters
$$ ---------------------------------
##NTUPLES= NMR SPECTRUM
##VAR_NAME=  FREQUENCY,     SPECTRUM/REAL,   SPECTRUM/IMAG
##SYMBOL=    X,             R,               I
##VAR_TYPE=  INDEPENDENT,   DEPENDENT,       DEPENDENT
##VAR_FORM=  AFFN,          ASDF,            ASDF
##VAR_DIM=   16384,         16384,           16384
##UNITS=     HZ,            ARBITRARY UNITS, ARBITRARY UNITS
##FACTOR=    0.220516191357248, 1,           1
##FIRST=     3312.39337860974, 0,            0
##LAST=      -300.323384396055, 0,           0
##MIN=       -300.323384396055, -581730,     0
##MAX=       3312.39337860974, 524253479,    0
$$ Real data points
##PAGE= N=1
##DATA TABLE= (X++(R..R)), XYDATA
$$ [...]
5137E214545p5001j13886k41417l28815l06123l44846j23426k12698m29316k65188
5127B773829k7261Q8928k10209j63187j68860J33829j67978j71022L1259P2849
5117B192177R4915J2325R8744L06373r3956l68965k16529p812O2843N9311k91164
5106A848262n17542J08266l3410j45988q2009r7320r852k8215r3774O9934K43512
5095A261864r2284j47209j90353J48662L6637l1477L8595l45400j55779M70770
5085I94026R6072j65949l20647q7194J07808K45746o6148j01986L0139j62308
5075E69559J0815J81861J69703P5169k11750j29401j50781J8775K18616p3578
5065F78988j78181q6884p0824O6641N3210K15473K9631k19007L5531Q201R0458
$$ y = [5214545, 5139544, 5025658, 4784241, 4455426, 4149303, 3804457, 3681031, 3468333, 3039017, 2773829, 2746568, 2835496, 2625287, 2462100, 2293240, 2427069, 2259091, 2088069, 2119328, 2192177, 2287092, 2299417, 2398161, 2704534, 2610578, 2241613, 2025084, 2017272, 2080115, 2139426, 1848262, 1330720, 1438986, 1405576, 1259588, 1177579, 1080259, 1070407, 1042192, 948418, 1018352, 1261864, 1169580, 1022371, 832018, 980680, 1017317, 985840, 1024435, 679035, 523256, 994026, 1090098, 924149, 603502, 516308, 624116, 869862, 803714, 701728, 731867, 569559, 580374, 762235, 931938, 1007107, 795357, 665956, 515175, 533950, 752566, 678988, 500807, 413923, 343099, 409740, 462950, 678423, 708054, 489047, 524578, 532779, 623237]
5054F23237p881j08808K38879N5148k50751q4484J93019K2743l26210J06538Q1603
5043E43033J00837J07107j07387k33122o7742m4134J08318M1846J4218Q8599K54387
5032H05960j74386j21007M0718L4364j00506N7344k5673j81553O680J02180j0256
5021D33865l7403p8649k0863K33884j50169Q9350o9349n6201K53676r4768j96946
5010C06427J61720k47504Q7291K42757j1026j1550j33054L0729j6380r1475n7584
4999B60351P2028L00471o4092k95082j01213j92445K56320J2651K15183j38060
4989C26112l6014J57645J57957J28541l4160m55191l1109J38165L01033J7424
4979F70403j48319k1024m6817l30907j29629K65779N4250q9597J14506k03819
$$ y = [623237, 615356, 506548, 745427, 800575, 549824, 465340, 658359, 681102, 354892, 461430, 543033, 643870, 750977, 643590, 410468, 342726, 298592, 406910, 448756, 462974, 551573, 805960, 631574, 510567, 551285, 585649, 485143, 542487, 516814, 335261, 341941, 444121, 433865, 396462, 317813, 296950, 530834, 380665, 470015, 400666, 344465, 598141, 503373, 306427, 468147, 220643, 307934, 550691, 539665, 528115, 395061, 425790, 409410, 317935, 260351, 332379, 632850, 568758, 273676, 172463, -19982, 236338, 248989, 464172, 326112, 290098, 447743, 605700, 734241, 700081, 244890, 213781, 351946, 652979, 670403, 522084, 501060, 454243, 123336, -6293, 259486, 313736, 224139, 338645, 134826]
4969A34826N2795J88716j42496J63538j28295j2209R3815J11783J24367j35462
4959D51378m4796J63854J2738J59130m1644m00516j73612j512Q3791k6086M3128
4948B25853N1846j83013N4457J58875j20019N1841J42536r3772R6927M01413m3428
4937G43516j14983r0296j30557j8612J55579n8754j51968R9550P1165n2189L2384
4926D84835l14246m8183K51811K212M6693j18639J11253J03305P2577j80473p9869
4915C31276O2718N9323p9647K20246o7136N2480J44469j31807o7699L3498k32214
4904C25507K84379N3949j6322O0510l01554L4499R7155j41720l4881J39609J89793
4893F90924J12229N497j51653K5638j6303N2418q806q8585n8980j8161J03357
$$ y = [134826, 187621, 376337, 233841, 397379, 269084, 256875, 350690, 462473, 586840, 451378, 406582, 570436, 583174, 742304, 700660, 300144, 126532, 125020, 208811, 182725, 225853, 277699, 94686, 149143, 308018, 187999, 239840, 382376, 288604, 385531, 786944, 743516, 628533, 538237, 407680, 389068, 544647, 485893, 333925, 433475, 504640, 452451, 484835, 170589, 122406, 374217, 376429, 423122, 304483, 415736, 519041, 591618, 411145, 331276, 393994, 453317, 373670, 593916, 526780, 579260, 723729, 591922, 524223, 557721, 325507, 609886, 663835, 647513, 708023, 406469, 440968, 538123, 396403, 361522, 501131, 690924, 803153, 808650, 656997, 682635, 666332, 718750, 709944, 621359, 562379, 544218, 647575]
4882F47575N8702j76667J2166o1125l0045J51106P4689P454M7507J32929o7674
4871G96617j2656r5284j53363R4530q333K5405L48552j43203J39369J18070j36493
4860I73211J51892j35838l00331j10057J92272O080j62228j25248L7961J18889
4850F46603J73220k3495p0700o7608L57670K58100J66013P6799j48368j48608
4840A219626R2058O0129j15205J73943L89261K73928J7149j33045J04697J39145
4830B221686l10993l32066j25324j39538O6939J89411j57144Q375K0105p1627
4820A369824K02766Q7274j4610k6417J79326M25670K51806k30400m32314k39302
4810A573623k9045j97787N5298O9969j0354Q4401j02053J70582m6457k23316J694
$$ y = [647575, 706277, 529610, 541776, 480651, 450606, 601712, 676401, 683855, 731362, 864291, 796617, 783961, 688677, 535314, 629844, 621511, 646916, 995468, 852265, 991634, 1109704, 973211, 1125103, 989265, 688934, 578877, 771149, 777229, 615001, 489753, 527714, 646603, 819823, 796328, 725628, 658020, 1015690, 1273790, 1439803, 1516602, 1368234, 1219626, 1311684, 1371813, 1256608, 1430551, 1819812, 2093740, 2110889, 1977844, 2082541, 2221686, 1910693, 1578627, 1453303, 1313765, 1380704, 1570115, 1412971, 1421346, 1441451, 1369824, 1572590, 1659864, 1645254, 1618837, 1798163, 2223833, 2475639, 2245239, 1812925, 1573623, 1544578, 1346791, 1402089, 1472058, 1461704, 1546105, 1444052, 1614634, 1568177, 1344861, 1346555]
4799A346555n1373J76761J84384N0481M6667L5672J01060Q1193K02774K84138
4789B458312P0271N00716O30035J38604M20490K07125L00523P3452l61298m43541
4779C994689J2031l70343m81136j18809j29805r5474J79016J60991j38589j98603
4769B813968N33781L48261L34435J58697K76434j0706m5777K6349m75722k07389
4759C752331l10913j43013j39605l3844O6943k16881K1884K90531M20238J17948
4749C825619L48325J85155K91584L28907j25077m6071q0587o12031m74541k53388
4739C387895k5998p0141l68757n28200K4258k06707R406J88266J63171o5999L8037
4728B545231P0085J14275M21279L56579K24262J80587J58678K29718M4002k87569
$$ y = [1346555, 1295182, 1471943, 1656327, 1706808, 1753475, 1789147, 1890207, 1971400, 2174174, 2458312, 2528583, 3029299, 3659334, 3797938, 4218428, 4425553, 4726076, 4799528, 4438230, 3994689, 4006720, 3636377, 3155241, 3036432, 2906627, 2811153, 2990169, 3151160, 3012571, 2813968, 3347749, 3696010, 4030445, 4189142, 4465576, 4454870, 4409093, 4435442, 3959720, 3752331, 3441418, 3298405, 3158800, 3124956, 3191899, 2975018, 2996902, 3287433, 3707671, 3825619, 4173944, 4359099, 4650683, 4979590, 4854513, 4808442, 4727855, 4115824, 3641283, 3387895, 3361897, 3291756, 2922999, 2394799, 2419057, 2212350, 2221756, 2410022, 2573193, 2507194, 2545231, 2615316, 2729591, 3150870, 3507449, 3731711, 3912298, 4070976, 4300694, 4344696, 4057127]
4718D057127m33915m27369l22256j8884l10729l79141k61483R782J45624j12744
4708A946012j59098l52814l07115J44407L16621l35606N3739J75666J64587R6812
4698A743211N2220J65946r7996j28054M32996O387k35478l04092K61217m62030
4688A434327q8072j43209k28875J98J24216K04268J22528l56614j45676N3560
4678I76651p4397J04866M79294J01684k6880J0371J64527J61450J12180j17903
4668A891843j76899l23142j86381K84794n9516p4835j27879k21413K9704p5811
4658I60465r4550J21316n3852p6574K07529j51339L7057K3397J30265l22948k52389
4647E28377M35664K46396l01450o6733R5487K18079j95550k19214Q2359J7029
$$ y = [4057127, 3623212, 3195843, 2873587, 2854703, 2543974, 2164833, 1903350, 1913132, 2058756, 1946012, 1786914, 1434100, 1126985, 1271392, 1588013, 1252407, 1306146, 1481812, 1646399, 1743211, 1795431, 1961377, 1863381, 1735327, 2168323, 2174710, 1939232, 1635140, 1896357, 1434327, 1346255, 1203046, 974171, 974369, 1098585, 1302853, 1425381, 1068767, 923091, 976651, 902254, 1007120, 1486414, 1588098, 1561218, 1571589, 1736116, 1897566, 2009746, 1891843, 1714944, 1391802, 1205421, 1490215, 1430699, 1355864, 1227985, 1006572, 1036276, 960465, 865915, 987231, 933379, 856805, 1064334, 912995, 950052, 973449, 1103714, 780766, 528377, 964041, 1210437, 908987, 842254, 937741, 1155820, 960270, 741056, 823415, 840444]
4637H40444j35392M3789K78527Q9470k16895j53810J00088j60028J01185o8128
4627G19250m9467L3857J89779j67693q4202L62674K31417m07116k11651K7437
4617F44285J62590J17123j51230M7578n9923j6164R5615j73556l16021J63084
4607E13381K77442m4979k2354N6540n8031k27652L7147K12785O1129l4956m4759
4596G25693j27771m2062J06455M0948k53089q5968J53109J66794j15822R4772
4586F63059j90314J01219K1897L5911k6050Q7858k75028M7574L56949k70449k80102
4575B72524J22845n0031L01244K2152j00123J56373J4067q0618O9997j21241J0328
4564F17517p2028l5424k6302o8630J67876J58442J11692j7052j00980j29912L0143
$$ y = [840444, 705052, 748841, 1027368, 1116838, 899943, 746133, 846221, 686193, 787378, 719250, 669783, 703640, 893419, 725726, 641524, 1004198, 1235615, 828499, 616848, 644285, 806875, 923998, 772768, 820346, 760423, 744259, 839874, 666318, 350297, 513381, 790823, 745844, 723490, 780030, 721999, 494347, 531494, 744279, 805408, 770452, 725693, 597922, 555860, 662315, 703263, 450174, 364206, 517315, 684109, 568287, 663059, 472745, 573964, 595861, 631772, 605722, 693580, 418552, 466126, 823075, 552626, 272524, 395369, 345338, 646582, 668734, 568611, 724984, 739051, 658433, 728430, 607189, 617517, 545489, 510065, 483763, 415133, 583009, 741451, 853143, 836091, 735111, 605199, 635342]
4553F35342K84760j05295k25416j82588K93849R6989m7838j90623K9034J4632
4543F02846L5686J23445J1609J52867p2308k24605L7352R460j9352j73318J08824
4532E92506q609J51891j14078k4228K49951j54862J20758l19451k1061r9842L7798
4521D10773O8830K04737R7361l1578j93345J80512K2570J47981k22542m5649J37344
4510G76994K32400l3267n3378n4712J40856o4636M9221J18004J3797J40896J14652
4499A380827k4825m8636N3556k476r6925J75213k01838O6865N4009o8589j18703
4488A168478o6280j60917J5623Q5078K2709j27517k46102j48428K01723J91142
4478I35509r970m1103k77519P3186P9061J51656j36925k5544J46422j5308q7496
$$ y = [635342, 920102, 814807, 589391, 406803, 700652, 797641, 749803, 559180, 588214, 602846, 638532, 761977, 773586, 926453, 854145, 629540, 666892, 676352, 657000, 483682, 592506, 583897, 735788, 621710, 597482, 847433, 692571, 813329, 493878, 472817, 372975, 410773, 479603, 684340, 781701, 750123, 556778, 737290, 759860, 907841, 685299, 639650, 776994, 1009394, 976127, 922749, 868037, 1008893, 944257, 993478, 1111482, 1125279, 1266175, 1380827, 1356002, 1307366, 1360922, 1358446, 1261521, 1436734, 1234896, 1301761, 1355770, 1287181, 1168478, 1102198, 941281, 956904, 1041982, 1064691, 937174, 691072, 542644, 744367, 935509, 925539, 884436, 606917, 680103, 759164, 910820, 773895, 748351, 894773, 879465, 791969]
4467G91969k10365P0462J76662O0030j0086l45456J9944L20201L14374l3351j83451
4456I70933R6422J71656N3984P5410p8972r3330J21707L2429O5112O8691j95035
4445A289007P4856k3400J2409k20321o1970K1545j16012J435q8740j12139J14461
4434H91131n3619k99136L7086l1760K886K15317P4907k6363j73083l7122N9144
4423F59388L83984l6821m66563K03394M8600K26763N1503P0884k53977k98366
4413E88789J33937j14056j61356K17594L61777j85723j94997J4787K90327J46186
4403A097265k04677j76639O719J036J39504J01478J37679k19131O6539J8473j18303
4392H49943j71887Q4812O6623l9092R0927M5980k07946q702J66898j03027q1406
$$ y = [791969, 581604, 652066, 828728, 888758, 878672, 533216, 553160, 873361, 1187735, 1154384, 970933, 1067355, 1239011, 1292995, 1368405, 1289433, 1196103, 1317810, 1350239, 1415351, 1484042, 1289007, 1363863, 1340463, 1352872, 1132551, 1070581, 1092126, 976114, 977549, 888809, 776670, 891131, 837512, 538376, 575462, 543702, 546588, 761905, 836812, 810449, 637366, 600244, 659388, 1043372, 1006551, 539988, 743382, 791982, 1018745, 1070248, 1141132, 887155, 588789, 722726, 608670, 447314, 664908, 1026685, 840962, 645965, 660752, 951079, 1097265, 892588, 715949, 722668, 723704, 863208, 964686, 1102365, 883234, 949773, 968246, 849943, 678056, 762868, 829491, 790399, 881326, 927306, 719360, 710658, 877556, 774529, 693123]
4381F93123l9864q9683j55667K48125L18611O8351J0153j18547j49154K40466
4371A025914j76900j69877N3026J79367M2966J27778j19662m1903k6616k80928
4361F13165r8802L17216K11534j08224K3197J19186L9342J3841K09822l41894
4351I98383j56936J78964J82505O8001o8004n1009K6351k9713j38411J63392L26055
4340A499578L2309j68235o8279L8403L48935k6160J41854q8354l70412J08243
4330A447882L48010J37250n9705p9661R057R9645P6223l3135j35289n5437K700
4319A757540J80562L956j2301J25455k8374r4852L2427L07336M2851p9618n4250
4308B180732J21067Q5286j06298j25680l6982M1902J20051J44585o3299j47998
$$ y = [693123, 653259, 563576, 407909, 656034, 974645, 1042996, 1053149, 934602, 785448, 1025914, 849014, 679137, 732163, 911530, 954496, 1082274, 962612, 920709, 894093, 613165, 514363, 831579, 1043113, 934889, 958086, 1077272, 1116614, 1130455, 1340277, 998383, 841447, 1020411, 1202916, 1270917, 1202913, 1151904, 1178255, 1148542, 1010131, 1173523, 1499578, 1531887, 1363652, 1295373, 1333776, 1682711, 1656551, 1798405, 1710051, 1339639, 1447882, 1795892, 1933142, 1873437, 1793776, 1802833, 1902478, 1978701, 1945566, 1810277, 1754840, 1757540, 1938102, 1942058, 1929757, 2055212, 2026838, 1931986, 1964413, 2271749, 2314600, 2234982, 2180732, 2301799, 2387085, 2280787, 2155107, 2118125, 2160027, 2280078, 2424663, 2361364, 2213366]
4298B213366Q5753J40655o8716p6956q9558K59088M4704k01067j16073K2338j19253
4287B094281K44675J19158J90647n4481j7849l9461K15621J91581j56303R5913
4277B883782q086k37885j0825o5974K02594N4289j10766P2966J06507k62566J5867
4266B639903J25695j81619k3452m1374j99398j12784L73732J5394K2641J59389
4256B778127O8407J27391j09506Q8551P4184k3066j43260k58627J66598j2242
4246B756557j11704Q6413J66367o6405L5877l1511K47537L5344J77443J92139
4236C488057l37895k77438K88954L70689K30073R1290q7657j52503M44127J20996
4226D178693k06989J58509q1640k01651r2032k0598K15576n8586k99444m8594
$$ y = [2213366, 2299119, 2439774, 2371058, 2294102, 2204544, 2463632, 2508336, 2307269, 2191196, 2213534, 2094281, 2338956, 2458114, 2648761, 2594280, 2576431, 2536970, 2752591, 2944172, 2787869, 2883782, 2875696, 2637811, 2626986, 2561012, 2763606, 2817895, 2707129, 2780095, 2886602, 2624036, 2639903, 2765598, 2583979, 2560527, 2519153, 2319755, 2206971, 2580703, 2596097, 2618738, 2778127, 2846534, 2973925, 2864419, 2952970, 3027154, 3004088, 2860828, 2602201, 2768799, 2756557, 2644853, 2731266, 2897633, 2831228, 2867105, 2835594, 3083131, 3118475, 3295918, 3488057, 3150162, 2872724, 3161678, 3532367, 3762440, 3853730, 3766073, 3613570, 4057697, 4178693, 3971704, 4130213, 4048573, 3846922, 3754890, 3734292, 3949868, 3891282, 3591838, 3543244]
4216C543244J7168L1910j66845k39873R6468O5265j3943j57202M5387K7370J23784
4205C372733p0558k19911K36412M6169l21385j34093M61q6299K4011j65551j10834
4194B571155m09633q2631R3268j26973q7415K798K43864k740r1956J00234K86825
4183B496796J3588j55095l24230j39832q4871m2691n6374R8859N1414j18167j99453
4172A539944l4653K4262j045J09716l0498K31459j01140j53055j51517K06144
4162A639617o746j85327P9201L01539j38546j78870K4369R6428M4789j16788N3189
4151A612855k2128j90333j9978J36073n2747K9965O0684O3762m4826j1727k22494
4140A339106j721J07720M8797j31504j21085K29342K66594j11467k07161k21168
$$ y = [3543244, 3560412, 3592322, 3425477, 3185604, 3282072, 3347337, 3333394, 3176192, 3221579, 3248949, 3372733, 3302175, 3082264, 3318676, 3364845, 3043460, 2909367, 2909828, 2823529, 2847540, 2681989, 2571155, 2161522, 2078891, 2172159, 2045186, 1957771, 1960569, 2204433, 2201693, 2109737, 2209971, 2496796, 2510384, 2355289, 2031059, 1891227, 1806356, 1763665, 1707291, 1806150, 1857564, 1739397, 1539944, 1505291, 1529553, 1528508, 1638224, 1607726, 1839185, 1738045, 1584990, 1433473, 1639617, 1632871, 1447544, 1526745, 1828284, 1689738, 1510868, 1535237, 1631665, 1676454, 1559666, 1612855, 1590727, 1400394, 1380416, 1516489, 1463742, 1493707, 1554391, 1618153, 1573327, 1561600, 1339106, 1337385, 1445105, 1493902, 1362398, 1241313, 1470655, 1737249, 1625782, 1418621, 1197453]
4130A197453J01679K47682Q1306N3839j18035j07183L7562R6890J21283j37108
4120A575368M2503L30339j01154j16734J76591k8276L6372k9844r5969J1486m665
4109A796017R9916O0397R6819J29630K74397J32789J68120J67389L1544K51741
4099C208759J72280k47371P896o0465Q7532j18189j04685J645M57904J23318p8186
4088C450438Q5673J43908K56288O37092M23559K56187M02650M73355J5441k58415
4078E886176j36752l22803k45900j16347l11247L4166K00639n1883j47779l1207
4068D757063L82754O34079P38680P64521J107075J162768J842613J312050N33348
4059A3234951K7618q78676j496494j317326j191859q90804o89452m37482m46642
$$ y = [1197453, 1299132, 1546814, 1628120, 1681959, 1563924, 1456741, 1494303, 1591193, 1712476, 1575368, 1617871, 1948210, 1847056, 1730322, 1906913, 1878637, 1915009, 1885165, 1789196, 1800682, 1796017, 1895933, 1956330, 2053149, 2182779, 2457176, 2589965, 2758085, 2925474, 2957018, 3208759, 3381039, 3133668, 3141564, 3081099, 3168631, 3050442, 2945757, 2947402, 3405306, 3528624, 3450438, 3536111, 3680019, 3936307, 4573399, 4996958, 5253145, 5655795, 6129150, 6144591, 5886176, 5749424, 5426621, 5180721, 5064374, 4753127, 4787293, 4987932, 4936049, 4788270, 4757063, 5139817, 5773896, 6512576, 7277097, 8384172, 9546940, 11389553, 12701603, 13234951, 13262569, 12383893, 10887399, 9570073, 8378214, 7487410, 6797958, 6360476, 5913834]
4050E913834l31160j84503M15801K10840m33717J37087J9649J03773j88148O4892
4040E728348K86550k53467k14005K64833J72357J22976K57476L14879J78314N13954
4030G372215Q75623Q06179Q11826L71357L40308L42855k09335m88532k56008j89061
4020I777427J93765Q15499J190708O31267M85798O11763j43816m85882o33820
4011A2442709q82800p61825m35909n44515l52831n24343l99146n44049p54376
4002G242915l11972m11960n73291n60794o06357j72758l7660j53500L389k06247
3992D211765J1268O3701J5377j8996K02183J64643L21731M15175K18252J64958
3982E770057N45856m2590j24723l44163m38825L4964j21980j99164k83339j59772
$$ y = [5913834, 5582674, 5398171, 5813972, 6024812, 5591095, 5728182, 5747831, 5851604, 5663456, 5728348, 6014898, 5761431, 5547426, 5812259, 5984616, 6107592, 6365068, 6679947, 6858261, 7372215, 8247838, 9054017, 9865843, 10237200, 10577508, 10920363, 10711028, 10222496, 9966488, 9777427, 9971192, 10786691, 11977399, 12608666, 13094464, 13706227, 13562411, 13076529, 12442709, 11559909, 10798084, 10362175, 9817660, 9464829, 8940486, 8541340, 7997291, 7242915, 6930943, 6518983, 5945692, 5384898, 4778541, 4605783, 4568123, 4414623, 4418012, 4211765, 4223033, 4286734, 4302111, 4283115, 4485298, 4649941, 4971672, 5386847, 5605099, 5770057, 6315913, 6273323, 6148600, 5804437, 5365612, 5400576, 5278596, 5079432, 4796093, 4636321]
3972D636321J1578J90725m4038j80119m0854L55625N29092l905K99000J73850
3962E927275N48894M21993k77861n16138n8347j2700p4558r4529M2032L35581
3952F241642Q9991J4798N56174P36505L45287J63523K89876k63k07824n157j35987
3941H088565m141l03104O942k99357m16226p00506m28989k11428k20832J56472
3931E667396r2707o5012J1551K03658r4641K67080K72724J99008L26219M62896
3921G158172L93046M36489O6984j94206j81429k81203Q104R0922p0727K3222O17796
3910H067170O09841N08736M25753L13256O9149N26597q3536j98516p53095m71848
3900I013507m21299m51792m09743l53446l25544n08196k80819P0197L9145J14508
$$ y = [4636321, 4647899, 4838624, 4794586, 4614467, 4573613, 4929238, 5458330, 5454425, 5753425, 5927275, 6476169, 6898162, 6620301, 6104163, 6045816, 6033116, 5958558, 5864029, 5906061, 6241642, 6331633, 6346431, 6902605, 7639110, 7984397, 8147920, 8437796, 8437533, 8229709, 8224552, 8088565, 8084424, 7781320, 7788262, 7488905, 7072679, 6372173, 5943184, 5731756, 5510924, 5667396, 5574689, 5509677, 5521228, 5724886, 5630245, 5897325, 6170049, 6369057, 6695276, 7158172, 7551218, 7987707, 8054691, 7860485, 7679056, 7397853, 7405957, 7496879, 7426152, 7449374, 8067170, 8677011, 9185747, 9611500, 9924756, 9993905, 10520502, 10436966, 10238450, 9485355, 9013507, 8592208, 8140416, 7730673, 7377227, 7051683, 6543487, 6262668, 6332865, 6372010, 6486518]
3890F486518L84484j3561L27535O7651j43407o187r5064j56841j44874k03499
3880F502755l15929M8648L76058K4137R0333K00281K20453M60351L62963M45741
3870H415791L17642K59555l25571n02447n53049k47998m61244k12111P9287M7641
3860F817496q586l5057J87204L40110L96718J89424r66J50946N19665K37435k13282
3849H581107j72782l43735n53501k39316k83891l79256l33019k32285k3549J64125
3839F183898m31727k20988M5942J59966j049n2777J69924k9439l74946j62254
3829E286550K687j0505J52435Q7461l98190Q2994K03276M05597K1856k25479r991
3818E598691N68752N07748K2555M0705Q2484n7903m61351k84416j19934l7705
$$ y = [6486518, 6871002, 6857441, 7184976, 7252627, 7109220, 7103033, 7007969, 6851128, 6706254, 6502755, 6186826, 6235474, 6611532, 6635669, 6726002, 6926283, 7146736, 7607087, 7970050, 8415791, 8733433, 8992988, 8667417, 8164970, 7611921, 7363923, 6902679, 6690568, 6769855, 6817496, 6808910, 6773853, 6961057, 7301167, 7697885, 7887309, 7886343, 8037289, 8556954, 8794389, 8581107, 8408325, 8064590, 7511089, 7271773, 6987882, 6608626, 6275607, 6043322, 6019773, 6183898, 5752171, 5531183, 5577125, 5737091, 5736042, 5683265, 5853189, 5823750, 5448804, 5286550, 5289237, 5278732, 5431167, 5518628, 5120438, 5203432, 5406708, 5812305, 5834161, 5608682, 5598691, 6167443, 6675191, 6697746, 6738451, 6820935, 6763032, 6301681, 6017265, 5897331, 5859626]
3808E859626k00355j60346K659j9142p4317m4504q5592O5231m4017R3776m6400
3797E346619n2686J2961J2434Q0316j46126j05030j31405L2349N7938Q6489l13493
3786D880366j98179J79006K49624n4858l10529L5484K61028j67580p5282J99999
3776D999079l08615k61164K99971L66750k38833L2917J10386o5715P2J48521J2192
3765E095561R0968k3264m1490R4715j47044Q4689J6558N8325L1925j84179J95706
3754E272470J94529R5713j68972k67226O5037J59927K65475o3331n8915m0716
3744E453991K85523J61401j2146M1700J15547Q1328j88881K74247j11319j62047
3734E939344j33980M3486J0333o2290K43765M9557P7736k5844o8216J30951J25414
$$ y = [5859626, 5659271, 5498925, 5501584, 5482442, 5408125, 5363621, 5278029, 5343260, 5299243, 5393019, 5346619, 5293933, 5306894, 5319328, 5399644, 5253518, 5148488, 5017083, 5049432, 5107370, 5193859, 4880366, 4682187, 4861193, 5110817, 5055959, 4745430, 4780914, 5041942, 4874362, 4799080, 4999079, 4690464, 4429300, 4729271, 5096021, 4857188, 4890105, 5000491, 4934776, 4934848, 5083369, 5095561, 5186529, 5163265, 5121775, 5216490, 5069446, 5154135, 5170693, 5229018, 5260943, 5076764, 5272470, 5466999, 5562712, 5393740, 5126514, 5191551, 5351478, 5616953, 5553622, 5494707, 5453991, 5739514, 5900915, 5888769, 5930469, 6046016, 6127344, 5938463, 6212710, 6101391, 5939344, 5805364, 5848850, 5859183, 5796893, 6040658, 6090215, 6167951, 6142107, 6073891, 6204842, 6330256]
3723F330256J54339j71995l3611Q7418J4144K45407J06166k28391m2392J19404
3713F580745K6616L02099L2500j28581k79583M34291R5403r2432M21496j5516
3703G377038j20010J11667J28829O2824L8187r3049J31255O4822L0359J27418
3693G859340n8890N7418J8256K2169R6256J27854J87865J30391J36849P8630J04534
3682H760672L27525k77588m00998K81405L50957K23802q1334k58357K43852l5068
3672I134868J52827K5922K191J49593L7105K24600n3499n5848M73042Q339k47233
3661I851907J92175K84502J19149R0713J61889P8664n8011l637J11002K1888L78138
3650A1228379K14196K19117k21623J17290R718J49226K49997j08766J64794K35279
$$ y = [6330256, 6484595, 6312600, 6278989, 6366407, 6380551, 6625958, 6732124, 6503733, 6461341, 6580745, 6607361, 6909460, 6941960, 6813379, 6533796, 6968087, 7063490, 6971058, 7392554, 7377038, 7257028, 7368695, 7497524, 7560348, 7598535, 7505486, 7636741, 7701563, 7731922, 7859340, 7800450, 7857868, 7876124, 7898293, 7994549, 8122403, 8310268, 8440659, 8577508, 8656138, 8760672, 9088197, 8810609, 8409611, 8691016, 9041973, 9265775, 9184441, 8926084, 9169936, 9134868, 9287695, 9313617, 9315808, 9465401, 9502506, 9727106, 9673607, 9617759, 10090801, 10099140, 9851907, 10044082, 10328584, 10447733, 10538446, 10700335, 10778999, 10720988, 10717351, 10828353, 10850241, 11228379, 11442575, 11661692, 11440069, 11557359, 11567077, 11716303, 11966300, 11857534, 12022328, 12257607]
3640A2257607O5443K1457M8856M63178K505K05915L01966K3134N1437N9403M9612
3629A3550513L82369P0994j75309L6242L42928P2845K40451Q7173L30721K50695
3619A5189622K71820q3057J05078K27699J72800K02485l8329L91447J23690P1986
3609A6635241p2125K66444K84392k739k36532J62686K13389K68678K37638J70024
3599A7927096K20590L59375J32812J30088K24454J06413P003K21708M88963J72963
3589A9991465L98789J61570j15799M1706M8298J27470K11587M92715J50571K42609
3579B1750981m5644K17739J39271L5388J54431L72531L45339M47513P4854M0210
3569B3532613J95242K83790Q4846L13016Q9067L3648O17185J11955l6428K18273
$$ y = [12257607, 12323050, 12344507, 12393363, 12856541, 12859046, 13064961, 13366927, 13390061, 13441498, 13500901, 13550513, 13932882, 14003876, 13828567, 13864809, 14207737, 14280582, 14521033, 14608206, 14938927, 15189622, 15461442, 15378385, 15483463, 15711162, 15883962, 16086447, 16048118, 16439565, 16563255, 16635241, 16563116, 16829560, 17113952, 17111213, 16874681, 17037367, 17250756, 17519434, 17757072, 17927096, 18147686, 18507061, 18639873, 18769961, 18994415, 19100828, 19107831, 19329539, 19818502, 19991465, 20390254, 20551824, 20436025, 20477731, 20526029, 20653499, 20865086, 21357801, 21508372, 21750981, 21705337, 21923076, 22062347, 22097735, 22252166, 22624697, 22970036, 23417549, 23492403, 23532613, 23727855, 24011645, 24096491, 24409507, 24498574, 24532222, 25149407, 25261362, 25224934, 25443207]
3559B5443207K90379N3759J67988K82954K9398n6507J81901K60128K56486K12040
3549B7121733K20480L55545J54115K64643q71J73959K76679L10343Q5723l8467
3539B8923882l7339K61780J14734J51780m1357J91750J69525j27K65822P067L52146
3528C0359663K45142J16087J53754K76575J47436K27268J17295J45853l7836Q451
3518C1759688K93625K24555J8634L50416l8213J10102L09687M26603R2783J83573
3508C3731453N84193K26602M74642M81073O12526M87293N34084R43912Q60259
3499C8936037R07137Q24339J437371J421444J802054K053330K487452L260736
3491E3129900M386484O492987Q684558J0810501J2503159J2506362R428543M432947
$$ y = [25443207, 25733586, 25787345, 25955333, 26238287, 26267685, 26211178, 26393079, 26653207, 26909693, 27121733, 27342213, 27697758, 27851873, 28116516, 28115645, 28289604, 28566283, 28876626, 28962349, 28923882, 28886543, 29148323, 29263057, 29414837, 29373480, 29565230, 29734755, 29734628, 30000450, 30007517, 30359663, 30604805, 30720892, 30874646, 31151221, 31298657, 31525925, 31643220, 31789073, 31751237, 31759688, 32053313, 32277868, 32296502, 32646918, 32608705, 32718807, 33028494, 33455097, 33547880, 33731453, 34315646, 34542248, 35016890, 35497963, 36110489, 36597782, 37131866, 38075778, 38936037, 39843174, 40667513, 42104884, 43526328, 45328382, 47381712, 49869164, 53129900, 57516384, 64009371, 72693929, 83504430, 96007589, 108513951, 117942494, 122375441]
3483A22375441j46274k779055k389040J11023L089106L961395K018253k038951
3475A24201898p554269j1350520j2984706j1685297r694057q318258o678920n749024
3467E0186847n034194m033847l169952k448519j773184j626967j076058p22031
3459C0302095o65869n79458n37255q24156p32729m24573o41111n60895o02830
3450B4733219j40508k46808n28217k16462j79628m66466k96198j48306k67382
3441B2243244r8361j8416l37822j68835o08525k84631O1919m16505l86122k79581
3431A9706365j23179j76436m51670j89072K5337k05326k60248l49953k39332M0825
3421A7777311n4075m37542k01879j79019J04191j80222j58494j24465J92856j61379
$$ y = [122375441, 122229167, 119450112, 117061072, 117172095, 120261201, 124222596, 126240849, 124201898, 116647629, 105297109, 92312403, 80627106, 70933049, 62614791, 55935871, 50186847, 45152653, 41118806, 37948854, 35500335, 33727151, 32100184, 31024126, 30302095, 29636226, 29056768, 28519513, 27695357, 26962628, 26538055, 25896944, 25336049, 24733219, 24592711, 24345903, 23817686, 23601224, 23421596, 22955130, 22658932, 22510626, 22243244, 22144883, 22126467, 21788645, 21619810, 21011285, 20726654, 20788573, 20372068, 19985946, 19706365, 19583186, 19406750, 18955080, 18766008, 18791345, 18586019, 18325771, 17975818, 17736486, 17777311, 17723236, 17285694, 17083815, 16904796, 17008987, 16828765, 16670271, 16545806, 16738662, 16577283]
3411A6577283j11194L59665J41006K9995N34063L17039M93435L66663N38409N73725
3401A9820089K45243K89085r0260k8591j35849J38146M28552k161m04764j72811
3391B0086679m17277l28286n46227l87910n09243m52863j95143p7415n89158n81053
3381A6002104k62358m76569m73708l42380o19576m42702k78187j92208j55608
3372A2758808j05092j49838l74392j49702k55315q1521n2557N2965l51652M8312
3362A1340016L24907j72790j70856k43725j19827j86138j52734k5867j16606N6133
3352A0532513j08405k37521o9854J18369J34193j42820K07186n0814R5117l76495
3342A0101469L340L0413k46060j82641k70348l6183n4467j58990k33873m2414
$$ y = [16577283, 16466089, 16825754, 16966760, 16996755, 17530818, 17847857, 18341292, 18707955, 19246364, 19820089, 20065332, 20354417, 20264157, 20235566, 20099717, 20237863, 20666415, 20664254, 20259490, 20086679, 19669402, 19341116, 18794889, 18406979, 17897736, 17444873, 17249730, 17172315, 16583157, 16002104, 15739746, 15263177, 14789469, 14447089, 13827513, 13384811, 13106624, 12914416, 12758808, 12653716, 12503878, 12129486, 11979784, 11724469, 11642948, 11590391, 11643356, 11291704, 11340016, 11664923, 11492133, 11321277, 11077552, 10957725, 10771587, 10618853, 10592986, 10476380, 10532513, 10424108, 10186587, 10116733, 10235102, 10369295, 10226475, 10433661, 10382847, 10477964, 10101469, 10104809, 10135222, 9889162, 9706521, 9436173, 9399990, 9345523, 9186533, 8952660, 8910246]
3332H910246J8412j62566J00772k6158k35069O4452r4022m27118K86644K82189
3322H717782Q960P1274l65734L04199K05485j05102p546n8576M57836J42780k24236
3311I147122j47297K36502J46638m6989j09187J03301K31493R61l40750k70864
3301H950930K15925O3300k5198N3049j81821k8017K49644o956J28656o1260k13824
3290I144428l46566M8077J44153m13027m47388p3553j39794o8353j68772o65j84268
3279G494272Q1878j33462J51001L75907J3989L2639L04309J26763K42110L47914
3269I037320K09254K15956M87460L51363N62731N23128Q11368N12131M91156R43605
3259A4145472Q78857N53290L07526L88449L89336O47385N37150K76567L19236
$$ y = [8910246, 8928658, 8766092, 8866864, 8840706, 8605637, 8670089, 8576067, 8148949, 8435593, 8717782, 8726742, 8798016, 8432282, 8736481, 8941966, 8836864, 8829318, 8770742, 9228578, 9371358, 9147122, 8999825, 9236327, 9382965, 9335976, 9226789, 9330090, 9561583, 9562544, 9221794, 8950930, 9166855, 9230155, 9204957, 9258006, 9076185, 9048168, 9297812, 9290856, 9419512, 9358252, 9144428, 8797862, 8845939, 8990092, 8577065, 8129677, 8056124, 7916330, 7847977, 7679205, 7678540, 7494272, 7576150, 7442688, 7593689, 7969596, 7983585, 8016224, 8320533, 8447296, 8689406, 9037320, 9246574, 9462530, 9949990, 10301353, 10864084, 11387212, 12198580, 12710711, 13201867, 14145472, 15024329, 15577619, 15885145, 16273594, 16662930, 17310315, 17847465, 18124032, 18443268]
3250A8443268J07402m7713j891Q6376p350K34064P1678j57777j9006l23116j64736
3239A8221199p5358n5355l14745l13217o02569m15374m40686p85910o43127o77153
3229A3897705p47575o60427q80150n99382q26434n22588p90194o08761o39681
3220G622513l81370j09420l76564k19598k01815k64339j53714K10473j70859j81662
3210E773645K76245K01476j4923j82255O8671K5654r1321j45235J99490J77668
3200F289115k76498l81353j4890K99434r0859R8816P6638l84070K17211K45967
3190F079511K21621m608l9015J16445K21274L32979J63778K41306K31494L72972
3180G937757L89707P93422O35749Q23251J015729J377277J349183J597179J831708
$$ y = [18443268, 18550670, 18502957, 18501066, 18587442, 18580092, 18814156, 18885834, 18728057, 18709051, 18385935, 18221199, 18145841, 18090486, 17775741, 17462524, 16859955, 16444581, 16003895, 15217985, 14574858, 13897705, 13150130, 12489703, 11609553, 11010171, 10183737, 9661149, 8870955, 8262194, 7622513, 7241143, 7131723, 6755159, 6535561, 6333746, 6069407, 5915693, 6126166, 5955307, 5773645, 6049890, 6251366, 6236443, 6054188, 6122859, 6148513, 6057192, 5911957, 6111447, 6289115, 6012617, 5631264, 5616374, 5915808, 5824949, 5923765, 6000403, 5616333, 5833544, 6079511, 6301132, 6296524, 6257509, 6373954, 6595228, 6928207, 7091985, 7333291, 7564785, 7937757, 8327464, 9120886, 9756635, 10579886, 11595615, 12972892, 14322075, 15919254, 17750962]
3171A7750962J326413J032878Q73492M17763O312L43686L93563k62027k48368
3162B1634674m28544j185021j151190j624343j840790j593779j246398j287578
3154A1277031r82161j071201p93915n13732l03498k32480o86385l45847j21101
3145F226711k77224m50431J16571K26244N709j11660J21994n6775l3472j39632
3135E628035j58598k65963N5839L60509j19428l80793r7383o4783J08778J42137
3125E208350j80780j43178L7404J24962l7308r1866J34204K5001j55718L19238
3115E240309K80427R916J65264j77856K09414J17332q6941L17185J9018m2824
3105F051244J49746k13619r3363L69979j67777Q209K31058K34937L31621J77270
$$ y = [17750962, 19077375, 20110253, 20983745, 21401508, 21407820, 21751506, 22145069, 21883042, 21634674, 21206130, 20021109, 18869919, 17245576, 15404786, 13811007, 12564609, 11277031, 10294870, 9223669, 8429754, 7916022, 7612524, 7380044, 6693659, 6347812, 6226711, 5949487, 5499056, 5615627, 5841871, 5847580, 5735920, 5857914, 5801139, 5767667, 5628035, 5469437, 5203474, 5259313, 5619822, 5500394, 5119601, 5022218, 4957435, 5066213, 5208350, 5027570, 4884392, 4921796, 5046758, 5009450, 4917584, 5051788, 5076789, 4921071, 5240309, 5520736, 5530652, 5695916, 5518060, 5727474, 5844806, 5757865, 6075050, 6094068, 6051244, 6200990, 5987371, 5894008, 6263987, 6096210, 6104419, 6335477, 6570414, 6902035, 7079305]
3095G079305r722P9983j59926K3260J15533K23672K1415L07387Q2174J66941J20115
3084H050137J72402L33462K12616K31111o2907K09815j254J50429J25823N7474
3074I479108m0295k50141j17305j29073l7367J61351O2350l5784m4042L27983
3064I376785o2864r5508j2027k79575j22216K01742j8070p1837L41650P9015J92821
3053I529916J45034P6270L53141L23289K20489L56173L37144J54719M68890K56650
3043A2221715N16838N80005J63270K69599K28084P3847R2412q3625l3044O0151
3033A4089252O4371K60847L73987Q180K56260L78739J67162j04821K0999k1836
3023A5493140m04764k55975k04087m58395l14992j43761l20922l20416J10448
$$ y = [7079305, 7069583, 7149566, 6989640, 7012900, 7128433, 7352105, 7373520, 7680907, 7763081, 7930022, 8050137, 8222539, 8556001, 8768617, 8999728, 8936821, 9146636, 9145382, 9295811, 9421634, 9479108, 9438813, 9188672, 9071367, 8942294, 8904927, 9066278, 9128628, 9092844, 9048802, 9376785, 9313921, 9218413, 9206386, 8926811, 8804595, 9006337, 8988267, 8916430, 9258080, 9337095, 9529916, 9674950, 9751220, 10104361, 10427650, 10648139, 11004312, 11341456, 11496175, 11965065, 12221715, 12738553, 13318558, 13481828, 13751427, 13979511, 14053358, 14145770, 14062145, 14029101, 14089252, 14153623, 14414470, 14788457, 14796637, 15052897, 15431636, 15598798, 15493977, 15514976, 15493140, 15088376, 14832401, 14628314, 14169919, 13854927, 13711166, 13390244, 13069828, 13180276]
3014A3180276J33707K39058L33000J38152K87781j2604j57266K06386K45782o4099
3004A4530173q7239L56731N25202R8152Q4986K63313K7612j32050P3191N23133
2994A6263204N48145N64262N76358N49155Q28245M84865M19094N89936K57687
2985B1080951N09822N46363P30935J096306J378737J414440R02517P25984O74121
2976B9060176N37228L75781R14699J578366J874899J753281K357086K469862K265889
2967D3187267K482271K893943L014162L587955L364237L535184L073862K214131
2959F7353012J122094J025651O90319M27062P19157N44185K26287J43443n3301
2950G2197909n52862n27624k03645k04999J18333N07411R89281J020100N62945
$$ y = [13180276, 13313983, 13553041, 13886041, 14024193, 14311974, 14299370, 14142104, 14348490, 14594272, 14530173, 14442934, 14799665, 15324867, 15423019, 15508005, 15771318, 15798930, 15666880, 15740071, 16263204, 16811349, 17375611, 17951969, 18501124, 19329369, 19814234, 20233328, 20823264, 21080951, 21590773, 22137136, 22868071, 23964377, 25343114, 26757554, 27660071, 28386055, 29060176, 29597404, 29973185, 30887884, 32466250, 34341149, 36094430, 38451516, 40921378, 43187267, 45669538, 48563481, 51577643, 55165598, 58529835, 62065019, 65138881, 67353012, 68475106, 69500757, 70191076, 70618138, 71337295, 71881480, 72107767, 72251210, 72197909, 71645047, 71117423, 70913778, 70708779, 70827112, 71334523, 72323804, 73343904, 73906849]
2941G3906849Q53419L33042l10882j095408j512731j803133k185188j766865j976703
2932F4442400j875082j949066j850525j245833r51199j118982j044034r90875
2924E3416804j385767j095779j102125j216888j118214m46257r4682Q08J36354
2915D7094254O4366n60681p80073j185913j010924j161774j414603j653098r96720
2906C8394834o26673p10283l94197m40815o90104j016132j381479j384413j033778
2897C0716960j063677j163072o93423J9758M51152O16706M25541R22664J538001
2888C1770610J353075J196904P13443Q22398M23807J50493Q2876J23769K75530
2879C6912905M29147R08961J717257K006969K365834K713851K679366K171524
$$ y = [73906849, 74760268, 75093310, 74782428, 73687020, 72174289, 70371156, 68185968, 66419103, 64442400, 62567318, 60618252, 58767727, 57521894, 56570695, 55451713, 54407679, 53416804, 52031037, 50935258, 49833133, 48616245, 47498031, 47051774, 46957092, 46957900, 47094254, 47158620, 46597939, 45817866, 44631953, 43621029, 42459255, 41044652, 39391554, 38394834, 37768161, 37057878, 36663681, 36222866, 35532762, 34516630, 33135151, 31750738, 30716960, 29653283, 28490211, 27796788, 27816546, 28267698, 28884404, 29309945, 30232609, 31770610, 33123685, 34320589, 35034032, 35856430, 36280237, 36430730, 36513606, 36637375, 36912905, 37342052, 38251013, 39968270, 41975239, 44341073, 47054924, 49734290, 51905814]
2871E1905814J587442Q08382J67139k59420o18507o58962o15031l69246K46212
2862E2193823R56925J183037J843526K096860K091156K055038J125519K95129
2854F3841013p20574j422432k434374k930892k832297k520790k209785j375911
2846D7393958q41454R7005P05935Q43568P56345J40152n42476r52935r27582j091855
2836D5580661j307052j085720p43759r44221p86514r64008p01553j144724j229651
2827C6673459j244307j104811o69169K03218L81840P78897J394999J555020J190228
2818C9159374R75121M76785K62990R293j97550l45708l88719l01485l74225n66743
2808C8709133m84354j68527K76543J43084N72282R99873J498001J932333J685337
$$ y = [51905814, 53493256, 54301638, 54468777, 54209357, 53590850, 52931888, 52316857, 51947611, 52193823, 53150748, 54333785, 56177311, 58274171, 60365327, 62420365, 63545884, 63841013, 63120439, 61698007, 59263633, 56332741, 53500444, 50979654, 48769869, 47393958, 46552504, 46649509, 47355444, 48199012, 48955357, 49095509, 48553033, 47600098, 46672516, 45580661, 44273609, 43187889, 42444130, 41499909, 40713395, 39749387, 39047834, 37903110, 36673459, 35429152, 34324341, 33655172, 33858390, 34240230, 35019127, 36414126, 37969146, 39159374, 40134495, 40611280, 40874270, 40883563, 40686013, 40340305, 39951586, 39650101, 39275876, 38709133, 38224779, 38056252, 38332795, 38475879, 39048161, 40048034, 41546035, 43478368, 45163705]
2799D5163705O98039N01156J22211n67884n46208o18477l44031k27169l11085
2790D3870257O5415J10701J34617L55481O99554J308332J809877K095795J807305
2781E2257334J543529R81429P683n75712j211279j012493q85931j033028o41563
2772D9429969l91867p82237j240038j399601j316436j525131j845908j736374
2764C9192377j568085j090212p93173l92084l05725R3209J0678N16688Q28736
2755C6492409J131798P06299N73875R58r7997L14367Q34085J018862J365717J573715
2745D3914088J285309J026265Q65567J348667K080616L083011L883600M573063
2737F2060186M537142L879782K562729J575360J632624K050879J630985J543324
$$ y = [45163705, 45861744, 46362900, 46485111, 45917227, 45371019, 44752542, 44408511, 44181342, 43870257, 43935672, 44046373, 44180990, 44536471, 45236025, 46544357, 48354234, 50450029, 52257334, 53800863, 54782292, 54789975, 54214263, 53002984, 51990491, 51104560, 50071532, 49429969, 49038102, 48255865, 47015827, 45616226, 44299790, 42774659, 40928751, 39192377, 37624292, 36534080, 35740907, 35348823, 35043098, 35136307, 35146985, 35663673, 36492409, 37624207, 38330506, 38904381, 38905339, 38807342, 39121709, 39955794, 40974656, 42340373, 43914088, 45199397, 46225662, 47091229, 48439896, 50520512, 53603523, 57487123, 62060186, 66597328, 70477110, 73039839, 74615199, 76247823, 78298702, 79929687, 81473011]
2729H1473011J677346R02953p7796j272212j462724j252252j604864k091479k003898
2720G4288085k361820k504968j968246q10376j52051K52386j63983j019807j251868
2711F4307352j733953k672878l646853l388948l153880k763027j882406l63246
2703D4702161N63071J340871J593032J699507P65945k72017q13085r73381n77399
2694D8028705J23872R11485J759978K009314K421800J893799J246652M80115l99800
2685E8475920j34480K53829M97309N75769O20284J038028J663452K408385L075845
2676F8474341L310092K791243J232514j004545k406986k796521k180209j876451
2668F5543478j623743p74726j126076j742237k116040j326313j96185J121905
$$ y = [81473011, 83150357, 84053310, 83975514, 82703302, 81240578, 79988326, 78383462, 76291983, 74288085, 71926265, 69421297, 67453051, 66642675, 66490624, 66743010, 66579027, 65559220, 64307352, 62573399, 59900521, 56253668, 52864720, 49710840, 46947813, 45065407, 44702161, 45265232, 46606103, 48199135, 49898642, 50664587, 50392570, 49579485, 48606104, 48028705, 48152577, 49064062, 50824040, 52833354, 55255154, 57148953, 58395605, 58875720, 58475920, 58341440, 58595269, 59092578, 59668347, 60288631, 61326659, 62990111, 65398496, 68474341, 71784433, 74575676, 75808190, 74803645, 72396659, 69600138, 67419929, 65543478, 63919735, 63145009, 62018933, 60276696, 58160656, 56834343, 56638158, 57760063]
2660E7760063K013319K753022K346584J015016j148495l106326m228424m134493
2652E3270266l601865k686013j657665n07986J20731Q62094J119748J359031J281589
2643D9559930Q69781J014007J434423J436503M99348k36136p65350p65577o38624
2634E2408305l99552L56284J008665P77391N44711N33395j1660k74350j68655
2625E4774534N70575J505683K230876J891561J197738J32211r52889j674233k162475
2616E7513581k805108k842533k817099k785368k466700k113137j606714q07810
2608C9269112m2795q8285L43611J78028j05420k27882m84835n03006J1589N69026
2598C8919143J222581J072678J004743K71121L77082K33936j31278m39224r81270
$$ y = [57760063, 59773382, 62526404, 64872988, 65888004, 64739509, 61633183, 57404759, 53270266, 49668401, 46982388, 45324723, 44816737, 44937468, 45799562, 46919310, 48278341, 49559930, 50429711, 51443718, 52878141, 54314644, 54813992, 54577856, 53812506, 53046929, 52408305, 52008753, 52365037, 53373702, 54151093, 54695804, 55229199, 55217539, 54943189, 54774534, 55345109, 56850792, 59081668, 60973229, 62170967, 62303178, 61350289, 59676056, 57513581, 54708473, 51865940, 49048841, 46263473, 43796773, 41683636, 40076922, 39269112, 39226317, 39138032, 39481643, 39659671, 39554251, 39326369, 38841534, 38338528, 38350117, 38919143, 40141724, 41214402, 42219145, 42490266, 42867348, 43101284, 42970006, 42530782, 41549512]
2589D1549512j110794j210301j506589j142223m10983q1941K21343K88909j60698
2580C6436235m09539q05700j409560j769252j532537j678418j446931q65684o59876
2571B5858738o24809m31156J74359J89943O30231L08021L02597J19427m46130
2562B6081221o03046o92973m25504k63665K5291R3282L89485M09290j54921o74076
2552B4184384p50317p83083p95788p44065p52673o07104q8690k84641k28551l93871
2542A8755601q4213J70284l1604k25357J86591K14237n5038K92360K67753K38030
2532A9728644L90023P73079L96958O31531J023377P60359O69069Q91740J305151
2523B6569931J296793J613326J603016J836715J632010J448211P24240J39145
$$ y = [41549512, 40438718, 39228417, 37721828, 36579605, 36168622, 36086681, 36308024, 36596933, 36436235, 36026696, 35220996, 33811436, 32042184, 30509647, 28831229, 27384298, 26518614, 25858738, 25233929, 24802773, 24977132, 25167075, 25797306, 26105327, 26407924, 26527351, 26081221, 25478175, 24785202, 24359698, 24096033, 24121324, 24214606, 24604091, 25013381, 24858460, 24184384, 23434067, 22650984, 21855196, 21111131, 20358458, 19751354, 19662664, 19378023, 19149472, 18755601, 18671388, 18841672, 18810068, 18584711, 18771302, 18985539, 18930501, 19222861, 19490614, 19728644, 20118667, 20891746, 21288704, 21920235, 22943612, 23703971, 24373040, 25264780, 26569931, 27866724, 29480050, 31083066, 32919781, 34551791, 36000002, 36724242, 36863387]
2515C6863387J33405L70546Q32572J155503J636573J914595J705383J732396J534925
2506D7879285J564658J725543K298017L777357N987987R092355J2015631J5735377
2498A00076210J6930078J4935427R076973J582311n785106r003546q825885o425371
2490A12561091l517822j769395j665461k644415m142578m172392l397186j665145
2482H9586697m61794l84598k054952m502547n929748p188472o957462n948360
2474E6158764n127210m093312l301844l057804k111793j290305p70302j03395
2466C6302799K51607P21790J183113J310900J770571K597567L019557K903427
2458E0061331K215163J232682k03935j218707j666736j612903j236687n15829
$$ y = [36863387, 36996792, 37367338, 38199910, 39355413, 40991986, 42906581, 44611964, 46344360, 47879285, 49443943, 51169486, 53467503, 57244860, 63232847, 72325202, 84340833, 100076210, 117006288, 131941715, 141018688, 142600999, 136815893, 127812347, 118986462, 112561091, 109043269, 107273874, 105608413, 102963998, 98821420, 94649028, 91251842, 89586697, 89124903, 88740305, 86685353, 82182806, 76253058, 69064586, 62107124, 56158764, 51031554, 46938242, 43636398, 40578594, 38466801, 37176496, 36406194, 36302799, 36554406, 37276196, 38459309, 39770209, 41540780, 44138347, 47157904, 50061331, 52276494, 53509176, 53305241, 52086534, 50419798, 48806895, 47570208, 47054379]
2450D7054379J89556J125648K622314L493916M479903M890659M759571L722130
2442G2338076K131724O67386K29331N65945J475033J588664O45052j112935k870428
2433G5657848m483915n028986m491462l366247k796454k004041j576989o53939
2425E1255815K83193O74305J508191K275891L180658M030304M519862N095558
2417G2823777O495280P878926Q983312R690422R510432Q952301P342401O701818
2409A38378669P314338Q319041Q661527O863354K881926l415284r420140j2920473
2401A46662958j3622392j1885629r050416o558983m249387j494686J251860L975052
2393A05028377O391785Q268684R734321J0694574J1926042J2414025J2663942
$$ y = [47054379, 47243935, 48369583, 50991897, 54485813, 58965716, 63856375, 68615946, 72338076, 74469800, 75137186, 75366517, 75932462, 77407495, 78996159, 79641211, 78528276, 75657848, 71173933, 66144947, 61653485, 58287238, 55490784, 53486743, 51909754, 51255815, 51539008, 52213313, 53721504, 55997395, 59178053, 63208357, 67728219, 72823777, 79319057, 87197983, 96181295, 105871717, 115382149, 124334450, 131676851, 138378669, 145693007, 154012048, 162673575, 169536929, 172418855, 169003571, 159583431, 146662958, 133040566, 121154937, 112104521, 105545538, 101296151, 99801465, 101053325, 105028377, 111420162, 119688846, 129423167, 140117741, 152043783, 164457808, 177121750]
2386A77121750J0864382N907131j678936q540525j3160289j4963177j4498742
2379A41051594j3204224j1951843j0291806q512897o704212m659834l056550j681091
2371H0989137o10719K04256O56367R28260J134260K274325K886844L297123M305385
2362I6065238N450142O378447P630488Q439426Q934397R061081Q834874P839037
2354A58633130O552290O106215P068955R511703J5007984K4284988L6586421N0379273
2346C14130959O1430347O4654289N4378795K9659089l508911l5001403n4440167
2339D31302998n9365149n3531765m4446715l6044930k9551658k4515336j9587628
2332A64259817j5632081j2170852r058548p074950n478069m030314k456204j079202
$$ y = [177121750, 187986132, 193893263, 192214327, 183673802, 170513513, 155550336, 141051594, 127847370, 115895527, 105603721, 97090824, 90386612, 85726778, 82670228, 80989137, 80378418, 80582674, 81239041, 82167301, 83301561, 85575886, 88462730, 91759853, 96065238, 101515380, 107893827, 115524315, 123963741, 132898138, 141959219, 150794093, 158633130, 165185420, 171291635, 178360590, 187872293, 202880277, 227165265, 263751686, 314130959, 375561306, 440215595, 494594390, 524253479, 520744568, 485743165, 431302998, 371937849, 318406084, 273959369, 237914439, 208362781, 183847445, 164259817, 148627736, 136456884, 127398336, 120323386, 114845317, 110815003, 108358799, 107279597]
2324A07279597n69588j90327L05996L70646R32286K134545L400132M715509N456719
2315A23835515O417204P066868Q514943J0962879J5431120K2661132L2949693
2308B27839354M5058094N5833280O1015870N6028290L9277442J2805618j6606253
2301D81251695m0039875n2375039n3751016m8726708m1150531l4127685k8188192
2294A82892649k2868668j7677526j3116495r613193n735508k497949n67559O37532
2286A11453283J394757L63025j832741l957787n705188o364796n817278m926384
2278H4606891l570052k216357j172581l35450k81050p65636j917213k735765l347378
2269F8265409l711027l526895k868292k153621j762249j085292o20366k97766
$$ y = [107279597, 106710009, 106519682, 106825678, 107196324, 108128610, 110263155, 113663287, 118378796, 123835515, 130252719, 137319587, 145834530, 156797409, 172228529, 194889661, 227839354, 272897448, 328730728, 389746598, 445774888, 485052330, 497857948, 481251695, 441211820, 388836781, 335085765, 286359057, 245208526, 211080841, 182892649, 160023981, 142346455, 129229960, 119616767, 113881259, 111383310, 110815751, 111453283, 112848040, 113211065, 111378324, 107420537, 101715349, 95350553, 89533275, 84606891, 81036839, 78820482, 77647901, 77312451, 77031401, 76265765, 74348552, 71612787, 68265409, 64554382, 61027487, 58159195, 56005574, 54243325, 53158033, 52537667, 52239901]
2261E2239901p7938n65505j069801j625471j543589r81715m79262n65736m44787
2252D4886097n79651j291320j389892j381939j768175j285151q89296j164783
2244C5135890r02973n71579n12062n68639l92027K85192L06711P0503j16900m24909
2234C2309207l48228l92250l25719k02095o0774O83213J150362J421761J247997
2225C5483474P70581M86994n31368j308686j582009j922780j825233j815975j175410
2216B6579588q76550q89128l33816J8673k9371J09225Q13317O43580O15813J5346
2206B6666677m58068n77106p64763j237208j314090j229201q96801j29773m25735
2197A9633932p53242l69736j48426j60660j49812L3642p4569J56542L6718K65901
$$ y = [52239901, 52161963, 51596458, 50526657, 48901186, 47357597, 46375882, 45896620, 45330884, 44886097, 44306446, 43015126, 41625234, 40243295, 38475120, 37189969, 36300673, 35135890, 34232917, 33661338, 33149276, 32580637, 32188610, 32473802, 32780513, 32851016, 32734116, 32309207, 31960979, 31568729, 31243010, 31040915, 30980141, 31663354, 32813716, 34235477, 35483474, 36254055, 36741049, 36209681, 34900995, 33318986, 31396206, 29570973, 27754998, 26579588, 25703038, 24813910, 24480094, 24498767, 24469396, 24578621, 25391938, 26035518, 26651331, 26666677, 26208609, 25631503, 24866740, 23629532, 22315442, 21086241, 20189440, 20059667, 19633932, 18880690, 18510954, 18362528, 18201868, 18052056, 18085698, 18011129, 18167671, 18204389, 18470290]
2187A8470290L43943K35881L45648j00930J17115M8619j13338k54389l48853j30414
2177A8613572k54732j84295k60095R7353j01686j00498L6332K61935M18946K95280
2167A8822112M17492K02344P18798L68896O10808O04480N00977J123095J441447
2158B4810449J293876J491833J660249J518493K205587K862122K828785L186569
2150D1857963L405047L941511M978191N617001O316476P312078R034227J0516848
2142I2979342J3112971J6572769K2346685L0154176M0021720M8661569N4383682
2135C18232914N2782877M1918366K2010137k142224k4045393m0239119m7443213
2128C21074345m7499104m3055163l6753512l1180777k6760528k2306770j8247065
$$ y = [18470290, 18814233, 19050114, 19395762, 19294832, 19411947, 19460566, 19347228, 19092839, 18743986, 18613572, 18358840, 18174545, 17914450, 18011803, 17910117, 17809619, 17845951, 18107886, 18526832, 18822112, 19239604, 19441948, 20160746, 20529642, 21140450, 21744930, 22245907, 23369002, 24810449, 26104325, 27596158, 29256407, 30774900, 32980487, 35842609, 38671394, 41857963, 45263010, 49204521, 54182712, 59799713, 66116189, 73428267, 82462494, 92979342, 106092313, 122665082, 145011767, 175165943, 215187663, 263849232, 318232914, 371015791, 412934157, 434944294, 432802070, 408756677, 368517558, 321074345, 273575241, 230520078, 193766566, 162585789, 135825261, 113518491, 95271426]
2121I5271426j4609408j1513129q872740p171573n773993m625974l897478l335519
2113C5471612k900991k460254j784013j701225j705275j399251j358039j171214
2105B0991350p73312o56512m69592m91017m63422l05246l86209n45999j52016
2096A6748025m54217l22774q02381o03462o01086k27488m15677l87252l40402
2087A2593286m10935j03351K59296O8592L40814K30121P2707K977J47509M21888
2077A3622904k6155q7790o4363m55798q40895n57712n13150n77247q52201o36084
2067I011509l05477k09025l90402j34775j17699J9974P1006J47529J198k55770
2057G838068l98392l42798k20005l38952k00905o09508k92618j91814k96641M125
$$ y = [95271426, 80662018, 69148889, 60276149, 53104576, 47330583, 42704609, 38807131, 35471612, 32570621, 30110367, 28326354, 26625129, 24919854, 23520603, 22162564, 20991350, 20218038, 19561526, 19091934, 18600917, 18137495, 17832249, 17446040, 16900041, 16748025, 16293808, 15971034, 15168653, 14565191, 13964105, 13736617, 13320940, 12933688, 12593286, 12182351, 12079000, 12338296, 12406888, 12747702, 12977823, 13050530, 13053507, 13201016, 13622904, 13596749, 13508959, 13444596, 12988798, 12147903, 11590191, 11077041, 10499794, 9647593, 9011509, 8706032, 8497007, 8106605, 7971830, 7854131, 7874105, 7945111, 8092640, 8093838, 7838068, 7439676, 7096878, 6876873, 6537921, 6337016, 5727508, 5434890, 5243076, 4946435, 4950560]
2047D950560k33837j14715j42405l17354j37917K7344q2026j07879j71608j16107
2037C554056j6474K33667J56978J10909q3146j83079j28848J86900j62690J19419
2027C787692o703J5139J26751R1477K35991K76391K05292J63130R2767J47023
2017E134950j70676m63358k34447m10064l11643r6318l19288j84015k49876j69690
2007B525575j9718J9623m9666M5286r9911j86082j00J01278R2965K3919j37505
1996B315664K8420j53422k6816R6906J64133l10208k78175J62624J07586n6288
1986B050424j37532j44824P9606Q7561R1084J7950k51879m31k20484N3310k2771
1975A602014J0482k22731j16889j22795K67174L55353m3714j80312O7107m6118
$$ y = [4950560, 4716723, 4602008, 4459603, 4142249, 4004332, 4031676, 3949650, 3841771, 3670163, 3554056, 3537582, 3771249, 3928227, 4039136, 3955990, 3772911, 3644063, 3830963, 3668273, 3787692, 3780989, 3796128, 3922879, 4014356, 4250347, 4526738, 4732030, 4895160, 4987927, 5134950, 4964274, 4500916, 4266469, 3856405, 3544762, 3448444, 3129156, 2945141, 2695265, 2525575, 2505857, 2525480, 2475814, 2521100, 2421189, 2235107, 2235007, 2336285, 2429250, 2453169, 2315664, 2344084, 2190662, 2163846, 2260752, 2424885, 2114677, 1836502, 1999126, 2106712, 2050424, 1912892, 1768068, 1847674, 1935235, 2026319, 2044269, 1792390, 1791959, 1571475, 1624785, 1602014, 1612496, 1389765, 1272876, 1150081, 1417255, 1772608, 1728894, 1548582, 1615689, 1569571]
1965A569571j1325k79647Q5709J58438j14166j87136m244P7781q2695J01766M9448
1954A363500o830j45045K35045J35236k7812j51436r0709J1087O9851k1491r7551
1943A273845l5594J06323J88395q9668j18980k60075k8174P8051n4859L0645j14218
1932I75691k03691M7083P7166L13095k12245J88267m5030j35715N4155j54935
1922I03841R0399P7003L5710k2625k83049J85513L0872j60469k4609O850k8498
1911H10938O2783l5927o0457L0692l7525k7005j13830J86582J17141P2760k29304
1900G76848J72845K78615j40587q2255N4397n7468m5030j22095K00014J9704l12818
1889G42170j43082m0502J71829J56747p0397k00641n1187J28215o8122k49139
$$ y = [1569571, 1558246, 1278599, 1364308, 1522746, 1408580, 1221444, 1217200, 1294981, 1212286, 1314052, 1363500, 1356670, 1211625, 1446670, 1581906, 1554094, 1402658, 1311949, 1323036, 1392887, 1371396, 1273845, 1238251, 1344574, 1532969, 1443301, 1324321, 1064246, 1036072, 1114123, 1059264, 1089909, 975691, 772000, 819083, 896249, 1209344, 997099, 1185366, 1140336, 1004621, 1058776, 903841, 994240, 1071243, 1106953, 1084328, 801279, 986792, 1017664, 857195, 832586, 839436, 810938, 873721, 837794, 777337, 808029, 770504, 743499, 629669, 816251, 933392, 1006152, 776848, 949693, 1228308, 1087721, 1005466, 1059863, 1002395, 957365, 835270, 1035284, 1054988, 742170, 599088, 558586, 730415, 887162, 816765, 616124, 564937, 693152, 625030, 375891]
1879C75891K70313J8464N0701q926M8483N1300N5700K9087o4425k4723L648K13596
1867A019109m4014k1006j56241J05751j12583j06200J18787Q3451O1379K76799
1857A225232K473O4427O180L44621J45430L20592J48168K30618K32818K45223
1847B965782j70022l45313k31098l06371q7807l24610n3828k27510m42764n3223
1837G23236N6307N7527J20215j34419k38190p5114K8514J56857L6106j88318j39410
1826D03311O5776K44786J63845k6130l53831k89865J19750K00278J12311k28294
1816D11937r6909Q9348j97863p7442J95474j27918o2689Q5775K3458L83109n7122
1805E69158J6796l8002j30345r3343J08360K22237k01394j7518n7025N5127k4163
$$ y = [375891, 646204, 664668, 715369, 706443, 754926, 806226, 861926, 891013, 826588, 801865, 805513, 1019109, 975095, 954089, 797848, 903599, 791016, 684816, 803603, 887054, 948433, 1225232, 1227705, 1292132, 1298312, 1642933, 1788363, 2108955, 2257123, 2487741, 2720559, 2965782, 2795760, 2450447, 2219349, 1912978, 1825171, 1500561, 1446733, 1219223, 776459, 723236, 779543, 837070, 957285, 822866, 584676, 509562, 538076, 694933, 731039, 542721, 403311, 469087, 713873, 877718, 851588, 497757, 207892, 327642, 527920, 640231, 411937, 315028, 404376, 206513, 129071, 324545, 196627, 133938, 219713, 243171, 626280, 569158, 585954, 547952, 417607, 324264, 432624, 654861, 453467, 435949, 378924, 434051, 409888]
1794D09888j04207l6146N201K03138j6387j27220m2228r9227R8603j2523L0446
1783C09338N6504K519L09995j53054K2886k93120j07704J00378Q7394J40592Q2558
1772E58286j45669K694j74498O3992K22728L7715j07499k84934J02071k5591J16388
1761C65683J18089j8092k12142Q6491N5933J10186j80523q3025K70065K695j62112
1750C53248L9704J9437k4284n2489j99971j3452N0882K83731m4500r806j94929
1739B07571K08385j42889R5956Q1856n3636n7624r6550k747K36783P7201j61604
1728C92702R20m4221j13463K3073J66386k65198o1860P8934L15521k443k63042
1717B27309j1592q2476j45114K72608l3223O9796J34913j30164p1236q4625J08274
$$ y = [409888, 305681, 269535, 274736, 477874, 461487, 334267, 292039, 192812, 291415, 278892, 309338, 365842, 368361, 678356, 525302, 548188, 255068, 147364, 247742, 335136, 475728, 558286, 412617, 415311, 240813, 304805, 527533, 565248, 457749, 172815, 274886, 249295, 365683, 483772, 465680, 253538, 340029, 395962, 506148, 325625, 242600, 512665, 515360, 353248, 392952, 412389, 388105, 335616, 135645, 122193, 173075, 456806, 412306, 402500, 207571, 415956, 273067, 369023, 450879, 397243, 339619, 243069, 240322, 477105, 554306, 392702, 393622, 349401, 235938, 259011, 425397, 160199, 98339, 177273, 492794, 490351, 227309, 215717, 133241, -11873, 260735, 227512, 297308, 432221, 302057, 230821, 146196, 254470]
1706B54470J55415k31794o2552J25209J61682J59193l22882k22750k8114J81496
1696A69373K64000j5694j77704j65207L98698j00437J0876L5431k59545j92594
1686c2803l8833K81500J16398L7886k04036N1267N2162J47001O6612j46028j6213
1675C14913J51242j53335m8058j33910J4533J91406k47747J3630L50768j45659
1665C07783L853J78633j36909l01243p3401J24768j24653Q703P6986K415p9827
1654a2892J24466J72142O3362k4177m1205J42509N8787K604l41422J78228k2229
1643C00173p1484J61726k59938j70254M1875J63208l40446J27685K20220N5125
1633B27890j53552J65510N787p1925k23728J05838J53081J54753k37507J81067
$$ y = [254470, 409885, 178091, 115539, 240748, 402430, 561623, 238741, 15991, -12123, 169373, 433373, 417679, 239975, 74768, 473466, 373029, 383905, 419336, 159791, -32803, -71636, 209864, 326262, 364148, 160112, 211379, 263541, 410542, 477154, 331126, 314913, 466155, 312820, 264762, 130852, 145385, 336791, 89044, 102674, 453442, 307783, 311636, 490269, 353360, 52117, -21284, 103484, -21169, -12466, 64520, 66935, -12892, 111574, 283716, 347078, 322901, 281696, 424205, 482992, 485596, 144174, 322402, 300173, 228689, 390415, 130477, -39777, 2098, 165306, -175140, -47455, 172765, 227890, 74338, 239848, 245635, 173710, -50018, 55820, 208901, 363654, 126147, 307214]
1623C07214L50365l40921j03967P678j83631J25540J08841K931k71636P69K85807
1612B88990j29363n3200k18095k1363j05724P7732K09058L4245O8341R9625m3888
1601B06358N2910J48469j18285Q4866p6202j7109J3264j59760p6161Q1656P2285
1590B12291k69673n4078K20383n5010J8922J00360K8550n5926L9749K5435l1041
1579A79962O3123j22575j07049K20378J10989k4541m3431k12693M790J83555K209
1568B54717J38685k5040j90519p7209Q884K14780j43844M9828J28818O941l9024
1557C27017n2425Q2590o9607k46026J42218j57397J71335J09044o0905k99212
1547e3368r947J06441L07305Q5758J42402j26923o8706j45950j14586R7791j2260
$$ y = [307214, 657579, 316658, 212691, 220369, 36738, 162278, 271119, 274050, 2414, 3183, 288990, 159627, 106427, -111668, -133031, -238755, -161023, 48035, 82280, 150621, 250246, 206358, 259268, 407737, 289452, 374318, 298116, 281007, 294271, 134511, 58350, 140006, 212291, -57382, -111460, 108923, 53913, 72835, 173195, 201745, 145819, 185568, 211003, 179962, 243085, 120510, 13461, 233839, 344828, 320287, 276856, 64163, 68953, 252508, 254717, 393402, 368362, 177843, 100634, 109518, 324298, 180454, 230282, 359100, 366041, 327017, 274592, 357182, 287575, 41549, 183767, 26370, 197705, 306749, 245844, -53368, -63315, 43126, 350431, 436189, 578591, 451668, 382962, 237012, 122426, 220217, 207957]
1536B07957o1875J72052K11077k36712Q5113n6367j74262j30964J12892K64194
1526C93105j5560n0599J58489k17491j01849l12653L61271N1404k50628L74053
1516C89542J82152k57590J87421J16680k76509j61089J21281K33208k22077J49826
1506D62845j3872J46209o6697J09519J38253j73471j50490J29598M75J32959J28926
1495H44254K2584O4419J1582J80934J68541l1839R7773J68406L24467L29763J33494
1484B314378L73517j77139Q9619Q0420K78818L20677L91636Q05699J089453J518149
1474G085227K471765L698481M917966M312474K281809p24973m479910m127690
1466A5435149l000046k289073j730733j414589j225491j338356r60970q58708
$$ y = [207957, 146082, 318134, 529211, 292499, 377612, 321245, 146983, 16019, 128911, 393105, 377545, 326946, 485435, 267944, 166095, -146558, 214713, 266117, 15489, 389542, 571694, 314104, 501525, 618205, 341696, 180607, 301888, 535096, 313019, 462845, 448973, 595182, 528485, 638004, 776257, 602786, 452296, 581894, 582369, 715328, 844254, 866838, 931257, 942839, 1123773, 1292314, 1260475, 1358248, 1526654, 1851121, 2180884, 2314378, 2687895, 2510756, 2600375, 2680795, 2959613, 3280290, 3671926, 4477625, 5567078, 7085227, 9556992, 13255473, 18173439, 22485913, 24767722, 24042749, 19562839, 15435149, 12435103, 10146030, 8415297, 7000708, 5775217, 4436861, 3475891, 2617183]
1458B617183j07434j30851j20539j08831j63423j26909m08635k91510J46405l97741
1448I07715J24008j36664o5048k1934P7177n2589k2830M6166k56833R7747J25498
1437H22413P894j73400L0365k65502J04091O5019M2901k28940j25269N4958P0770
1426D05300j06679K6421L232O5912R6240k3100P4914r3520j71355M6135N4497
1415C77997J64176m6530k47635K6987j14421j1183M6138l7831J26987J6027k10616
1404I0096j69891K35504n4935J99288j10169R5479J07423j66493L5081q098j14479
1393A38806r0044J12561N0679J0224k11640N8942K8649J11740k71049r6635J79041
1382B1274K07059j88077j04457l3710M45865k16088k2748N7943n8894m7028l61
$$ y = [2617183, 2509749, 2378898, 2258359, 2149528, 1986105, 1859196, 1450561, 1159051, 1305456, 907715, 1031723, 895059, 830011, 808077, 885254, 832665, 809835, 856001, 599168, 696915, 822413, 830307, 656907, 687272, 421770, 525861, 590880, 633781, 404841, 279572, 334530, 405300, 298621, 325042, 328274, 394186, 490426, 467326, 542240, 448720, 277365, 323500, 377997, 542173, 495643, 248008, 274995, 160574, 149391, 195529, 157698, 284685, 300712, 90096, -79795, 155709, 100774, 300062, 189893, 285372, 392795, 226302, 261383, 253285, 138806, 48762, 161323, 212002, 222226, 10586, 69528, 98177, 209917, -61132, -157767, 21274, 228333, 40256, -64201, -97911, 347954, 131866, 109118, 167061, 108167, 61139, 60778]
1371F0778p5636J15469O3693l1131n4454r6460k8124l1437o8297Q9150K25971
1360A69522O7825k69239N9769J55248j64746j93412J20244K35218J6320J85962
1350C82711J25641j86177k94888K2694K05537K57218j70288l32885J49808K0499
1340A79870m31091J51298M3885o486r5789K77911j65248n4911K83821J939j6383
1329A68816j08831J9200K05438j11979m3416k657K54219J7947k06908R6982j00012
1318A88799j22254l6342j55254k17642L16362M2655j80050J54144P1126q1271
1308a9727l14360J37249P4826K34936J6507N0945J57851k30166q6566p929k03270
1297a89704J99141o3230n789J64495q5726q4720Q9478r7995N840J32000j17841
$$ y = [60778, -14858, 100611, 164304, 133173, 78719, -17741, -45865, -77302, -145599, -56449, 169522, 237347, -31892, 27877, 183125, 18379, -175033, -54789, 180429, 196749, 382711, 508352, 322175, 27287, 49981, 255518, 512736, 342448, 9563, 159371, 179870, -251221, -99923, -56038, -62524, -158313, 119598, -45650, -100561, 183260, 185199, 168816, 59985, 79185, 284623, 172644, 129228, 126571, 380790, 398737, 191829, 288811, 188799, 66545, 30203, -125051, -342693, -26331, 16324, -163726, -9582, 61544, -19727, -334087, -196838, -122012, 112924, 129431, 180376, 338227, 108061, 21495, 13566, -189704, 9437, -53793, -59582, 104913, 19187, -65533, 23945, -74050, -68210, 63790, -54051]
1286e4051j05227O1578J85636O7845M2018j48543j92263K6927J59009N3171j15921
1275a9821P3732J2138n3180j65863K68346L30822j19942m38260J20412J98542
1265B06926m454o8368m5633k57161m6638K46164J05298j47733k90915q5042M25291
1254C7735K32669j37835j6939j37737m86L90532l4623l70936j28516K06176P2487
1243A12527j79282J15844N7929j43981j51643M26928O5276l25690q0184J00870
1233a406J42900j73829k63194L4615J64605M6445o3598L58780k36879J19581q4232
1222D3788K0140R7765N2603K4305M9785l23513N8010K9973Q9765j69230j64732
1211a91341n5385K06815m8192Q6847l4977r3464P9823J53146J40360q0995j09991
$$ y = [-54051, -159278, -97700, 87936, 155781, 197799, 49256, -143007, -116080, 42929, 96100, -19821, 53911, 66049, 12869, -152994, 115352, 446174, 326232, -112028, 8384, 206926, 202472, 134104, 88471, -168690, -215328, 30836, 136134, -11599, -302514, -387556, 37735, 270404, 132569, 115630, -22107, -22593, 367939, 333316, -37620, -166136, 40040, 112527, -66755, 49089, 107018, -36963, -188606, 238322, 303598, -22092, -102276, -1406, 141494, -32335, -295529, -260914, -96309, -49864, -113462, 245318, 8439, 128020, 43788, 63928, 161693, 214296, 238601, 288386, -35127, 22883, 52856, 142621, -26609, -191341, -246726, -39911, -88103, -1256, -36233, -129697, -49874, 103272, 243632, 162637, 52646]
1200E2646J06157J41855M5629J68221q4021l27724j40416J73575M406m851k56302
1189a20825j46811j29538O4945L60620L6818q75k81828J42136J41806N8894P0085
1178A95427k3361J5185j23542J33072Q0617n7585k95610p7153J39254J09367k216
1167I3455k36491Q3216J8090j09306n0712r5510L15215j2183J6955r6130J45752
1156G2351K14531j7555l11245r2658K28682K44326j46592l1778l1638j29180k11033
1145b11789J29068J42169L2545l5803k8050j46493J9491L5389R0662j94471j12500
1134b79782L15945J92259P9055o8192j04800M1041J10364o2314P81k14356k6622
1123a6621J13148j52368j30224j3855O2337J11167J77047j83258l2794K39298
$$ y = [52646, 158803, 300658, 346287, 514508, 430487, 102763, -37653, 135922, 140328, 135477, -120825, -267636, -397174, -332229, 28391, 65209, 64334, -217494, -75358, 66448, 125342, 195427, 172066, 187251, 63709, 196781, 277398, 219813, -75797, -152950, -13696, 95671, 93455, -143036, -59820, -41730, -151036, -201748, -297258, 17957, 5774, 22729, -73401, 72351, 286882, 269327, -41918, -134576, 94106, 338432, 191840, 160062, 128424, -756, -211789, -82721, 59448, 91993, 56190, 28140, -118353, -98862, -63473, 27189, -167282, -279782, 36163, 228422, 307477, 239285, 134485, 175526, 285890, 223576, 224357, 10001, -16621, 96527, -55841, -186065, -199920, -137583, -26416, 150631, -32627, -65421, 173877]
1113A73877j97942o05K23212m4864j23069J581L0653O8569J88143j73328k86917
1102a40690J08250L69429k99223k04992P4560J9223J10275m716j60834J8401J68655
1091E8338m0002j12387L61759R3509j11379j14680p1847Q973j1613j08102N8494
1080A1063L5442j1234K77583j86148j78646j43429L2646R9374j56379K55527o7555
1069c1756k29381m5258J82350K62516N4513o8238p9376L00391O8423k35278j45380
1058C3526j7340L6971n744j48926j39456J898l2260J40629J57404k66457J97048
1047d2707R5288j25681J32856l5140l16616R9050J14321J47552P799j14805J17274
1036G9191Q6384o5216j27050j9496k10500j23565K91410Q8589l5557k71390J86872
$$ y = [173877, -24065, -24670, 198542, 153678, 30609, 32190, 62843, 131412, 319555, 146227, -140690, -32440, 336989, 37766, -167226, -92666, -73443, 36832, 32116, -128718, -110317, 58338, 18336, -94051, 267708, 361217, 249838, 135158, 63311, 72284, 60671, -47431, 11063, 46505, 35271, 312854, 126706, -51940, -195369, -162723, -63349, -219728, 35799, -31756, -261137, -306395, -124045, 138471, 192984, 124746, 45370, 345761, 414184, 178906, 33526, 16186, 53157, 47413, -101513, -240969, -239071, -271331, -130702, 26702, -239755, -42707, 52581, -73100, 59756, 24616, -292000, -192950, -78629, 68923, 76722, -38083, 79191, 165575, 100359, -26691, -46187, -256687, -380252, -88842, -253, -35810, -307200, -120328]
1025a20328l7289J53327o035j51332J1134N8885K68329K3052j27065j07246j90996
1014b25564j81166J5447L95335K08019m9570p9557j98165J79148K1094k36260
1004a51239n4107J11555l51791K43918J59490K1962J44556r5433J24172j45873
994G210N5696J72171K2555k09730j1732K59289r0691k67114R0902j56245p1348
983a99037J81309K43135k22380k7444J06515m9439L4823o8964j3991j19487J12665
972b2295Q2380p1436N5245J11671o5484K72615m2438m44926j03738K28630k5793
961b5569j62266k1401Q3988J77317R0501j94301J6187m5755K165Q9011j7764Q0816
949G2929n612j42976j26691N760K8171q620l575L7627L4454k35195O6763J12119
$$ y = [-120328, -157617, -4290, -10325, -161657, -150523, -91638, 176691, 199743, 72678, -34568, -225564, -406730, -391283, 4052, 212071, 162501, 82944, -115221, 63927, 85021, -151239, -205346, -93791, -445582, -201664, -42174, -20212, 124344, 28911, 153083, 7210, 62906, 235077, 257632, 47902, 36170, 295459, 204768, -62346, 28556, -127689, -199037, -17728, 225407, 3027, -24417, 82098, 32659, 67482, -1482, -15473, -134960, -22295, 60085, -11351, 43894, 155565, 90081, 362696, 320258, -124668, -228406, 224, -25569, -187835, -209236, -125248, 52069, 142570, -51731, -35544, -81299, -79134, 9877, -7887, 72929, 67317, -75659, -202350, -196590, -168419, -177039, -180614, -142987, -108533, -343728, -276965, -164846]
937a64846Q0571N2865j86052j20830J10629J25106J15684O0711j39276j97345
927b62783J71521M529P2001Q4337j99769Q7329j63177J68471J76827k31134j53801
916b45649K37941K8285r7795Q415j75520M5762J599K8733M4602J36598R555j6787
904E739K51508Q7817r730m03097k88722M10862J15130N1608j5926j29145k04504
893a28460J55679m1530j72833J09409J35539K81767k65537j78977J27949K36733
883B59739k50784l89004P8087J24877K34872J82930k08181q2497P5626J44718
873A70383j6502k45625j25206K62541J52739J71240j65048l73989j82690J71525
863a80632n5618J50271O3221J2034j31983j10653J83705K5558N0093m27008k2576
$$ y = [-164846, -84275, -31410, -217462, -338292, -227663, -102557, 13127, 73838, -65438, -262783, -91262, -86733, -14732, 69605, -130164, -42835, -206012, -37541, 139286, -91848, -245649, -7708, 20577, -77218, -68803, -244323, -198561, -196962, -168229, -123627, 12971, 22526, 5739, 257247, 345064, 335334, -67763, -356485, 54377, 169507, 221115, 205189, 76044, -128460, 27219, -14311, -187144, -77735, 57804, 339571, 74034, -104943, 23006, 259739, 8955, -380049, -301962, -177085, 57787, 240717, 32536, -49961, 25665, 170383, 153881, -91744, -216950, 45591, 198330, 369570, 204522, -169467, -352157, -180632, -236250, -85979, -22758, -10724, -142707, -253360, -69655, -44097, 5996, -421012, -443588]
852d43588L73394J72607N8844r6685j74288j4500l7193K48842J46521j06436k72700
841a45182J08648J39481J50701m96694r1308J17524n786j401J86070o1846r3181
830a92974R8660o4268J15021n0990n7175J90246J08158j77992J62629K51907l60684
819B2538j11120J11897j43238j33842r870M40931j58956k91212M4943J08629j27329
808b46629Q3048K59348j01576k84624M0970K08818M7078j21233M4371q422q9206
797a68057L25493J78417o0504k71045l609K37710k85014p8346r0445J9213M8047
786a48140L7809J70336j16807L6423M695K04162O3781k71108n6035L5728j0390
775d9546j16096J98731K54131k36494k04220P8419k23479K81755K65724j49965
$$ y = [-443588, -70194, 102413, 161257, 64572, -109716, -124216, -161409, 87433, 233954, 127518, -145182, -36534, 102947, 253648, -243046, -334354, -216830, -222616, -224017, -37947, -99793, -192974, -94314, -158582, -43561, -94551, -151726, 38520, 146678, -31314, 131315, 383222, 22538, -88582, 23315, -119923, -253765, -263635, 177296, 18340, -272872, -227929, -119300, -246629, -163581, 95767, -5809, -290433, -249463, -40645, 6433, -114800, -70429, -78851, -168057, 157436, 335853, 275349, 4304, 695, 238405, -46609, -124955, -215400, -196187, -148140, -110331, 60005, -56802, -20379, -15684, 188478, 252259, -18849, -74884, -39156, -49546, -165642, 33089, 287220, 50726, -153494, -75075, -298554, -16799, 248925, 98960]
765I8960q7731N4781J39997O9145q7296j77909N6274J9351p4687J02399N6096
754A69380k8933r6455r3147Q7909j77p6769j17047J45431M9821J2593k06529k08804
742c62727J27949J38626k0317L9868j85422J74172J32816k18385K56836j6826
732F6590J12843l9507R2363K8130k30948j45430l3905j26297J35717j13044j08762
721c62250R4456L32714p93k20150m5408m03N618K55879j86994j3128J74043j04690
709g1106J47743J33935r4570k11269n6535K4331L00513l23765J57841m5714j02318
698a40914J85471n2395j91968R446M1269N2106L30464J30021m23612K84578p9691
687A44775j16591K29826k47363k72892J54602J98100q6229N6737j83079J62038
$$ y = [98960, 11229, 66010, 206007, 275152, 187856, 9947, 66221, 85572, 10885, 113284, 169380, 140447, 43992, -49155, 38754, 38577, -38192, -155239, -9808, 40013, 52606, -153923, -362727, -234778, -96152, -116469, -76601, -262023, -87851, 44965, -173420, 83416, 66590, 179433, 139926, 232289, 260419, 29471, -115959, -149864, -276161, -140444, -253488, -362250, -267794, 64920, 64127, -156023, -201431, -201834, -196216, 59663, -127331, -140459, 33584, -71106, 76637, 210572, 116002, -95267, -151802, -127471, 173042, -150723, 7118, -38596, -140914, 44557, -7838, -199806, -190360, -149091, -96985, 233479, 363500, -60112, 224466, 144775, 28184, 258010, 10647, -262245, -107643, 90457, 4228, 60965, -122114, 39924]
677C9924j32344p3737P9710M1153k50082J40252L01396J42048k00858j40419r0023
666a42980R7712J36375j09768N7779j01175L3934J40496j36326j43457J74207
656F797l7431j19397p1130K87722J4215o301l35517K0570J58037K813o1503J42187
644A062m0658j18863N5018j33191L14295j17509J11336L83303k39867j09250j25496
633a9820j37476n3861j38802K04224K83228k4457l25564q9679K63486r1018r230
622a38969n8619J59173J16674L632L7178j03355J49064l7014k01047m2246K36013
611A20484N5313M2399q4590k98452N3293K14947j49948q6450j18657j87392O7072
600c71981K59716l5972k36284J54046O9946Q6697o596k8716N0637L8351j56275
$$ y = [39924, -92420, -166157, -86447, -45294, -295376, -155124, 146272, 288320, 87462, -52957, -142980, -45268, 91107, -18661, 39118, -62057, -28123, 112373, -23953, -167410, 6797, -30634, -150031, -221161, 66561, 80776, 74475, -261042, -240472, -82435, -79622, -141125, 1062, -39596, -158459, -103441, -236632, 77663, -39846, 71490, 454793, 214926, 105676, -19820, -157296, -211157, -349959, -145735, 137493, 113036, -212528, -302207, -38721, -129739, -138969, -197588, -38415, 78259, 81891, 119069, 15714, 164778, 127764, -73283, -115529, 120484, 175797, 218196, 133606, -164846, -111553, 103394, -46554, -133004, -251661, -439053, -371981, -112265, -148237, -384521, -230475, -160529, -73832, -80428, -109144, -58507, -20156, -176431]
589a76431K47814K31765j42870j82929k57000K81807J94256k59024k1605o9207
579a53424m9241j19385j43388K29015K05719r0768l15652J29965M9196O8039J47856
568d2068j34093J79761J54101l7812n3818R0934k01242L2318k3321m549N2175
557A2386k9708l4674J6498k29318j72104L66584P9718j37739J04175K60864q9238
546A47444k337q2591M4296R6589k3840l76093j4870J56512J82466j59770j58252
535a90446p6310L12107J3877p5187K5789k14759m1512J89830J84661j97922N8466
524a1406m3031j13988p6532j28726J87226L55044j5884j16312M1804l60163n7863
513c39831K14721P6678j68266R6416r2499O4740R8875k00854R4605N3447j38695
$$ y = [-176431, 71383, 303148, 160278, -22651, -279651, 2156, 196412, -62612, -84217, -153424, -202665, -322050, -465438, -236423, -30704, -121472, -437124, -307159, -257963, -189924, -42068, -176161, 3600, 157701, 119889, 66071, 157005, -44237, -11919, -35240, -39789, 12386, -17322, -51996, -35498, -264816, -436920, -70336, 9382, -128357, -24182, 236682, 147444, 145107, 62516, 106812, 203401, 179561, -196532, -211402, -54890, 127576, -32194, -190446, -266756, 45351, 59228, -15959, 9830, -204929, -246441, -56611, 128050, -69872, -11406, -54437, -168425, -244957, -373683, -186457, 168587, 152703, 36391, 78195, -281968, -339831, -125110, -48432, -216698, -120282, -212781, -148041, -49166, -250020, -155415, -101968, -240663]
502b40663J30243K7286j56979r4114j2141r042K01464L3856M5858J4814k32143
491b91561L1352L375L19827l2670j71910j1856O943l721p4627K79909k08800j1770
479a65509J3473l5225K03441J35271L7629l45007j84235K26637K93712j76116
469D071l79814l1815J44229N5143J67309K7541K12503k50241k8552N2500M8906
458B1780m4125q4827P1032k6726K0012j0405k66586J83695j68111K127K42477
447e9657o0464J9906K43804n5772m80650K22137J19549r2529K16537j5149l16935
436b59223l8426K86932J82504R5317l75995N1797q9752j54341n450j317J23371
425a84583j56665P425J42852P1066Q6819j06238J85066K6050j53471K48566P444
$$ y = [-240663, -110420, -83134, -240113, -334227, -346368, -355410, -153946, -120090, -74232, -59418, -291561, -260209, -256834, 62993, 30323, -141587, -153443, -146500, -150221, -224848, 55061, -153739, -165509, -152036, -187261, 16180, 151451, 189080, -155927, -340162, -113525, 180187, 4071, -375743, -407558, -263329, -208186, -40877, -13336, 199167, -51074, -79626, -27126, 21780, -22345, -107172, -36140, -62866, -42854, -53259, -319845, -136150, -304261, -302134, -59657, -120121, -100215, 143589, 87817, -392833, -170696, -51147, -143676, 72861, 57712, -259223, -297649, -10717, 171787, 267104, -108891, -57094, -146846, -301187, -306637, -307954, -184583, -341248, -333823, -190971, -119905, -33086, -139324, 45742, 71792, -81679, 166887, 174331]
414A74331j93979j9723j0973r5745K52597j42964j70858Q6020J91249j59858l9260
403a29163Q7644r9660R5696N1425j14504n8527q017j73616R4596J5609K35966
392b551L4324J42358q684k45430j71913K68779j69913r2902J40101j03j9802j42779
380b68515N3011j08196R7508K18137j66134O0892O9210k34362P6516p0719R8338
369a74314q2185J29049j53687N3596K48474M0745m0656M1454j6636j04493Q4770
358B6117j34685j1547j92930q3890L17385M4361o6929l33546j18659L11929J11818
347a30576k4414N5628J62367j06239n6974J50884q8689L8291R5299o4186J476
336C2867J11670j50481K09842j78931r8987j64499R3749J31410k32471j4545J24228
$$ y = [174331, -19648, -39371, -50344, -146089, 106508, -36456, -207314, -121294, 69955, -89903, -129163, -41519, -141179, -45483, 5942, -108562, -167089, -175106, -348722, -254126, -238517, -2551, 31773, 174131, 165447, -79983, -251896, 16883, -153030, -245932, -105831, -105934, -125736, -268515, -215504, -323700, -226192, -8055, -174189, -113297, -44087, -278449, -201933, -272652, -174314, -256499, -127450, -281137, -227541, 20933, 61678, 21022, 62476, 45840, -58653, 26117, -108568, -120115, -313045, -396935, -79550, -35189, -102118, -435664, -554323, -242394, -130576, -154990, -99362, 63005, -43234, -100208, 50676, -38013, 278, 95577, 31391, 32867, 144537, -5944, 203898, 24967, -74020, -238519, -144770, -13360, -245831, -260376, -136148]
325a36148k54038J23211N7790P6191K4606O4103Q5436j84568n1004M14560j11236
314A08903o4782J15607j13057p3118o8971L0302j45676l7499O8546P5340j19489
303b23894q8928n3806J73465P0217p5011j34904Q6273L1203k28772L28591Q5500
292c0066j23969R5009m0816K15380J1826l01689m8310J71442J5059J1990r3895
281a18039j62426J10418l1142l03477Q7580K38629n5969j71932j4321O3025L42542
270a5112k43765L5480J13037J64739j39747J25607L7126m6486P276k2073k13389
259a97307n1224k4145j48046K57451p435l55039J15594L2051K14516J69989k25102
248b18697J70795O4847k08115R0694J83623j66882O3203M1107j30042J5020j20318
$$ y = [-136148, -390186, -266975, -209185, -132994, -108388, -44285, 41151, -143417, -194421, 220139, 108903, 44121, 159728, 46671, -26447, -95418, -65116, -210792, -248291, -179745, -104405, -223894, -312822, -366628, -193163, -122946, -197957, -332861, -246588, -215385, -444157, -115566, -30066, -154035, -59026, -99842, 115538, 127364, -174325, -222635, -51193, -36134, -24144, -118039, -280465, -170047, -201189, -504666, -417086, -178457, -234426, -406358, -420679, -357654, -15112, -258877, -223397, -110360, 54379, -85368, 40239, 77365, 30879, 38155, 16082, -197307, -248531, -272676, -420722, -163271, -170706, -525745, -410151, -378100, -163584, 6405, -218697, -47902, 16945, -191170, -100476, 83147, -83735, -20532, 20575, -109467, -94447, -214765]
237b14765Q0939J46632k69192l40515L29928K25030J51785o5744j23319q4494
227a63715J32589P9032l21691n1936K44117J11898k78473P8959J08295o0085N734
216a15276O1701n403K6799J86798j12977j71945q3454j27922J31427n7232N4552
205b12932q5760o5293J57990L9102r4685L4482L3482j5762j2882K16256K4561
194A8559j57265P9007O8571p2382J73828j90179J4207k30047j95889J46967k4591
183c69214n6748j06047k7166K4405L49874K30560j67740k567K47043L0860j06456
172D6804o1490q4919q2235m2610j7073j4q3641r8755K27369l6009K5292N5291
160a51990j0032L4590K1135j81646O2036M8584J50725j04195O2336j61868j14440
$$ y = [-214765, -133826, 12806, -256386, -596901, -266973, -41943, 109842, 44098, -79221, -163715, -31126, 47906, -273785, -325721, -81604, 30294, -248179, -169220, -60925, -121010, -115276, -53575, -58978, -32179, 154619, 41642, -130303, -213757, -341679, -210252, -267484, -212932, -298692, -363985, -205995, -166893, -261578, -227096, -193614, -209376, -222258, -6002, 18559, -138706, -59699, 8872, -63510, 110318, -79861, -65654, -295701, -491590, -344623, -369214, -425962, -532009, -559175, -534770, -184896, 45664, -122076, -124643, 122400, 153260, 46804, -14686, -99605, -181840, -224450, -241523, -241537, -325178, -423933, -196564, -232573, -207281, -151990, -162022, -127432, -106297, -287943, -225907, -177323, -26598, -130793, -68457, -230325, -344765]
149c44765K24924Q1471q260K0539Q2744j02512l9757K6003m0142j62680j1599
138b74034N3323M6425m425L2272q7815J05089q4838p3693O3096J55418l5416j70719
126b75317J05192m312R1749K05153m8969j36210k24726n6876J54558J45576j13639
115a57821k89212J08543K63756k00190Q2043j35417J02593P8817P5276M2468J40173
104A11029L0842j09557k01053l4812Q3090J02329j50786l39796N9813K59049o4535
93b54387j40855K12652J04910r1676j98239K40385j5587j18642j5419J22562J98974
82D4678q7031M9577j00147j49124J05537K24691j77886r7006j25677K04563j50335
71b58160m0496J34016L1313j52088p9471J73197J13640l9215Q611M7967m9276
$$ y = [-344765, -119841, -38370, -46630, -26091, 56653, -45859, -85616, -59613, -99755, -262435, -274034, -220711, -174286, -178711, -146439, -234254, -129165, -214003, -287696, -224600, -69182, -104598, -275317, -170125, -174437, -82688, 122465, 73496, -62714, -287440, -344316, -189758, -44182, -157821, -447033, -338490, -74734, -274924, -192881, -328298, -225705, -146888, -71612, -29144, 111029, 141871, 32314, -168739, -203551, -120461, -18132, -168918, -508714, -448901, -189852, -254387, -395242, -182590, -77680, -169356, -367595, -127210, -142797, -261439, -276858, -154296, 44678, -42353, 7224, -92923, -242047, -136510, 88181, -89705, -186711, -312388, -107825, -258160, -298656, -164640, -133327, -285415, -364886, -191689, -78049, -117264, -108653, -60686, -109962]
60a09962K8493j67829N338q3148K6712m148J06665q2600K7275N1300J03516j72838
48b71226j2558m2159l6350N4650K35921J219j60344O447P6487j17266Q1022J04726
36g9431q3161m6378K226o9252M0732M6609j4983k61454J06395P4403J41305N9573
24h3416k68706R2252P1108J02841J16408j88545k02507J20466K36003k4070m1136
13f9302N1451j70456k3387L2759Q050N1969q8942r5225J03083j07567P4720Q0463
1a52384M2076
0a10308
$$ y = [-109962, -81469, -249298, -243960, -327108, -300396, -304544, -197879, -280479, -253204, -201904, -98388, -271226, -283784, -325943, -362293, -307643, -71722, -70503, -230847, -224400, -147913, -265179, -184157, -79431, -162592, -208970, -206744, -275996, -235264, -188655, -203638, -465092, -358697, -284294, -142989, -83416, -352122, -259870, -188762, -85921, 30487, -158058, -360565, -240099, -4096, -28166, -69302, -17851, -188307, -211694, -178935, -170885, -118916, -207858, -303083, -200000, -307567, -232847, -152384, -110308]
$$ Imaginary data points
##PAGE= N=2
##DATA TABLE= (X++(I..I)), XYDATA
16383c879708N6917J00023j35214j02622J64359K64716j34719P8563M0086j26100
16373c673699J13667J39910m2464M3861J23099J66098M2487q9001L1227j4924
16363c159739N6388R3377J16008R7674p761J1207J47792k9810k5253n6346J25538
16352b630925O6604j18849N8893Q0516L0761P91K20362q7265J1310J01410J28230
16341b138162p869o2260J37723J41641J54181p5594j08354J30013l5351p2460
16331a936492J13530O8139J00801j20627J27898N9989J06657N2246Q279m5466
16321a465046q8043J05866J13148J4524p127N6787j0131O9873J422J47754k04910
16310a265883n6926J96467M89606J9335k26677q9673j1152J75727o6011L7400
$$ y = [-3879708, -3822791, -3722768, -3857982, -3960604, -3796245, -3531529, -3666248, -3587685, -3547599, -3673699, -3560032, -3420122, -3462586, -3418725, -3295626, -3129528, -3087041, -3176042, -3144815, -3159739, -3103351, -3009974, -2893966, -2796292, -2804053, -2792846, -2645054, -2674864, -2700117, -2756463, -2630925, -2564321, -2683170, -2624277, -2543761, -2513000, -2512209, -2291847, -2379112, -2367802, -2266392, -2138162, -2146031, -2208291, -2070568, -1928927, -1774746, -1850340, -1958694, -1828681, -1864032, -1936492, -1822962, -1754823, -1654022, -1774649, -1646751, -1586762, -1480105, -1427859, -1419580, -1465046, -1553089, -1447223, -1334075, -1319551, -1326678, -1269891, -1280022, -1210149, -1208727, -1060973, -1265883, -1322809, -1126342, -636736, -617401, -844078, -933751, -944903, -769176, -835187, -797787]
16300g97787J8208K22034P0787j5008K3183J29095q9206q2565o7536O0491J93637
16289c34667N2684k07085J19028K26710o5716r9167j1201J94009J4098r0577m4479
16278b46363K55616k9988P016Q1896J23300k7032j92567J38620J35739P974P3819
16267C28030K21364J226p4699k09116Q8403O3506p4696l4977K5951O8987R3377
16256D97356J31442J9009j20101m7778N0825l335J43798j18789J6905J59349n217
16245G23464J51824K9662J26913j36320j57595p210O3339K71096O9507k94065
16235H40615J5818O8907J70477r0963P5003M5214j8779n8595J61717Q5838q4632
16224A210620j03870J27496q6927j75595M16223k33475j00587J92217J72782J0256
$$ y = [-797787, -779579, -557545, -486758, -501766, -478583, -349488, -438694, -521259, -588795, -528304, -334667, -281983, -489068, -370040, -143330, -209046, -308213, -319414, -125405, -111307, -201884, -246363, 9253, -20735, -13719, 68177, 191477, 164445, -28122, 110498, 246237, 254211, 328030, 549394, 550620, 475921, 266805, 355208, 418714, 344018, 309041, 334992, 403979, 497356, 628798, 647807, 527706, 479928, 530753, 527418, 671216, 552427, 569332, 728681, 723464, 875288, 904950, 1031863, 895543, 737948, 730738, 794077, 1065173, 1134680, 840615, 856433, 925340, 1095817, 1004854, 1079857, 1125071, 1106292, 1047697, 1209414, 1295252, 1210620, 1106750, 1234246, 1147319, 971724, 1387947, 1154472, 1053885, 1246102, 1418884, 1429140]
16214A429140k39149p361J36487M29735j01456j87374J26926k05034J1396L5862
16204A429172P9550K52059n8070j22086m0439p6031R0748j97173k59720K58087
16194A356097L18420J27800J43754j35644J27179j19706q3274N0146J63900l16863
16184A631809J45725J35010k8050j87814k6745K58537q6823k98600K21675L76032
16174B140756k75446P5049J16838r5104J26326m4000k50097O6531J16448j01711
16164A875590P6906Q8862R7485L37671j57600j83708j12170J57834K1822j97288
16154B005404P6169j2834q4729q5323J38136P1397k04830M2711J80431O8541j04008
16143B091065R3303k8307J12775L7215j51223R1474l8931k4531K11473J21960
$$ y = [1429140, 1189991, 1182630, 1319117, 1748852, 1647396, 1460022, 1586948, 1381914, 1393310, 1429172, 1508722, 1760781, 1702711, 1580625, 1540186, 1464155, 1554903, 1357730, 1098010, 1356097, 1674517, 1802317, 1946071, 1810427, 1937606, 1817900, 1734626, 1784772, 1948672, 1631809, 1777534, 1912544, 1884494, 1696680, 1669935, 1928472, 1841649, 1543049, 1764724, 2140756, 1865310, 1940359, 2057197, 1962093, 2088419, 2044419, 1794322, 1860853, 1977301, 1875590, 1952496, 2041358, 2138843, 2476514, 2318914, 2135206, 2023036, 2180870, 2202692, 2005404, 2081573, 2068739, 1984010, 1898687, 2036823, 2108220, 1903390, 1946101, 2126532, 2195073, 2091065, 2184368, 2156061, 2268836, 2306051, 2154828, 2246302, 2207371, 2182840, 2394313, 2516273]
16133B516273m40629j8322m2745r387J28985l2669o5913L2943n9179K2951n4782
16122A977526J63896M2917j12551O5427J22631K98028J03011k01583j29677j24266
16112B205359K40775p9428l05420N6924M7351J29874P3498n200k92188l7437K41754
16101B275862q1296n9217j1573N9029J74794J51468m1931J32977K0128j48003
16091B472238o273L6089m6795k6909J98417l7839j80209q1821J19974M9824J540
16080B498236k17395j31731J32113J79718m446L8346j60425J82448L346o356k19543
16069B294311J35825O988J92643j39629p2998K02163q8181j0873L39j53151p244
16058B360193m4052j01862M0285J34052K4172O8136j55574J04159J1146j01046
$$ y = [2516273, 2075644, 2057322, 2014577, 2005190, 2134175, 2101506, 2035593, 2068536, 2009357, 2032308, 1977526, 2141422, 2184339, 2071788, 2137215, 2259846, 2557874, 2660885, 2459302, 2329625, 2205359, 2446134, 2366706, 2061286, 2118210, 2165561, 2295435, 2368933, 2363733, 2071545, 2034108, 2275862, 2194566, 2135349, 2123776, 2182805, 2357599, 2509067, 2467136, 2600113, 2620241, 2472238, 2465965, 2502054, 2455259, 2428350, 2626767, 2588928, 2408719, 2326898, 2446872, 2496696, 2498236, 2280841, 2149110, 2281223, 2460941, 2456495, 2494841, 2334416, 2516864, 2520210, 2513854, 2294311, 2430136, 2437124, 2629767, 2490138, 2417140, 2619303, 2531122, 2520249, 2520588, 2367437, 2360193, 2316141, 2214279, 2254564, 2388616, 2412788, 2480924, 2325350, 2429509, 2440655, 2339609]
16048B339609N5056J21058J53804k79201L6315J62661J3215k7108k52190j08545
16038B214674J07306N0643k0720k39573J77255M18316j43956k47331J42204j74538
16028B284280J09176j22623l716j7474O6866R4080R4393J15535l6052p9800j58327
16017B346338j07297K17854K29549r6129j07984M652j05899j14945J33023K1159
16007B420321m8273n4488q832J88795J77820n3732j04279j61207J35991Q1190
15997B573306n0242r6091o8783R3900J01683N5184j21569L0659K8583o1529N7696
15986B542797R3710k50347M747J00360O5931j1898O8594j17488m5838Q6825N2593
15975B589986j14407j81941M8264Q821J69093L2777j09890M6428N8802p4689M2591
$$ y = [2339609, 2394665, 2515723, 2669527, 2390326, 2426641, 2589302, 2602517, 2575409, 2323219, 2214674, 2321980, 2372623, 2351903, 2112330, 2289585, 2707901, 2563945, 2316614, 2458818, 2284280, 2393456, 2270833, 2267117, 2249643, 2316509, 2410589, 2504982, 2620517, 2584465, 2504665, 2346338, 2239041, 2456895, 2686444, 2590315, 2482331, 2486983, 2381084, 2266139, 2399162, 2420321, 2372048, 2317560, 2308728, 2497523, 2675343, 2621611, 2517332, 2356125, 2492116, 2573306, 2523064, 2426973, 2358190, 2452090, 2553773, 2608957, 2487388, 2518047, 2546630, 2485101, 2542797, 2636507, 2386160, 2390907, 2491267, 2557198, 2545300, 2613894, 2496406, 2450568, 2537393, 2589986, 2475579, 2293638, 2341902, 2350723, 2519816, 2552593, 2442703, 2489131, 2547933, 2473244, 2515835]
15964B515835K8473j50018j02085K53305k121R974Q9615l4944j49366j66226K96742
15953B589184j30541p8347o3940O7557r5758J66603O6594m2288J9991l422m6225
15942B449408P4648j98614k6257K63826J14363p1306J627j6335j51948j01318
15932B338094j73695J6483J4294J26887L21230p660j74246J16363p7738j85206
15922B314806P754J16524j25275J60541J53736j74439l8278o2584k74978L21323
15912B399130K62019l99462j12914M17869K5034m3634Q4165k11261l8806j6638
15902B365502k3404J03617j82506K7215K10074o5694m9727K46121Q0086j12319
15892B598965j3248j15564K8227P3920j62382J92468Q3632j72195k6918J09156
$$ y = [2515835, 2544308, 2394290, 2292205, 2545510, 2543389, 2553363, 2642978, 2608034, 2458668, 2292442, 2589184, 2458643, 2380296, 2316356, 2383913, 2288155, 2454758, 2521352, 2479064, 2499055, 2495633, 2449408, 2524056, 2325442, 2299185, 2563011, 2677374, 2606068, 2607695, 2591360, 2439412, 2338094, 2164399, 2180882, 2195176, 2322063, 2643293, 2635633, 2461387, 2577750, 2500012, 2314806, 2322560, 2439084, 2313809, 2474350, 2628086, 2453647, 2415369, 2352785, 2077807, 2399130, 2661149, 2261687, 2148773, 2566642, 2591676, 2548042, 2632207, 2420946, 2382140, 2365502, 2342098, 2445715, 2263209, 2290424, 2500498, 2434804, 2385077, 2631198, 2711284, 2598965, 2585717, 2470153, 2498380, 2572300, 2409918, 2602386, 2686018, 2513823, 2486905, 2596061]
15882B596061p5130k3318O4506J21073p5154L5735l1433j81233Q3614J72250J8806
15871B705777k17900j09981J70270J25507k4949j58840Q3312q9841j63635n0449
15861B269271J87235O7214k18820J96910K73635j29813j91643M5406M8330j10790
15851B436935J59220n752p1312k14132j56560L7611N4152J02807N3887l30356
15841B066500N7709K14749K81932m6734k84961J8718J17231J914n1491P5793P022
15830B458382o6083p9005N9876o24j5802L600J4641N0932r9375q8508K43550j9758
15818B461826N6368k1001p2702R6139q3180l55048K08850K66819j85481P8089
15808B450679r8616k38935K05755J04567N1032M3773J4157k20043L00380J09134
$$ y = [2596061, 2520931, 2497613, 2562119, 2683192, 2608038, 2643773, 2612340, 2431107, 2514721, 2686971, 2705777, 2487877, 2377896, 2548166, 2673673, 2648724, 2489884, 2573196, 2483355, 2319720, 2269271, 2456506, 2523720, 2304900, 2501810, 2775445, 2645632, 2453989, 2499395, 2547725, 2436935, 2596155, 2590403, 2519091, 2304959, 2148399, 2186010, 2240162, 2342969, 2396856, 2066500, 2124209, 2338958, 2620890, 2574156, 2289195, 2307913, 2425144, 2427058, 2375567, 2451360, 2458382, 2392299, 2313294, 2373170, 2372546, 2356744, 2360344, 2374985, 2425917, 2326542, 2238034, 2481584, 2461826, 2518194, 2497193, 2424491, 2520630, 2437450, 2082402, 2291252, 2558071, 2372590, 2450679, 2352063, 2113128, 2318883, 2423450, 2474482, 2518255, 2532412, 2312369, 2612749, 2721883]
15798B721883r7854j06111j8472j12253j31342n6044J15920K5051O1100K97792
15788B699670q4774j17661o1263k41839J53891L81303N4968k11407j2847o2944
15778B497097r0231o483l1643O7723j4503M8174n3066K06986J27052j48155j37147
15767B465804j47486J11854j46479K86220K51j26039K20871j67379q8066j2963
15757B396588k27519K33439J48160O5870k89222P9027K70879j14153j03628j20341
15747B339100J31392Q0644j99406k8413J64576k9901k0135J5600k6843q8636J01345
15736B439323o6831J29451j04946J94377n4098l11679K08164L00800j18688N6500
15726B672373K4763k04106l26840J43257J20661K2873r6826j31120J2394N9541
$$ y = [2721883, 2624029, 2517918, 2499446, 2387193, 2255851, 2199807, 2315727, 2340778, 2401878, 2699670, 2614896, 2497235, 2435972, 2194133, 2348024, 2729327, 2784295, 2572888, 2560041, 2497097, 2406866, 2400383, 2368740, 2436463, 2421960, 2470134, 2417068, 2624054, 2751106, 2602951, 2465804, 2318318, 2430172, 2283693, 2569913, 2570164, 2444125, 2664996, 2497617, 2409551, 2396588, 2169069, 2402508, 2550668, 2616538, 2327316, 2406343, 2677222, 2563069, 2459441, 2339100, 2470492, 2551136, 2351730, 2323317, 2487893, 2457992, 2437857, 2453457, 2426614, 2337978, 2439323, 2372492, 2501943, 2396997, 2591374, 2537276, 2225597, 2433761, 2734561, 2615873, 2672373, 2697136, 2493030, 2166190, 2309447, 2430108, 2452981, 2356155, 2225035, 2237429, 2296970]
15716B296970R5443L7866Q3763M4401K4837J04196J8918k38306J25497n506k34746
15705B353333n950L45365k31111l88996o3723L05948L58743R4735k11543k87346
15695B269455O0999L1582j0917j04449K81336N5283k02458Q7789L2649M3647Q3045
15684B627961k57417p9329J73857J31441j32890J2017p0104j94620K6180N4969
15674B292065J9472n1407R8385l5324K34181J77572m83224O2211J41445j13874
$$ y = [2296970, 2392413, 2430279, 2514042, 2558443, 2583280, 2687476, 2706394, 2468088, 2593585, 2588079, 2353333, 2347383, 2692748, 2461637, 2072641, 2008918, 2314866, 2673609, 2768344, 2556801, 2269455, 2330454, 2362036, 2351119, 2246670, 2528006, 2583289, 2380831, 2468620, 2501269, 2544916, 2627961, 2370544, 2291215, 2465072, 2596513, 2463623, 2475640, 2405536, 2210916, 2237096, 2292065, 2311537, 2260130, 2358515, 2323191, 2557372, 2734944, 2251720, 2313931, 2455376, 2341502]
$$ [...]
##END NTUPLES=NMR SPECTRUM
##END=
