##TITLE=1H_EC-3378(12)
 200.13Hz, CDCl3.
 8 sc
 
 23.4.2026
##JCAMPDX= 6.0         $$ Bruker NMR JCAMP-DX V2.0
##DATA TYPE= NMR SPECTRUM
##DATA CLASS= NTUPLES
##ORIGIN= UXNMR, Bruker Analytische Messtechnik GmbH
##OWNER= pz
$$ XWIN-NMR		Version 3.5
$$ Thu Apr 23 14:24:51 2026 Russian Standard Time (UT+4h)  she@DPX200
##.OBSERVE FREQUENCY= 200.131
##.OBSERVE NUCLEUS= ^1H
##.ACQUISITION MODE= SIMULTANEOUS
##.ACQUISITION SCHEME= undefined
##.AVERAGES= 8
##.DIGITISER RES= 18
##SPECTROMETER/DATA SYSTEM= spect
##.PULSE SEQUENCE= zg30
##.SOLVENT NAME= CDCl3
##.SHIFT REFERENCE= (INTERNAL, CDCl3, 0, 16.4179)
##AUDIT TRAIL= $$ (NUMBER, WHEN, WHO, WHERE, WHAT)
$$ ##TITLE= Audit trail, XWIN-NMR		Version 3.5
$$ ##JCAMPDX= 5.01
$$ ##ORIGIN= Bruker BioSpin GmbH
$$ ##OWNER= she
$$ F:/spectra/data/she/nmr/H-C/1/pdata/1/auditp.txt
$$ ##AUDIT TRAIL=  $$ (NUMBER, WHEN, WHO, WHERE, WHAT)
(   1,<2026-04-23 14:22:58.46 +0400>,<she>,<DPX200>,
      <created by zg, POWCHK disabled, PULCHK disabled
       configuration hash MD5:
       00 E9 B6 7A A2 85 ED C7 34 08 36 98 17 FE 4E 26
       data hash MD5: 16K
       3D 4E 86 2D E2 94 43 D7 8E 4B F5 10 8B 05 68 F8>)
(   2,<2026-04-23 14:23:26.25 +0400>,<she>,<DPX200>,
      <Start of raw data processing
       efp BC_mod = 2 LB = 0.25 FT_mod = 6 PKNL = 1 PHC0 = -4224.116 PHC1 = 14.59229 SI = 16K 
       data hash MD5: 16K
       44 89 9B E7 E5 EF 0F CC 9B 63 07 04 A9 9F E6 2D>)
(   3,<2026-04-23 14:23:49.96 +0400>,<she>,<DPX200>,
      <pk PHC0 = 161.6991 PHC1 = -3.4 
       data hash MD5: 16K
       D4 88 7B 8B 0F C1 C4 33 C9 F9 E8 24 71 C3 31 DC>)
(   4,<2026-04-23 14:23:54.67 +0400>,<she>,<DPX200>,
      <abs ABSG = 5 
       data hash MD5: 16K
       3D B8 8C 58 8E 72 69 0F F0 C9 8C 69 3C 39 6C 2A>)
$$ ##END=
$$ 
$$ hash MD5
$$ EF 0E 1E 13 B1 8A F1 27 0B 22 07 76 75 0C 56 AF
##$RELAX= 
##$RELAX= 
##$RELAX= 
##$RELAX= 
##$RELAX= 
##$RELAX= 
$$ Bruker specific parameters
$$ --------------------------
##$DU= <F:/spectra>
##$EXPNO= 1
##$NAME= <H-C>
##$PROCNO= 1
##$TYPE= <nmr>
##$USER= <she>
##$AMP= (0..31)
100 100 100 100 100 100 100 100 100 100 100 100 100 100 100 100 100 100 
100 100 100 100 100 100 100 100 100 100 100 100 100 100 
##$AQSEQ= 0
##$AQ_mod= 1
##$AUNM= <au_zg>
##$AUTOPOS= <>
##$BF1= 200.13
##$BF2= 200.13
##$BF3= 200.13
##$BF4= 200.13
##$BF5= 200.13
##$BF6= 200.13
##$BF7= 200.13
##$BF8= 200.13
##$BYTORDA= 1
##$CFDGTYP= 0
##$CFRGTYP= 5
##$CHEMSTR= <none>
##$CNST= (0..31)
1 1 145 1 1 1 1 1 1 1 1 1 1 1 1 1 1 1 1 1 1 1 1 1 1 1 1 1 1 1 1 1 
##$CPDPRG= <>
##$CPDPRG1= <>
##$CPDPRG2= <>
##$CPDPRG3= <>
##$CPDPRG4= <mlev>
##$CPDPRG5= <mlev>
##$CPDPRG6= <mlev>
##$CPDPRG7= <mlev>
##$CPDPRG8= <mlev>
##$CPDPRGB= <>
##$CPDPRGT= <>
##$D= (0..31)
0 0.7 0 0 0 0 0 0 0 0 0 0.03 0 0 0 0 0 0 0 0 0 0 0 0 0 0 0 0 0 0 0 0 
##$DATE= 1776939778
##$DBL= (0..7)
120 120 120 120 120 120 120 120 
##$DBP= (0..7)
150 150 150 150 150 150 150 150 
##$DBP07= 0
##$DBPNAM0= <>
##$DBPNAM1= <>
##$DBPNAM2= <>
##$DBPNAM3= <>
##$DBPNAM4= <>
$$ [...]
##$SUBNAM3= <"">
##$SUBNAM4= <"">
##$SUBNAM5= <"">
##$SUBNAM6= <"">
##$SUBNAM7= <"">
##$SUBNAM8= <"">
##$SUBNAM9= <"">
##$SW= 18.0517599122864
##$SWIBOX= (0..15)
0 0 2 0 0 0 0 0 0 0 0 0 0 0 0 0 
##$SW_h= 3612.71676300578
##$TD= 16384
##$TD0= 1
##$TE= 0
##$TE2= 300
##$TE3= 300
##$TEG= 300
##$TL= (0..7)
0 120 120 120 120 120 120 120 
##$TP= (0..7)
150 150 150 150 150 150 150 150 
##$TP07= 0
##$TPNAME0= <>
##$TPNAME1= <>
##$TPNAME2= <>
##$TPNAME3= <>
##$TPNAME4= <>
##$TPNAME5= <>
##$TPNAME6= <>
##$TPNAME7= <>
##$TPOAL= (0..7)
0.5 0.5 0.5 0.5 0.5 0.5 0.5 0.5 
##$TPOFFS= (0..7)
0 0 0 0 0 0 0 0 
##$TUNHIN= 0
##$TUNHOUT= 0
##$TUNXOUT= 0
##$USERA1= <user>
##$USERA2= <user>
##$USERA3= <user>
##$USERA4= <user>
##$USERA5= <user>
##$V9= 5
##$VALIST= <valist>
##$VCLIST= <CCCCCCCCCCCCCCC>
##$VD= 0
##$VDLIST= <DDDDDDDDDDDDDDD>
##$VPLIST= <PPPPPPPPPPPPPPP>
##$VTLIST= <TTTTTTTTTTTTTTT>
##$WBST= 1024
##$WBSW= 4
##$XGAIN= (0..3)
0 0 0 0 
##$XL= 0
##$YL= 0
##$YMAX_a= 298431
##$YMIN_a= -587146
##$ZGOPTNS= <>
##$ZL1= 120
##$ZL2= 120
##$ZL3= 120
##$ZL4= 120
##$ABSF1= 16.55125
##$ABSF2= -1.500645
##$ABSG= 5
##$ABSL= 3
##$ALPHA= 0
##$AQORDER= 0
##$ASSFAC= 0
##$ASSFACI= 0
##$ASSFACX= 0
##$ASSWID= 0
##$AUNMP= <proc_1d>
##$AZFE= 0.1
##$AZFW= 0.1
##$BCFW= 0
##$BC_mod= 2
##$BYTORDP= 0
##$COROFFS= 0
##$CY= -3
##$DATMOD= 1
##$DC= 0
##$DFILT= <>
##$DTYPP= 0
##$F1P= 0
##$F2P= 0
##$FCOR= 1
##$FTSIZE= 16384
##$FT_mod= 6
##$GAMMA= 0
##$GB= 0
##$INTBC= 1
##$INTSCL= 3.241238e-09
##$ISEN= 128
##$LB= 0.25
##$LEV0= 0
##$LPBIN= 0
##$MAXI= 10000
##$MC2= 0
##$MEAN= 0
##$ME_mod= 0
##$MI= 1.114404
##$NCOEF= 0
##$NC_proc= -5
##$NLEV= 6
##$NOISF1= 3.799351
##$NOISF2= 2.8
##$NSP= 0
##$NTH_PI= 0
##$NZP= 0
##$OFFSET= 16.41792
##$PC= 1
##$PHC0= -4062.417
##$PHC1= 11.19229
##$PH_mod= 1
##$PKNL= yes
##$PPARMOD= 0
##$PSCAL= 0
##$PSIGN= 0
##$REVERSE= no
##$SF= 200.129520647742
##$SI= 16384
##$SIGF1= 3
##$SIGF2= 2
##$SINO= 0.751879
##$SIOLD= 32768
##$SREGLST= <19F.Aceton>
##$SSB= 0
##$STSI= 16384
##$STSR= 0
##$SW_p= 3612.71676300579
##$SYMM= 0
##$S_DEV= 0
##$TDeff= 16384
##$TDoff= 0
##$TI= <>
##$TILT= no
##$TM1= 0
##$TM2= 0
##$TOPLEV= 0
##$USERP1= <user>
##$USERP2= <user>
##$USERP3= <user>
##$USERP4= <user>
##$USERP5= <user>
##$WDW= 1
##$XDIM= 16384
##$YMAX_p= 327190341
##$YMIN_p= -759737
$$ End of Bruker specific parameters
$$ ---------------------------------
##NTUPLES= NMR SPECTRUM
##VAR_NAME=  FREQUENCY,     SPECTRUM/REAL,   SPECTRUM/IMAG
##SYMBOL=    X,             R,               I
##VAR_TYPE=  INDEPENDENT,   DEPENDENT,       DEPENDENT
##VAR_FORM=  AFFN,          ASDF,            ASDF
##VAR_DIM=   16384,         16384,           16384
##UNITS=     HZ,            ARBITRARY UNITS, ARBITRARY UNITS
##FACTOR=    0.220516191357248, 1,           1
##FIRST=     3285.71029131115, 0,            0
##LAST=      -327.00647169464, 0,            0
##MIN=       -327.00647169464, -759737,      0
##MAX=       3285.71029131115, 327190341,    0
$$ Real data points
##PAGE= N=1
##DATA TABLE= (X++(R..R)), XYDATA
$$ [...]
13414 -234667 -13389 -8857 -131254 -182756 -84 86654 224536 224528 103194 19934 -89446
13403 -89446 -443857 -142372 -61389 -443724 -61678 -29738 2144 35187 51457 -371238 -3507
13392 -3507 -141002 -295083 -230355 -342281 3555 137295 16959 -100461 -84793 160725
13382 160725 136521 -43759 38752 -4046 -347798 -240743 -302006 -308989 -115699 -205907 72817
13371 72817 13095 -102097 -248382 -354394 -252612 -74656 -97904 -104817 -166718 -228171 -193977
13360 -193977 -424571 -233178 15047 -209038 41772 -203943 -67759 140059 42192 -84408
13350 -84408 5809 -232786 -364956 -204413 -211055 -14237 -20890 32625 -63434 10394 36413
13339 36413 -195102 -117987 -127827 -379422 -68445 -7045 -208708 -61927 -207953 -319259
13329 -319259 -387308 -416349 8782 90912 9942 15633 42843 -121292 -161995 -63817 -9091
13318 -9091 -105505 -113458 -269061 -191079 -72596 -202798 54983 262204 -214621 -423540 -196545
13307 -196545 -195657 -261596 -167955 -59112 77154 96053 -104109 -390607 -216846 -4969 -111156
13296 -111156 150594 11485 131270 78095 -262602 -348981 -283955 -232680 -222245 -332503
13286 -332503 -149265 23930 -101458 -16716 85432 -24175 -79042 -236581 -216957 -71728
13276 -71728 -204950 -81519 7050 24253 148208 -161284 -271131 -276336 -225196 96125 141596
13265 141596 244009 224384 149794 9372 -151576 -88813 -125210 -24784 364697 196982
13255 196982 -82942 199110 206253 372191 500700 251778 229462 139193 312922 235991
13245 235991 29947 221865 296670 26746 -123573 132661 203580 34631 398922 376254
13235 376254 265006 224698 43988 -49744 -231178 -188456 38057 65478 -261994 28294
13225 28294 121409 -23621 -70558 -219747 159325 13478 -328211 -175073 -155702 -143596
13215 -143596 229289 261123 77022 222974 109903 -65065 134521 353701 199843 -95915
13205 -95915 -42696 -12435 1811 312501 243706 470300 648040 213463 190337 59209 -76560
13194 -76560 -51976 -80678 52479 -54754 -8046 79501 172894 184885 22879 69490 184750
13183 184750 291126 252424 357604 357778 334417 366306 126878 22227 217407 -27633 -66818
13172 -66818 -91183 -13527 127225 195754 162014 224279 529047 395165 -21252 -14964 -6839
13161 -6839 -279821 45869 359784 166365 -278 120933 -3421 -49805 194776 254865
13151 254865 127516 320046 315691 350029 298736 266413 -34659 226164 291287 84448 89349
13140 89349 11628 159631 180148 81701 -60367 116757 187014 49356 -202142 -133739 57631
13129 57631 -303664 -245761 209414 315141 62677 178602 134634 44855 33969 -185079
13119 -185079 -130970 20282 165313 188630 -239446 -222290 -88278 -144131 189599 199350 145491
13108 145491 177751 142515 -309426 -237756 -301432 -400180 -187538 -168586 -68518 -284629 81043
13097 81043 123363 100050 521057 388186 106174 -28896 201532 85840 -92567 84174
13087 84174 393282 183096 185789 89907 -7669 3002 -3915 -106842 -283323 -241458 -302648
13076 -302648 61458 -99915 -83190 119167 -145088 -132344 -407716 -298327 -235090 -140070
13066 -140070 66903 -13868 420574 389703 259020 153758 -28311 -65807 8968 218087
13056 218087 258278 237945 150494 27133 71113 93397 110790 -74720 -11161 78190 135412
13045 135412 181363 86751 156759 -152174 -124442 -84398 87115 158138 163959 405235 289165
13034 289165 -189875 89533 125984 59966 322004 115619 93649 -140180 -60730 82537
13024 82537 164239 -54472 -204591 -114176 -227859 -129439 -322668 -35381 72371 -173698
13014 -173698 -206972 -208730 109832 -17869 52739 194830 -110992 -61464 -149039 55717 376077
13003 376077 591868 285206 21628 -37141 -158855 -277843 -156930 148912 42143 -169456
12993 -169456 -121262 -276462 -124310 365159 275789 520621 238881 -21663 2086 -34181
12983 -34181 207432 462850 151749 207246 213876 -70817 -27138 52823 -149953 93874 -226700
12972 -226700 -289083 -83918 -70315 -23006 -97178 -33431 -149222 -133605 33068 40813 -257238
12961 -257238 -25912 104601 -14690 40436 182114 84323 170031 78063 -153224 -412309
12951 -412309 -311083 -266665 -148796 -9886 175115 342491 -15242 -12703 173156 214208
12941 214208 80238 391777 352756 241762 -121029 -112082 149460 123115 225890 227168 123200
12930 123200 191235 512309 275938 216782 404660 608036 374771 137346 126325 -1209
12920 -1209 60244 109400 100655 117312 10449 102586 16103 -120432 67864 105832 130582
12909 130582 146663 7123 288 326055 364758 325626 513671 201254 -204874 -136531 8052
12898 8052 -62017 -17191 -73328 7655 122428 12139 90490 37787 200789 177177 121579
12887 121579 -102804 -138827 144652 281232 -96671 -20382 343767 229674 147527 -177467
12877 -177467 -245275 -189910 46692 127843 143335 93208 95155 -135340 -408187 -90935 -58157
12866 -58157 -286054 -153240 122729 121077 -228899 -92213 -63752 -164601 17250 -136329
12856 -136329 -155402 70447 89249 26747 -94047 -60593 -108394 -197534 -326141 -355073 -25480
12845 -25480 -51741 -48790 225405 -178431 -69608 -127704 -356413 -68779 -217689 -429283
12835 -429283 -551468 -420090 -375846 -102215 304868 395698 348597 175305 -111901 -203626
12825 -203626 -170454 -189051 -83589 211999 241978 122734 -4219 6100 -76606 -135120 -6239
12814 -6239 83033 193923 -77570 33582 -292376 -411574 -260522 -276512 -24160 -39001
12804 -39001 67175 137269 -217216 -47865 -93435 -349330 -209154 -294015 -573873 -478270
12794 -478270 -356784 -378625 -133050 -25803 157705 -42929 -266069 -142928 -295667 -356182
12784 -356182 -233364 127604 -105336 -417384 -77552 -29094 88613 128613 222910 155423
12774 155423 -18308 25528 -35244 86375 402065 63396 268576 256944 108089 -159512
12764 -159512 -22478 -187074 121505 -7763 -220632 142714 41945 153141 7476 -147284
12754 -147284 5449 12791 -375279 -268916 89378 57290 -11574 188453 102957 380729
12744 380729 315683 130733 148726 -28831 41449 269313 -32666 87664 159797 -27869
12734 -27869 129638 -40125 -186108 -209888 -56046 -138468 12884 129039 119976 139563 -30595
12723 -30595 217829 167351 -97871 -193932 -145658 -11664 -218943 -94106 -60655 7531 -37142
12712 -37142 67471 -78876 -146510 86154 105392 55682 -62332 -55986 -225843 -317233 -172075
12701 -172075 -111271 -217356 -384535 -269207 -63525 -255829 -504353 -366397 -68116 -207075
12691 -207075 -25338 -82276 51415 39906 126083 15020 132770 -67884 -10653 -100797
12681 -100797 -222443 165343 26143 -57229 78357 77627 -210881 -596461 -217153 4775
12671 4775 181598 183031 159613 248519 55653 -105251 -250010 -258173 -191886 -11578 -47189
12660 -47189 99940 118397 290077 317600 232234 349782 53306 -70750 -186542 -307546
12650 -307546 -190073 70055 16578 7000 107101 -30652 -90596 -149818 -101484 41451 -5863
12639 -5863 -20104 36961 125199 95252 56988 153001 232162 272339 168621 122235 -8690
12628 -8690 -47664 -15073 -109752 -273679 -213411 -371177 -342177 -560728 -424924 -380965 -461454
12617 -461454 -210207 -302545 -497104 -518854 -610860 -402292 -229933 26986 -84033 -82766
12607 -82766 -114214 -236302 -309492 -54574 -64412 -79444 -53921 -14356 -99561 -112294 -175979
12596 -175979 -52929 -52531 -232720 -297731 -477897 -22504 288163 36848 -25641 119914
12586 119914 61665 -144988 -125912 158703 -242456 -129070 -43624 117384 197226 431358
12576 431358 88999 -147042 -128587 -363210 -136067 -154284 -384933 -220291 -61961 -287886
12566 -287886 -30986 -8459 -176467 -312327 -295014 -392383 -322920 -36638 -196070 -124978
12556 -124978 144870 -128838 -10073 107414 324581 143855 -121417 -12907 54769 236564
12546 236564 189614 214701 48546 -165638 -197298 21280 -103016 -80512 -86600 -77838 7023
12535 7023 49157 -24806 -174565 -42794 89914 244547 345044 22260 5248 76595 126689
12524 126689 -261724 232777 240407 154139 413232 83340 -313012 -276193 -179574 -291168
12514 -291168 57764 -93266 -95792 39336 -5437 -336561 -204149 -174437 -65031 75898
12504 75898 68958 -30598 -444411 -204765 -94180 91090 171643 236979 460524 132393 63530
12493 63530 117755 -102449 23569 310112 -98724 -159607 183253 35763 43903 111899 34007
12482 34007 200920 186114 133113 -34548 -143878 -74555 26879 476 193486 251312 356126
12471 356126 514893 121727 173988 141836 -400834 -80508 82469 41477 -94267 101787
12461 101787 215374 18995 -23679 -161158 95479 30667 8666 86897 262494 183282
12451 183282 94309 37357 -68683 -13921 -32941 -47994 69364 -149986 -214376 -193819 68035
12440 68035 251685 4407 195117 225526 -100965 -125660 -29231 293630 -6938 6408
12430 6408 -146111 -112246 37122 -78747 231186 116303 96491 -166551 -101003 197058
12420 197058 291629 72041 -34520 38206 -216820 -29595 -63772 107134 133873 81852
12410 81852 143578 -254108 -42136 -127822 -255584 -121868 244556 152893 -73570 438520
12400 438520 163934 -272576 -472590 -552674 -440754 -362810 -282066 -313697 -326141 -425992 -134567
12389 -134567 -141942 -227375 -212811 -219018 -82890 -116169 125207 377505 298176 359030 235735
12378 235735 5306 -171029 -98132 -181595 -105041 -96034 -162042 -185216 -133560 -58220 -104031
12367 -104031 -131981 -348128 -315395 -399882 -379021 -25315 11121 -45559 51673 134704 -113780
12356 -113780 -62981 -56649 160043 161209 62532 -19691 172066 278358 1914 64273 -19290
12345 -19290 -76068 -131715 -36913 -243066 -16388 116409 -81715 79310 -144563 -8701
12335 -8701 84640 17776 313504 340944 42885 421077 448114 116271 -6325 13102 26850
12324 26850 -71872 -113262 110732 166072 179533 41689 256528 358321 27534 141692
12314 141692 3677 146996 347104 195732 -204906 38812 194154 96890 76873 190478
12304 190478 232216 303631 12559 -100296 66673 172169 -28632 66134 123662 201166
12294 201166 188738 22824 -328351 1965 96340 101663 187035 102724 164435 -108901 -104188
12283 -104188 -145028 -169698 -9700 -22289 -125726 -98818 -36626 138792 -37494 -211989
12273 -211989 -299792 -148330 -27374 -183896 -160210 -6870 -204302 -223336 -122684 -171131
12263 -171131 -44194 -75628 -54432 -427960 -127116 293623 167531 123675 273656 322013
12253 322013 219582 98937 -50074 -79838 212281 136244 181554 -6131 274952 149084
12243 149084 -143058 19301 -103302 -38978 -58288 396914 -19208 -76927 -216465 -271696
12233 -271696 -103732 7311 91919 -95170 -88041 94593 -111213 -27955 204689 -38421
12223 -38421 -121601 139168 -170493 -139928 52852 172663 301152 201472 74213 -79337
12213 -79337 -38929 -250595 -137590 -12680 103247 12759 -21283 12091 -70433 -21239 -76809
12202 -76809 120214 129518 -29446 -244236 109450 94921 -267309 -216082 -320906 75008
12192 75008 17854 -275622 -32454 -75523 -25802 -47734 -44899 102899 22590 -43975 -230575
12181 -230575 -351002 -182458 -131548 170597 8911 20287 -164453 -10160 181685 222729
12171 222729 268191 -72775 146781 192428 341283 281151 631543 313480 -243221 -263652
12161 -263652 -420992 -428476 -423343 49622 26873 -121431 -121682 -101734 -122477 -207324 -389153
12150 -389153 -108822 -94107 -64722 325546 425195 202976 -1911 -82863 -51045 -14815 42017
12139 42017 206960 487676 596961 470641 671066 47670 86377 34651 -132607 -135921
12129 -135921 70830 192414 148894 146402 101740 151136 -231471 -30219 -60755 -198290 -100667
12118 -100667 -232433 247036 183398 150945 339446 170287 30988 75333 376664 254402
12108 254402 195222 170733 195865 -17650 244227 158726 152739 99165 5160 29224 39377
12097 39377 341293 257314 172253 -115371 -123972 -170192 -211412 -245251 25051 78033 -62608
12086 -62608 -31442 41286 -97445 -90856 -57420 269467 -128916 -105139 -122365 23662 270887
12075 270887 180452 188841 295876 121809 -72350 30115 154682 276955 352405 353269 300710
12064 300710 342271 149501 29128 135402 359428 304294 198981 73318 82543 167132
12054 167132 116243 153021 80365 11486 204907 -19944 -77412 -223669 -89119 100198
12044 100198 20341 102731 -43812 -181275 -155594 -445550 -398446 -131211 103123 -211772
12034 -211772 194236 56741 -309851 -97148 46550 47538 -280648 48831 -37087 -152636
12024 -152636 257986 231066 -17837 -68502 -146601 -97335 62909 271323 54964 115460
12014 115460 132804 -25327 -34010 44854 241071 276670 192297 -186308 -19029 32733 -223916
12003 -223916 -441243 -142801 -27356 -60825 -197629 -268490 -152707 -208268 -344121 -165738
11993 -165738 -146179 -478776 -309388 -117879 74914 -42005 -134467 -116021 -492 -28116
11983 -28116 -142626 47498 135292 -52408 -252339 -318880 -132666 -175687 -89149 62476
11973 62476 -55275 -177372 -342619 -48324 14813 172477 34137 195287 52169 34081
11963 34081 4495 -246137 -234047 40331 -14166 -333706 54467 71579 -184582 -179319 -83125
11952 -83125 -203172 2776 69095 91471 170474 -6877 -35552 -49952 -312151 -212704 -577806
11941 -577806 -432526 -252929 -228422 -247445 -96260 17729 -150498 -13678 2743 182447
11931 182447 -89928 -94191 95855 -107090 -10869 -161662 -98749 -212723 -289758 -259166 -483528
11920 -483528 -26626 20879 -148659 -80703 39152 66164 -212576 -81039 46476 90840
11910 90840 169982 -148197 -139299 199645 372550 202961 32155 -13273 -297294 -441927
11900 -441927 -418727 -123784 13598 -185351 141523 -15651 -171210 -43561 -253647 -137166
11890 -137166 -268862 -159465 -210075 -328733 -300542 38842 255759 -81742 -96717 -156792
11880 -156792 -26250 -49078 -75814 129253 173310 369696 162848 221873 47456 154301
11870 154301 125510 -29070 346551 311467 58956 -325868 -30828 52975 56468 156105 44714
11859 44714 63861 -75604 173782 267251 288916 505498 345406 355974 -146694 -129059 -141382
11848 -141382 173701 39152 -183395 131045 133718 181381 21557 -36142 -178468 -35662
11838 -35662 -361503 -305176 -83989 -82687 3414 -348926 -496718 -460950 -201600 -220718 -196654
11827 -196654 -63245 -146252 -177378 -195612 149525 128513 200328 -134451 -226429 7093 138664
11816 138664 59453 151907 102326 186062 144476 -9867 53884 127779 207964 30542 8812
11805 8812 102796 217878 234907 238122 98272 349644 28427 -42406 68241 176819 106738
11794 106738 33724 28356 -95818 98099 -152497 -452 -134913 -23938 9158 15141 337752
11783 337752 186930 117463 66092 -90359 -335019 -395101 -339458 69885 -77319 40579
11773 40579 122292 172365 120527 139929 286108 270662 38178 -20802 55744 -99414 -172433
11762 -172433 -459343 -303086 -298446 -394298 -304327 -84907 -141690 -591806 -390105 -204009
11752 -204009 -149514 -434148 -317464 -181599 -289226 -544899 -656585 -487710 -281557 -120682
11742 -120682 -124915 -248230 30804 84785 -413474 -51665 112067 -180647 44742 61219
11732 61219 -43665 39822 -185071 8757 69605 -105780 -134768 -72554 -193012 -126112 -18972
11721 -18972 -106755 -35167 2340 -68106 80199 -72174 -195096 -186858 -96962 9606 33197
11710 33197 -78612 -215279 137700 -17118 -157996 80944 196422 -33577 24318 -134950
11700 -134950 -353601 6123 6008 -128576 -58589 206399 119551 144984 60093 126885 32379
11689 32379 -663 -68621 48487 67850 -83615 -132698 -322283 -463611 -77278 -89511 -120761
11678 -120761 72061 41826 -39645 -101531 6316 -48545 11161 344048 234144 242470 194496
11667 194496 -61118 -251401 -198185 -204547 -231842 27916 -69774 151033 337089 257573 208329
11656 208329 -10149 48041 -140525 -338983 -279237 -237222 -116039 -374649 -212082 -385828
11646 -385828 -209035 -39591 -61138 -193306 -25149 -349386 -440274 -80952 27773 8629
11636 8629 -255435 -166720 -157811 -153069 -198809 67137 -99378 -484460 -755331 -594639 -496913
11625 -496913 -578359 -485442 -332296 -236954 -229355 -391774 -74610 154363 -90115 142641
11615 142641 286497 200629 -91621 104654 49177 136417 410077 313635 330635 316960 -46599
11604 -46599 106988 426800 -12398 236302 409815 269176 445518 74322 141264 -12806
11594 -12806 -126821 -269320 -90304 66375 10680 -194459 -252711 -135200 -419885 -349843
11584 -349843 7593 311600 321547 143167 142777 9160 -13769 184628 -20702 -91427 -183938
11573 -183938 63707 203795 54862 -156545 -624906 -266216 -24142 259500 424643 211908
11563 211908 366462 -146067 -663846 -540642 -218466 -147493 81302 -52428 378586 -75406
11553 -75406 -193851 -126949 14673 345269 -204683 -14965 62937 99607 -130113 107689
11543 107689 172483 30717 43169 10384 -31484 -346711 -221339 -299211 -222625 -279114 -388037
11532 -388037 32319 140180 138559 6136 8080 -95290 -295560 -66472 12209 291006
11522 291006 290827 9113 -200321 134913 7261 -78120 152056 -158322 -17976 -97741
11512 -97741 -356822 -157062 -51275 -182739 -418507 -112440 60982 87050 350904 200543
11502 200543 50038 25332 56574 -67850 61000 -88060 19824 -123786 -229752 -5950
11492 -5950 245654 245431 95538 2193 -165318 154240 154103 -16553 -129373 45467 -63858
11481 -63858 -79141 78232 145688 105935 121043 108999 -210736 38231 17173 9695 28589
11470 28589 -42395 302221 135573 147520 40573 111261 262073 110514 56099 188442
11460 188442 -128110 -256033 -162095 -558997 -195679 62445 -60145 -198307 -250330 -35689
11450 -35689 177470 127460 5385 -180728 10598 -149378 -233883 -208628 -108805 -136523 -272922
11439 -272922 -152904 -12816 32357 192773 178617 -34930 87829 -48183 -198701 -83622
11429 -83622 229863 175288 123541 56925 136065 228517 -51678 -106868 -29633 103773 125940
11418 125940 -151471 -459719 -309067 -126818 -153298 107517 188289 26643 -53823 -66239
11408 -66239 73050 -19032 99529 -12358 -191391 -414122 -659203 -441813 -66480 32107
11398 32107 -438179 -364786 -219918 -488031 -464479 -326940 -274219 -247203 -263157 -210726 -97503
11387 -97503 -294344 -213707 -26829 -116110 -194188 -251092 -153901 -269952 -164945 -370655 -273929
11376 -273929 -9654 73254 22615 47168 87295 -23099 -11442 50049 86022 -148311 -238278
11365 -238278 -131971 -13838 -46964 -150268 -277995 -90401 120418 -18233 35429 -34515
11355 -34515 -61747 -44410 -74726 -12990 -156923 185986 -56067 -54637 -91917 -119705 88305
11344 88305 -190293 -268464 -170763 178617 217221 459138 687380 453969 151435 -108918
11334 -108918 -121857 320287 86945 113581 198295 188374 158303 147332 242884 266668 399078
11323 399078 137600 -187696 -20351 44269 -50925 -71470 135913 254916 391802 359775
11313 359775 346696 335012 167065 292278 317326 599373 188629 132519 134212 -14677 62916
11302 62916 39714 158552 194714 -12023 43371 -11304 40809 54876 -21209 -116736 -76368
11291 -76368 -402287 -395400 -76048 -237917 -88549 -337102 -73469 15601 -220324 -23840
11281 -23840 -206285 -152254 -90985 -749 355217 179613 16735 -51384 187671 201787 268548
11270 268548 302640 184060 -31917 -55684 93512 24799 230821 117313 47473 -57475
11260 -57475 -137600 -6422 100976 220058 314548 286170 233524 -125350 -64677 -144241 45625
11249 45625 -4443 -39310 135413 112154 -109793 -146482 -148323 -197657 -105441 -151806 126315
11238 126315 395523 226704 -271491 122493 -121748 -233129 -61615 20125 150133 -173173
11228 -173173 -282331 -181138 -249010 -328320 -238937 -96030 190910 -171321 -613441 -518269
11218 -518269 -196669 -276945 -144486 86125 -65315 -113637 -353991 -151722 19167 64166
11208 64166 -28096 -166723 117479 -27038 -390230 -153450 -29283 -67091 40744 73231
11198 73231 -144278 111805 147127 219020 -57416 -196409 -141571 -194873 203923 80775
11188 80775 126743 359039 589438 518759 294334 281158 55935 122485 82234 163881 354262
11177 354262 6668 -348467 -255997 -283312 -27190 49426 176014 236056 13169 -17866
11167 -17866 61665 325163 27693 59894 -34039 122504 -145929 -186802 14525 -68455 234130
11156 234130 121498 29304 161472 196905 116750 -50595 23471 24814 -121465 224604 89514
11145 89514 -5830 204653 -12851 -40164 22601 -59774 -99765 -87631 32804 170032 392330
11134 392330 268712 68347 111453 12163 109977 79769 52801 139176 84172 8001 -44957
11123 -44957 -121648 -10647 120545 141124 -43379 -273545 -149803 75485 -23403 81330
11113 81330 326972 127104 -94940 -181238 47119 181014 -213372 -296596 65344 17283
11103 17283 150505 353517 332748 486571 405392 189920 -153420 21157 91726 154297
11093 154297 82487 89257 -76600 -287791 -142003 -130123 -78377 -102475 -104509 -141762 -189436
11082 -189436 -89523 -150271 136416 96074 83710 -29823 -159020 181080 175373 24422 57150
11071 57150 264249 178965 183957 7645 145629 203948 -28465 -138353 13368 -149613
11061 -149613 -289808 -127436 -42839 37914 -305094 -514454 -241390 -357017 -102652 28528
11051 28528 308202 246562 -72020 10204 -366397 -352366 -194919 -151239 143467 188711 -258492
11040 -258492 -172619 155740 135479 214381 220768 189749 162153 -190703 -337853 -235988 4046
11029 4046 -166297 -131874 128672 -94056 -19543 144651 -101207 24804 -57088 -255361
11019 -255361 -271833 -243350 -66971 32063 204658 89263 9083 48336 26921 103178 339565
11008 339565 160683 132643 -225888 -246882 -288265 -234640 -328091 -266257 25551 107619 167761
10997 167761 93322 -138386 -10339 56520 53651 131334 -197436 -425651 -301998 -307705 -458585
10986 -458585 -289214 -261792 62534 39510 105424 -172327 30874 70454 74167 35519 -19576
10975 -19576 65421 232451 27464 -173282 -93579 -404381 -146686 -164875 -33551 69479
10965 69479 -5918 86294 87514 -60728 269067 401120 428229 177243 2067 -6028 -17148
10954 -17148 77725 168283 281375 -191188 -253528 -134343 -115410 19398 -165645 222800
10944 222800 309537 116638 -27817 -286116 -187136 10754 26657 -218083 -78366 50861
10934 50861 91334 143652 94089 94975 154463 -206809 31494 22989 209916 229572 27193
10923 27193 45355 -54382 -180700 -181996 45684 -17353 -8335 -247859 -211539 -376492 -199428
10912 -199428 260185 -94958 -7984 7556 -77750 -50456 -292110 -342324 -342842 -539152 -165500
10901 -165500 -78816 -122708 144788 -6553 -18562 -102386 83490 402471 148017 19443
10891 19443 -196975 -166621 -246937 -365809 325914 205782 4800 149741 -123394 -219845
10881 -219845 154590 136450 272257 302678 140370 154499 -148110 -249145 -103657 136378
10871 136378 -37787 -30332 120219 -17680 -150451 52369 236836 147385 272210 -143457
10861 -143457 -302161 -291251 -126835 189274 279289 303104 173830 307965 54374 -137890
10851 -137890 -32669 -76020 13191 -151851 -326966 -159823 -43588 218660 284021 276793
10841 276793 106518 51691 137274 68745 -24189 -329117 -278928 20570 31720 -5080 -195604
10830 -195604 -60898 214200 45199 126476 203138 161656 153852 -50630 160543 247593 92222
10819 92222 146035 138043 130050 37121 111826 29129 151671 16230 20963 85691 271074 269499
10807 269499 251220 113834 15461 109206 36635 -93243 -145413 12038 -43974 -110185 58633
10796 58633 292455 411066 297916 230604 287191 52832 41947 174045 13958 -309978
10786 -309978 -269802 -30218 7309 -87201 79835 530343 247499 378859 381942 168228
10776 168228 94494 -78790 -156029 -90160 128016 31000 306125 77335 315260 12640
10766 12640 275351 342604 164950 319754 65687 153221 -50884 499 -115469 50246
10756 50246 72924 269523 305512 404903 395449 143866 40779 231445 10266 -8991 148238
10745 148238 -31244 80086 68283 9101 365596 221594 188319 423544 210278 302931
10735 302931 221548 297240 -134164 -264174 -54966 5457 -114475 69169 385355 196027
10725 196027 78481 -52087 72297 -56199 -247309 -14587 33191 224361 -73799 -244042
10715 -244042 -267122 58735 3195 -159530 74786 -67168 -154737 -244628 -137420 41799
10705 41799 54235 166760 -28883 26830 -3223 -137214 -59315 -109655 -248608 -305372 -92213
10694 -92213 -26993 -30659 -88521 34514 346468 197882 -33214 268863 297366 65213 -255015
10683 -255015 -460835 -293928 -205768 -234680 321521 269744 -89399 -12513 94478 475124
10673 475124 91263 88534 172684 129326 -72287 -118862 228867 475774 220275 -276454
10663 -276454 -198877 -103046 -302471 -430694 -171169 65096 -110072 -415405 -210481 -452401
10653 -452401 -227826 -119420 -331177 214449 189033 -108795 111103 220907 35964 -145728
10643 -145728 -280578 35789 149807 91020 -7531 -70641 -135990 -1301 23106 -76045 110142
10632 110142 95046 288477 -54471 -68800 -135250 -92663 100553 264241 96332 208916
10622 208916 243895 282613 427408 185290 -146828 -135367 14147 160703 83576 -39595
10612 -39595 251251 275638 30646 -53956 125423 337549 367560 124616 189535 17433
10602 17433 -86383 90273 221947 321321 214913 68226 -89097 -76998 -14781 9689
10592 9689 88264 269738 241835 64176 -54838 40808 148655 -124464 63638 -15072 -231518
10581 -231518 -188380 -30696 62106 -160726 -17491 -170277 10945 -35950 243350 223241
10571 223241 229152 175819 -235929 -78932 -238488 -170919 88077 190982 352595 282358
10561 282358 -86639 -248254 -314717 -305626 -241568 129477 172209 -269893 -448511 -205691
10551 -205691 -126776 -52930 -1605 268419 152204 -42439 -68550 -319289 -264991 15187
10541 15187 267668 -5141 -13179 64028 -129496 109083 31685 213918 -53236 -10893 -198955
10530 -198955 -108540 -47118 -249248 -76037 177494 219017 235600 392537 143229 152919 243848
10519 243848 -13412 52507 -217298 12082 -48993 -293647 -115591 -144265 35319 96583
10509 96583 340255 145220 150574 -52911 133270 -192848 -209832 -29122 -267047 77535
10499 77535 141065 75114 182965 268098 342847 361492 171623 47433 -47957 -23154 -51508
10488 -51508 147523 470307 297300 115702 280701 434613 228929 16104 188971 281913
10478 281913 501225 163796 44709 399149 87496 55714 194909 250639 229149 43595
10468 43595 -95701 -214938 -32215 320532 308705 122869 28541 -86116 37341 -87404
10458 -87404 -446200 59313 68863 -7493 -182402 -277690 -173018 77300 260360 182089 80601
10447 80601 -72644 120896 242295 175538 501961 523403 338013 485389 500376 414550
10437 414550 228165 341367 452823 128804 -31882 22087 -155048 -291078 7234 -40202
10427 -40202 7128 -27404 -6033 183989 163154 16980 -20498 237872 235194 -53221 -117395
10416 -117395 -140362 -434273 -184456 -123493 83339 265005 -1214 20629 196083 273008
10406 273008 445674 219579 108759 -15208 -102474 -131460 -77014 -40341 17248 184004
10396 184004 364535 18842 -248774 -86866 18747 -48419 86871 -28712 -188786 -9379
10386 -9379 -264022 -57594 110598 -111802 -117424 72918 17043 -26890 -98769 -100422 -296424
10375 -296424 -240015 -97495 -76766 -183002 40707 12963 -64355 61092 -242813 93068
10365 93068 118675 229456 418583 74513 123696 133944 138808 241465 185184 6902 -19662
10354 -19662 -135012 210980 507734 107581 -94651 -100076 -329 -269492 -539232 -223168
10344 -223168 -19485 -176187 -104783 90293 -27741 -90396 169029 247114 224394 109018
10334 109018 -80398 -31218 -35970 105383 -24242 -98555 -1933 194852 81648 -323949
10324 -323949 -154933 174098 -81450 -129009 30041 -118256 46279 132054 119962 161836
10314 161836 194592 -69175 96889 -59091 -12119 201679 -109216 -82753 -226155 -203610
10304 -203610 -360022 -318425 -254457 -424388 -299298 -362152 105604 -368288 -531514 -403469
10294 -403469 -513533 -246780 -256886 -217141 -79410 -116173 -105020 91892 -158597 -98562
10284 -98562 206458 322426 28099 178707 49499 -153300 -114254 174000 17471 -168422
10274 -168422 -61486 946 -17316 -249943 -155344 -246565 -223860 -424438 -160095 -183294 -241318
10263 -241318 -144111 -167190 -51896 -120104 -109693 -243941 36960 -63143 -168575 -301696
10253 -301696 -417891 -287109 -10922 9245 38162 194187 -18307 -58711 -202207 -144215
10243 -144215 -194629 -314044 -210195 -75282 -213222 -164735 -321041 -293646 -115580 11295
10233 11295 79431 -75078 -189329 -257809 -70874 -6901 -29408 15493 93908 134431 -128206
10222 -128206 -102182 -319856 -423696 -229327 -315362 93380 579348 257046 183244 -32303
10212 -32303 -24798 -60598 -181931 -106403 46899 -58656 -187909 8473 -395948 -245960
10202 -245960 -233040 -273633 -544903 -318038 -160509 -37297 411331 -41977 -395058 177206
10192 177206 175388 -80762 331431 294243 175103 50191 194111 474161 632256 406348
10182 406348 101162 62501 -46788 101542 -108434 133986 432136 210262 -4701 -138637
10172 -138637 -18335 -31757 20905 -184025 -293871 -155021 90488 177080 96031 353982
10162 353982 125777 -131534 -209512 -341343 -227271 101831 203952 84418 312910 111974
10152 111974 -70747 158022 13667 -72896 20197 -80290 -160430 -112759 11461 -12375
10142 -12375 103524 -128279 53379 -53300 -262568 -125978 60996 239008 -212625 -210506
10132 -210506 -159281 -272812 -286744 -3976 -35775 112650 148628 82503 145238 201647 162374
10121 162374 59796 3979 121648 -54710 -58249 -157756 -200726 -230487 -73640 -137585 -31844
10110 -31844 -49122 -136854 -293164 -111792 146475 -62464 208008 268526 32790 -183899
10100 -183899 28439 -72693 -207565 95766 129142 165168 150042 -118657 641 117342
10090 117342 -89748 -198409 45576 -147859 125553 325620 450261 331431 -15738 -20534
10080 -20534 221558 195536 177057 275340 342588 371771 38398 51841 172693 249817 408106
10069 408106 343630 233307 136895 2636 -199345 -109012 234914 149845 16849 49022
10059 49022 76724 -123691 187875 151494 -24784 -25753 12672 395565 -7997 -73808 107156
10048 107156 160618 -258380 -288772 51281 -3082 -48279 -105511 -328041 -148391 -216641 -241394
10037 -241394 75972 426487 153308 -145033 -74203 19748 210914 95388 75309 36573
10027 36573 229214 -249494 -67460 131580 81223 146873 97551 188460 71828 -96142
10017 -96142 -27167 97756 17079 -61956 -159468 -50578 -44485 -101294 84400 335706 215897
10006 215897 238226 271433 387542 -19177 283 -125527 -229898 12246 18842 -69532 180913
9995 180913 332139 340797 466145 557695 195538 407546 617182 176576 -130573 -17320
9985 -17320 119804 88059 224127 233311 -2786 -136801 -292685 -352619 -262843 23314 288617
9974 288617 -28786 -121054 -127378 -158757 -188177 86869 307049 67027 -139546 -143160 -75487
9963 -75487 236853 -86719 -3735 -99661 -104541 -477979 -464344 -335498 -240785 14008 -344570
9952 -344570 -109279 21537 22499 -169850 -355276 -241292 -344275 -158664 -203608 -279086 -287946
9941 -287946 -397521 -135218 -150103 -272502 217617 283633 -89596 -20510 55867 -380732
9931 -380732 -198230 -125322 13497 -38153 -195166 20536 86661 103931 -42319 -120750 44392
9920 44392 -56907 -131449 92207 -7232 -49619 -2520 -125167 -211650 -115124 -207043 -266774
9909 -266774 403524 423505 3481 66161 318711 234308 139699 -93454 -247262 71202
9899 71202 118441 58742 161556 164148 92411 82946 58470 -25591 187443 9979 23756 95111
9887 95111 -305003 -362871 -214214 -89089 -4921 304498 271859 -51797 -23035 -14243 -78279
9876 -78279 -136310 -52379 -163644 -23815 46172 -36168 -1740 -113995 766 -12348 92572
9865 92572 354707 439843 216751 -107015 -273621 -44146 -535821 -153342 187736 -21202
9855 -21202 189196 82979 -312959 -287703 -131159 247213 152158 37846 -113475 -67654
9845 -67654 -70488 -157235 -91413 52120 60815 67358 77976 -159276 -98031 -276370 21723 164469
9833 164469 142955 256001 -138287 460 59255 -108039 -195060 11504 56652 64861 37086
9822 37086 211660 254044 316310 240811 -73093 -110246 -201682 61074 -210136 -308108 92658
9811 92658 -26259 -52756 -232174 -149774 90103 224118 -68158 -279376 -109380 4591
9801 4591 -53590 -42280 10907 70134 27400 -198911 -173225 -92827 -127129 -63701 151566 208478
9789 208478 306817 311131 206972 48439 33148 24953 -82325 21328 155595 275575 391168
9778 391168 251067 34670 205863 196915 -132139 -341469 -144587 -24957 -220269 -388640
9768 -388640 -334627 -181094 -59893 -266576 -324149 -210587 -262718 -338836 -618836 -317451
9758 -317451 -132896 115619 166620 68039 -127413 -190896 -492878 -463684 -179729 -89153 -120321
9747 -120321 -130756 89640 -201539 -561454 -122610 10587 -341016 -639398 -460237 -411954
9737 -411954 -403099 -151239 -87149 -593876 -625744 -501413 -605734 -441754 251508 22513
9727 22513 33176 -299332 -367894 -162272 -271342 -240340 -16162 202983 -114058 -14344 83289
9716 83289 -139494 156294 286834 34537 71203 74612 211589 -33155 17778 302512 219256
9705 219256 -145368 67002 86303 -202656 -315952 -232843 -59585 -116734 -57988 119469
9695 119469 165551 236816 387841 454439 433624 -81257 -364252 -72751 -175073 -211058 -213356
9684 -213356 -24808 152518 -21711 77435 60945 54380 189894 142979 56512 255684 100189
9673 100189 -68104 -17544 34109 -6051 -11573 -16352 77168 172513 86329 -44730 -67542 -108759
9661 -108759 -37595 45294 -9819 -84787 -310283 -11590 -247091 -269630 -218448 -115214 -74918
9650 -74918 -17386 -82900 -125102 -280442 -210430 -148122 -94837 -94374 -92483 -120012 -138131 -247962
9638 -247962 -165852 -192965 37380 181175 229972 248756 82512 174664 -47780 -59398 -19741
9627 -19741 -116865 -190229 -111390 -123111 -78267 -55691 -205799 -52264 -118407 211769 334389
9616 334389 268498 111990 -32011 126050 -146801 -341512 -201471 -173411 -132196 -34103
9606 -34103 26415 3443 166494 -5081 -187172 -219348 89998 210900 143179 208035 164029
9595 164029 164300 -123887 -29086 167283 191308 29505 -146927 -164501 26575 165070 29124
9584 29124 -183352 40677 -76673 -328504 -489620 -102863 -306634 -382712 -328108 24341
9574 24341 136246 -188535 -80101 217924 167474 3180 36605 -39925 -21710 -303875 -149705
9563 -149705 -335364 -368527 -474263 -367239 -259570 -207738 -217400 -295025 -298223 -270481 -160636
9552 -160636 -395949 -347568 -232015 -58516 -243103 -254466 -95261 -153447 -208175 -144134 33120
9541 33120 19970 173772 515681 429327 187853 -142643 -273523 -41071 -100966 90220
9531 90220 389492 257313 104921 118089 21492 -204126 103577 -166400 -216351 -387896
9521 -387896 -522556 -358334 -372857 -22067 180200 93142 -241708 -290132 142164 80173
9511 80173 -219256 15832 182388 144767 126646 -18165 -165011 -215686 -147081 -128108 -110293
9500 -110293 -54665 -105125 104980 246090 85388 63843 -156764 -274313 -62374 246707
9490 246707 14241 164024 334790 -116685 -196479 -112823 -60010 13739 5160 -82826 -225086
9479 -225086 -66738 38207 32676 46111 -30972 198537 110681 -202922 -22950 -75687 113835
9468 113835 93613 15069 -11793 124062 380725 55636 -130029 -74260 124598 149077 470880
9457 470880 388764 179198 247127 245895 300990 311501 48925 228661 271367 308565 24327
9446 24327 -108278 135507 154664 151359 210277 93190 -93982 -16082 -182103 126311 -139112
9435 -139112 -27279 91523 -244370 -253748 41159 -123735 -148074 253241 147725 100397
9425 100397 172949 72257 251713 204081 113536 239206 -157861 -10354 -119837 -16169
9415 -16169 -146699 -26706 -18274 -242662 -301601 29673 -91057 13719 78021 -46879 197163
9404 197163 5176 6813 -26351 6386 3961 93376 -109805 -261169 -173634 -341329 -282031
9393 -282031 -116324 88025 43907 -223181 -461679 -538711 -506260 -558198 -596697 -172500 -328547
9382 -328547 -382025 -301435 -561044 -208967 46684 -1610 -205816 -194219 -132601 -281379 -407984
9371 -407984 -138429 -6854 -57968 -96156 -134047 -157924 -387848 -381174 -196697 -156861 -55973
9360 -55973 48027 -56600 129925 99706 -206891 -192738 38474 -162287 -165774 -212768 115225
9349 115225 477058 173159 42828 259423 -7460 -58777 25256 15137 125250 -114801
9339 -114801 24618 -59333 -26374 -84416 -59754 -211597 -46812 -69168 -456773 -341859 -326576
9328 -326576 -300089 -43448 -93647 -117869 9927 -202076 -157859 -236471 -308738 15599 -95770
9317 -95770 -138771 -208247 -334898 -371820 -78260 53121 63286 -67480 23222 -193752 -491510
9306 -491510 -227727 -58663 25714 -136749 -67044 -132727 20746 -59154 -54826 80780 -174826
9295 -174826 -129094 -249239 -139049 168525 295166 325056 23586 152157 173319 -33507
9285 -33507 -65197 -225511 -50168 94783 186212 183275 283857 150945 49978 41275 -71284
9274 -71284 -13118 189717 93026 227331 211359 160361 68064 -226246 -241330 -102495 -312592
9263 -312592 -311797 -206202 -281153 -335103 -414163 -340095 -507507 -463239 -261867 -122794 -142967
9252 -142967 -185159 -130904 -250115 -80971 -109852 2259 -145727 -49131 215642 273581 207180
9241 207180 -31912 47373 31320 104350 256707 -4281 -68350 106113 51364 98506 -10228
9230 -10228 -46677 85536 5127 -128045 -227552 -289922 -74202 63405 -188959 -318949 -263687
9219 -263687 -87871 -13751 -99597 -60071 -142742 -102836 -181015 -16051 161660 193318 118180
9208 118180 -4576 148957 138923 -65700 -183411 -128075 94922 125638 249594 119393
9198 119393 175889 81766 -65309 -64472 -2387 -380367 -157915 22907 -307441 -131271 15338
9187 15338 111395 -49591 263458 387317 158711 -136553 -251071 -178096 74284 37214
9177 37214 -141546 82772 318132 222382 7589 151181 296585 448217 309567 325224
9167 325224 251191 127857 33430 167464 347515 185733 29564 137047 210494 459630
9157 459630 467268 583555 365425 139803 58150 201456 221930 130010 484275 489154 459150
9146 459150 601582 247569 322175 530051 456994 217537 451853 410795 31862 -79967
9136 -79967 -10705 275883 294500 246555 466509 491901 317174 361316 353555 365686 146511
9125 146511 -49075 188193 357732 144964 381716 639376 588747 778741 765244 868902
9115 868902 845122 576168 436013 243365 122158 -31505 8918 204585 153777 73680
9105 73680 50903 235996 562524 336210 86238 276212 325050 351362 438883 326415 429439
9094 429439 290386 484137 509966 532168 368293 204977 415216 633259 441570 434868
9084 434868 327561 256782 123574 414357 556456 565144 840828 758138 493812 289673
9074 289673 203624 314174 458800 311176 559624 689338 360798 276252 444882 522630
9064 522630 213403 289029 179270 388831 546068 426654 270366 94499 386724 368745
9054 368745 280350 187164 20452 -155980 -238881 40695 213166 193892 224939 369172 218432
9043 218432 118674 -148646 -31695 -94815 -115068 51244 255840 162888 342099 371569 145060
9032 145060 218105 162402 146317 313539 264002 375731 288909 373336 376489 83395 -25434
9021 -25434 90625 -4664 -68108 25549 127474 199136 -36581 217693 67219 177925 191074
9010 191074 48044 -399697 -28471 62303 70281 206089 366849 300110 191245 -145326
9000 -145326 -265022 121985 217572 78284 91387 462546 455758 197058 206178 592752 583210
8989 583210 389398 -51829 140427 219004 -55910 370297 162890 257571 258099 53544 9667
8978 9667 155143 238782 145659 289677 106698 2681 -211914 -290790 -99616 -239526 -42829
8967 -42829 225089 401455 395407 239444 331016 503988 249471 378313 566114 792669
8957 792669 498300 275535 491641 661314 304177 714411 794254 792571 554687 441643
8947 441643 813387 832634 902891 990110 982392 780097 934692 906621 905028 1113662 1107746
8936 1107746 614016 765788 1073118 1108399 1134573 1204679 1271316 810296 464437 415852
8926 415852 672989 841756 757897 1029178 784487 847219 871455 1064131 1223632 1324722
8916 1324722 1144575 1143660 1440009 1014568 882326 1016442 1016791 1126098 1127368 1186391 1412375
8905 1412375 1463870 1670429 1690310 1785095 1603783 1699722 1845757 2006646 2135174 1881986
8895 1881986 1712958 1909255 2272512 2393945 2616005 2601943 2682866 2403805 2734231 2697697
8885 2697697 2542058 2425350 2344960 2453623 2189041 2230328 2356085 2573142 2406765 2470873
8875 2470873 2295081 2428495 2523135 2371711 2691243 2538971 2758222 2341455 2661799 2902726
8865 2902726 3005168 3101985 3019320 3315935 3337785 3227393 3163988 3389227 3504912 3614335
8855 3614335 3557406 3531230 3650671 3626655 3541266 3714421 3984293 4111967 4362074 4354678 4602525
8844 4602525 4724128 4907413 4894433 4951245 5538366 5799728 5997533 6270167 6409528 7063645
8834 7063645 7445703 7683131 8066654 8321630 8697379 9269367 9951571 10553935 11439137 12018190
8824 12018190 12797150 13779950 15183415 17010354 19713750 23276515 27342031 31665389
8816 31665389 36347712 41453202 47090419 52925157 57624689 60601827 61444333 61839860
8808 61839860 61567446 60654414 59189963 57038887 55734952 55119051 56016641 58521717 61937859
8799 61937859 65944462 69315975 71920759 76067826 82249373 89598105 96628268 100003021
8791 100003021 99407494 95220952 88321416 80352888 71809632 63585038 57635814 54495045
8783 54495045 53416088 53830615 55490018 58613933 62876605 67413341 71851489 74545997
8775 74545997 75127291 74853763 73846331 72293766 69726692 66823526 64949389 64953552 66141267
8766 66141267 67911568 69099233 70397894 72919599 77039544 82996197 90014869 95900659
8758 95900659 99208406 100263989 98211954 93201131 85515715 75192302 64174540 53329823
8750 53329823 44065224 36626620 30953677 26387015 22982172 19979850 18090287 16744875
8742 16744875 15460819 14300746 13202554 12341514 11503005 11281937 10604229 10064377 9453182
8733 9453182 9074241 8579689 8059317 7874666 7653571 7584305 7340609 7006264 6525270 6260935
8723 6260935 6292288 6260377 6102864 5706656 5495621 5096097 4737521 4935890 4854400 4676082
8713 4676082 4602428 4202736 4317736 4254011 4028507 3983692 3910837 3984605 3397307 3067624
8703 3067624 2894233 3089011 3139623 3036889 2761648 2984923 2886995 2810132 2960823 2939403
8693 2939403 3016907 2857196 2799519 2680573 2878215 2886134 2831931 2731961 2856648 2699813 2621325
8682 2621325 2565400 2457348 2761132 2644615 2371709 2166210 1883935 1842848 2010459 1811764
8672 1811764 1833344 1957371 1584536 1678787 1586900 1548723 1548615 1642464 1837089 1875025 1717370
8661 1717370 1642337 1714217 1598484 1607319 1608760 1659325 1500260 1372176 1196860 1076515 888782
8650 888782 1145674 1038515 731300 1016916 1116348 977599 1052168 1281955 1257680 1437459
8640 1437459 1042951 1107337 925285 1166330 1276070 1407522 1136076 1021240 1146237 969508
8630 969508 1240338 1526470 1588072 1281376 1282323 933218 884500 778398 781983 877486 1059473
8619 1059473 932644 450221 532047 798729 960750 872125 941516 821249 791548 773850
8609 773850 603471 847584 849789 675691 1023778 1115870 1240641 1235284 1131418 913811 842064
8598 842064 523597 453782 536638 565103 478501 366977 189874 -134186 95762 230626
8588 230626 185957 293258 281868 24317 343976 264190 323534 512510 288929 345648 86480
8577 86480 362724 339523 451714 521504 350403 269726 46318 90507 82225 118765 158578
8566 158578 88925 -46260 186004 137813 214520 510063 561346 460693 215698 249676 425973
8555 425973 237061 246873 39107 71188 -71396 48677 498139 411874 480165 624349 736127
8544 736127 580809 534357 488733 438007 464916 360297 296694 -37524 214567 453239 745032
8533 745032 646328 698009 778214 607402 426251 578984 610893 618672 1006754 898392 710008
8522 710008 854819 853681 751622 850947 940513 758314 652719 651293 634054 826350 567252
8511 567252 482214 477218 217126 143653 358930 670761 675071 585162 775279 833891 644823
8500 644823 637958 537078 616909 569843 589603 483002 486715 729363 956635 1055213 1175428
8489 1175428 929697 923794 1019923 1079257 1229418 1438143 1417624 1396006 1518800 1054916 1015991
8478 1015991 472136 727654 669764 424424 674799 577745 933551 690017 578994 447336
8468 447336 637389 907348 1088163 948248 839419 1172779 1065772 1032555 797263 855372
8458 855372 1113728 893770 698699 799018 968449 781797 816430 898384 796928 734717
8448 734717 527483 619351 676479 781480 700716 502777 824996 801071 729213 623941 653734
8437 653734 1189117 1199858 1099584 1220806 1266335 1070882 1304606 1307580 1253600 1384688 1429947
8426 1429947 1375615 1203515 1335319 1516112 1339492 1308570 1363823 1101768 1085027 1216313
8416 1216313 1154526 1494159 1537624 1649928 1832506 1633617 1695161 1636105 1497227 1635952
8406 1635952 1405535 1421829 1432369 1238317 1272155 1395008 1386838 1327291 1524783 1577991 1332406
8395 1332406 994233 1146132 1335051 1023648 1246386 1175603 1125471 1363121 1284665 1325087
8385 1325087 1352364 1356169 1430022 1467724 1845660 2029659 2152304 2016203 1958746 2095952 2118973
8374 2118973 1954714 1990281 2367300 2128504 2070364 2032516 2102225 2172477 2009606 1760986
8364 1760986 1552184 1468860 1390859 1677230 1885704 1863753 1868195 1850010 1639149 1585749 1609878
8353 1609878 1579352 1601821 1809092 1556699 1539434 1657579 1931105 2351231 2145922 1966394
8343 1966394 1970736 1947067 1970723 2093333 1890322 1908429 1926034 1630035 1490691 1383906 1433105
8332 1433105 1465474 1678243 1745134 1633239 1906169 1984720 2114031 2079849 2140027 2115576 2378921
8321 2378921 2660004 2521042 2391061 2328246 2369258 2642630 2912986 3055734 3008535 3034410
8311 3034410 3236577 3689064 3422522 3677979 3900731 3628436 3351969 3298558 3052627 3109777
8301 3109777 3395347 2947770 3035672 2899067 3137499 3434869 3580150 3926472 3933574 3748845
8291 3748845 3735351 3600676 3812050 3969719 4133933 4400082 4099087 4398061 4832222 5272219
8281 5272219 5387449 5633564 6085408 6482785 6710606 7024530 7097608 7198712 7444520 7847008
8271 7847008 7805877 8207490 8748965 9253243 9457308 9387294 9852754 9953757 9951326 10123485
8261 10123485 10316318 10264417 10300271 10298161 10502069 10715052 11156726 11674597 12204005 12890129
8251 12890129 13821234 14443224 15136658 16015829 17517753 19593847 21726563 25027371 29524923
8242 29524923 35349497 42494706 49462983 55048448 59802244 63937975 68429549 73587690
8234 73587690 77309212 79084741 78438048 76352451 73298945 69968533 67505731 64834233
8226 64834233 62358515 60926458 60790422 61980601 65041836 69957060 77518207 85663660
8218 85663660 91930600 96096609 97424919 97057941 95244469 91193498 85079440 76862143
8210 76862143 68128482 60466960 55591254 53148370 52960596 55469435 58815902 62838667
8202 62838667 65486990 66887953 68192358 70063356 72836060 74656086 74437528 71730655
8194 71730655 66902895 61154745 57657806 56023902 53721294 52309183 51056338 50203391
8186 50203391 48511622 47039728 45499663 43177358 40668089 38194076 36952452 36684368
8178 36684368 37969372 39982657 43265193 46797230 48912775 50369180 50607200 50693020 51345431
8169 51345431 54049601 58928617 65071210 72112219 77767748 82228638 84155324 84287336
8161 84287336 82748373 79907732 75069189 68606808 61814439 54896371 49506629 43996818
8153 43996818 39929046 36499132 33737662 31680045 29896462 28804544 28358816 27814569
8145 27814569 27189406 27322069 27614821 28316550 29909610 32445826 36235641 41902488 48992590
8136 48992590 57621854 65757855 71364786 74597820 76354001 76944366 77718336 77521672 75081537
8127 75081537 70469586 63461111 55076191 46990872 40345721 34891612 30783598 27252173
8119 27252173 24603759 22474875 20770243 19457405 18653980 18074564 17193092 16702243 15895940
8110 15895940 14949268 14418531 14040372 13813282 13647673 13515781 13310775 13127126 12872721
8101 12872721 12956968 13048021 13574034 14157822 14469909 14668452 15097822 15572865 16170050 16824716
8091 16824716 17062781 17550679 17881050 18059737 18286079 18613751 18624847 18691765 19050960 18735489
8081 18735489 18505691 18666238 18518141 18502013 18641508 19190498 19729937 20084125 21493642
8072 21493642 23836775 26251506 28509486 30103369 31559269 32612018 33890798 36114296
8064 36114296 39869327 44972267 50131512 54871491 58256540 60357304 61532940 63337067
8056 63337067 66106737 70758139 78326930 89525307 105471800 125686244 148005107 169402906
8048 169402906 188180592 202837609 212128640 213956575 208526765 196167122 179095917
8041 179095917 160107174 141545250 124232088 109607957 97229685 87797053 81098642
8034 81098642 76352639 72532795 69667482 67195077 66212585 67110774 69658185 73398460
8026 73398460 77544029 81401616 83688032 84410696 84884714 85951226 89128694 95438343
8018 95438343 105960823 119882239 136615861 154726698 175458738 202982572 243151108
8011 243151108 283960359 316005321 327190341 309534366 276727234 239350338 205761375
8004 205761375 175214205 147226973 122232267 102120177 86288458 74646459 66120228
7997 66120228 59696152 54196550 49757920 46056637 43977714 42304937 41623802 41921903
7989 41921903 42104141 42232361 41795956 40771116 40132469 40592002 42613467 45961103 49872834
7980 49872834 52441976 53645307 53534828 53555601 53143761 52016069 49413545 44887256 39644528
7971 39644528 34441673 30042836 26899929 24296880 22280749 20771244 19296295 17937990
7963 17937990 16750410 15373183 14319769 13324384 12439436 11456832 10852406 10328110 9889482
7954 9889482 9346985 8780031 8416300 7962075 7489522 7210635 7363900 7513304 7365461 7357444
7944 7357444 7459214 7487822 7673791 7655628 7706240 7315748 7243340 7299156 7063934 7127642 7095140
7933 7095140 6787879 6908717 6599141 6444943 6588041 6170531 5979957 5785033 5434593 5146863
7923 5146863 4990103 5126574 5053391 4850121 4747626 4747372 4672457 4642312 4679700 4739134 4632555
7912 4632555 4197993 4086973 4214193 4025960 3933853 3924089 3924027 3958807 4034611 3942109 3890901
7901 3890901 3747143 3677581 3469966 3222648 3014739 2982103 2746395 2664891 2598200 2465202
7891 2465202 2188655 2081849 2135524 2296032 2269758 2527052 2640759 2245114 2541019 2706604
7881 2706604 2613121 2706829 2790133 2831789 2755335 2656681 2520533 2580868 2377585 2315982 2176597
7870 2176597 2112462 2092707 2154396 2167859 2166772 2010244 1888024 1668089 1843841 1782970 1452982
7859 1452982 1399402 1136627 899558 1234487 1186955 1196425 1379629 1415666 1650228 1629880 1699447
7848 1699447 1688129 1477328 1533319 1239234 897367 1003866 1008298 912592 820457 770833 692333
7837 692333 1042788 1103818 1324768 1242584 1170371 1289917 945034 1132395 1437245 1446250 1305097
7826 1305097 1528410 1320321 987646 1015037 1220354 1145730 1265426 1545532 1461223 1428923
7816 1428923 1004732 723127 679089 990846 924097 841363 856484 777518 615061 299983
7806 299983 392785 176280 100043 40891 41137 317484 93414 297371 475267 536442 542293
7795 542293 389236 281058 556919 558867 119647 -26340 -28824 -8355 -34369 -55058 -41050
7784 -41050 -60926 -75316 40675 456572 674605 766587 554107 490508 656942 319111 344524
7773 344524 433887 597969 680415 345275 395701 488274 375091 194538 390249 146244
7763 146244 -8452 -1801 -99056 -42341 -198835 -215901 -108290 -174573 -51823 -64891 187733
7752 187733 390466 612180 451355 699016 745229 684724 716417 454001 772664 858511
7742 858511 868396 806953 643905 394368 650967 474971 322425 317003 120386 439525 424841
7731 424841 301663 232037 109245 -56584 97536 43575 329060 285439 109038 281645
7721 281645 292259 393114 335186 523150 494766 555943 621234 365510 590462 726884 794736
7710 794736 697845 681523 757204 490675 367356 543226 591556 506667 702429 728237 426790
7699 426790 530522 652408 765433 782473 700868 611193 434833 335033 422997 544188 543461
7688 543461 1006161 827472 608128 658580 805208 764409 1069425 792558 1020094 782745
7678 782745 333872 744388 898541 838277 652075 680878 501926 568269 565080 698448 410995
7667 410995 265338 274443 436821 264538 418143 341186 171310 343683 -54247 394353
7657 394353 637516 808025 770543 763893 714607 868673 814977 884960 845043 926774 1013698
7646 1013698 1057738 1030871 1020630 918758 411868 407586 612018 464117 559067 881915 536399
7635 536399 373394 428742 -577 260348 242891 -164252 10100 92915 -177921 -32862
7625 -32862 81922 -13207 263285 216040 12323 102652 461974 341909 49296 -101488
7615 -101488 169925 15529 -39017 215387 295382 142000 -213920 10592 45819 -231880
7605 -231880 -38770 -25709 -52345 91235 157667 298629 264486 266753 -105254 -175499 -219019
7594 -219019 -315772 -72972 136475 152787 228962 201609 -94908 -227677 -101214 -453780
7584 -453780 -263492 -101857 -182477 -233727 -279899 -174983 -299669 -181182 -94524 -46985 -112223
7573 -112223 -23981 -9797 214691 -31900 180244 268147 -35494 -227835 31750 155794
7563 155794 389631 401066 401749 680338 628170 531034 599486 244348 166070 222981 135109
7552 135109 -53118 190408 447595 55927 -95717 -217221 -371289 -279859 73306 -68082
7542 -68082 88977 243645 165106 19565 -174941 -23752 384819 606840 746041 948386
7532 948386 1272393 1077400 708166 817023 730280 514410 346191 565413 502746 403656
7522 403656 329036 458952 335364 205031 -179612 -413415 -397593 -213153 -148366 -220043
7512 -220043 -248940 -189311 -265393 -77392 -160009 -104891 -159696 -235242 97720 -235811 -238028
7501 -238028 -143833 246418 184386 177689 198088 73469 223545 248711 151215 346980 286697
7490 286697 310508 109975 272492 66919 48344 370853 417736 154158 -53466 -107416
7480 -107416 24057 125643 -178096 73732 -5812 -329710 -208474 7109 128833 214051
7470 214051 23257 45095 29051 24624 -2965 290432 488792 85921 26007 111152 150077
7459 150077 150851 309027 265784 151716 53806 51370 -90814 156582 215880 168038 28212
7448 28212 -112602 -228236 -216357 -173830 -129832 -59994 -158395 -141851 -179820 -368118 -479771
7437 -479771 -315969 -157344 124745 149375 58660 -14080 -200503 -174462 -263773 104112 -515
7426 -515 -201306 -71118 -124335 -50984 -101127 213770 205810 123272 157154 -173796 -279156
7415 -279156 110965 198532 104362 282786 35746 -319929 -318213 -306865 -242824 9562 260956
7404 260956 246780 229112 109927 211888 27295 10924 -792 94309 -10624 -93052 -167380
7393 -167380 -259685 -198613 56329 57154 127325 376454 303509 124678 31379 -109953 -58782
7382 -58782 -165133 -186999 20276 -94507 65089 -188494 -156223 44934 -33753 122390
7372 122390 152744 -92382 72450 270826 -104139 -235879 -160996 18680 270881 152096
7362 152096 -74905 -94783 -34390 -226101 -367453 -225162 -93128 139937 62940 41844
7352 41844 310808 185185 -82126 83291 83995 37955 -169263 -466395 -99631 -5535 -31774
7341 -31774 280003 430045 326027 143266 -131 -235726 -104379 35490 -5919 -276945
7331 -276945 -246696 97627 -73289 -274773 -29854 -84155 -198676 -108069 -308832 -180199
7321 -180199 53057 291051 43346 9339 -260641 -145791 38617 217390 34466 -186165
7311 -186165 30829 -24610 -94792 -170310 -108715 -110645 -49111 -152798 -444265 -440046 -198698
7300 -198698 9114 66305 74876 -62603 -41426 -9112 -225304 50299 -133430 -346059 -83627
7289 -83627 10895 327454 -8747 149321 376752 -128219 -186000 142007 173473 -13807
7279 -13807 144890 105040 -112128 -338640 -134010 -68139 -360065 -224657 -287942 -247385 -235347
7268 -235347 -516295 -446491 -2661 172867 -10886 73318 -4561 399074 259389 -39876
7258 -39876 -150731 34262 -154775 -382067 -387433 -278681 -288789 -482844 71448 -128281
7248 -128281 -72993 65449 -92007 14238 -129686 -232058 -350409 -503067 -14641 75034
7238 75034 33521 73539 2838 104423 221781 173984 -146219 -260561 -256756 -321588 -451930
7227 -451930 -433531 -445881 -560468 -375144 -408273 -268216 -161404 -304638 -334630 -342200 -267577
7216 -267577 -291512 -1691 1145 -145550 -301785 -330067 -449064 -323573 -160141 122460
7206 122460 57078 154718 83996 84837 289442 120572 146053 82736 -87663 43702 -172569
7195 -172569 -83543 -50001 17379 243280 238062 471337 193148 146406 48388 -59520 -12503
7184 -12503 84294 -17885 -367015 -95461 231801 213614 324986 192740 193541 206228 84873
7173 84873 -14657 -122700 110418 91128 23608 -148334 -180323 41596 -15469 45036 231993
7162 231993 195261 112016 159087 -32370 154069 172854 12191 -178228 4393 -224268
7152 -224268 -296986 -97604 -286462 -476039 -167694 -13202 90769 32784 -22058 23839
7142 23839 223847 152466 -58557 11113 -75668 77570 -8417 293396 234578 178059 468905
7131 468905 633894 454003 58392 214488 114104 74788 -56458 -61580 -11144 -36323 -63212
7120 -63212 -94745 67326 -176371 -1087 -91040 108156 168110 14488 22004 104992 136776
7109 136776 -44116 -67980 -184712 -68410 -132066 -215591 51693 94610 -53770 11663 -92981
7098 -92981 -244100 -169320 -125557 -139816 230642 157373 254494 184114 -54033 -151298 67429
7087 67429 -56347 -424257 80406 -5381 30244 162312 54602 194349 352716 -25393
7077 -25393 -28158 -29161 -68581 -51918 -89346 -2529 20906 -129406 -287536 -99240 263031
7066 263031 219241 -48391 157078 75639 -33532 -50896 -279954 -44571 44023 -440433
7056 -440433 -318896 -259796 -415111 -148079 -6140 -114456 -274185 -233875 -67774 -160052
7046 -160052 -189444 -235175 -211965 -188683 -236469 -162509 -185038 -59688 -247900 -83010 84905
7035 84905 -167308 35045 -213301 -320451 -142957 -172359 -219798 -50713 -51039 100783 -71170
7024 -71170 -224212 -121857 -209959 -101377 -24481 -15735 -227960 -132225 -180201 -461423 -147774
7013 -147774 19997 245496 313793 330323 501768 299853 119673 -62554 98916 -100359
7003 -100359 -364854 -329771 -76168 -7727 -154786 11000 -33516 -28987 -295618 -185792 183692
6992 183692 261762 242092 264769 228028 55581 -78164 -105241 87271 -7344 158986 138214
6981 138214 189626 97359 87291 188397 158533 387914 78462 -390291 -440118 -339427 -232291
6970 -232291 30347 253171 67772 83212 -156333 206691 222353 49123 141544 86860
6960 86860 -28643 -51789 109831 394032 484216 654065 297589 117157 155889 170260 287376
6949 287376 382466 159002 -41406 -205170 -297706 -240029 -222676 84759 -236373 -4731
6939 -4731 88381 -88310 -201200 -299225 -332577 -167835 -123863 -71803 193970 184758 -13192
6928 -13192 74889 17989 1323 269219 242527 344207 379628 419583 96668 -111898 -22237
6917 -22237 64415 57529 -45903 126374 70005 -29647 -552 -5800 128123 -24848 -225449
6906 -225449 58709 -89758 -45139 -143742 -103153 134850 -26973 -101277 41219 49934 223246
6895 223246 115753 -9082 -33790 -52544 157967 79198 177038 549222 147403 88325 310287
6884 310287 205632 1763 193702 38433 38240 167253 160169 -22376 -258246 -152827 73494
6873 73494 46649 138498 23318 115831 -99716 -23761 2310 58448 316589 299384 370263
6862 370263 152195 59119 -161901 -310135 -224717 -362645 -90303 -99155 -357282 -44277
6852 -44277 37282 -188671 -308838 -236115 -36418 -284176 -332032 -127160 -254492 -150791
6842 -150791 -194326 -160696 -32347 69885 145628 197649 321899 260821 -144181 -201050 -247899
6831 -247899 -68197 -381111 -109459 -10829 -166903 -227016 -463270 -421528 -456595 -280867
6821 -280867 37205 96760 51515 -231811 -220041 -229893 -192887 126703 142754 -108396 -25613
6810 -25613 -237027 -566128 -428708 -140981 -292191 -74654 -224679 -532340 -350277 -331585
6800 -331585 -346028 -273224 -369194 -486403 -575636 -482050 -163427 -14306 78904 -17361 -178971
6789 -178971 2771 41065 -21044 127441 151664 -37742 -167298 -365708 17566 117528
6779 117528 -42455 217110 -37210 -104193 43288 -54439 -123493 -55826 12896 -282310 -488415
6768 -488415 -190262 -214692 -374611 -196344 -180480 -32045 103355 19739 202223 229034
6758 229034 -89908 -53984 -23875 149393 361752 108707 -261874 -205875 -460594 -200829
6748 -200829 -177585 -220919 -97747 -104493 -311100 -483462 -159960 1297 178415 -11744
6738 -11744 113425 -149874 20033 -10452 -171157 -144134 -303376 -156564 -1779 -200184
6728 -200184 -188057 -1108 -65140 -148522 136124 -8524 -161756 11687 -142818 58009
6718 58009 -125862 -503976 -215682 -228034 88057 -63189 -199720 -47673 -24672 -10424
6708 -10424 -271206 -316125 -198519 -207243 -308693 -39946 -86342 -50789 89828 -154531 -149109
6697 -149109 -179564 100416 80098 70596 93614 -283574 -130136 -24946 -14213 263521 123795
6686 123795 179906 164470 20156 6925 77463 -48311 227975 171279 73656 45017 -182481
6675 -182481 -305032 -390297 -177248 -311707 -165912 -162353 -384854 -413870 -302694 -330812 -467397
6664 -467397 -30343 -172761 -436059 -471337 -137442 -253449 -483055 -461683 -208071 -235538
6654 -235538 -392276 -250768 -178741 -140600 -142773 -299775 -32557 152388 111646 247088 41415
6643 41415 78789 -59809 18174 -97891 -226945 -155990 -15140 16605 252126 218938 -5236
6632 -5236 -203846 -448590 -275420 -466286 -597339 -170778 -173143 -280695 -431853 -539856
6622 -539856 -391054 -537296 -646093 -417713 -227540 -319371 -56562 3612 -214515 -294536
6612 -294536 -426923 -278467 -93741 -257531 -348449 -214608 -150572 243731 -44978 -150871
6602 -150871 267567 155537 -98296 -46403 143529 86082 -148007 215572 206287 198417 -67291
6591 -67291 42858 96852 249690 -13465 133467 146241 -97584 -44509 -40946 25901 263729
6580 263729 468327 123697 231773 174718 245939 153806 124052 355265 260868 112724 -209611
6569 -209611 173 127157 80291 527283 430546 433987 433408 152803 -10165 -106405 18425
6558 18425 -192403 -177671 -69278 -92206 -76473 -9003 220903 313813 375356 269850 196082
6547 196082 365455 195513 -82564 -152501 -140214 -401563 -306912 -179271 -149600 -322996
6537 -322996 -293324 -130675 -45728 -176583 -293302 -15105 -28555 -222111 -228219 -147200 -364145
6526 -364145 -83791 52738 -145786 -183846 -36942 -76962 -11467 210408 309567 30346
6516 30346 153833 -67736 -35874 -329571 -217098 193248 173507 -49377 -120019 -254022
6506 -254022 -442156 -375232 -359085 -211905 -93023 -146161 -155371 -256008 -498616 -456549 -394256
6495 -394256 -257204 -387366 -340884 -310731 -155725 -30334 107844 -20256 -20919 317000 1345
6484 1345 -117319 -108843 68206 -111221 -63387 -4523 92018 79084 -109662 -26573 -125400
6473 -125400 -348715 -418270 -288300 -437045 -144868 -6686 54618 250567 158780 -165549
6463 -165549 -414420 -195078 -157955 -12179 -111244 -141236 -276117 -322553 -337881 -204311 -43435
6452 -43435 138037 31984 -106091 -343470 -24467 -78647 56287 41596 -99195 -290022
6442 -290022 -424145 -134846 -403320 -126032 54100 -102913 -358995 -124154 -131296 -134076
6432 -134076 -11465 -15073 -153894 -290834 -526744 -270367 -171994 -156394 -118943 66270 224041
6421 224041 118710 82351 -91081 65854 -12592 -468969 -406703 -215954 -383233 -293528
6411 -293528 -165878 -162592 -180713 -21125 67722 222705 301111 -20541 -74581 -142424 134055
6400 134055 -119869 -35676 -35617 -158265 -116047 25975 -89059 -98749 169523 -137767 -82318
6389 -82318 -154832 -169028 61002 16019 -148241 -16297 16464 -162981 -72884 56177 125464
6378 125464 302084 408067 91886 33469 -25538 -182712 -296598 -320186 -237539 -178916 -468481
6367 -468481 -230418 -239566 -263640 -373988 -521757 -467543 -453336 -458456 -322602 -136457 -196266
6356 -196266 14839 -236579 -295762 -178723 -183040 -240496 -163501 -112622 -136843 83419 38238
6345 38238 134112 50448 -29671 -245575 136674 27792 127759 199791 75337 134338 -199481
6334 -199481 -65052 134593 -81053 -231023 -287492 -240724 -58518 -43498 96879 79230
6324 79230 319079 -37192 46588 338377 312927 306893 217416 44156 -57569 -276475 -420081
6313 -420081 -277817 -122307 -545969 -435667 -249571 -372431 -267036 -124657 -71870 -40619
6303 -40619 -35492 -59705 138443 209295 -201104 -61890 88751 -59517 -165404 -100294 -111373
6292 -111373 272036 123472 195585 358294 341292 375901 -63818 -96484 -245439 -252714 -203630
6281 -203630 -131902 -66716 -31967 -81068 -195458 -341800 -139116 36473 165126 61431
6271 61431 128120 71871 -196860 -179842 -225530 -71695 -100959 2122 178941 426944 303347
6260 303347 -31445 -72197 113380 -80127 -429902 -336036 -237096 -374269 -119264 -164986
6250 -164986 -258282 -186532 -115093 -66013 -89028 -24793 -2675 86366 245994 -132988 -213520
6239 -213520 -279395 -131553 -240954 -466445 -147256 -160719 -194203 -431066 -313027 30700
6229 30700 -111705 -167662 -240353 -37044 107550 -218689 -15835 135353 193046 -195761
6219 -195761 -28238 -225565 -189474 -277141 -242022 -21525 18064 -155206 -196312 -49375 44648
6208 44648 288323 411895 212979 -21795 -41046 -5420 -65285 -151747 55591 -117580 -70401
6197 -70401 -105356 -199363 -76520 -41648 203798 -6995 -104379 -59221 14394 -70107 -6728
6186 -6728 -116893 -168945 89356 -58626 37319 -176879 -298850 -297373 -477838 -235351 -69221
6175 -69221 -181342 -5818 44361 -9180 -17527 -50766 -327702 127719 189669 -131881 -250104
6164 -250104 -6581 149261 -16642 -54547 2583 128276 -22081 -219271 -142876 -158603
6154 -158603 -277402 -27412 -319529 -285748 -215169 -289363 -29330 -49596 -338345 -309763 -202404
6143 -202404 -56234 -267139 -170437 -349104 -152227 -4146 -16313 -71902 -214618 173719
6133 173719 -169572 -26136 57781 80476 -109270 -282488 -196339 -328222 -424852 -270760
6123 -270760 -45520 -260658 -438423 -489857 -242200 -37435 -350562 -104027 -30583 -497391
6113 -497391 -404703 -365042 -497866 -535873 -400339 -584001 -533462 -403336 -253591 53444
6103 53444 -119934 -171178 -4927 89407 53910 41238 -164202 -359143 -264464 -330284 -408997
6092 -408997 -310516 -212680 -168147 -376945 -200243 -361128 -144504 -77739 -335424 -135209
6082 -135209 -108409 -153558 -89717 -218528 -223257 -40149 -88205 -118284 35680 -15872 -403969
6071 -403969 -286732 -299693 -209571 -213287 -421446 -333567 -186755 -400520 -399352 -277769 -235693
6060 -235693 -233850 -16372 -64653 54325 99466 -72334 103739 -32105 -82596 118125 185459
6049 185459 86720 116372 58116 -293877 35289 60750 212425 290938 43682 -96316 -343237
6038 -343237 -184214 -317074 -176784 -36451 19844 -479930 -205581 -148060 -305059 18525
6028 18525 52174 89767 9567 -143108 -64624 -179069 63862 155741 254002 -20315 -61202
6017 -61202 -22058 49231 177297 -185368 4175 -175386 -173243 -312649 -306659 -272208 -225132
6006 -225132 -97104 -78199 -121128 -242759 -279710 -450707 -313700 84732 -76781 -152837
5996 -152837 -34728 -47212 -213064 -144994 2476 196425 272941 -18874 -46146 81124
5986 81124 224915 247561 98300 -23085 30649 -340829 -478222 15495 414783 315618
5976 315618 197768 -36828 -161142 -184798 -178168 -263745 37288 4846 -166239 30997 271416
5965 271416 110890 282441 154277 -113355 108231 -332722 -514440 -297943 147529 142509
5955 142509 35161 10520 25865 -183189 -440403 -231720 -153458 -288457 -71452 -153328
5945 -153328 -179613 -344365 -131208 -109239 -95914 -121629 -360490 -151858 -225544 -278304 -472976
5934 -472976 -216704 -186934 -284086 -373983 -373322 -176037 -384169 -451529 -162987 -54488 -108226
5923 -108226 -367277 -39661 -118031 -377555 -104312 -58333 314368 -121598 -269882 57127
5913 57127 155302 -175361 -90129 -43356 -192681 -213438 -418189 -558165 -163375 -147499 -154812
5902 -154812 -528727 -419754 -234547 -128654 147357 12573 -26881 -70814 57090 139559
5892 139559 -8718 45096 4850 -174878 -192428 -426354 -149339 101392 -154097 -56456
5882 -56456 170362 -14122 -133448 90676 321472 117404 -181599 -146588 -189559 -338315
5872 -338315 37159 -114458 18807 53397 -24710 33303 -39026 104609 273583 147165
5862 147165 113614 -30270 -228323 9093 -174071 -242077 -227015 -434585 -101224 -101511 -198815
5851 -198815 225881 203807 25278 -428524 -394339 -84151 -197836 -59163 -19893 390890
5841 390890 265868 -64784 162331 197623 177687 108366 91574 136084 164372 47026 322311
5830 322311 568655 320916 221236 117442 -19907 -157637 -22120 139511 323782 455760
5820 455760 105949 -73386 113363 -45659 -334941 -133277 164544 122897 142716 139558
5810 139558 -22109 -18548 -47722 -248122 -18674 215727 112815 32665 202484 224683 360561
5799 360561 -132307 61835 383082 218915 222877 289850 562104 525625 263849 280824 110885
5788 110885 125833 187454 215237 269673 108785 82686 113726 448844 418999 639701 462207
5777 462207 337275 233964 10510 61933 317375 353179 193482 -53005 -34101 -67405
5767 -67405 100408 257494 159993 542862 364603 366771 171829 439046 491497 485537 502476
5756 502476 292819 538094 341052 528849 431718 301175 647959 538063 459767 697531
5746 697531 550099 351610 275344 310270 581248 832903 745855 1177480 1023196 669974
5736 669974 750887 406817 782663 1002612 1045488 886902 696637 637039 603264 728031
5726 728031 826160 1068689 977534 1000351 890788 1004324 832460 790637 1117184 1259859
5716 1259859 1362797 1582195 1533490 1763663 1927958 2123171 2329943 2531952 2640645 2574383
5706 2574383 2590014 2339940 2691645 2770617 2598098 2420041 2300372 2136142 2312102 2473341
5696 2473341 2721081 3255578 3099856 3397384 3505523 3741601 3879579 4609813 5179971 5528787
5686 5528787 5958153 6020828 6021239 6081287 6043883 6033967 5975403 6025517 6261697 6104482 6159911
5675 6159911 6263137 6315575 6504180 6750769 6715843 6744756 6656971 6848983 6981868 7002399
5665 7002399 7420547 7884260 8146388 8622184 8451365 8791805 8932297 8820735 9328085 9907011
5655 9907011 10498998 11240778 12133589 12601287 12687772 12544708 12168477 11857949 10829768 9966194
5645 9966194 9729034 9516970 9318669 8942877 8776834 8800481 8902675 8691883 9043817 9231455
5635 9231455 9345289 9333897 9581332 9701312 9891355 10508425 10558061 10636454 10929752 10904205
5625 10904205 10944037 11601816 12057982 12734216 13267351 13638949 13548257 13245264 12628643 11749266
5615 11749266 10677431 9845677 9034640 8439852 8125460 7698281 7687304 8016062 8118978
5606 8118978 8641326 8977159 8754160 8383752 7940533 7292814 7018927 6854689 6926639 6741494
5596 6741494 6589611 6624564 6574469 6107713 5309072 5271697 4762711 4199312 3906730 3671779
5586 3671779 3346355 3381021 2837950 2845118 2750393 2585151 2611234 2575525 2647852 2316911 2293913
5575 2293913 2514549 2464002 2322433 2295185 2478556 2558771 2633571 2804014 2841308 2585399
5565 2585399 2481982 2127541 2152298 2673354 2518126 2435726 2677211 2854939 2697398 2887367
5555 2887367 3397504 4526498 5350271 6047516 7467297 9190257 10042400 10030887 9979102
5546 9979102 9511635 8396445 7403999 6708993 6193844 6226675 6006352 6459779 6976451 7528940
5536 7528940 8408610 9348696 10563410 10788328 10163534 9287626 8443213 7572517 6773704
5527 6773704 6155174 5821316 5272326 4829709 4703274 4396758 4606476 4571749 4424390 4679659
5517 4679659 4874467 4673661 4981068 5394802 5557733 5695073 5635937 5853019 6185442 6509759
5507 6509759 6978636 7859585 9072581 10517639 12473049 14601492 17091125 18439648 18998386
5498 18998386 18810750 17428129 15688844 14061324 12343727 10921732 9703930 8890898
5490 8890898 8137002 7367183 7233598 6776339 6473193 6130834 5866679 5509207 5470400 5492598
5480 5492598 5659188 5795268 5664935 5957288 5720813 5568879 6198536 6495747 6914444 7513317
5470 7513317 8347892 9119256 10201059 11010984 11484202 11907997 11724791 11299914 10747282
5461 10747282 9990610 9350309 8956003 8263330 7754032 7770290 7193283 7301440 7447094 7508926
5451 7508926 7422320 7443970 7738417 8213609 9068135 9273726 9840736 10643782 11220264 12183641
5441 12183641 13421819 14899454 16631600 19518753 22931331 27256893 32422239 37045597
5433 37045597 41703516 44110522 44211204 42278066 38730830 34431920 30564373 26895805
5425 26895805 23552776 21195150 18897200 17365266 15938824 15139787 14422579 13906706 14031096
5416 14031096 14411269 15255060 16340186 17724946 19212576 20467747 20896029 21106652 20842935
5407 20842935 20484816 20508849 21064226 22573534 24704462 27225710 30497567 33795197 36481330
5398 36481330 37883470 38078812 37261447 35518100 33625744 31610221 30180057 28912092
5390 28912092 27494831 26273489 24730334 22822968 20926816 19328660 18009294 17279304
5382 17279304 16667002 16230966 16403394 16370081 16650613 17241136 18024741 19274479 20832165
5373 20832165 22750074 25370693 28947169 33026319 37970327 44001188 50204150 55128856
5365 55128856 58646879 59993463 59454134 57208402 54162091 50558652 48146812 46468546
5357 46468546 45009081 43520780 42123468 41342631 40747271 40912590 41344309 42043284 42632826
5348 42632826 43424256 45427287 48348252 52293511 57122600 61472088 64845141 65928492
5340 65928492 64633723 61323281 56873288 51712690 46889403 42932684 40168246 38844385
5332 38844385 38217625 38737591 39168906 38937636 38358524 36317504 33942047 30854529 27877431
5323 27877431 25356012 23466597 22313555 21313797 20704379 20075946 19588266 18174334 16617639
5314 16617639 15267417 14055315 12725557 11778592 11458700 10717344 10552132 10505346 10131080
5305 10131080 10345971 10727960 11130687 11937211 13024242 14377546 15962010 17625330 18821778
5296 18821778 19576948 19088440 18097357 16379028 14639879 13345794 12299453 11472187 10623137
5287 10623137 10017131 9206874 8931313 8847245 8757015 8984314 9466843 9734615 10088775 11028549
5277 11028549 11914160 12783455 13483168 13962311 14022687 13580779 12594525 11477224 10267982
5268 10267982 9029519 8029442 7241176 6441542 6082841 5713973 5223769 4917174 4739951
5259 4739951 4662258 4279135 4057948 3929755 3561830 3598983 3394895 3187513 3195162 3064369
5249 3064369 2971834 2592100 2703049 2948455 2740962 2670989 2499203 2459732 2290448 2039462
5239 2039462 2088454 2140351 2135686 2169388 2391231 2464893 2667043 2457276 2575808 2574990 2510530
5228 2510530 2251292 2175866 2250582 1873341 1788713 1763400 1574222 1557532 1787324 1726989 1659189
5217 1659189 1728064 1553956 1748381 1960734 1952851 1733477 1744560 1864842 1724063 1210020
5207 1210020 1132144 1250361 1439305 1573619 1412575 1434312 1531929 1460048 1281159 1140824
5197 1140824 1250877 1497536 1475364 1296009 1409708 1348574 1200553 1106954 905110 1037698
5187 1037698 1032598 986748 1080421 1208757 1272389 744141 731790 989093 805686 894339 1210384
5176 1210384 1139247 1304332 1294270 1065005 1095818 786468 970214 1065381 1114343 790983
5166 790983 904402 919716 945385 789877 648162 803826 999944 1102039 648779 926524
5156 926524 1083633 1048030 900420 1029743 1027081 1309433 986034 1007029 1104227 735269 611921
5145 611921 837637 1099953 1073921 1187682 1013996 1416369 1269470 1220509 1175175 1291728
5135 1291728 1542818 1620439 2152702 2412072 2587516 2700235 2791113 2753577 2581538 2671768
5125 2671768 2616317 2689708 2764159 2592061 2306930 2764430 2762403 2873316 3020009 3242899
5115 3242899 3388448 3740942 3988848 4466306 5069772 4969575 5334765 5459526 5586364 5369204
5105 5369204 5391655 5520377 5433743 5361639 5132452 5171221 4930112 5156972 5610098 5722939
5095 5722939 5934597 6075470 6109622 6300997 6783671 6985192 7320508 7797295 7847940 7669328
5085 7669328 7930984 8088136 8116899 8220206 8366564 8341463 8117341 7738638 7753783 7928734
5075 7928734 7848455 8010506 8246089 8405819 8647054 8868156 8971045 9113562 8976754 8762206
5065 8762206 8745706 8534107 8174545 8128788 8021980 7668689 7441719 7280164 7113549 7388911
5055 7388911 7584243 7703367 8040397 8236713 8291961 8406625 8368948 8524916 8173919 7557294
5045 7557294 7167645 6584092 6293140 5943399 5769762 5916946 5477647 5318671 5224179 5030075
5035 5030075 4820147 4694006 4735580 4606817 4675677 4613367 4732424 4762974 5160297 5029308
5025 5029308 4932525 4747959 4424823 4098050 3697253 3732343 3467568 3151001 2788840 2509474
5015 2509474 2278298 2239375 1834140 1811112 2000528 1790906 1499313 1689531 1968737 1906805
5005 1906805 1964628 2020925 1888054 1826229 1801717 1738997 1556787 1356824 1563265 1131927
4995 1131927 1116175 1254990 1350105 1207729 992646 898618 1020149 1135662 897934 814739
4985 814739 697794 496177 759503 820210 1083657 1083331 874729 947633 674683 648398 715463
4974 715463 493004 510175 1006526 1001767 987263 1195943 1332669 964368 642312 709248 863871
4963 863871 963929 909330 1191682 890303 790133 758196 876631 958217 705176 872133
4953 872133 748696 689859 655918 844469 743791 730464 880378 793302 802849 893008 892831
4942 892831 1034939 1086616 979773 804115 1012756 703225 698990 708521 481746 744752 681324
4931 681324 648375 664544 938244 820496 594904 473557 453417 413891 224547 232501 435711
4920 435711 467370 299682 522650 744295 636894 723184 633047 748388 808308 669503
4910 669503 890617 993912 724303 693197 802324 781093 783109 749352 719657 797224 632318
4899 632318 592306 512441 568839 812495 1028952 987625 705336 654405 585713 748923 824469
4888 824469 638499 564792 893024 982304 783305 660569 730181 815884 1001113 755922
4878 755922 761548 854320 829244 667886 833226 965957 725934 827158 805689 852825 968367
4867 968367 842210 984836 1035829 1147037 1158236 754681 883985 880364 619452 695955 631237
4856 631237 712069 778558 761200 910269 1001998 944980 1086838 1138590 953039 890315 792395
4845 792395 674800 438550 463583 671115 824674 815897 706190 761144 1008479 1033767 1112518
4834 1112518 645865 768471 679402 393927 542447 581754 856706 724072 918689 872674
4824 872674 841157 870390 858168 873283 1234641 1102858 720653 914336 1078454 1016981 843788
4813 843788 725756 1107962 871569 646854 674163 646884 779136 711048 766515 817837 893469
4802 893469 311997 371215 653210 784618 676583 323361 476630 428623 506418 383230
4792 383230 542791 578497 258781 463520 626559 911526 897735 794915 764566 777115
4782 777115 519139 652710 814273 854336 974422 819355 619412 591468 594656 738042
4772 738042 946495 760409 546238 715546 714690 770923 990436 850541 721146 902154
4762 902154 1204202 1084781 959756 1055918 1228975 1085302 1175239 929324 947782 918993
4752 918993 474293 837204 831474 1011585 1132693 990362 1014494 802694 512360 623239
4742 623239 618073 564350 838420 854852 892193 1205047 904173 1050615 716663 718347 760911
4731 760911 575919 872539 899259 994418 1045799 1203228 1375045 1171158 962373 922392
4721 922392 753540 810247 1017835 1148676 1026806 1093011 1032918 819677 873053 675539
4711 675539 461128 557471 799561 1079364 1160015 1231318 1355083 1199297 1190195 1284016 969345
4700 969345 1074989 1018242 867651 1019945 1025393 1212723 1034952 906995 1428594 1191844
4690 1191844 737190 1046689 1220234 812024 806794 846254 597834 791962 991140 840242
4680 840242 709768 698943 480972 588832 826417 758775 1010870 1155112 926928 927749 1048993
4669 1048993 886363 956976 921034 1112116 977930 1215341 951763 1103670 1214366 1071212
4659 1071212 1177984 995597 744584 728971 767507 562953 796369 822114 684940 682500
4649 682500 744897 574637 731476 1019001 988112 834640 992511 974011 880817 830502 647842
4638 647842 799898 767859 461634 693990 977849 941765 890526 1168533 1248420 1075080
4628 1075080 1051297 1013111 1045931 857026 667976 509356 856888 857079 717152 655956 789126
4617 789126 803246 920610 1108807 954610 976783 530892 409959 411829 491203 216682 283204
4606 283204 420238 484142 489000 652311 915708 936239 886401 885365 1039344 765209 1024965
4595 1024965 1013356 892834 989591 950992 838920 1021636 1177747 1055815 810802 855491
4585 855491 972697 829082 767017 815967 1048751 589585 477245 812445 1060578 840548
4575 840548 1054119 1108935 1125557 1129644 833224 652780 847224 782801 786246 971472 935656
4564 935656 823545 593578 761243 903481 927870 857264 927574 1008861 987237 1019866 878715
4553 878715 833767 891021 677741 542512 435440 339826 617219 868488 1080976 1140353
4543 1140353 1136412 952805 915012 1014347 909883 781701 865938 1019028 842144 593613
4533 593613 774326 829102 1013328 1136225 993813 958627 961118 833704 751818 951657 1082765
4522 1082765 1046213 834737 782074 820404 740069 641503 626518 515683 395565 521389 681768
4511 681768 716457 435152 299844 449870 361302 296513 404010 564753 566069 708512 660232
4500 660232 795969 420159 427080 574793 416649 493276 527696 389245 529786 716725
4490 716725 749908 763414 764424 572945 671384 675174 652270 459745 341467 610180 596952
4479 596952 678691 559908 878920 810492 740324 771795 703650 852260 787387 1079837 1017891
4468 1017891 1204617 1075193 990181 1305976 1322391 1459783 1370883 1196671 1140967 1131036 1308115
4457 1308115 1438066 1638074 1866143 2134080 2520624 2594927 2540554 2595415 2737211 2336405
4447 2336405 2529194 2455700 2250966 2664163 3047730 3561293 3898676 4177592 4027515 4477333
4437 4477333 5091924 5087082 5162217 5256898 5199173 5141929 5153245 4774844 4712235 4632012 4751962
4426 4751962 5014844 5228501 5401757 5434593 5893465 6350152 6665775 6596479 6421608 6485586
4416 6485586 6197445 6000879 5652316 5367623 4971618 4774108 4718156 4703408 4981792 5093405
4406 5093405 5237495 5045180 5205770 5306984 5598280 5430024 4985810 4728169 4346713 3984909
4396 3984909 3457353 3299882 3061320 2916108 2582225 2314793 2107510 2409564 2791033 2634230
4386 2634230 2938955 2741574 2416524 2110751 1839047 1765105 1838859 1583238 1416269 1414570
4376 1414570 1355154 1169161 1180239 1483089 1135901 1293805 1201954 1100741 1108102 844543
4366 844543 692978 479771 299207 161723 314005 390802 623001 639433 638176 984446
4356 984446 705004 479365 708445 950948 639698 577613 545572 360475 621053 892552
4346 892552 693247 514149 678672 656452 721295 694543 827626 836686 844557 497796 522889
4335 522889 525799 340118 594487 537535 857797 663065 668514 919726 837947 784943 591726
4324 591726 506284 280842 361731 394602 276724 517205 567035 778801 757987 529524 557901
4313 557901 375260 99479 333234 429006 327347 589558 726561 754972 588340 481941
4303 481941 679929 655731 648505 699776 844779 1065776 934822 779123 466025 276016
4293 276016 95861 -86937 -54668 261727 387804 464066 735982 645430 672357 473996
4283 473996 297764 286969 133266 212945 89740 280610 597754 368226 400196 393839 341689
4272 341689 458002 448010 163190 290000 537640 615180 609867 481577 421284 360232 293990
4261 293990 276977 317165 223847 375749 704166 307643 392257 549193 385995 440821 168530
4250 168530 204598 423605 436053 333700 362171 620097 788462 553397 631761 582524 505550
4239 505550 599853 416869 522913 820247 446673 202626 368406 803768 608311 449138
4229 449138 553641 1030204 898314 683642 843883 681196 774053 682906 505973 451735
4219 451735 1081551 911333 908068 894697 798514 817907 1002515 1193135 1160094 1015278 533850
4208 533850 661412 545889 337266 564135 979060 637291 906708 1043583 1181756 1101444
4198 1101444 910734 1104402 1193965 1040657 749937 585559 389360 565122 775026 682728
4188 682728 786088 1050279 1055601 797007 898660 958038 717953 536761 596236 494494
4178 494494 579367 743841 505299 747982 958829 824020 793079 915759 901798 1380456
4168 1380456 1460736 1547501 1503957 1294685 1383842 1198899 1064623 1423165 1343104 1238050
4158 1238050 1183883 1256315 1115726 1283539 1365503 1625171 1697323 1553724 1446268 1371971
4148 1371971 1437965 1548761 1669259 1782924 1489689 1150847 1342138 1298338 1268422 1311235
4138 1311235 1295713 1285069 1674518 1694502 1884926 2061557 2000949 1848161 1286635 1527558
4128 1527558 1422039 1306092 1464109 1700666 1565740 1088356 954981 878460 914321 1040575
4118 1040575 972485 1035393 1361282 1363520 1697587 1948692 1881382 2171554 2241027 2166836 2118645
4107 2118645 1964014 1727714 1588030 1436416 1291205 1478802 1331682 1607328 1704938 1494503
4097 1494503 1640178 1968940 2006966 2239242 2934632 3517175 3754956 4021363 4009949 3533831
4087 3533831 3305149 3196969 2571604 2545244 2544261 2557353 2596489 2743834 2825571 2709217 2877422
4076 2877422 3007029 3583681 3762578 3969646 4265369 4427288 4434734 3791899 3350379 3009567
4066 3009567 2754750 2348644 1923314 1957935 1795412 1633405 1660331 1895135 1645903 1350294
4056 1350294 1778225 2094125 2145221 1918582 1664022 1500483 1875960 1843111 1770705 1975692
4046 1975692 2121001 2085054 2357714 2387917 2476239 3096828 2940760 3245476 3806921 4043102
4036 4043102 4627529 5232856 5507275 5509507 5409719 4904575 4297391 4178224 3814621 3238969
4026 3238969 3330964 3160092 2964980 3423001 3320623 3466485 4386290 5139768 5599682 5972159
4016 5972159 6693781 6792402 5958592 5382452 4920997 4026564 3160956 2941376 2724416 2672709
4006 2672709 2329897 1910001 1746066 1725520 1610307 1367715 1477061 1582736 1378388 1239892
3996 1239892 1266852 1373413 1919530 1651892 1561633 1868592 1737311 1978814 2033544 2167057
3986 2167057 2232510 1791487 1650311 1813198 1672427 1526018 1811263 1889030 1858330 1939944
3976 1939944 2093438 1872750 1626668 1820476 1314907 1183156 1517543 1334206 1007755 1314598
3966 1314598 1523074 1760330 1863304 2379605 2616501 2479035 2454407 2917982 3467294 4080973
3956 4080973 5370854 6659592 7522355 7658792 6894784 6395724 5605213 4930502 4775980
3947 4775980 4337562 4377436 3904105 3708348 3711376 3560535 4197978 4832343 5783276 7371183
3937 7371183 8744227 9791085 11055406 11973955 12304710 12130961 11059385 9876498 8361876
3928 8361876 7137980 6414369 5637615 5307619 5121695 5305688 6056663 6107737 6356210 7010921
3918 7010921 7690696 8606448 9635230 10546647 10479201 9685458 8129317 7017983 6038076
3909 6038076 5499194 5474856 5346997 5206655 5182771 4951978 5141969 5475201 5411983 5315804
3899 5315804 5111099 4901959 4349074 4080880 3655888 3341451 2901208 2820613 2874817 2729530
3889 2729530 2897032 2663175 2708154 2921057 2598462 2722568 2899432 2811918 2208968 2276179
3879 2276179 2176763 2421858 2562845 2724670 2754891 2944291 3124717 3066039 3474175 3839605
3869 3839605 4328821 5112231 5833324 6893103 8279855 9412335 9938777 10232337 9887330
3860 9887330 8952932 8114998 7196155 6592122 6206607 5729574 5707017 5702602 5575290 5696301
3850 5696301 5808103 6084466 7016050 7734740 8326748 9287737 9682082 9535656 8756164 8093142
3840 8093142 6802911 5843673 5156999 4518036 4039532 3563069 3340714 3237309 3203940 3199619
3830 3199619 3062987 2883275 2798127 3001620 2775451 2694638 2910180 3106287 3483910 3371787
3820 3371787 3445208 3627565 4226980 4716831 5352999 6033457 6678014 7657126 8705802 9655432
3810 9655432 10006588 9769463 9241483 8529632 7784778 6888895 6231550 5605902 5231535 4689772
3800 4689772 4315121 4046758 3534077 3585349 3160345 3122829 3146436 3016577 2838509 3085232
3790 3085232 3089065 3232314 3231986 3751311 4130559 3998079 4288436 4742464 4825585 5176041 5915881
3779 5915881 7122243 8018979 8806535 9666554 10258306 10579826 10521974 10193243 9751851 9498871
3769 9498871 9257317 9136781 8895763 8772662 8295403 7884526 7504729 6829238 6406602 5848719
3759 5848719 5618524 5977771 6188524 6127461 6372689 6547547 6402071 6004199 5777970 5744610
3749 5744610 5336351 5117497 5235085 5381670 6036895 6688266 8000575 9409000 10342323
3740 10342323 11076732 10722893 10321913 9721092 9163863 9011870 9100048 9456959 10384827 11609110
3730 11609110 12904011 14096437 14325841 13671196 12268569 11260012 10535872 10131985 10847651
3721 10847651 11730280 12876909 13520342 13629212 13052368 11874908 11193157 10750426 10145708
3712 10145708 9992168 10105415 10496369 10610491 11179472 11074911 10564132 9722622 8473548
3703 8473548 7587864 6642449 5677758 5166584 4782253 4137141 3756006 3439767 3155676 3025786
3693 3025786 3188748 3113469 3153472 3050249 3060793 3119140 3127961 3143469 3179964 3454322 3254203
3682 3254203 3352840 3598357 3749714 4159009 4422639 4862762 5333175 5399143 5309527 5016412
3672 5016412 4737295 4287080 4002936 3567109 3536599 3146760 3007301 2928033 3009194 3060808
3662 3060808 3026050 2941355 2875524 2680316 2480817 2274434 2102581 2265564 2193891 1912598
3652 1912598 1976279 2043676 2108276 2111422 2115257 2244796 2146423 2352618 2341452 2368613 1968807
3641 1968807 1481615 1894856 1577027 1419386 1765798 1756875 1890559 1955097 1996132 1969893
3631 1969893 2264662 2181846 2414704 2171266 1741887 1914791 2242785 2473136 2589212 2795953
3621 2795953 2997682 3117027 3204835 3206805 3232744 3133004 3173729 2852019 2751800 2663239 2598112
3610 2598112 2362703 2325571 2420215 2460597 2444237 2345660 2628402 2684137 2577486 2924923 3353123
3599 3353123 2994587 2829783 3106710 2792929 3084847 3400745 3720941 4125018 4207276 3918988
3589 3918988 4406773 4632607 4506522 4422205 4227886 4309331 3633385 3382624 3521913 3542083
3579 3542083 3378163 3251223 3373671 3414262 3541560 3491725 3871285 3840509 3693255 3588642
3569 3588642 3563697 3680995 3612690 3707745 3999333 3983367 4273258 4364725 4722659 4757936 4648346
3558 4648346 4947872 5123894 4862081 4912535 5024576 4798367 4886474 4679165 4493477 4471787
3548 4471787 4520358 4416636 4527580 4856243 4801794 4758538 4516662 4526283 4786736 4539904
3538 4539904 4853340 4812341 5058783 5265704 5367363 5606712 5908180 5563123 5500351 5265937
3528 5265937 4847572 4898044 4947012 5048383 4980513 4758172 4813094 4579563 4689450 4720127
3518 4720127 5129225 5934769 6173780 6497823 6704004 6563762 6349884 5844795 5376984 5133512
3508 5133512 5085133 4752446 4587331 4882266 4988687 4330481 4512260 4170469 4027459 4195848
3498 4195848 4034709 4056502 4249487 4186153 3932293 3914305 3738756 3640663 3698336 3567266
3488 3567266 3402722 3476421 3515985 3399020 3561602 3478277 3184447 3254872 3114179 3262054
3478 3262054 3301195 3320640 3213114 3076066 3261578 3278436 3269804 3202155 2980650 2941187 2762891
3467 2762891 2616246 2705886 2701018 2836025 3090992 2727169 2387434 2401132 2445975 2497464 2512987
3456 2512987 2482808 2371352 2621319 2584340 2692598 2568242 2569493 2646516 2459415 2643038
3446 2643038 2433881 2445935 2314303 2189075 2212229 2572751 2461992 2451437 2360995 2566010
3436 2566010 2438455 2127982 2055192 2120753 1958656 1882813 1971878 1802832 1925912 2133111
3426 2133111 2044450 1955214 1919695 1855339 2027839 1705626 1984803 2073327 1657430 1739440 1793888
3415 1793888 2107513 2052466 2090329 2109294 1881316 1708606 1750101 1657067 1765925 1930994
3405 1930994 2235049 2053638 1832842 2074821 2200087 2155576 2282440 2287616 2252127 2069217
3395 2069217 2204894 2460816 2546904 2511588 2700762 2705520 2643385 2408447 2257776 2462012
3385 2462012 2256601 1988529 2172652 2268129 2289733 2594510 2621695 3015262 3265364 3374051
3375 3374051 2987324 2991817 3070378 2650227 2543074 2580960 2638500 2208751 1994582 1980998 2252989
3364 2252989 2333058 2295322 2570329 2599196 2728073 2321120 2400267 2547346 2559515 2647380 2515258
3353 2515258 2497440 2330674 2180036 2325703 2168995 2219363 2142515 2141137 2194432 2158356 2069720
3342 2069720 2120847 2142304 2257630 2164276 2251039 2757383 2671297 2392337 2813562 2762862 2604194
3331 2604194 2799948 2762758 3191759 3672196 3907252 4334769 4535435 4725343 5018677 5766321
3321 5766321 6517058 7139210 8291242 9592882 10591952 11850224 12948346 13759065 14734574
3312 14734574 15663880 16715069 18178257 19752674 21276957 22534431 23032855 23150905 22477880
3303 22477880 21533335 20784450 20323208 19916579 19341492 18352350 17536894 16173231 14183242
3294 14183242 12550959 10822445 9623904 8249717 7403923 6800820 6155008 5557840 5455362
3285 5455362 5105240 4717213 4563640 4159950 3671146 3275404 3243912 3097370 3213282 3286704
3275 3286704 3000330 2843484 3227504 2960779 2931010 3085073 2818462 2638230 2381482 2300456
3265 2300456 2253896 2281256 2686510 2272178 2064015 2286605 2244306 2371564 2517465 2361734
3255 2361734 2325613 2094692 1915649 1849035 2003744 2081306 1903629 1638944 1899994 1810033
3245 1810033 1406411 1307635 1257290 1447551 1529639 1303414 1305337 1358928 1458270 1311426 1180183
3234 1180183 1272506 1211134 948438 975471 1094597 933966 1390216 1442297 1548351 1565549
3224 1565549 1487501 1507637 1570073 1415661 1574497 1485041 1098549 1011910 859773 1147198
3214 1147198 1108474 1234265 1142736 999619 1236561 1307047 1213393 1348384 1524545 1478903
3204 1478903 1737076 1585143 1488042 1509479 1318996 1481140 1608802 1616131 1473814 1330006
3194 1330006 1043636 986445 955056 877757 949795 1012643 833620 1213566 1451508 1256046
3184 1256046 1355323 1565312 1487596 1333235 1260563 1136545 1315973 1333911 1429254 1120649
3174 1120649 1223959 1028463 942885 1098890 1171710 1566882 1663718 1503765 1407695 1168663
3164 1168663 886727 708621 899613 926687 1270203 1244523 1030954 1185871 1299407 1091618
3154 1091618 1158222 1263169 1044512 902046 1119578 1316985 1481081 1528176 1452448 1705799
3144 1705799 1558661 1650328 1645584 1703498 1541872 1372563 1448520 1625640 1185552 1244444 1178581
3133 1178581 1115056 1105557 1302324 1151593 1275475 1549975 1255549 1178417 1060567 1213293
3123 1213293 1308786 1400312 1319851 1202958 1221275 1370000 1303572 1198687 1139035 1438135 1367341
3112 1367341 1335781 1236848 1466891 1552963 1268177 1395152 1640651 1385641 1265318 1331121
3102 1331121 1536712 1705504 1686377 1886100 1766501 1687709 1892856 1774982 1566418 1634292
3092 1634292 1709943 1903342 1828051 2003393 2182925 2308695 2523515 2504472 2472212 2871666
3082 2871666 2927408 2817382 2759869 2886327 2936563 2694381 2735719 3116041 3339403 3345844 3064371
3071 3064371 2767213 3042246 2765248 2693061 2730586 2939537 3046933 2879839 2868906 2767869
3061 2767869 3033451 3077314 2968302 3086213 2986534 2919481 2814227 2854899 3000309 2923338
3051 2923338 2932534 2823678 2597451 2697035 3038629 3097193 2781897 2751328 2674526 2539057 2353911
3040 2353911 2218010 2165731 1991586 2152890 2029753 2032036 2079614 2198736 2467039 2359863
3030 2359863 2080866 2211162 2131211 2064762 1992822 2021004 1947302 1749214 1740848 1568812 1604944
3019 1604944 1813736 1712030 1576896 1773410 2053008 1929211 1601368 1663980 1924791 1638345
3009 1638345 1430313 1620323 1958086 1735746 1678208 1908355 1640598 1832003 1603739 1679476
2999 1679476 1943704 1724739 1669486 2014459 1907665 1902179 2119951 2132336 2304020 2245129
2989 2245129 2269282 2422856 2289913 2080610 2220025 2209608 2376871 2704999 2489876 2521630
2979 2521630 2669959 2577044 2471169 2458946 2481028 2272696 2352169 2256860 1926632 1954603 2037463
2968 2037463 2061964 2232327 2358886 2476964 2535258 2225590 2453908 2553397 2527761 2586060
2958 2586060 2765760 3139332 3112778 3339778 3074583 3082365 3406950 3340655 3377082 3720846
2948 3720846 3983429 3667169 3689892 3583665 3992677 3864268 4017660 4154037 4286427 4377109
2938 4377109 4235302 4299613 4622180 4933183 4685363 4961908 5068140 5070486 5191946 5531591
2928 5531591 5705358 5928361 6121326 6453938 6987950 7500106 7641174 8069779 8617035 9153250
2918 9153250 9320692 9450663 9598949 9856716 9906140 10130286 10733346 11103019 11605671 11837150
2908 11837150 12342808 12926303 13254761 13837392 14685925 15438167 16197031 16869172 17488023
2899 17488023 18263583 18644441 18971306 19110408 18823693 18924737 18495835 18223579 18130793 17823853
2889 17823853 17398604 17013018 16740740 16514866 16327241 16353624 16693850 16633607 16870544 17017173
2879 17017173 16471151 16306216 15841270 15188837 14562960 13906070 13595584 13061279 12687501
2870 12687501 12085469 11690607 11020452 10437662 9896270 9828006 9532734 9676212 9566362 9368424
2860 9368424 9512305 9345167 9430531 9414906 9749471 9638732 9646233 9863896 9765998 9361527
2850 9361527 9418893 9585771 9651170 9814322 10230311 10531103 10991706 11135353 11072604 11116738
2840 11116738 10962409 10782341 10963990 10597656 10184835 10243819 10027021 10006095 9927931 10174689
2830 10174689 10392311 10617966 10958728 11051809 11111175 11078053 11098791 11179483 10846657 10368282
2820 10368282 10202936 10029441 9564059 9566759 9650177 9653361 9916773 9948580 9770995 9757022 9682433
2809 9682433 9661666 9943877 10299597 10447980 10669264 10657804 10853312 11008744 10967812 10855647
2799 10855647 10774527 11036858 10905821 10962321 11335004 11772136 12054478 12457317 12715738 13049323
2789 13049323 13144497 13291037 13372788 13498168 13460194 13249666 13114973 12953556 12633853 12314386
2779 12314386 12308397 12581139 12804437 12410382 12478724 12605560 12602219 13008725 13077289 13203998
2769 13203998 13555276 13110697 12907613 12715055 12437173 12312859 11977792 11881150 11366730 11125795
2759 11125795 11067571 11052197 11094757 10877348 10674919 10448050 10844018 10874199 10922734 11109585
2749 11109585 11291547 11434749 11757350 11900656 12061066 12227533 12264551 12551293 12686646 12674804
2739 12674804 12769486 13542108 13797464 13948804 14186689 14350550 14332547 14338929 14288827 14490383
2729 14490383 14802443 14937777 15387393 15587993 15869383 16379500 16409205 16498027 16601452 16597364
2719 16597364 16525286 16561781 16819281 16734263 16446381 16454961 16389079 16211606 16001335 15636782
2709 15636782 15251906 14996568 14662121 14338174 14083932 14304471 14239324 13769065 13830669 13829762
2699 13829762 13584973 13496418 13671023 13909472 13945629 14083644 14735264 15192584 15124597 15023591
2689 15023591 14776113 14438231 14421986 14528446 14917510 15292352 15682045 16075755 16357497 16392700
2679 16392700 16426640 16192175 16443704 16835035 16819783 17134512 17441625 18029633 18277303 18341273
2669 18341273 18819929 19504130 20295675 20938634 21510178 22258358 22218658 22099913 22409726 22653673
2659 22653673 22726751 23082455 23772727 24111014 24491009 24949965 25402319 25636711 26317504 27097364
2649 27097364 27437704 27765358 28317146 28772358 29107477 29774034 30962300 31848896 33195660
2640 33195660 34947513 36964386 39311297 42058925 44810698 47635866 50171566 52973091
$$ [...]
##END NTUPLES=NMR SPECTRUM
##END=
