##TITLE=1H_EC-3375-x2
 200.13Hz, DMSO-d6.
 8 sc
 
19.3.2026
##JCAMPDX= 6.0         $$ Bruker NMR JCAMP-DX V2.0
##DATA TYPE= NMR SPECTRUM
##DATA CLASS= NTUPLES
##ORIGIN= UXNMR, Bruker Analytische Messtechnik GmbH
##OWNER= pz
$$ XWIN-NMR		Version 3.5
$$ Thu Mar 19 13:39:04 2026 Russian Standard Time (UT+4h)  she@DPX200
##.OBSERVE FREQUENCY= 200.1313
##.OBSERVE NUCLEUS= ^1H
##.ACQUISITION MODE= SIMULTANEOUS
##.ACQUISITION SCHEME= undefined
##.AVERAGES= 8
##.DIGITISER RES= 18
##SPECTROMETER/DATA SYSTEM= spect
##.PULSE SEQUENCE= zg30
##.SOLVENT NAME= DMSO
##.SHIFT REFERENCE= (INTERNAL, DMSO, 0, 15.4957)
##AUDIT TRAIL= $$ (NUMBER, WHEN, WHO, WHERE, WHAT)
$$ ##TITLE= Audit trail, XWIN-NMR		Version 3.5
$$ ##JCAMPDX= 5.01
$$ ##ORIGIN= Bruker BioSpin GmbH
$$ ##OWNER= she
$$ F:/spectra/data/she/nmr/H-C/1/pdata/1/auditp.txt
$$ ##AUDIT TRAIL=  $$ (NUMBER, WHEN, WHO, WHERE, WHAT)
(   1,<2026-03-19 13:37:40.12 +0400>,<she>,<DPX200>,
      <created by zg, POWCHK disabled, PULCHK disabled
       configuration hash MD5:
       00 E9 B6 7A A2 85 ED C7 34 08 36 98 17 FE 4E 26
       data hash MD5: 16K
       0E 59 44 20 8F D1 8A 3C B0 27 77 49 8D E5 57 69>)
(   2,<2026-03-19 13:37:42.43 +0400>,<she>,<DPX200>,
      <Start of raw data processing
       efp BC_mod = 2 LB = 0.25 FT_mod = 6 PKNL = 1 PHC0 = -3710.96 PHC1 = 19.7923 SI = 16K 
       data hash MD5: 16K
       C4 79 75 45 15 92 50 F6 3D 20 9D C5 9A 28 FF 26>)
(   3,<2026-03-19 13:37:59.56 +0400>,<she>,<DPX200>,
      <pk PHC0 = 9.635807 PHC1 = -12.8 
       data hash MD5: 16K
       EC 66 F3 FC 7C 4D 57 E9 B3 64 CD BD 9C E5 DC 4F>)
(   4,<2026-03-19 13:38:03.04 +0400>,<she>,<DPX200>,
      <abs ABSG = 5 
       data hash MD5: 16K
       04 C4 38 27 64 0D 9F 35 DF 18 BE 6D 89 57 A9 34>)
$$ ##END=
$$ 
$$ hash MD5
$$ F7 D0 3B 1C 16 65 0A 36 7D E5 64 A8 7F 60 54 C7
##$RELAX= 
##$RELAX= 
##$RELAX= 
##$RELAX= 
##$RELAX= 
##$RELAX= 
$$ Bruker specific parameters
$$ --------------------------
##$DU= <F:/spectra>
##$EXPNO= 1
##$NAME= <H-C>
##$PROCNO= 1
##$TYPE= <nmr>
##$USER= <she>
##$AMP= (0..31)
100 100 100 100 100 100 100 100 100 100 100 100 100 100 100 100 100 100 
100 100 100 100 100 100 100 100 100 100 100 100 100 100 
##$AQSEQ= 0
##$AQ_mod= 1
##$AUNM= <au_zg>
##$AUTOPOS= <>
##$BF1= 200.13
##$BF2= 200.13
##$BF3= 200.13
##$BF4= 200.13
##$BF5= 200.13
##$BF6= 200.13
##$BF7= 200.13
##$BF8= 200.13
##$BYTORDA= 1
##$CFDGTYP= 0
##$CFRGTYP= 5
##$CHEMSTR= <none>
##$CNST= (0..31)
1 1 145 1 1 1 1 1 1 1 1 1 1 1 1 1 1 1 1 1 1 1 1 1 1 1 1 1 1 1 1 1 
##$CPDPRG= <>
##$CPDPRG1= <>
##$CPDPRG2= <>
##$CPDPRG3= <>
##$CPDPRG4= <mlev>
##$CPDPRG5= <mlev>
##$CPDPRG6= <mlev>
##$CPDPRG7= <mlev>
##$CPDPRG8= <mlev>
##$CPDPRGB= <>
##$CPDPRGT= <>
##$D= (0..31)
0 0.7 0 0 0 0 0 0 0 0 0 0.03 0 0 0 0 0 0 0 0 0 0 0 0 0 0 0 0 0 0 0 0 
##$DATE= 1773913059
##$DBL= (0..7)
120 120 120 120 120 120 120 120 
##$DBP= (0..7)
150 150 150 150 150 150 150 150 
##$DBP07= 0
##$DBPNAM0= <>
##$DBPNAM1= <>
##$DBPNAM2= <>
##$DBPNAM3= <>
##$DBPNAM4= <>
$$ [...]
##$SUBNAM3= <"">
##$SUBNAM4= <"">
##$SUBNAM5= <"">
##$SUBNAM6= <"">
##$SUBNAM7= <"">
##$SUBNAM8= <"">
##$SUBNAM9= <"">
##$SW= 18.0517328524113
##$SWIBOX= (0..15)
0 0 2 0 0 0 0 0 0 0 0 0 0 0 0 0 
##$SW_h= 3612.71676300578
##$TD= 16384
##$TD0= 1
##$TE= 0
##$TE2= 300
##$TE3= 300
##$TEG= 300
##$TL= (0..7)
0 120 120 120 120 120 120 120 
##$TP= (0..7)
150 150 150 150 150 150 150 150 
##$TP07= 0
##$TPNAME0= <>
##$TPNAME1= <>
##$TPNAME2= <>
##$TPNAME3= <>
##$TPNAME4= <>
##$TPNAME5= <>
##$TPNAME6= <>
##$TPNAME7= <>
##$TPOAL= (0..7)
0.5 0.5 0.5 0.5 0.5 0.5 0.5 0.5 
##$TPOFFS= (0..7)
0 0 0 0 0 0 0 0 
##$TUNHIN= 0
##$TUNHOUT= 0
##$TUNXOUT= 0
##$USERA1= <user>
##$USERA2= <user>
##$USERA3= <user>
##$USERA4= <user>
##$USERA5= <user>
##$V9= 5
##$VALIST= <valist>
##$VCLIST= <CCCCCCCCCCCCCCC>
##$VD= 0
##$VDLIST= <DDDDDDDDDDDDDDD>
##$VPLIST= <PPPPPPPPPPPPPPP>
##$VTLIST= <TTTTTTTTTTTTTTT>
##$WBST= 1024
##$WBSW= 4
##$XGAIN= (0..3)
0 0 0 0 
##$XL= 0
##$YL= 0
##$YMAX_a= 172126
##$YMIN_a= -219254
##$ZGOPTNS= <>
##$ZL1= 120
##$ZL2= 120
##$ZL3= 120
##$ZL4= 120
##$ABSF1= 15.48356
##$ABSF2= -2.56829
##$ABSG= 5
##$ABSL= 3
##$ALPHA= 0
##$AQORDER= 0
##$ASSFAC= 0
##$ASSFACI= 0
##$ASSFACX= 0
##$ASSWID= 0
##$AUNMP= <proc_1d>
##$AZFE= 0.1
##$AZFW= 0.1
##$BCFW= 0
##$BC_mod= 2
##$BYTORDP= 0
##$COROFFS= 0
##$CY= -3
##$DATMOD= 1
##$DC= 0
##$DFILT= <>
##$DTYPP= 0
##$F1P= 0
##$F2P= 0
##$FCOR= 1
##$FTSIZE= 16384
##$FT_mod= 6
##$GAMMA= 0
##$GB= 0
##$INTBC= 1
##$INTSCL= 3.241238e-09
##$ISEN= 128
##$LB= 0.25
##$LEV0= 0
##$LPBIN= 0
##$MAXI= 10000
##$MC2= 0
##$MEAN= 0
##$ME_mod= 0
##$MI= 1.114404
##$NCOEF= 0
##$NC_proc= -7
##$NLEV= 6
##$NOISF1= 3.799351
##$NOISF2= 2.8
##$NSP= 0
##$NTH_PI= 0
##$NZP= 0
##$OFFSET= 15.49568
##$PC= 1
##$PHC0= -3701.324
##$PHC1= 6.992299
##$PH_mod= 1
##$PKNL= yes
##$PPARMOD= 0
##$PSCAL= 0
##$PSIGN= 0
##$REVERSE= no
##$SF= 200.13000520788
##$SI= 16384
##$SIGF1= 3
##$SIGF2= 2
##$SINO= 0.751879
##$SIOLD= 32768
##$SREGLST= <19F.Aceton>
##$SSB= 0
##$STSI= 16384
##$STSR= 0
##$SW_p= 3612.71676300578
##$SYMM= 0
##$S_DEV= 0
##$TDeff= 16384
##$TDoff= 0
##$TI= <>
##$TILT= no
##$TM1= 0
##$TM2= 0
##$TOPLEV= 0
##$USERP1= <user>
##$USERP2= <user>
##$USERP3= <user>
##$USERP4= <user>
##$USERP5= <user>
##$WDW= 1
##$XDIM= 16384
##$YMAX_p= 480071443
##$YMIN_p= -811463
$$ End of Bruker specific parameters
$$ ---------------------------------
##NTUPLES= NMR SPECTRUM
##VAR_NAME=  FREQUENCY,     SPECTRUM/REAL,   SPECTRUM/IMAG
##SYMBOL=    X,             R,               I
##VAR_TYPE=  INDEPENDENT,   DEPENDENT,       DEPENDENT
##VAR_FORM=  AFFN,          ASDF,            ASDF
##VAR_DIM=   16384,         16384,           16384
##UNITS=     HZ,            ARBITRARY UNITS, ARBITRARY UNITS
##FACTOR=    0.220516191357247, 1,           1
##FIRST=     3101.15049015017, 0,            0
##LAST=      -511.566272855608, 0,           0
##MIN=       -511.566272855608, -811463,     0
##MAX=       3101.15049015017, 480071443,    0
$$ Real data points
##PAGE= N=1
##DATA TABLE= (X++(R..R)), XYDATA
$$ [...]
7344 335026 512857 451275 306780 325017 214120 35663 309153 300861 463916 484610 468496
7333 468496 550117 882989 817129 461973 676377 866302 1343944 1641507 1623219 1511933
7323 1511933 1338177 1005701 538118 225681 214926 312345 289850 163382 345245 379471
7313 379471 222978 154792 192545 -82984 77722 214288 249635 215792 227439 367177 363193
7302 363193 241542 402541 218411 130126 416606 3631 115528 171191 59891 74743
7292 74743 -35587 62853 82261 260304 33624 -239283 100789 233641 266278 263661 264705
7281 264705 266368 171046 280005 475588 187457 51149 177346 238430 163629 97373 -58252
7270 -58252 -11644 160624 -9164 6859 103946 254531 109570 -81233 254845 169295 -84515
7259 -84515 -10599 71831 170598 114364 -121550 -255894 -84155 67574 -143867 -92285 -149243
7248 -149243 -193183 41312 28625 -36458 61529 36771 -265936 -267366 -11323 95730 19598
7237 19598 5402 120999 -36846 -141280 -157994 -33481 -30603 77555 36404 -78835 -325046
7226 -325046 -331392 -101387 3434 -64088 -132956 -33149 -242698 -105780 71273 229084 -114233
7215 -114233 -70380 193752 127175 -62060 -106095 104676 206089 -48430 -88860 53759
7205 53759 61479 -240680 -311980 -91458 -136403 -290742 -37089 111701 323978 472834 195528
7194 195528 51904 31088 20074 160445 230878 215364 220187 143296 -12234 -316501 -184140
7183 -184140 -112730 -33472 -13726 111854 178483 207506 172909 124156 156638 168216 -12338
7172 -12338 86361 -34082 -230123 -268451 -318293 -135268 142366 25844 -252 295 156226
7161 156226 242887 218177 203467 19656 17126 124156 175130 9242 -215100 -84236 13094
7150 13094 -40681 -137048 -171330 95536 158934 136238 13124 190794 85172 -100270 -194690
7139 -194690 -77896 -43813 137144 162462 57969 217301 149876 -111788 -191456 -194105 -198617
7128 -198617 32352 46617 -158539 -235137 -82982 -158051 -200140 -156543 48485 -187603 -454535
7117 -454535 -240211 -267583 -202008 116209 235918 84197 153821 6406 -190025 -365661
7107 -365661 -131573 -189745 -36463 36120 97957 365508 271126 -35448 -78107 63255 -139319
7096 -139319 -206395 -204116 6442 -36522 -216222 41395 122488 -153322 -509275 -494618 -390816
7085 -390816 -407556 -90696 65300 -148345 -76794 -193016 -287741 22425 953 42702 -133511
7074 -133511 -141723 -365893 -322941 -329303 -397257 -170001 416 -7915 162440 -66089 -52264
7063 -52264 -4577 -182075 -236317 -294061 -228391 -336226 -149547 -66131 -163290 -201300 -310612
7052 -310612 -105317 -49863 -175525 -268051 -453788 -323220 -133835 133349 106519 46690
7042 46690 -60269 -125984 40831 182602 190611 173171 34349 -153189 -6072 45377 110873
7031 110873 -57081 -262579 -201622 -193295 65240 80123 -183064 -158555 -79509 -276203 -340924
7020 -340924 -364192 -476440 -89798 -94117 -139097 -78069 -21866 -140482 -280344 -223000 -218940
7009 -218940 -96758 -260374 -139228 -166574 -45235 202999 150244 -120815 -88142 10810
6999 10810 -85972 -134485 -137262 -284475 -23765 -94789 69140 -84558 -58109 -21444 -80384
6988 -80384 -150169 70269 126692 243258 314425 25582 63434 61566 -398527 -386225 -152442
6977 -152442 -210825 5691 -235480 -61251 -335148 -462008 -424787 -269272 -285547 -310573
6967 -310573 52200 5507 -183164 -233457 -258761 -81921 -143304 -491160 -341592 -222329
6957 -222329 -190957 -96764 -104537 76231 -157682 -94367 -73653 -99464 -234175 -245801 -140325
6946 -140325 -237261 -381817 -181491 -65898 -135667 -10389 104890 -9206 43897 -127194
6936 -127194 -57036 -86945 -177965 62288 187088 -89830 64995 -47199 -280641 -292433
6926 -292433 -100670 -176593 -141394 -59069 -53638 -53213 -207240 -204272 -171090 -6757 125871 127045
6914 127045 54588 -269855 -382179 -151376 -504261 -492532 -137019 -154882 -133789 212054
6904 212054 -45134 1912 -189753 -280759 -376578 -288101 -170886 -121407 -210745 -483463 -196249
6893 -196249 32708 -261413 -267945 67405 92324 5992 -18948 -39557 -37263 -60017 -126570
6882 -126570 -50339 103083 -168008 123590 -18934 -18517 -65687 -86763 -91302 21817 99759
6871 99759 -269017 -98369 -111046 -131031 -61101 -157382 63940 71295 -102025 -187630 -346663
6860 -346663 -105239 -31992 128201 93394 21100 -213121 -365768 -16347 115799 169405
6850 169405 -3368 -247218 -266714 -284202 -225304 -104918 -119438 -233448 -348306 -520355
6840 -520355 -294991 -187931 -105310 -78021 -273555 -561667 -452208 -187987 -8182 -11973
6830 -11973 -201919 -118079 -201490 -344532 -261693 -127299 -188054 -99440 -157642 -202885 -234547
6819 -234547 -283510 -229718 -116533 -100506 -93028 -53035 -41733 -124455 -336361 -160595 -220878
6808 -220878 -93834 -96583 -146158 -107454 -270537 -274378 -288061 -132142 -199564 68086 6357
6797 6357 -35600 25451 -234560 19048 60512 94470 181525 109889 38323 -124163 124958
6786 124958 319932 -9383 -167951 -101097 -216161 -255750 -227958 -34992 -84463 -23839 -63550
6775 -63550 -84105 94341 -25392 35487 -54624 -42916 -45241 43482 32727 -100517 7776
6764 7776 -40786 -4062 99339 -936 40630 152613 82481 -126217 -132502 -204830 -20607
6753 -20607 71181 -94956 -237076 -100818 136752 113480 -63543 -78363 -226205 77455
6743 77455 125986 353112 342748 190589 224164 138902 134302 116168 32318 132157 162062 48536
6731 48536 -133738 -44126 12237 17979 61050 3283 147164 -257524 -129317 -160751 -111312
6720 -111312 -90894 -76604 -54502 -56240 1935 18725 154136 98022 14452 -169060 -272546
6709 -272546 -337966 -92348 194959 -29910 -37445 -145641 -346289 -334477 -419709 -166430 -117176
6698 -117176 -70368 66615 118230 91865 -41421 -84387 -151178 -178405 -373954 -201190 107860
6687 107860 -100528 -268136 -122869 -241643 -40593 158040 200305 111212 177953 227926
6677 227926 -156138 -405764 -291625 -457010 -318865 -72639 21161 130324 114622 -203897
6667 -203897 -408414 -249743 60222 148089 -128134 -29798 21385 -192115 -224895 -135458 -167959
6656 -167959 276247 79586 -7933 -148620 36236 327612 38779 7049 -241779 -242073 -186400
6645 -186400 11466 -52384 144681 -49264 -64874 -181679 -159626 -43868 -58128 -70755 -93515
6634 -93515 -2316 -205470 -69281 8084 -51744 -227547 -265539 -160969 -254949 -223041 -89820
6623 -89820 -179143 -365636 -227894 -33985 17004 -89616 -160464 184722 235152 86682 -134940
6612 -134940 -121197 9044 9364 133340 -164782 -321559 -116201 52004 188937 99456 43722
6601 43722 77847 288082 207262 133437 58458 122004 257813 -15293 -46611 43566 -61651
6590 -61651 -35761 -32877 -68635 -127562 -168029 -51755 -72611 -175881 12980 142912 269437
6579 269437 36956 -48609 144807 17962 55161 28874 -148451 -138738 189426 -3333 75414
6568 75414 299882 146817 163050 29540 -134871 -109239 77058 -43200 -62530 31423 38381
6557 38381 -88573 171898 72962 -68579 338417 306179 198433 215735 -176321 -211195 -70974
6546 -70974 63968 180005 186953 118763 73755 193516 56370 10689 172088 220314 293561
6535 293561 -20509 -47693 108263 79249 48543 76297 79631 -47771 79982 61954 153517
6524 153517 262616 404904 319638 91342 255617 66484 60298 94133 111210 -83187 -246942
6513 -246942 -390713 -235116 40497 44340 104412 314043 265595 -9074 198155 59915
6503 59915 -68555 -120124 74499 107948 154847 165009 188937 324522 313557 243917 12251
6492 12251 30831 159580 -72568 -208681 111256 318325 293922 217462 85233 154704 145729
6481 145729 -204983 -39824 147882 132443 153890 253551 199536 188691 212642 2531 -5860
6470 -5860 38609 62437 79206 229819 151343 262406 347716 559918 434785 542079 237461
6459 237461 212985 520609 477869 424304 447615 382421 389450 595077 670849 595153 649322
6448 649322 502864 486322 453951 421786 358227 259906 468160 438531 304011 290420 354163
6437 354163 352441 417472 400147 406585 407223 295073 307581 629399 639845 599439 704882 759021
6425 759021 907561 640540 460876 624127 585326 396647 463697 600114 619785 521702
6415 521702 561647 672247 550993 722982 631328 621840 714240 777529 1082010 796578 388740
6404 388740 508468 355344 846092 782661 620681 475296 490683 631068 634771 610294 713769
6393 713769 692137 690865 680791 594021 729731 343902 712531 580929 512993 692927 798861
6382 798861 916675 752962 832873 969772 806602 732142 854660 1020878 1060593 781612
6372 781612 744310 972679 951461 1006898 895934 1319627 1548853 1427733 1324433 1540047
6362 1540047 1695102 1562375 1663002 1397406 1679825 1699604 1843628 1845891 1709927 1813559
6352 1813559 1723888 2065438 2259535 2138849 2021532 1950578 2139205 2410316 2161555 2075662
6342 2075662 2357969 2267250 2405299 2618284 2842226 2802246 2870556 2834215 3123210 3398542
6332 3398542 3526017 3334437 3582263 3657829 3891796 3760400 3733456 4056423 3936669 4011798
6322 4011798 4150196 4194908 4260876 4215541 4403570 4626944 4759235 4815111 4699668 4910231
6312 4910231 5008287 5155747 5199112 5400580 5564415 5800381 6110411 6274116 6508515 6526360
6302 6526360 6416312 6385529 6693564 6900824 6975947 7206087 7224991 7454144 8040353 8536481
6292 8536481 8612209 8799343 9008448 9110690 9130880 9309752 9390731 9329397 9293338 9660066
6282 9660066 9688098 9810810 9776929 9703049 9896043 10012756 10248528 10346322 10476357 10405088
6272 10405088 10410174 10601544 10724656 10933978 10978875 11325335 11611823 11548011 11242751 11576058
6262 11576058 11679435 11858660 11864038 11737646 11759358 11876326 12043162 11889879 11974763 11752188
6252 11752188 11861245 12095694 11930304 11828921 11891184 11980803 11585206 11458816 11375375 11444513
6242 11444513 11366544 11176604 11056006 11199064 11033212 10815001 10909508 11094192 11094428 10880397
6232 10880397 10867374 10701894 10801808 10950342 10856748 10619236 10602432 10425554 10014559 9925280
6222 9925280 9880926 9811968 9468230 9316893 9127638 8621138 8716635 8476820 8365721 8093310
6212 8093310 7890696 7727900 7467078 7333724 7269753 7108404 6928697 6868133 6934734 6676585
6202 6676585 6192375 6086918 5871118 5788475 5849918 5924483 5896252 5628733 5651451 5592528 5381930
6191 5381930 5354364 4997160 4835600 4636809 4403035 4515834 4597052 4377053 4173256 4133520
6181 4133520 3789494 3815155 3538284 3403673 3494512 3532775 3230689 3129763 3066950 2982550
6171 2982550 2758873 2626356 2604448 2543303 2438087 2084230 2153440 2381041 2239656 2132116
6161 2132116 2040895 2064484 2037418 1755817 1908224 1815861 1835905 2039583 1920166 1779596
6151 1779596 1661651 1664235 1869887 2273202 2080201 1842271 1640735 1857806 1785642 1758050
6141 1758050 1909946 1933552 1864897 1819178 1921510 1775555 1653332 1692663 1868347 1917452
6131 1917452 1916392 1848392 1711919 1585815 1883242 2235535 2257525 1990771 2121898 2319354
6121 2319354 2287174 2156010 2243576 2429615 2486456 2853483 2817220 2783331 2921166 3151077
6111 3151077 3432523 3346476 3617700 3617837 4102632 4225431 4497447 4700282 4925651 4744441
6101 4744441 4797928 4750654 4673600 4931053 4850699 4785846 4988116 5164907 5159267 5551172 5841166
6090 5841166 6109764 6143057 6384943 6665432 6889178 6927324 6768682 6694230 6867235 6877792
6080 6877792 6853177 6955530 6931741 6697301 6325925 6200358 6230211 6158450 6019306 6172893
6070 6172893 6475205 6620854 6740043 6612917 6769296 6606988 6426137 5954833 5782555 5859005
6060 5859005 5775054 5726596 5704321 5965723 6241985 6274287 6466802 6518716 6626899 7107364
6050 7107364 7583174 8077269 8297977 8641936 9034645 9445022 9965958 10731530 11462758 12229653
6040 12229653 13053835 14167704 14793153 15631451 16032285 16341868 16974961 17160511 17467328
6031 17467328 17531999 17611168 17850870 18059968 18818372 19440435 20129338 20912148 21584933 22282365
6021 22282365 23066574 23894932 24263030 24477136 24700837 24623593 24735070 24709038 24485464 24191054
6011 24191054 24254566 24359913 24571098 24724316 24794572 24784985 24660579 24655656 24685320 24595330 23970685
6000 23970685 23317162 22548014 21847748 20816463 19969281 19080455 18359254 17770922 17126826
5991 17126826 16879450 16741086 16832473 16884330 16711859 17084231 17543573 18103173 18387218 18706312
5981 18706312 18902662 19132218 19067776 19032437 19036611 18880632 18645999 18252643 17931495 17241937
5971 17241937 16653038 16120830 15698245 14850776 14192909 13549981 12990783 12504363 11496362
5962 11496362 10977403 11033862 10677953 10333445 10082554 9860630 10085568 10059061 10124681 10029023
5952 10029023 10322650 10362519 11048659 11586158 11734695 11975365 12357234 12260488 12024415 11824194
5942 11824194 11435658 10986195 10934303 10371930 9538453 9431263 8741273 8296613 8063670 7538204
5932 7538204 7320398 7085166 6473174 6079931 5682898 5592916 5450871 5374037 5313535 5339904
5922 5339904 5664231 5565473 5475886 5566677 5588688 5897587 6205180 6344103 6156955 6163105 6331963
5911 6331963 6282406 6105258 6234269 6162874 6271378 5650869 5576576 5559441 5245411 4945305
5901 4945305 4859380 4559471 4118765 4162985 4034791 3893178 3827587 3707475 3828252 3357270
5891 3357270 3106187 3485221 3222411 3048220 3139911 3233552 3335495 3490325 3636410 3895277
5881 3895277 4333216 4149828 3800304 3903563 3866970 3734932 3521799 3536575 3311002 3288944
5871 3288944 2975506 2654617 2320856 1983848 1962228 2226082 2312191 1981677 2047007 2017066
5861 2017066 1930648 1900681 1919350 2025352 1806291 1715306 1920409 1631115 1599107 1711859
5851 1711859 1492502 1487247 1524246 1623724 1676565 1623566 1647959 1680236 1628699 1539213 1206708
5840 1206708 1523037 1759141 1632954 1847069 1795691 1781365 1476555 1427608 1672694 1781885
5830 1781885 1663200 1704621 1682624 1659035 1590158 1366805 1403708 1445254 1506280 1432905 1748065
5819 1748065 1731557 1795591 2037399 2143518 1959715 1731575 1971692 1927357 1805162 1832903
5809 1832903 1781252 2148289 2351526 2168117 2103485 2300821 2384875 2588539 2678673 2398488
5799 2398488 2287521 2632528 2805004 2719836 2605148 2665683 2790336 2798213 2873626 2918406 2944659
5788 2944659 2863408 3070808 3012578 3367492 3853274 4147716 4553060 4421719 4659435 4944073
5778 4944073 5177516 5618149 6176865 6685700 7164249 7641830 8218973 8932084 9533607 10500047
5768 10500047 11813411 13561395 15970792 20452996 28881940 43282918 63604218 85010066
5760 85010066 94372298 86671622 71955679 55955963 41712297 31329354 24032988 19146247
5752 19146247 15603053 12904700 10585166 9082524 8216323 7203487 6466176 5984357 5683315
5743 5683315 5405127 5062139 4702083 4558312 4381435 4227894 4145552 4054450 4250039 4035953
5733 4035953 3562199 3366412 3255238 3225181 3369906 3051269 2936144 2809173 2919386 2965292
5723 2965292 2944186 2695876 2290027 2046745 2100417 2322855 1744692 1720739 1640596 1521307
5713 1521307 1699669 1996378 2048656 1811891 1712039 1875994 1913176 1727773 1475273 1226595
5703 1226595 1153889 1385048 1276402 1318627 1202289 1366842 1348309 1497492 1773130 1375990
5693 1375990 1271728 1567362 1442715 1239746 1383175 1381417 1439436 1385909 1526192 1219920
5683 1219920 1287344 1249250 1218839 1370066 1404557 1529540 1243040 1072460 1279101 1062219
5673 1062219 1094056 1259437 1093932 1196665 1178903 868741 1143221 919989 803463 1152570
5663 1152570 1193718 1007677 814018 941171 981570 1030219 1205814 1055487 1098938 1181615
5653 1181615 941098 805345 838856 849053 1003880 850474 796970 768460 860213 890309 727338
5642 727338 728379 722820 576818 712712 808409 782272 729047 549091 731127 888825 1019026
5631 1019026 806477 802506 754992 631705 536062 603369 603971 880293 863073 619637 797664
5620 797664 1017149 1092288 995186 1147695 1179902 1188564 928507 770433 849355 692188 643633
5609 643633 647189 812290 846014 1215664 1398078 1104002 836920 755277 1014814 897294
5599 897294 724299 1160873 1079275 948986 878660 835560 1027237 1285724 1008542 892800
5589 892800 1015088 1198079 1151467 1209091 1302761 1293655 1175930 940376 1110857 1070769 1059120
5578 1059120 1160051 1281694 1176706 899128 980888 1062999 958686 1139241 1196735 1205201
5568 1205201 1196129 1271955 1243844 1165007 1232993 1180963 1055001 837502 971715 1032610 1073373
5557 1073373 1071946 941262 1130564 1088187 838698 1008132 1152620 1288658 1366850 994537
5547 994537 1034897 1065477 898160 842860 1022030 1072464 1002408 1068832 937856 1066861 998397
5536 998397 1033091 1136267 980773 1100171 1206344 1204272 1233387 1158519 1095168 1360328 1221460
5525 1221460 1362006 1296889 1210655 1375332 1304135 1302397 1016996 1011209 1632892 1609492 1367052
5514 1367052 1298164 1430900 1472178 1335261 1409532 1548511 1767941 1828259 1522213 1751389
5504 1751389 1653660 1609088 1626249 1593040 1621963 1815580 1903990 1881630 2048165 1925451 1882701
5493 1882701 1970062 1889993 1778604 1927793 1955265 2204057 2205253 2026110 2258514 2327266 2118801
5482 2118801 2177740 2535828 2822339 2618291 2608026 2492952 2720737 2937549 3335754 3230353
5472 3230353 3312705 3598753 3608275 3449367 3557282 3871172 3945616 3963803 4020841 4264592 4333961
5461 4333961 4446744 4499842 4636465 4875339 4968778 5047169 5401585 5015020 5064904 5317848
5451 5317848 5453333 5560922 5615922 5759590 5785858 5823488 5894995 6037572 6128210 6217642 6442618
5440 6442618 6542963 6536513 6561715 6852818 6817770 6719825 6878794 6777506 6825317 6692079 6731544
5429 6731544 6843014 6864896 7115360 7250266 7197715 7188675 7426374 7801365 7777182 7993102
5419 7993102 8101100 8030854 8320928 8386977 8235733 8518922 8862207 8912391 8997288 8950705
5409 8950705 8980404 9218895 9306974 8922769 8800181 8953197 9099361 9207902 8980697 9035763
5399 9035763 8947171 8870091 8814041 8928246 8901235 8861817 8518253 8399419 8678447 8652469 8552678
5388 8552678 8422755 8137809 8114128 8124455 8172188 8174814 8095126 8102909 8208960 8322030 8177542
5377 8177542 8273605 8201177 7655743 7637275 8157097 8087497 7921064 7961832 7853741 7584655
5367 7584655 7912693 7861924 7605773 7454017 7650464 7757241 7787493 7648232 7764918 7740635
5357 7740635 7595302 7768757 7677622 7383509 7409748 7122926 6945048 6945545 6749716 7019998
5347 7019998 6930785 7156786 6810394 6665572 6629073 6714295 6945769 6808997 6595159 6501893
5337 6501893 6441859 6634102 6531237 6623330 6710190 6946005 6794326 6558922 6786162 6816584
5327 6816584 6747480 6681577 6819966 6711952 7031031 7047505 7115627 7229630 7274842 7206082 7290543
5316 7290543 7415850 7324768 7175339 7455677 7497446 7746812 8047809 8142940 8143175 8119776 8298418
5305 8298418 8411314 8364956 8515207 8836039 9071544 9316234 9355408 9405511 9460330 9592773
5295 9592773 9729513 9844507 10154171 10322551 10443250 10632740 10713354 10706717 11279264 11560542
5285 11560542 11766905 11867662 12263101 12528938 12685465 12965248 13053596 13672277 14071459 14370111
5275 14370111 14389655 14705127 14931199 15195502 15483240 16012644 16525135 16863140 17346262 17293020
5265 17293020 17729621 18319209 18770359 19426917 19952694 20465614 21097023 21734852 21997035
5256 21997035 22506730 22854741 23380318 24062684 24629399 25450611 26277811 26678507 27315007
5247 27315007 28013344 28680910 29244374 29865029 30277413 31199724 32631532 33470712 34184754
5238 34184754 35046634 35917258 37242188 38251819 39071437 40270908 41374764 42499507 43760090
5229 43760090 45051123 46715537 48302388 49700803 51254206 52749040 54376889 56174124
5221 56174124 57809977 59818016 61920392 63917551 66043236 68074040 70321494 72714607
5213 72714607 75261307 77938660 80648497 83328884 86013995 88979068 91978822 94846387
5205 94846387 98031335 101068613 104064559 107067891 110003700 113115217 116115561 119044238
5197 119044238 121585494 124043862 126518044 128389908 130138765 131597065 132607412 133346190
5189 133346190 133611272 133474964 133233786 132329214 131146228 129616781 128002817 125658533 123532722
5180 123532722 121299218 118673409 115825187 112828648 109980164 107159980 104157669 101155322
5172 101155322 98240211 95363582 92392592 89723366 87184280 84431459 82067085 79619795
5164 79619795 77025334 74915797 72714637 70423540 68666863 66855150 65057875 63415065
5156 63415065 61643381 60258718 58713439 57105472 55909713 54384463 53211034 51902746
5148 51902746 50535805 49552599 48733775 47836088 46736151 45599450 44306200 43512679 42788032
5139 42788032 42164315 41276414 40382007 39875830 39112447 38534294 37864486 37028467 36181205
5130 36181205 35958088 35493925 34701615 34396724 33732009 32849934 32289250 31801551 31174115
5121 31174115 30752618 30315835 29782749 29320652 28734070 28222501 27778614 27445327 26770573
5112 26770573 25864590 25309435 24856322 24258202 23904905 23501734 23026131 22435876 21901482
5103 21901482 21393648 21187619 20679800 19888388 19343705 19144805 18591282 17971031 17725540
5094 17725540 17498091 17189118 16871053 16531160 16092153 15565235 15243081 15091962 14962528
5085 14962528 14495268 14274479 13863345 13426725 13270615 13118357 12749063 12818239 12549081 12080169
5075 12080169 11940984 11646542 11508740 11451401 11186157 10755600 10678100 10406280 10360889 10648223
5065 10648223 10320029 9879448 9802256 9735960 9848488 9745295 9606880 9512978 9304428 9511824
5055 9511824 9719279 9525229 9502966 9440044 9400256 9657755 9570001 9336971 9475628 9478449 9228989
5044 9228989 9186249 9342311 9519757 9616468 9630731 9657243 9283491 9358990 9640550 9908549
5034 9908549 9877645 10000542 10023104 10207197 10076938 9877448 10375529 10385228 10196619 10222474
5024 10222474 10446581 10518722 10349579 10426915 10404059 10534539 10571306 10681794 10876764 11031067
5014 11031067 11141739 11353405 11515034 11731656 11950744 12077849 12250698 12719773 12794021 12937092
5004 12937092 13168195 13375554 13579634 13624543 13831266 13638673 13807252 14083703 14513988 14957442
4994 14957442 15519231 16042906 16408999 16400101 16089914 15873732 15674289 15512620 15277966 15383250
4984 15383250 15404745 15165077 15321718 15468150 15401376 15310942 15497113 15638944 15878881 16201073
4974 16201073 16146575 16070937 16137164 16298714 16257275 16646400 16456227 16505004 16572283 16601349 16689233
4963 16689233 16782332 16782933 16799091 16825384 16858935 16847602 16848435 16949389 17140774 17393169 17424438
4952 17424438 17658371 18076029 17957547 17903366 18062096 17971913 17835428 17740577 17436892 17134419
4942 17134419 16828042 16419496 16448852 16504896 16540538 16171721 16048393 15791114 15637085 15461522
4932 15461522 15795144 15573529 15538868 15469342 15615510 15667914 15360180 15121172 15133470 15380807
4922 15380807 15549015 15455709 15327859 15563387 15460173 15315048 15411549 15615347 15780200 15454691
4912 15454691 15598433 16032669 16105381 16373212 16860998 16951415 16930218 17153516 17351730 17443728
4902 17443728 17710595 18043389 18142142 18329991 18536594 18575521 18213534 18011431 18031918 18160189
4892 18160189 18479500 18543878 18602330 18642779 18952504 19222669 19671588 19838686 20171518 20588500
4882 20588500 21125866 21460476 21901853 22249193 22808616 22986085 22916262 23644730 23731770 23461600
4872 23461600 23277105 23110407 22709516 22165753 21552950 21003203 20475106 20337465 20154608
4863 20154608 19745341 19380342 19347231 19150606 18874852 18922050 19215390 19589453 20134573 20711499
4853 20711499 21154429 21617374 22216358 22390412 22464399 22510314 22293474 22086699 22125957 22001113
4843 22001113 22182906 22401044 22727349 23130062 23504734 23672265 23823024 24038163 24696221
4834 24696221 25424170 26526589 27812593 30155520 34648345 43359132 56716820 72805917
4826 72805917 84031063 82721554 73824483 62877949 51913631 43681837 37926850 33819021
4818 33819021 30919591 28959637 27451894 26204664 25425662 24883834 24035352 23278575 22870646
4809 22870646 22482336 21725448 21028883 20514565 19875283 19223944 18662254 18318464 17966602
4800 17966602 17430835 17123806 16858755 16561723 16254358 15869878 15408646 15084749 14883725
4791 14883725 14901501 14811709 14855127 14851593 14339859 14027909 13663986 13329185 13329997 13045716 12654089
4780 12654089 12419711 11958904 11820559 11695098 11797528 11277932 10939397 11059785 10959686
4771 10959686 10789547 10769073 10696338 10611862 10613131 10430434 10221454 10696208 10638103 10770341
4761 10770341 10884233 10886610 10994057 10985474 11204167 11439920 11693389 11709481 11696223 12007016
4751 12007016 12402934 12524502 12819745 13248418 13677494 14184604 14748297 15296697 15667946
4742 15667946 16235397 16787050 17491684 18385046 18821673 19124477 19765109 20393680 21037597
4733 21037597 21759258 22583690 23307435 23953918 24440613 24945687 25443829 25852172 26576427
4724 26576427 27012397 27618512 27929035 28065662 28325070 28416339 28772924 29225343 29775317 30324081
4714 30324081 30911385 31409972 31903629 32580748 33465498 34227235 35436911 36602810 37573107
4705 37573107 38801146 40099990 40944026 41991049 42873197 43449724 44029044 44072592 43992825
4696 43992825 43334734 42580476 41864331 40825881 39869185 38689471 37649564 36707198 35430233
4687 35430233 34302132 33479489 32553880 31942093 31572436 31170857 30744606 30254939 29911148
4678 29911148 29286720 28524052 28314906 28034544 27522022 26794734 25970587 25136240 24473630
4669 24473630 23405288 21965085 21066944 20005060 19122725 18318887 17400750 16396710 15683787
4660 15683787 14983144 14440723 13634241 13081644 12830659 12049052 11293657 11024463 10948633 10765600
4650 10765600 10153949 10031155 9789692 9639596 9709745 9565725 9556390 9376280 9121370 9207380
4640 9207380 9139985 9149363 9282487 9318971 9567243 9647646 9747505 10041163 10688378 11665470 13515175
4629 13515175 16782718 21017184 24914390 26435641 25159360 22783126 19801691 16996291
4621 16996291 15195238 13927260 13114691 12896823 12871580 13150618 13407261 14021648 15167827
4612 15167827 16436038 18345078 20508633 22144612 23152866 23787640 24185813 25115154 26771881
4603 26771881 29424929 32539059 35763735 37398657 37509685 36882553 36594522 37178398 38992159
4594 38992159 41840194 44853843 46875072 46154503 44071889 41100236 38257751 36678213
4586 36678213 36556975 37281772 37674599 36773563 34491082 31395390 28085465 25618290 24121130
4577 24121130 23205911 22410376 21265254 19838146 17921612 15622935 13643050 12178781
4569 12178781 10490303 9069054 8532501 7691303 7235289 6762810 6284144 5942487 5635787
4560 5635787 5473699 5280030 5238065 4940673 5000749 4758959 4597251 4356468 4208025 4173813
4550 4173813 4260579 4293049 3998698 3571384 3519891 3413874 3368213 3325912 3156726 3422398
4540 3422398 3231730 3071846 2865822 3115565 3068785 2933280 2892957 2633251 2882259 2852422
4530 2852422 2640428 2648858 2638699 2643890 2591897 2495053 2531413 2579350 2647638 2580903 2572947 2564328
4518 2564328 2416624 2445566 2629915 2416658 2411947 2486993 2518070 2376714 2203737 2058338
4508 2058338 2285599 2131117 1858300 2044259 1862317 1693952 1950027 1834083 1712623 1404682
4498 1404682 1300625 1430317 1520836 1572654 1825404 1767669 1904863 1849466 1689427 1654111
4488 1654111 1721337 1834590 1521117 1656406 1326455 1233477 1316720 1334938 1280087 1211365 1353017
4477 1353017 1479260 1601295 1603299 1484935 1417688 1527453 1413437 1408799 1605563 1628208 1643312
4466 1643312 1449250 1363132 1377325 1496262 1293858 1202229 1121792 1307191 1279344 1332428 1532495
4455 1532495 1367140 1371117 1399626 1466014 1459538 1291729 1257851 1496468 1573273 1438813 1332725
4444 1332725 1423230 1191814 1280571 1339067 1155509 1344077 1353404 1344690 1172946 1356536 1110526
4433 1110526 1107387 1303503 1338045 1238770 1280490 1410037 1595729 1486440 1502154 1606321 1566236
4422 1566236 1536247 1687863 1691353 1294762 1287936 1391001 1626613 1902098 1870078 1781463 1859160
4411 1859160 1750374 1712043 1710781 1544185 1576717 1918361 1944330 1629231 1700541 1727724 1690614
4400 1690614 1777745 1717343 1822515 1756153 1560393 1691440 1748974 1251814 1522241 1692665
4390 1692665 1741269 1735728 1849648 1751656 1642207 1871731 1767124 1657887 1660292 1735002 1813121
4379 1813121 1625296 1768742 1787472 1680725 2020038 1874661 1778001 1991772 1672100 1809915
4369 1809915 2189544 2342374 2187716 1929497 1895063 1922411 2167149 2057243 1956816 1933312
4359 1933312 2184493 2209561 2376101 2668190 2600763 2648151 2567091 2666255 2733028 2795912 2735389
4348 2735389 2805800 2935356 3066879 3208895 3152256 3233775 3102004 3144085 3366235 3543554
4338 3543554 3703749 3839597 3864963 3974969 3858237 4163435 4564494 4824779 4960141 5173487
4328 5173487 5369582 5314680 5533730 6006615 6133180 6010915 6243955 6508436 6532064 6822694
4318 6822694 7207045 7109921 7208690 7382377 7547863 7831308 8149426 8506092 8461529 8191845
4308 8191845 8213944 8766163 8924871 8983762 9067139 8776501 8955282 9037894 9038211 9107421 9047331
4297 9047331 8972440 8973213 8829839 8824325 9016880 8944082 8726067 8683213 9080264 9359607 9343506
4286 9343506 9370468 9267863 9218023 9398476 9472465 9611747 9808268 9806368 9882488 9771980 10086326
4275 10086326 10805598 11116694 11493265 11943049 12436358 13139895 13475426 13307382 13516168
4266 13516168 13779463 13941208 14004479 14072602 14252678 14353661 14704376 14808384 15077033 15350541
4256 15350541 15420034 15678242 15878364 16293825 16705358 16595623 16525721 16759859 16893523 16924322
4246 16924322 16954550 17452588 17981506 18182945 18295635 18417283 18779194 19152314 19233141 19282216
4236 19282216 19936313 20788984 22058814 23915237 27214558 33735500 45800368 62677058
4228 62677058 78782316 83721937 75617923 63103234 50285336 39601962 32079473 26602879
4220 26602879 22818588 20216063 18341337 17000932 16299347 15773448 15333554 14808600 14341971
4211 14341971 13940881 13440204 13479554 13300381 13297144 13307066 12882589 13056319 13207141 13125697
4201 13125697 12699568 12368233 12374420 12026064 11719551 11530302 11311621 11087124 11066550 11035439
4191 11035439 10585802 10356787 9800802 9698284 9532428 9219149 9121356 8954193 8722614 8710769
4181 8710769 8658783 8364979 8345603 8169956 7930389 7654966 7555039 7188222 7206782 7089688
4171 7089688 6728836 6417241 6307954 6095313 5939659 5704381 5415064 5372190 5682602 5586196
4161 5586196 5587951 5854208 5793929 5837624 5632485 5391069 5367587 5226698 5080328 5258262
4151 5258262 5396387 5334556 5216224 5389048 5511485 5313546 5400324 5342476 5134377 5203867
4141 5203867 5441033 5623263 5670583 5734965 5875222 5832362 6154146 6081947 6256031 6411230
4131 6411230 6360479 6728228 6919246 6923647 7222315 7380987 7723975 7873404 8136043 8369588
4121 8369588 8582626 8983188 9068696 9355391 9615235 9964880 10303206 10471887 10478510 10939781
4111 10939781 11268607 11591028 11963289 12555518 12860658 13252793 13611551 13961254 14340402
4102 14340402 14633772 15229524 15714762 15964383 16204115 16674482 17060444 17270994 17829403
4093 17829403 18251008 18557669 19190388 19472167 19896080 20321398 20889952 21434220 21575816
4084 21575816 22185655 23069539 23594564 24353348 25232919 25850958 26635658 27227663 28250743
4075 28250743 28850007 29053733 29459464 29994154 30573310 30919926 31055605 31459041 31680979
4066 31680979 31664817 32085151 32469542 33155583 33438230 34039332 34737417 35443446 36398639 37703686
4056 37703686 39863104 42452113 45912147 48575122 49359837 48595437 47603964 46147225 45247693
4047 45247693 44942463 44766253 45165233 45517646 45715668 46194563 46561757 46816506 47306016
4038 47306016 47603221 47613631 47648434 47766784 48207816 48563989 48891886 49362295 49446995 49432836
4028 49432836 49541445 50042927 50322848 50393563 50417584 50513687 50363135 50322760 50380317 50633926
4018 50633926 50654236 50443786 50181484 49784938 49563966 49574583 49466841 49192297 48836853 48879144
4008 48879144 49024271 48800147 48523132 48485592 48070263 47811124 47728314 47280140 46930473 46346493
3998 46346493 45790932 45055988 44246630 43197380 42348488 41598946 40816674 39834769 39130121
3989 39130121 38442828 38026996 37873049 37379936 36933446 36658009 36641201 36271636 35914167 35671197
3979 35671197 35835890 35641702 35424921 35732978 35826866 35707855 35099693 35058143 34911239 34698283
3969 34698283 34121185 33669211 33365209 32952730 32291183 31684063 31245583 30605589 30421242
3960 30421242 30190589 29970860 29792656 29453039 29290233 29526378 29786956 30446477 32167690
3951 32167690 34072248 35623851 35712834 34147294 31943600 29858499 28150798 26748479
3943 26748479 26049202 25186207 24839704 24302248 23786089 23593000 23069935 22554432 22647949 22338021
3933 22338021 21826319 21544099 21238348 21157081 20971635 20615489 20608707 20227346 20159984 20338606
3923 20338606 20764236 21398346 22713729 24847885 26945839 27122684 25941411 24095838 22151394
3914 22151394 20495312 19261343 18189436 17259152 17083891 16898251 16820090 16349588 16261475
3905 16261475 16171097 15934820 16011666 16093621 15917038 16165141 16241075 16327220 16401478 16440852 16707901
3894 16707901 16621588 16829945 16933194 16787319 17293860 17779650 17967654 18135603 18168765 18140904
3884 18140904 18217348 18791696 19386964 19741416 20287857 20977349 21631146 22448382 23175922 23871560
3874 23871560 24615784 25290420 26233719 27394129 28530066 29780159 31064725 32392934 33726120
3865 33726120 35038838 36163349 37189882 37931979 38591762 39458128 40111144 40420546 40361531
3856 40361531 40408635 40241613 40194805 39948129 39963447 39972254 40062813 40263561 40255012 40217370 40193391
3845 40193391 39981499 40003206 39618326 39200370 38308174 37263144 36650369 35608825 34627378
3836 34627378 33795834 33248186 32661369 32285207 32073834 31387054 30527271 29513966 28353845
3827 28353845 27307674 26520193 25718860 24495677 23708026 23072008 22436035 21548920 21113017
3818 21113017 20483968 19772181 19601930 19298556 18662257 18065346 17936822 17502879 17355015
3809 17355015 16764753 16361437 16182788 15629520 15335039 15115772 14917556 14718524 14382091
3800 14382091 14343688 14035865 13761872 13661226 13484338 13105252 12791181 13007063 12815368 12416865
3790 12416865 12319613 12055459 11903629 11703035 11490557 11623766 11614517 11489600 11429486 11542766
3780 11542766 11598174 11363626 11482638 11342891 11323436 11365289 11573668 11595908 11569210 11687085
3770 11687085 11503562 11430285 11498393 11681094 11543309 11526498 11657542 11809241 11564645 11697352
3760 11697352 12101425 12151078 11944911 11990158 12038462 12176936 12386872 12397414 12223581 12119689
3750 12119689 11957465 12039017 12043249 11975243 11979402 12221958 12317994 12164809 12000999 11884241 11990894
3739 11990894 12222205 12127698 12181972 12363404 12611867 12900187 13034515 13165590 13317298 13357912
3729 13357912 13185587 13513059 13790899 13776035 13833390 13928324 14010322 13978722 14141758 13990543
3719 13990543 14061118 13789280 13625169 13487056 13111660 13171808 12975291 12996638 13069234 12870974
3709 12870974 12909683 13107558 13001683 12972771 12904560 12926709 13204867 13170660 13318539 13268167
3699 13268167 13131923 13155734 13210279 13129623 13220511 12904267 12753797 12781341 12680277 12578721
3689 12578721 12490611 12386212 12244961 11928335 11647419 11636256 11387779 11317995 11043726 11081510
3679 11081510 10950806 10772704 10720407 10479251 10212842 10233832 10067342 10212073 9946488 9869729
3669 9869729 9976907 9677003 9672452 9835157 9717883 9587665 9773505 9782288 9533738 9315495
3659 9315495 9480599 9408983 9551253 9719034 9603175 9615414 9863265 10001496 9856531 9767714
3649 9767714 9795854 10029217 10473163 10673790 10721336 11041589 11104698 11413822 11521513 11978132
3639 11978132 12246610 12378588 12431782 12698211 13058972 13002390 12898215 12928043 12847430 12707172
3629 12707172 12753756 12695030 12779819 12780109 12568381 12453432 12348245 11982803 11772106 11745056 11446630
3618 11446630 11259561 11278124 11291232 11145976 11050064 10981165 11004739 10631844 10528372 10471394
3608 10471394 10590309 10614922 10483990 10664649 10973386 10855460 10760071 11002306 11035035 11237538
3598 11237538 11326546 11696957 11805094 11946555 12162467 12818835 13203739 13456759 13771438 13997388
3588 13997388 14398291 14964844 15689470 16425885 16943440 17671848 18047952 18587725 19572559
3579 19572559 19880613 19973559 20593909 20720708 20887243 21217096 21251633 21184128 21152093 21337771
3569 21337771 21584618 21815552 22142585 22581909 22735481 22866430 23372188 24059615 24499521
3560 24499521 24684006 25083731 25069265 25209256 24953736 24502442 24331133 23547578 22945881 22421214
3550 22421214 21918516 21095827 20465526 19803615 19594211 19501965 19080193 18730659 18222033 18165393
3540 18165393 18228943 18134242 17676544 17324046 17010661 16607107 16086827 15788325 15435125 15034695
3530 15034695 14820294 14417530 14406890 14408608 14111494 14229126 14379936 14409234 14542521 14713772
3520 14713772 15154421 15420062 15575015 15627600 15469661 15378896 15427919 15173632 14990572 15093541
3510 15093541 15006413 14830718 14730453 14891371 15019889 15348248 15523664 16041836 16197952 16420725
3500 16420725 17163510 17307751 17560907 17543367 17110666 16715593 16334693 15577055 15134012 14772560
3490 14772560 14330505 13608954 13068026 12480213 12105872 11687338 11514071 11319861 10965849
3481 10965849 11075017 11050697 10932411 10774200 10574387 10323927 9989191 9779154 9258539 8754457
3471 8754457 8222223 7661137 7178484 6884955 6820194 6423866 6242493 6127147 5783141 5422278
3461 5422278 5325542 5338238 5308148 5152628 5249769 4973304 4851124 4777268 4409441 4435626 4407185
3450 4407185 4517737 4706615 4826950 4697702 4638438 4328409 4185834 4490142 4256723 4250576
3440 4250576 4228397 3914569 3618983 3382624 3494137 3782124 3568128 3173751 3302342 3463267
3430 3463267 3343720 3273760 3410429 3385129 3167377 3316440 3341450 3119938 2838714 2723410
3420 2723410 2923544 2976306 2954807 2831863 2883402 2839384 2663397 2575767 2544010 2605287 2762556
3409 2762556 2782024 2777401 2954239 2906576 2878012 2865319 2877355 2795036 2706898 2867920 2847753
3398 2847753 2906546 3227277 2979046 3131216 3160509 3278810 3559127 3746519 3998114 3697570
3388 3697570 3710809 3749336 3615141 3826289 3821749 3607266 3304449 3420115 3602461 3461683
3378 3461683 3439016 3535612 3403241 3478220 3645226 3694404 3618758 3559506 3821568 3853833 4206797
3367 4206797 4560537 4763070 4822211 4757214 4881289 4575872 4305631 4033714 3872337 3857180
3357 3857180 3788429 3748481 3536138 3420463 3489496 3342120 3054134 3139745 3249457 3242999 3327043
3346 3327043 3354896 2971382 3252733 3537441 3375668 3377672 3570135 3484478 3667574 3720715
3336 3720715 3914636 4072443 3996013 4147499 4173138 4369118 4460305 4392201 4190830 4338971
3326 4338971 4009430 3948159 3922992 3702736 3931728 4163848 4201886 3887952 4041259 3961041
3316 3961041 4052957 4528744 4550686 4629328 4790829 5052773 5050015 5214008 5520098 5819190
3306 5819190 6111900 6157825 6407201 6517089 6892256 7164375 7673655 7983391 8322363 8424212
3296 8424212 8409652 8605800 8816821 9084008 9104917 9085844 9503317 9861981 9603240 9197009
3286 9197009 9108981 8934373 8885850 8846423 8980547 9226337 9375997 9469947 9744262 10110075
3276 10110075 10512099 10813407 11130099 11428243 11912721 12655328 13357099 13995819 14602819
3267 14602819 15340647 16147112 16898166 17925096 19228034 20410327 21835964 23254441 25512976
3258 25512976 27658403 30093899 33130361 36665215 40781986 46167516 52712154 60664251
3250 60664251 69375754 78537766 86804690 92090688 93403212 90658920 84577939 76681140
3242 76681140 68546366 60824524 54117277 48351418 43640224 39800887 36560217 34011372
3234 34011372 31597638 29880500 28981771 27962659 26998805 26520521 25930854 25640362 25536286
3225 25536286 25701572 26380310 26874465 27807619 29042744 30548863 32057610 33994274 36458497
3216 36458497 39409114 43362449 48171310 54678621 62337285 71294626 80988711 89642179
3208 89642179 95614735 97280996 94479966 88502642 80184673 71499560 63471832 55615262
3200 55615262 49148515 43560907 38814329 35070619 32035856 29194737 26738573 24917729
3192 24917729 23433512 22050445 21149476 20287940 19370516 18750872 18488996 18160220 17447244
3183 17447244 17029017 16671592 16353235 15891600 15563775 15066296 14747652 14558336 14444757
3174 14444757 14386624 14146844 13982135 13669642 13415160 13505426 13618282 13734007 13464459 13551894
3164 13551894 13699025 13623799 13619525 13519796 13502884 13750591 14155569 14143469 14522902 14559931 14604240
3153 14604240 14957874 15393356 15697674 15623812 15742791 16126631 16403408 16895507 17304248 17547303
3143 17547303 18044917 18811096 19501261 20279080 21212051 21955651 22892068 23449934 24143833
3134 24143833 25146105 26010686 27436643 28616963 30493893 32367699 34052372 36114874
3126 36114874 38606915 40948048 43392836 46625343 50207793 54249174 58949578 64555139
3118 64555139 71123970 78888918 87693805 98426207 111525860 126481375 142766584 158368648
3110 158368648 172625232 183055546 188884595 189325416 184940544 177180645 167866314 158885370
3102 158885370 151564876 146412307 143642634 143474180 144939749 146531610 147037035 145617715
3094 145617715 141360420 134889678 126913717 118762865 111193944 104838500 100205353 97341261
3086 97341261 96559477 97624385 100489397 104562309 109407402 113935903 116199359 115557577
3078 115557577 111608316 105033758 96487343 87198369 78031532 69854265 61970964 55762851
3070 55762851 50335508 45596584 41671640 38301200 35383102 33117315 31057014 29006951
3062 29006951 27759988 26554177 25198671 23927223 22797990 21552463 20580808 19689784
3054 19689784 18663050 17557557 16880675 16410974 15914984 15284089 14575488 14281983 13794772
3045 13794772 13454268 12750252 12209734 11599652 11511615 11060687 10688959 10315373 9912107 9894510
3035 9894510 9539526 9120467 9077672 8830478 8498947 8307738 8175439 7972693 7491586 7687861
3025 7687861 7689042 7203272 6938893 6653118 6456925 6351938 5896259 6144349 6145217 5742903
3015 5742903 5657392 5589550 5357414 5351922 5372888 5270025 4946918 4906847 4726606 4743844 4974312
3004 4974312 4823158 4680873 4718036 4431009 4414125 4453596 4516076 4173623 4183200 4296707 4135904
2993 4135904 3831937 3668004 3508244 3622748 3810598 3614931 3642935 3596781 3576700 3740344
2983 3740344 3761681 3649401 3362962 3252379 3455665 3486485 3214852 3167341 3208812 3001229
2973 3001229 2827591 2668246 2569759 2793396 2986661 3063184 3312008 3255916 2966621 2832666
2963 2832666 2774243 2618465 2661022 2651575 2645574 2369022 2451326 2503557 2336392 2177972 2244224
2952 2244224 2309313 2390243 2279868 2389876 2289171 2186111 2098937 2103825 1811748 1536110
2942 1536110 1686971 1995177 1989057 1925292 2059593 1893699 1837582 1990894 1965890 1836121
2932 1836121 1851964 1483829 1387120 1590724 1527920 1581956 1895978 1870805 1798722 1986135 1976071
2921 1976071 1755178 1711072 1652192 1609611 1728142 1620859 1405545 1715054 1969125 1868833
2911 1868833 1868283 1722214 1824505 1597401 1255438 1238935 1299991 1352107 1252185 1254732 1464668
2900 1464668 1341070 1220777 1399117 1294282 1216784 1128567 984875 912145 1477677 1296449
2890 1296449 1058560 992490 1100509 970745 1210284 1250789 1169447 1003685 905557 677293
2880 677293 828548 1052666 1093349 1132792 863203 618196 857080 1090294 895359 824756
2870 824756 637774 884573 977601 992082 751014 628716 689670 749164 639347 698935 809512
2859 809512 653958 668295 525596 586173 296260 185816 481825 610593 697992 812070
2849 812070 923060 757531 772840 749620 742671 807295 954823 782762 586271 697113 805691
2838 805691 947418 818636 716543 832226 842002 646393 694373 1012271 1132845 1160369
2828 1160369 1067083 1215291 1166090 1434288 1432075 1463842 1718384 1788391 1624671 1622034 1327208
2817 1327208 1306588 1433756 1417768 1397600 1641594 1773803 1721112 1927042 1530058 1380373
2807 1380373 1363922 1084962 997616 1047593 1231350 1165459 1347652 1136167 1139077 1046627 822357
2796 822357 756920 849981 1128531 1104053 1247989 1397521 952635 736234 879098 668932
2786 668932 558769 722541 729178 548209 698512 641357 801702 647287 810688 662487
2776 662487 562228 566013 597434 383990 564256 758256 452535 579622 601906 651341 400249
2765 400249 233660 240107 415137 416794 572617 646277 338730 379846 382340 341548 370972
2754 370972 362365 530048 430366 81461 223164 387903 339030 532804 614749 608934 601826
2743 601826 425317 310282 416071 415274 583721 667252 604809 214289 178484 136325 14266
2732 14266 245727 428603 531420 627035 626699 515959 640545 592999 378202 649254 793139
2721 793139 640733 415782 240306 418269 451115 580387 291675 1428 76236 309087
2711 309087 390144 352572 252133 118121 39778 156662 447158 473573 226637 223844 89474
2700 89474 167085 112831 95136 263618 480343 516972 645307 524760 190340 166685 311962
2689 311962 189674 350399 325434 175510 133104 48142 65912 328809 307699 223524 311852
2678 311852 213570 227641 172032 46266 36645 -39089 -23612 317694 354148 177435 15423
2667 15423 206088 112573 307618 489399 406179 173296 230625 200325 57982 184965 418205
2656 418205 527576 364985 312830 305984 310815 485376 472792 220556 308649 167704 369203
2645 369203 623462 430820 404068 520359 479598 259232 333814 243204 27667 36351 244754
2634 244754 441621 494319 521915 650993 661390 438938 197720 170870 103381 309173 359091
2623 359091 550118 431881 357568 -86080 -2808 163636 116914 239297 203968 119912 26085
2612 26085 204256 330504 163625 229924 312027 142830 393572 303352 327110 224128 338159
2601 338159 780927 841789 809020 796686 537521 474119 618291 957664 791954 764466 916592
2590 916592 1525877 1977369 2306784 2615270 2621305 2316245 2246403 2015596 1584274 1257245
2580 1257245 874808 820481 556699 465522 525319 582171 597342 480828 493186 575003 550079
2569 550079 569320 617947 436875 382509 580487 622267 558291 171061 167600 510155 909815
2558 909815 738727 547733 758412 557582 506814 743215 965342 977378 621768 731940
2548 731940 892195 673614 827280 790101 713996 718407 578893 507204 599981 930369 889883
2537 889883 749057 800593 845247 577778 584545 452135 375765 429081 385211 361407 622479
2526 622479 977360 519049 384357 482510 371357 367784 318011 222498 -14450 98686 180096
2515 180096 319077 202452 346905 113211 -26377 293703 117747 185882 302852 493188
2505 493188 593889 507211 523572 679338 668059 628215 684150 316760 269943 456691 257805
2494 257805 365399 411016 408626 500832 505194 496459 742390 792376 913985 1085196 1072670
2483 1072670 939811 939031 1165627 934446 971399 1155062 1051358 1144736 702596 873865
2473 873865 1191684 1429805 1620470 1407353 1225587 1025135 819710 902046 1103394 1076813
2463 1076813 1082781 1091655 1078786 1136168 1223038 1146797 1124912 1317403 1344507 1341239 1310117 1111277
2451 1111277 1253570 1197789 1225960 1229912 1422791 1447343 1401177 1332478 1320417 1266292 1416754
2440 1416754 1578443 1539144 1517099 1639964 1558676 1491708 1428254 1155847 1337861 1262334 1592051
2429 1592051 1645970 1877515 1934772 1707794 1768728 1896557 2041901 1799215 1895329 2346839
2419 2346839 2256406 2207230 2095766 2194363 2119050 2242749 2365582 2542677 2440899 2574298
2409 2574298 2319766 2479492 2812803 2816319 2556478 2517823 2741852 2652418 2725196 2889704
2399 2889704 3083269 3118011 3232920 2998044 3200984 3319625 3413310 3623642 3613446 3518950
2389 3518950 3764979 3748112 3439834 3549118 3719968 3850311 4414016 4685204 4775758 4985841
2379 4985841 5331035 5506580 5640028 5776555 5406850 5524205 5790761 5879934 6266153 6815770
2369 6815770 7103507 7475277 7901203 8477261 9329634 9836063 9978891 9819869 9716342 9685841
2359 9685841 9816074 9732950 10034138 10369817 10739461 11120655 11888483 12470144 12917248 13446652
2349 13446652 14065275 14706759 15384354 16225601 17345261 18502473 19617576 20510197 21940999
2340 21940999 23619599 25892441 29625203 34709262 39773962 43880875 45670198 46840691
2332 46840691 48157985 49823014 52313122 56720327 63340957 73330051 87729478 111774378
2324 111774378 153972161 228628210 333142577 438457540 480071443 435862077 360076954
2317 360076954 279770275 210236010 159650712 122971340 96855022 78566316 64874845
2310 64874845 54941393 48063545 44018794 41845599 40588295 39200746 36607144 33351279
2302 33351279 30278057 27524194 25266271 22883152 20828972 19382280 18335088 17679901
2294 17679901 16690417 16047257 15195394 14099539 13382034 12767005 12267665 11986136 11635072
2285 11635072 11082273 10928335 10432874 9685219 9248370 8689411 7920811 7080128 6404937
2276 6404937 5853223 5977651 6146098 6217523 6577089 6537306 6499162 6454160 6151618 5817239
2266 5817239 5574845 5120184 4785624 4758229 4426495 4312281 4029764 4116254 4147190 4052730
2256 4052730 4141067 4124513 4290927 4340020 4156171 3950944 3793525 3710714 3615809 3306747
2246 3306747 3184223 3036415 3139342 3129024 3077859 3099880 3193641 3160754 3213459 3210521 2911930
2235 2911930 2630592 2575517 2566812 2300450 2243561 2385897 2080456 2008124 1930794 1711619 1910618
2224 1910618 1942974 2069615 2004602 1749914 1701977 1714995 1829278 1774437 1692327 1785742 1967441
2213 1967441 1989511 2263560 2294395 2302222 2439724 2114163 2106741 2039100 1786092 1736768 1784522
2202 1784522 1529299 1665478 1582076 1553595 1594096 1354934 1544463 1750155 1635946 1621228
2192 1621228 1680425 1492531 1316782 1153193 1258621 1313178 1561861 1555242 1322846 1349533
2182 1349533 1454061 1477298 1591152 1546273 1376154 1354266 1305033 1091586 921671 1105942
2172 1105942 895323 753075 769020 708007 631677 831134 1048224 929389 757026 726661
2162 726661 611201 646870 577729 519451 633675 750821 674692 688898 586562 395956 478626
2151 478626 653475 541453 607853 757878 809447 1038653 1033371 940420 891780 670785 688088
2140 688088 603180 598763 532285 469450 468148 506850 619706 610401 705773 754522 745370 863859
2128 863859 828714 767993 570459 631945 737390 858521 723492 866920 781063 725363 747925
2117 747925 554009 454084 663176 883306 775866 808878 288902 374527 231656 254000
2107 254000 350738 224917 216066 419402 296655 23113 175128 319667 475382 365136
2097 365136 396673 456439 193231 44368 168827 91770 6957 147260 362332 371019 316375
2086 316375 208931 243447 240575 396458 355297 256906 319751 191737 286688 377960 412480
2075 412480 313466 588111 470194 425566 524877 493974 457315 595685 592398 701867 694788
2064 694788 562020 686018 660519 499024 442544 358042 570038 464461 591821 1049739
2054 1049739 1228501 1563037 2018305 2597261 2697220 2344004 2146116 1668550 1423211 1106204
2044 1106204 863649 640067 510584 557055 523115 324867 98684 -65206 39485 283738
2034 283738 375871 428855 592728 691837 558993 327052 131300 205210 387333 342137 161863
2023 161863 38492 126814 297676 331602 352548 84554 295591 83106 103951 306889
2013 306889 137862 26920 -164520 -148042 99698 22514 127167 62579 -22487 119512
2003 119512 288908 306833 385398 368644 141186 38648 218549 -10950 46070 322330
1993 322330 350271 683728 426707 251374 334935 247522 143787 191626 361230 504716
1983 504716 190843 174014 305919 172918 256682 119476 227534 242385 32242 220707
1973 220707 144397 133691 108431 -123686 -100869 -142245 -36608 -92188 -87964 -214511 -204586
1962 -204586 -40668 6898 -32139 -48108 70152 137261 238207 352844 269436 -37752 -87829
1951 -87829 -202445 -256885 24759 121955 85519 125264 -94674 74706 109260 183338 252830
1940 252830 265444 172749 -97851 -52673 -194875 -258458 -276624 -348773 -45316 208004 201669
1929 201669 133620 75536 209771 271415 441650 310490 -38142 -38856 156278 127806 2464
1918 2464 -38382 200517 110223 -52562 -194117 -87160 327180 333764 229248 40020 -46959
1907 -46959 133910 215204 168885 151428 59001 -5280 -71845 -214682 -266354 -448542 -9764
1896 -9764 190179 -113391 20010 8531 9299 -3561 -3492 -100019 -19015 153079 138333 -81547
1884 -81547 102215 164852 -85172 -158633 -3808 -158883 -140155 -71893 -99643 -201099 27437
1873 27437 169632 -195898 -93200 53514 -220700 -281504 -158510 -84233 -60030 67737
1863 67737 102821 68282 200784 178673 24029 -48836 -39897 7606 160939 41186 50289
1852 50289 204643 181280 -46544 -94179 -132262 -213387 -130695 88090 169055 247838 45996
1841 45996 157480 144205 -86534 5750 49719 -34795 120674 -52946 159973 431576 285815
1830 285815 27406 83682 227689 -68451 -246196 -55284 -39536 -6646 48002 66371 224776
1819 224776 -94478 -230765 -239449 201011 365353 241307 146262 94172 -36955 -71922 23672
1808 23672 349698 447446 399929 398354 78068 123757 208816 377113 466402 330169 234844
1797 234844 19368 281550 302997 21437 -85483 -38784 200071 -18794 -135504 -8122
1787 -8122 3787 124223 269229 125389 -211918 -6754 109789 46282 -191981 -219374 15334
1776 15334 189230 300265 287690 240092 212454 157227 211878 393420 132040 -76706 273237
1765 273237 302761 299512 401426 313112 -134941 -263308 -80645 132738 -84238 -342012
1755 -342012 -151657 49952 88456 -53765 -100350 101076 126187 2706 191761 269118
1745 269118 -18432 -207847 -127151 -10579 92515 373565 344616 8007 41846 60248
1735 60248 307289 226563 286017 91981 303410 445117 315256 73797 5085 46409 -78439
1724 -78439 -136573 9831 125017 254893 316190 192137 69705 68618 210506 -50131 27731
1713 27731 76221 228506 54950 131135 131701 130695 117724 -152584 26246 380286 469380
1702 469380 233465 287139 97406 111049 -20157 -2165 222869 236584 95749 239819
1692 239819 215089 216606 323381 450113 268947 363102 347439 224170 293429 26424 -19757
1681 -19757 -203715 -186335 -204 65621 79583 184649 -90622 -206057 -23665 -84706 -179221
1670 -179221 -445716 -342671 -1189 -214829 -53185 -17525 -52738 27727 -52880 62021
1660 62021 93008 -222643 -340029 -295720 -412981 -285373 -172383 -191288 77569 -17974 -111527
1649 -111527 108473 -7779 -113697 99143 84816 166826 148707 81512 135764 316954 137572
1638 137572 -2508 -80860 -293495 -126595 -1578 -54934 -100866 -3237 -180123 -26798
1628 -26798 67681 -39309 -160129 -87428 -217665 -151087 -124276 -99777 29894 24924 250693
1617 250693 202732 87655 -46750 69448 46458 23066 172905 134548 193109 330746 249166
1606 249166 301263 200661 177261 180559 60681 97440 143021 -11219 -34373 158739 13875
1595 13875 15214 255845 224092 194834 215284 133888 9696 -207686 -73300 81236 303666
1584 303666 107798 -14472 84074 93385 -129036 -113563 11324 200411 346645 4461
1574 4461 16188 -196295 -6981 61630 -191913 -194983 26684 189846 166918 173567 137219
1563 137219 -32356 -383079 -104256 -16423 -75791 47341 156451 69005 318017 70370
1553 70370 -123538 -64504 -254609 -334171 -26929 140900 -61216 -28083 -34218 19407 -68169
1542 -68169 55030 106894 53668 -208018 -53061 -23929 35538 -39517 45887 173638 290841
1531 290841 -142427 5623 294946 261559 168893 -278148 -89787 391978 201199 140169
1521 140169 -52480 -130499 99033 138321 14246 159452 56932 -37195 91515 385384
1511 385384 365613 18849 156317 86745 -25757 -18416 -37264 -4877 124756 -21074 -21483
1500 -21483 83178 43854 13003 147387 17699 -42863 -78990 168245 3157 -154840 149640
1489 149640 -208251 -452757 -141931 -86991 -81220 -232821 -295101 -244431 -121120 -165227 -300031
1478 -300031 -63762 216883 124634 -18967 -67328 155765 111951 298104 -91150 -181413
1468 -181413 -211919 9720 -141900 -67721 12842 162549 89710 45856 253335 65093 -97532
1457 -97532 -94087 -2920 62768 -31444 -49369 305203 47493 6492 -139325 -263738 -18241
1446 -18241 128857 47731 -42578 -79428 47732 -21860 -106738 -287566 -234693 -42127 132821
1435 132821 -72737 -218499 56883 45166 -186370 -60600 98007 39416 -23579 40027
1425 40027 -2349 -140298 26092 57901 -124681 -82480 -197925 -247820 -163213 69658 -66376
1414 -66376 -203766 -61694 -117278 -305875 -102956 85742 -11838 105751 -28982 -105352
1404 -105352 -105362 141297 245838 125966 118389 -118129 171695 159589 24946 43179 51780
1393 51780 162994 169650 217690 314127 239774 49427 -61195 -10807 32918 -115149 -3114
1382 -3114 387253 354062 368638 89485 165914 192839 96455 196692 12533 -104416 62038
1371 62038 -42499 -289120 -383045 -111202 -31502 -4941 30257 4508 82067 23458 -104516
1360 -104516 -195371 -18381 -29001 -37782 -57131 -24457 100296 -145508 -191124 -5168 50143
1349 50143 -128505 -162783 -107432 -221978 83844 -2969 -59837 -249361 -42471 53867 -29209
1338 -29209 -67132 -42695 226613 80656 225974 234022 -79365 1215 -17524 46116 132819
1327 132819 -41503 -74943 263295 512298 340250 -25739 -219334 -58072 -263043 -97084
1317 -97084 -138507 -339772 -95649 122317 97789 -43679 89863 163848 104242 -16048 -238031
1306 -238031 -180192 -73595 12496 80546 -84277 15623 -111951 -40534 -69033 -21787 59739
1295 59739 -99829 -185667 -24813 -71979 -44078 -133976 -350494 -165541 -78590 8231 134429
1284 134429 -505 -95010 -330637 -247159 -152170 -74779 -92748 140486 175373 29171 -37240
1273 -37240 35061 49443 253484 408292 164565 -83702 13603 130666 140594 100099 75675
1262 75675 242294 362977 494672 318573 383506 231519 99057 -10633 233539 193280
1252 193280 161431 259396 -29229 103117 -12285 33033 -32441 44148 42521 -118851 -199818
1241 -199818 -66963 42894 159922 -39742 -382666 -326789 -218867 -15717 84429 117377
1231 117377 171000 249678 137883 96386 49951 112506 83295 90985 191437 32428 -80324
1220 -80324 107315 -131167 105355 173511 15602 -12562 234837 113846 383006 143907
1210 143907 49632 -47450 -46539 -4011 203957 -87506 -125896 -4682 -80128 13438 37917
1199 37917 30439 25242 -18247 -176941 -152292 122036 177782 77941 36205 24341 129831 68390
1187 68390 53343 -229399 -77624 79409 165008 177734 134582 -18415 -62447 -232851 -162478
1176 -162478 -194374 16336 -114756 -199847 107983 309957 202414 171212 38533 -84639
1166 -84639 -71625 -55230 -31018 41603 -299371 -152370 -4373 -203571 -10045 108471 -57464
1155 -57464 -64869 -100488 -313400 -170330 -141836 38845 -39389 93929 -51854 -69416 42337
1144 42337 -85531 27066 -241505 92030 150688 -45917 -24742 223339 221517 208663 58739
1133 58739 -201100 -130044 87880 -22209 -150372 -113165 14115 -249215 -176202 -246077 -216081
1122 -216081 -296712 -43231 -79563 -203476 5401 -45105 -6655 258053 241061 -26146 -29981
1111 -29981 -85014 202120 213089 192448 -14842 74721 188849 174892 -215280 -181232 -214327
1100 -214327 29010 -75803 -85065 -31230 19307 72445 49038 5033 -58118 -14985 -61837
1089 -61837 -97897 -54705 197615 4846 -69597 -101073 29799 282783 142552 30975 63929
1078 63929 252195 159722 -23946 72963 -44010 3474 322108 216397 295407 204592 240534
1067 240534 177198 42005 121420 188933 72521 -244061 -369636 -10692 99531 163564
1057 163564 113545 154214 454097 200851 -11454 -18199 115190 -11539 -38818 221220 301449
1046 301449 383750 371068 210592 305343 350980 11509 -104955 42668 26388 42407 376220
1035 376220 2310 -307996 -246590 -108884 -53301 -136894 9232 -105573 -73282 -21529 32413
1024 32413 59102 -59206 -120215 -113345 -52803 -146843 -46027 105896 -63430 -270573 -248458
1013 -248458 26087 -146345 -4004 -2106 23147 -16556 97988 328319 292454 -30020 165530
1002 165530 101181 5579 -21322 138339 148532 65995 -34044 -237044 -148621 -117051 -38430
991 -38430 -22985 -74447 -167916 -142772 -246179 -3071 -44688 11258 -504 -46484 17740 2125
979 2125 18526 -366271 -298956 -162115 -54440 -188712 -189315 -91816 21623 -137 -242920
968 -242920 -8672 4932 -227813 -32657 -154887 -123201 28992 -2770 -112567 69420
958 69420 22677 -27090 -22605 -136092 -2110 -203921 -8241 -46140 -361172 -218026 74328
947 74328 42900 -57966 -152974 72306 -95365 -161012 -251061 -206614 -137823 -154151 -215147
936 -215147 -385407 -347298 -38464 -39322 -71689 73646 89354 -99887 -54024 139230 86845
925 86845 125936 61596 -77123 -105814 7856 88279 -23750 -31476 177649 87116 159635
914 159635 206361 -118856 -38222 39109 -164357 -72207 247933 98096 -120681 -76191 -372597
903 -372597 -155063 121177 -158688 -245992 -243149 -81428 -179372 -174363 177788 113939 63740
892 63740 -89318 -157650 -95780 -32986 -99803 -166978 118363 94276 197260 -8159 166928
881 166928 47795 14379 87242 75604 27542 227576 268741 153896 106999 101167 9304
870 9304 -44218 15015 -15777 -224753 -151177 -29747 -177304 -32115 45839 -107718 -145700
859 -145700 -55584 -169289 -96892 -380806 -256124 -296859 -351430 -519092 -211693 202263 40183
848 40183 -160663 -107397 -163024 -39917 1128 -75826 -103593 -168389 -67133 -23374 -318880
837 -318880 -182490 -67474 -176748 -29297 -106864 -274471 -270802 -203802 -31689 21306 217662
826 217662 179938 23269 -270299 -480025 -314411 -285374 86114 229689 -73509 61516
816 61516 -235328 -85149 -12338 -24770 70040 221700 103751 -85698 -86877 55912 98942
805 98942 128826 89173 -216630 -20676 29845 -166100 -161890 -173507 -322194 -154207 -269117
794 -269117 -111726 -70673 93390 114348 51627 10645 217498 81803 -112524 -12186 17337
783 17337 66689 169479 233475 92900 69101 96030 -131094 -235097 36790 -23753 -123356
772 -123356 -222524 -184220 -50179 -14318 -119934 -215216 -92655 -77571 -243796 -300457 -262777
761 -262777 -335798 -153156 24937 28482 -92624 124069 156140 25817 56229 -164518 -171930
750 -171930 -50334 -219984 -254633 -209678 -20380 82291 -27981 -34674 -140814 -136355 78174
739 78174 133791 84315 -41667 -101601 -238386 -123014 -49816 -140499 -93098 15397 29664
728 29664 20712 144001 192318 221277 55171 -32376 108047 10319 -17909 89680 23344
717 23344 115558 29290 -80019 66918 -42013 -17667 436859 491212 81632 58753 266835
706 266835 376616 399217 -26790 -224001 126406 101302 166940 184752 -17313 -2367 -176436
695 -176436 -192635 -164543 -355202 -170338 -321063 -47731 -43148 3149 -259190 -444630 -384015
684 -384015 -195738 89956 -203973 -293847 -265923 -489233 -433434 -370090 -28390 180944 -149761
673 -149761 -247178 -201446 -264927 -367267 -274461 -413464 -108405 -79332 -257992 -226275 -56887
662 -56887 18852 96093 -29756 -47810 -157888 149196 252364 112141 15391 24790 113341
651 113341 338804 -115560 -84453 -80578 -32695 329 218333 286417 113185 14926 -132940
640 -132940 -36562 -99410 132329 76766 112534 58564 166900 91607 -40324 -98532 -270014
629 -270014 -184252 -239887 -78681 -36955 94408 -210616 -26907 167454 65731 -131832
619 -131832 -155046 -38499 -13456 156966 -150378 -172539 -319303 -278963 -168533 -237202 -262312
608 -262312 76922 78985 -117451 -304476 -100161 -74920 -203757 -256092 -129679 -255352 -97006
597 -97006 -67768 -113627 -106532 -97773 -179849 -285723 -212799 -129284 -39126 135545 311270 14524
585 14524 139376 53803 -161622 -351235 -108837 -35353 87941 174771 123326 -49695 -161
574 -161 9065 -76036 -8761 -181209 -67374 -133222 -55487 7244 -140332 -1428 -103224 -351423
562 -351423 -119975 -23118 179847 -92399 -246402 -82825 -94415 139406 71307 86588 106342
551 106342 -24691 -39539 37505 146741 83121 226700 364074 233143 289396 435135 213605
540 213605 47907 -16511 -59715 -110538 137249 125449 146732 -225964 -274252 -20744 -50666
529 -50666 5540 40597 -50549 -26013 -251602 -370271 -605394 -439494 -288708 -129936 23888
518 23888 -122735 -97261 -120727 -176816 -77786 -120869 -21652 -31443 -21871 254034 220134 208436
506 208436 25589 -237165 -240337 -14775 143089 196940 -42682 64622 161549 232454 -50180
495 -50180 -286674 -390494 -284555 -226451 -213225 -277561 -327663 -17890 289212 195510 30653
484 30653 -29517 -28520 -48654 145943 130019 -10350 -396579 -102267 25682 54733 99996
473 99996 3400 -226104 36560 19201 -21977 78698 101226 -40246 -114077 50421 -36236
462 -36236 -37751 -191469 53896 -125799 73278 133307 6318 197534 98570 62710 -54486
451 -54486 -212386 -108196 45203 87044 182450 345569 52772 -229746 -80044 11658 193381
440 193381 87417 -2131 143137 -17153 -45943 26653 98941 -130808 67872 -100415 -224766
429 -224766 -9568 -117305 -498820 -332955 -68867 -131614 -257990 -267849 -264359 -67638 52020
418 52020 -259043 -334428 -420921 -267188 -381388 -280527 -202673 -476808 -246637 -123778 -253003
407 -253003 -61608 9732 -59626 -37479 -77249 -183098 -358510 -277661 -209500 -189653 -156264
396 -156264 25616 63250 72165 27234 33319 -84041 -237459 16164 -36729 -28398 -107624 -200881
384 -200881 -207462 155662 118026 -46498 -77080 -277124 -253363 10871 73509 -174292 -228878
373 -228878 -302484 -240663 -274358 -60703 -236670 -35435 -91860 -334838 -120560 34254 98947
362 98947 -51388 -16164 -223767 71227 5727 15125 -75574 2083 -22939 -23805 -135432 4443
350 4443 194254 -156871 -83361 -121627 -44101 10504 154434 109998 -183917 -170640 -351608
339 -351608 -194553 -194976 -205604 -110593 -288708 -152327 -300540 -329419 -271660 -195709 -214776
328 -214776 -211632 -253968 -239621 37835 -9414 -250793 -265249 -120216 -182123 -294820 -20935
317 -20935 209292 94381 -39044 -6081 -157183 -113240 -290132 -146149 129793 -203153
307 -203153 -375494 -270725 -280125 -163030 -138981 -291001 -650855 -246077 -150533 -146218 32660
296 32660 -99382 -142341 -72053 -177131 3138 151310 -18209 133415 118954 63871 65627
285 65627 -165260 -243764 115428 -62342 -101876 15456 152854 217291 154528 133806 7362
274 7362 165529 -29917 -108181 -168137 -87634 -77174 -133189 -179026 -195839 -88329 -59248 16196
262 16196 -227967 -170870 -30553 2507 -125977 -160084 -140005 -78528 -84009 -279361 -518873
251 -518873 -523402 -464408 -670478 -469912 -176324 -132277 -359017 -215843 -109458 -232390 -237769
240 -237769 -264138 -4335 18317 -165782 -70928 143768 -102829 -83157 -32213 103999 -207878
229 -207878 87254 -65901 -191947 59021 248522 260174 64408 -8246 -265758 -241244
219 -241244 -207000 -364514 -188507 -190412 -271794 -96615 -172283 -196153 142114 38776 -98600
208 -98600 43087 -54003 -282731 -246325 -369374 -238223 -7871 6559 121607 -103807 -48430
197 -48430 77709 -160405 -421386 -259341 -273624 -166477 -269325 -82437 -113388 -170907 124070
186 124070 -99757 -213362 -161533 -34364 -120010 -141812 37328 -109900 -110273 -75301 -228299
175 -228299 -18096 -23394 -122852 -82193 127612 276871 -49543 -157462 -351513 -396105 -93520
164 -93520 135183 102563 145132 -97643 -125997 68216 -128074 -316539 -261056 -90617 -209912
153 -209912 -176401 -271000 -160257 -16024 11086 30688 -104586 -77829 -230157 -291866 -379781
142 -379781 -572736 -245583 -189033 -192532 120651 65169 44140 -164789 -26513 -121834 -189851
131 -189851 -89616 -76828 -138674 -203059 -191059 -129677 -200414 -144965 -51055 -2120 -19395 -15326
119 -15326 -114763 -191238 -213775 -116011 -106684 -207926 -136796 -100128 -83958 103988 67903 -58202
107 -58202 -206418 -149345 -103017 -11283 -31168 -179699 24372 -19563 47820 99434 -56946
96 -56946 -107115 -102303 -116146 -104894 -54758 -175456 -349428 -251816 -269123 -162987 -141835 -297642
84 -297642 -205161 -313984 -320181 -254444 -312874 -299147 -262303 -234277 -146824 -221532 -361035 -27636
72 -27636 -45872 -183645 -181189 -218457 -89988 -39171 -88342 -168216 -163133 -9977 67036 40998
60 40998 -215396 -357226 -258188 -77490 -120559 -65088 -88334 30757 28146 -328106 -281249
49 -281249 -91314 -135761 -230208 -192489 -10271 -32916 20254 -40557 -156305 -280502 -91188
38 -91188 68750 34560 12632 -12992 5629 154009 63702 -67092 -115033 -151061 -155769 -258726
26 -258726 -157543 -8597 119880 40876 -121342 -170342 -269806 -185361 -155469 -125397 -224624
15 -224624 -232879 -47444 -39973 -95346 -46827 -58602 -86134 -119797 -62957 -121934 -109943 -192530
3 -192530 -373231 -263228 -380266
0 -380266
$$ Imaginary data points
##PAGE= N=2
##DATA TABLE= (X++(I..I)), XYDATA
16383 -1658402 -1726938 -1796615 -1690854 -1535672 -1598850 -1529725 -1395595 -1406268 -1561863 -1519407
16373 -1519407 -1373595 -1528458 -1298738 -1255321 -1140416 -1241131 -1292455 -1098897 -1219060 -1378615
16363 -1378615 -1142237 -1043500 -952267 -1030176 -1134520 -1096091 -1052099 -1012254 -826236 -839462 -881744
16352 -881744 -811037 -921068 -845017 -789924 -853655 -783961 -797797 -793501 -738094 -533889 -435789
16341 -435789 -551191 -483848 -517143 -421632 -532985 -428710 -527484 -674106 -705746 -595834
16331 -595834 -560814 -403882 -176587 -297526 -525336 -436887 -70261 -112947 -162006 -219729
16321 -219729 -303330 -86002 -138007 -5617 -83304 -412786 -479167 -432142 -459065 -184214 113024
16310 113024 97225 45431 -34179 17128 190935 205771 198438 -9825 23827 330978 271403
16299 271403 245722 391555 396452 393417 422477 618227 634590 599849 562988 537244 539765 449560
16287 449560 611193 563416 595476 687573 497890 449086 494954 512622 684080 573713 677037
16276 677037 804067 808573 720888 881561 978144 975062 1064665 905132 819304 939653 1081203
16265 1081203 1157607 1062981 1235532 1180025 1161004 1067768 1228301 1101030 1256350 1301166
16255 1301166 943800 743249 809157 1235993 1189976 1289005 1184766 1115667 1288498 1396003
16245 1396003 1238198 1303889 1147554 1185387 1182610 1170242 1303499 1106991 1231672 1479289
16235 1479289 1385738 1595067 1387696 1392942 1617598 1601782 1488550 1465434 1786476 1831599
16225 1831599 1814471 1636371 1570840 1657287 1726041 1688788 1546196 1590756 1791294 1554465
16215 1554465 1476001 1442846 1590633 1733904 1470042 1451622 1568288 1778231 1893130 1907281
16205 1907281 2014185 1994751 1851913 2098595 2035619 2069157 1633692 1583645 1634782 1909913
16195 1909913 1956168 1713562 1721294 1803125 1678876 1706696 1912363 1960858 1902380 1756506 1950906
16184 1950906 2031511 1782339 1759534 1958400 1776733 1723429 1968915 1985339 1912716 2126942
16174 2126942 1965062 1837433 2005444 1958558 1936509 1856521 2019247 2222244 2207730 2415822
16164 2415822 2288675 2219183 2233752 2175853 2136557 2267044 2391088 2224725 1877755 1967095
16154 1967095 2046647 2150080 2062019 1899041 2139853 2179917 1938590 2205776 2112260 1882392
16144 1882392 1716487 1811787 1982949 2168336 2246099 1960031 1932781 2012663 2035006 2141905
16134 2141905 2055975 2022028 1976277 1852087 2017183 1998876 1764222 1682955 1904525 2214667
16124 2214667 2116793 2161474 2062055 2110320 2204069 2224795 2305119 1971164 1644334 1732519 1783296
16113 1783296 2086781 2279084 2178249 2048507 2155789 2037115 1967001 2128312 2082678 2212337
16103 2212337 2234929 2266058 2360391 2428461 2314259 2064444 2068215 2189418 1982301 1927960 2146312
16092 2146312 2187026 1837536 1915448 2177223 2168092 2043217 2062157 2184146 2147172 2128100 2277568
16081 2277568 2223426 2365029 2365311 2220080 2224651 2411198 2222983 2243847 2162955 2089490 1999068
16070 1999068 2038385 2152245 2210645 2245028 2321005 2322509 2360721 2244769 2212999 2380254 2215681
16059 2215681 2147555 2102333 2110264 2224557 2282897 2290310 2079315 2116720 2462896 2458603 2119293
16048 2119293 2310067 2401815 2318139 2278553 2173870 2387380 2424939 2021362 1993972 2270095
16038 2270095 2269028 2342920 2329999 2177769 1946222 2109380 2093474 2262763 2124418 2071604
16028 2071604 2038348 2080682 1974057 2141940 2458887 2563868 2136600 2045921 2192141 2261753
16018 2261753 2472026 2397025 2284117 2256465 2043131 2038854 2197279 2117813 2075164 2115383 2300091
16007 2300091 2421662 2195656 2278516 2356268 2197811 2210169 2021505 2082359 2206230 2201700
15997 2201700 2285849 2349820 2376551 2438381 2349163 2250991 2246809 2369109 2291158 2345368 2507051
15986 2507051 2717409 2404028 2216626 2495486 2357498 2305508 2522043 2340919 2363208 2320071
15976 2320071 2106345 1977299 2087436 2305390 2453464 2492036 2311414 2288241 2132291 2122973
15966 2122973 2521349 2451201 2431566 2261396 2072167 2059589 2346379 2283465 2391548 2287198
15956 2287198 2061830 2278434 2048838 2042057 2370260 2217490 2107769 2058084 2289267 2423465
15946 2423465 2476352 2376105 2199695 2068535 2246576 2410653 2503237 2445301 2058716 2136092
15936 2136092 2190769 2257860 2364534 2210739 2151977 2008971 1929734 1931886 1956915 1987483 2162673
15925 2162673 2461509 2404926 2416910 2272807 2611311 2502956 2281903 2267471 2377332 2404987
15915 2404987 2396571 2190423 2523634 2635456 2495786 2560477 2554078 2388947 2283791 2232653
15905 2232653 2122557 2379428 2539614 2360011 2570285 2572510 2353959 2009983 2276154 2349791
15895 2349791 2392735 2289978 2473555 2499510 2245704 2400285 2261883 2191020 2034980 2082455
15885 2082455 2265275 2259286 2249514 2445357 2208714 2135679 2056430 2198375 2296875 2297701 2317193
15874 2317193 2207703 2152867 2106612 2108716 2315284 2317984 2326028 2485323 2532938 2643221 2365464
15863 2365464 2448352 2511738 2573630 2433926 2217171 2075039 2188971 2341727 2235408 2217466
15853 2217466 2149945 2170081 2283217 2461600 2437713 2625488 2535208 2589474 2548685 2414647
15843 2414647 2472157 2421282 2643160 2510470 2320540 2408045 2442217 2497118 2520238 2361759
15833 2361759 2027445 2296655 2468915 2489315 2487608 2477112 2388461 2324878 2201167 2045056
15823 2045056 2113035 2165144 2134903 2376849 2384577 2240146 2221614 2416653 2412875 2314354 2296996
15812 2296996 2193329 2205559 2365582 2245769 2021221 2087881 2407270 2486141 2340167 2152381
15802 2152381 2211297 2369826 2189691 1882075 1683852 1899953 1931979 2181815 2336678 2422875
15792 2422875 2266402 2327636 2269483 2111032 2143423 2030676 2034952 2008748 2245225 2213750 2485562
15781 2485562 2016569 2159339 2299575 2098207 2115105 1859331 2010101 2084005 2134935 2314071
15771 2314071 2146331 2055112 2308980 2352907 2140919 2117114 2262666 2044809 2296072 2475595
15761 2475595 2560178 2505237 2399608 2245985 2204480 2521544 2519252 2251387 2235361 1948106
15751 1948106 2077297 2144518 2098170 2237041 2039544 2234999 2177409 2072268 2273673 2240923
15741 2240923 2116734 2177590 2297844 2330427 2181393 2233910 2375787 2409940 2687663 2564676
15731 2564676 2620279 2549661 2262681 2386275 2523491 2468809 2394072 2466092 2471329 2332942 2453641
15720 2453641 2381035 2250017 2306979 2241032 2189719 2358107 2425503 2487483 2535222 2314046 2178161
15709 2178161 2167605 2139846 2049072 1993932 2362276 2284375 2261992 2331443 2193861 2323417 2400120
15698 2400120 2511157 2589290 2525903 2537287 2543885 2221303 2111913 2169836 2501844 2584262 2287468
15687 2287468 2288636 2276276 2315628 2650995 2671780 2571433 2432947 2140146 2121392 2185109 2344081
15676 2344081 2477864 2391159 2315867 2281809 2372705 2588533 2512601 2268197 2418173 2414624 2445376
15665 2445376 2266519 2276823 2241826 2367682 2530133 2387447 2312006 2446281 2392420 2335227
15655 2335227 2277640 2171656 2293233 2324713 2175843 2200815 2388415 2468980 2237490 2251688
15645 2251688 2512227 2475712 2478404 2507306 2349103 2256187 2223688 2365349 2313067 2231943 2404278
15634 2404278 2227484 2234313 2155800 2233618 2378040 2346772 2465979 2452976 2381368 2363445 2265978
15623 2265978 2378541 2269315 2550206 2533001 2400454 2521763 2567376 2260291 2231871 2334645
15613 2334645 2564401 2393797 2144892 2334892 2344289 2372703 2386222 2403345 2381585 2308375 2250156
15602 2250156 2288134 2559055 2492823 2609923 2343121 2294330 2492625 2575583 2469853 2354313
15592 2354313 2594936 2407523 2483055 2218485 2172943 2192597 2125159 2227833 2445549 2361677
15582 2361677 2246403 2238570 2241954 2235490 2172035 2372359 2464254 2650069 2528258 2270219 2249924
15571 2249924 2349189 2438998 2242117 2128368 2281772 2611671 2481431 2441493 2268719 2164590
15561 2164590 2408325 2165579 2266634 2329266 2136817 2335210 2385174 2458853 2620790 2716797
15551 2716797 2862802 2531932 2203323 2407819 2447740 2455900 2400015 2510021 2289594 2405789
15541 2405789 2373467 2194142 2168750 2253929 2404955 2337284 2300785 2181620 2217251 2328523
15531 2328523 2441087 2348041 2194114 2319032 2432548 2430400 2455674 2477539 2467089 2653182
15521 2653182 2531151 2527876 2405770 2265274 2222119 2324497 2398979 2291601 2324199 2422609
15511 2422609 2187807 2312548 2302417 2242778 2368081 2303053 2399214 2078161 1985603 2149324
15501 2149324 2346757 2122153 2199248 2404582 2338107 2431974 2506433 2567236 2414007 2627957
15491 2627957 2550846 2279064 2537737 2407849 2412683 2434117 2378519 2606298 2722725 2590737
15481 2590737 2336655 2259825 2428030 2375021 2421444 2310400 2403138 2195305 2240512 2358296
15471 2358296 2510046 2757891 2518209 2528021 2303642 2262691 2286099 2328913 2205764 2404439
15461 2404439 2597412 2372801 2607818 2532687 2252290 2382481 2494832 2352966 2345189 2326075
15451 2326075 2207507 2449082 2407894 2278890 2501416 2539463 2517099 2351795 2222555 2067927
15441 2067927 2093519 2285369 2376257 2352423 2504656 2255639 2291863 2260189 2368067 2581701
15431 2581701 2428142 2399114 2329843 2376197 2450202 2297916 2202579 2135666 2204317 2260757 2289770
15420 2289770 2298733 2255266 2257829 2106707 2140983 2320565 2366351 2380636 2333570 2463650 2452333
15409 2452333 2699524 2603476 2152607 2147789 2421231 2272998 2141212 2403343 2342933 1973765
15399 1973765 2210861 2522667 2327253 2343428 2091736 2272017 2466851 2297804 2389171 2429526
15389 2429526 2193367 2264234 2632221 2675403 2416989 2257520 2348251 2340169 2286298 2309599 2263884
15378 2263884 2278847 2176299 2341674 2566136 2685449 2730573 2616837 2492930 2362135 2509339
15368 2509339 2858883 2705240 2471264 2430413 2541889 2372740 2509621 2541830 2368485 2349396
15358 2349396 2527039 2466868 2400028 2439434 2422312 2401419 2434571 2317410 2167739 2234429 2372120
15347 2372120 2532088 2542775 2280347 2232173 2504681 2406662 2248461 2302943 2582124 2516147
15337 2516147 2307105 2536263 2646945 2738302 2532911 2523108 2512320 2574883 2544941 2386711
15327 2386711 2396632 2504369 2410260 2402696 2332727 2175446 2389209 2554486 2399760 2288062
15317 2288062 2612566 2622353 2630056 2378684 2273519 2524199 2543013 2419983 2394459 2477763 2626633
15306 2626633 2567078 2432770 2469299 2474362 2393334 2470187 2391000 2319846 2379763 2614731 2650250
15295 2650250 2529699 2482012 2331280 2335106 2122269 2371157 2535630 2455456 2370767 2447121
15285 2447121 2717727 2563839 2533953 2500732 2326538 2630680 3002721 2605294 2514952 2401976
15275 2401976 2442796 2552572 2336252 2220489 2183820 2199833 2171524 2180085 2098071 2194793 2272479
15264 2272479 2422038 2546491 2576630 2449412 2548485 2518138 2451772 2553706 2474489 2473245 2364309
15253 2364309 2334830 2226978 2247709 2561475 2448396 2520131 2816808 2696735 2977193 2833712
15243 2833712 2549030 2539940 2552677 2600472 2507630 2422862 2220005 2288871 2149047 2139422 2451825
15232 2451825 2461539 2377507 2357552 2523521 2445144 2600150 2592197 2658211 2860634 2684333 2592209
15221 2592209 2524439 2359716 2362636 2441560 2538688 2396257 2411773 2517494 2536437 2263006 2226544
15210 2226544 2366271 2547941 2560259 2506682 2468799 2140927 2348766 2679045 2366466 2495283
15200 2495283 2600399 2693579 2642422 2560714 2297968 2193407 2511898 2687840 2677484 2534705
15190 2534705 2682372 2398652 2258140 2310164 2291498 2101854 2217282 2404559 2513405 2415783
15180 2415783 2414656 2513244 2509885 2477717 2420954 2449234 2280729 2215832 2414052 2484975 2464654
15169 2464654 2464490 2438583 2373057 2381999 2415987 2483905 2495407 2670402 2642282 2514639 2535502
15158 2535502 2475156 2417942 2573260 2566120 2521669 2393813 2452355 2339485 2375064 2375857 2337631
15147 2337631 2514650 2474681 2291375 2354303 2482358 2338368 2385961 2442124 2459867 2486028
15137 2486028 2638791 2658153 2517181 2495295 2327594 2238265 2594885 2542582 2660951 2601279
15127 2601279 2551673 2512489 2378664 2395940 2465993 2537727 2444131 2301044 2340864 2417034 2334984
15116 2334984 2349513 2499641 2667511 2545372 2423523 2302123 2480545 2400683 2379115 2507448
15106 2507448 2741037 2688281 2462293 2382033 2345621 2351142 2610098 2501109 2513946 2717213
15096 2717213 2727565 2630470 2658890 2689377 2621997 2727913 2721559 2728527 2642560 2633827 2602169 2353349
15084 2353349 2254177 2360007 2409647 2733754 2528896 2434394 2574688 2664155 2633778 2386168
15074 2386168 2363080 2182146 2252581 2382347 2634170 2704550 2505227 2432618 2347745 2398698
15064 2398698 2540328 2339351 2416717 2617744 2508487 2286334 2308172 2426387 2513234 2491960
15054 2491960 2524148 2559305 2677487 2593892 2544828 2511396 2237085 2606920 2493675 2395059
15044 2395059 2452791 2368614 2460261 2496097 2456508 2606762 2589498 2536676 2732207 2546797 2527058
15033 2527058 2650007 2512006 2548463 2308164 2417112 2698906 2593928 2469196 2624956 2352357
15023 2352357 2365140 2565336 2462012 2476239 2279586 2001777 1949614 2364670 2613573 2684508
15013 2684508 2366146 2454461 2745389 2481096 2622895 2760263 2673906 2555864 2565578 2468157
15003 2468157 2568789 2491972 2332221 2318461 2316103 2585863 3015037 2646620 2399446 2580971
14993 2580971 2927802 2845228 2788603 2514329 2292665 2331359 2434501 2364066 2282032 2437171
14983 2437171 2442226 2853667 2686056 2465726 2531840 2389167 2402943 2611394 2412294 2390840
14973 2390840 2135885 2432366 2585616 2439132 2333729 2524768 2602629 2576946 2788196 2782876
14963 2782876 2881009 2748764 2676098 2484690 2500461 2492851 2641618 2563512 2701966 2516406
14953 2516406 2396945 2242312 2294854 2249081 2101433 2207883 2407673 2719963 2634824 2644816
14943 2644816 2338422 2698534 2692097 2605648 2364409 2455199 2601962 2331757 2559067 2504326
14933 2504326 2193657 2406694 2472083 2372886 2458874 2649844 2866615 2662204 2722111 2521221
14923 2521221 2580682 2820362 2644235 2613001 2617192 2696268 2767102 2766293 2457341 2420205 2283932
14912 2283932 2409622 2495629 2531969 2406889 2299248 2291447 2381572 2408477 2460550 2420005 2463474
14901 2463474 2506949 2403202 2411850 2553469 2762708 2647956 2653853 2531315 2449179 2266184
14891 2266184 2273818 2338200 2557121 2536774 2703965 2718770 2801190 2867246 2638442 2623316 2490689
14880 2490689 2465073 2511055 2601745 2606180 2451141 2531414 2850557 2904164 2904535 2922340 2795442
14869 2795442 2582370 2653901 2577628 2575845 2419937 2727415 2635191 2604719 2357866 2496420
14859 2496420 2529651 2489246 2679000 2750563 2765373 2619713 2484109 2487687 2729186 2420605
14849 2420605 2308791 2749362 2780152 2516355 2761905 2525737 2517762 2539917 2768055 2587852
14839 2587852 2535868 2747325 2556700 2726192 2848949 2580408 2496491 2461040 2415288 2506391
14829 2506391 2725335 2890303 2739525 2566147 2559596 2709012 2668634 2615941 2661230 2623726
14819 2623726 2846825 2785865 2563973 2638924 2842246 2560875 2561382 2612319 2587884 2714688 2807110
14808 2807110 2598479 2720469 2788201 2738800 2705502 2951256 2896212 2651987 2584728 2492587
14798 2492587 2596400 2326770 2307091 2546641 2719587 2847299 2874439 2782846 2662991 2695104
14788 2695104 2410234 2324640 2373728 2255378 2132322 2232398 2443573 2404526 2531606 2489498
14778 2489498 2625386 2453105 2458172 2602472 2637652 2441226 2480917 2768933 2809014 2799818 2696324
14767 2696324 2556224 2830393 2786871 2554882 2750634 2814848 2877428 2766498 2623691 2582554
14757 2582554 2716292 2992033 2946935 2575448 2663690 2608900 2391516 2435197 2476717 2573941
14747 2573941 2459144 2546845 2819534 2552744 2416059 2274334 2387334 2502714 2631467 2780843
14737 2780843 3013999 2925241 2720215 2603368 2416270 2516134 2511551 2472592 2425035 2394121 2361827
14726 2361827 2535686 2400116 2338539 2631935 2721726 2745299 2748803 2612407 2590339 2594529 2484161
14715 2484161 2752256 2642891 2526970 2917764 2786456 2594532 2633420 2698071 2809767 2821436
14705 2821436 2523900 2557399 2451172 2592595 2663825 2641623 2722468 2744091 2741693 2887761 3031386
14694 3031386 2981089 2774005 2889996 2801481 2730596 2849334 2656982 2662501 2685765 2729895 2757509
14683 2757509 2755465 2642696 2546110 2408999 2554037 2631422 2241005 2328829 2369305 2325989 2490158
14672 2490158 2744710 2607502 2561675 2625812 2644076 2898521 2739079 2892872 2813926 2693040
14662 2693040 2493843 2447894 2422210 2468049 2561409 2691009 2970625 2770772 2795137 2627401
14652 2627401 2465950 2524569 2556451 2386530 2444739 2592070 2682640 2691939 2577513 2440093
14642 2440093 2652562 2575747 2592851 2471598 2445828 2533235 2498814 2453956 2726092 2816692 2913432
14631 2913432 2810499 2689175 2941423 2766440 2577260 2687102 2757180 2792387 3114109 2729920
14621 2729920 2634007 2481227 2649067 2661892 2895728 2793537 2723524 2771393 2632004 2572964
14611 2572964 2266653 2478572 2404897 2424803 2464706 2421239 2524325 2712317 2673713 2627546
14601 2627546 2497457 2414937 2634649 2448353 2563045 2711314 2709526 2752935 2770711 2840381
14591 2840381 2857573 2507377 2470213 2429969 2424219 2596965 2849441 2914730 2803148 2580892
14581 2580892 2382164 2396357 2336734 2436260 2452306 2489201 2433988 2594200 2565227 2568310 2701650
14570 2701650 2697460 2652354 2834943 2889532 2657094 2595411 2593240 2510403 2795874 3009300 2746673
14559 2746673 2775085 2771504 2847760 2916905 2873893 2791599 2727296 2675860 2511801 2441180 2542280
14548 2542280 2612841 2563322 2474273 2587605 2429092 2343224 2282807 2423399 2597959 2712784
14538 2712784 2458416 2408335 2312563 2425320 2677781 2495603 2401506 2340299 2523397 2555375
14528 2555375 2482377 2603550 2448379 2610361 2756141 2805201 2922150 2876015 2744469 3020259
14518 3020259 2835524 2694988 2829783 2539240 2664016 2559956 2572821 2736732 2739838 2693310
14508 2693310 2873026 2756484 2451266 2432462 2472456 2502014 2515059 2566833 2830646 2841596
14498 2841596 2572876 2608205 2464884 2498474 2447505 2352362 2547551 2711601 2738637 2580148
14488 2580148 2642326 2514884 2668663 2657455 2551019 2489298 2711685 2770798 2962626 2734944
14478 2734944 2598890 2543378 2568945 2698807 2735761 2827054 2827033 2720772 2967284 2555384 2688701
14467 2688701 2949689 2671051 2461218 2659657 2735968 2733705 2724796 2740125 2858157 2572131
14457 2572131 2626001 2679900 2742701 2693048 2717670 2686980 2787819 2925466 2915295 2718112 2659241
14446 2659241 2429948 2483843 2496233 2545428 2845262 2933908 2843631 2765852 2620630 2420213
14436 2420213 2566815 2663714 2661189 2597566 2666904 2722019 2721214 2588421 2681764 2666581 2873125
14425 2873125 2875937 2793098 2914357 2822513 2738595 2700934 2925964 2773693 2775587 2738277 2592131
14414 2592131 2507874 2590090 2697431 2993854 2914593 2796859 2747773 2702734 2746772 2883228
14404 2883228 2813241 2813576 2700123 2612662 2821043 2686175 2735168 2785932 2729897 2625997 2527461
14393 2527461 2427758 2758195 3086831 2977057 2814377 2761936 2909073 2632739 2560398 2856675
14383 2856675 2699665 2805239 2850063 2830352 2741034 2615654 2604918 2322023 2281796 2443833
14373 2443833 2487774 2721370 2847522 2619033 2700318 2818559 2749741 2674867 2585617 2582436 2589087
14362 2589087 2407050 2599840 2870866 3099177 2909319 2917491 2821729 2794188 2765330 2813559
14352 2813559 2757640 2759670 2786898 2742151 2918488 2971467 2746233 2731988 2575281 2658546 2832258
14341 2832258 2506668 2481891 2813898 2701963 2503417 2549448 2712312 2844647 2736133 2887215
14331 2887215 2815514 2728242 2637795 2738366 2747938 2704034 2762105 2493150 2485314 2574369 2435257
14320 2435257 2586059 2733309 2552976 2756090 2664921 2549727 2538617 2625108 2795530 2860383
14310 2860383 2759260 2801235 2830657 2679584 2677636 2615990 2861601 2774807 2614074 2666867 2709836
14299 2709836 2552269 2549318 2561891 2620128 2984960 2834880 2557877 2853545 2886499 2959960
14289 2959960 2882183 2643069 2567586 2744360 2668725 2739222 2779540 2683306 2730527 2666135 2627131
14278 2627131 2521034 2398267 2582098 2485334 2841127 2602521 2363632 2537503 2554248 2589581
14268 2589581 2718812 2598023 2872799 2926288 2684611 2660302 2774119 2705603 2510603 2541848
14258 2541848 2656346 2625130 2706042 3004633 2866815 2762469 2469914 2714309 3042047 2903573
14248 2903573 2884123 2817180 2593716 2475397 2648185 2503182 2779401 3077461 2964792 2722563
14238 2722563 3070351 3242300 2953038 2970460 2840939 2845839 2733277 2710310 2772285 2826959
14228 2826959 2986027 2927632 2805193 2483659 2470545 2538704 2669553 2583061 2478821 2808047
14218 2808047 2668245 2797387 3039155 2927187 2725340 2792228 2727242 2698742 2621459 2828216
14208 2828216 2781872 2752694 2888929 2751605 2719500 2730204 2565730 2842140 2800699 2822102
14198 2822102 2816279 2891240 2914118 2885835 2810188 2847542 2452008 2502805 2914497 3062180 3000096
14187 3000096 3062148 2975441 2892076 3137395 3277813 3127433 2928027 2696203 2840216 2822702
14177 2822702 2899099 2721767 2682070 2791743 2757318 2714918 2879505 2977969 2814400 2934477
14167 2934477 2660602 2635760 2749637 2769360 2714609 2540914 2504786 2563700 2515506 2642793
14157 2642793 2606801 2671756 2660319 2733806 2744696 2872446 2735487 2785764 2833438 2913064 2842487
14146 2842487 2738506 2761921 2840325 2760523 2796446 2532903 2538333 2595600 2590449 2793472 2690943
14135 2690943 2778461 2690346 2512896 2514836 2696596 2802541 2659466 2955023 2913804 2775679
14125 2775679 2903382 2878470 2842618 2868285 2752633 2773205 2799562 2913488 2965667 2822440
14115 2822440 2693236 2869495 3026282 2717955 2624591 2806572 2947774 2883365 2836177 2717293
14105 2717293 2669860 2599387 2530139 2637495 2853279 2792948 2892735 2884227 2904858 3006478 2872413
14094 2872413 2888522 2747456 2593824 2816224 2933312 2776807 2966501 2893062 2660568 2637163
14084 2637163 3118857 3115092 2812255 3073079 3145928 2986994 2851814 2936000 3035049 2988122
14074 2988122 2890833 2862931 2869165 2762129 2752219 2948516 2901710 2792544 2753407 2690844 2505401
14063 2505401 2496598 2611218 2517562 2508138 2633609 2742963 2710706 2735689 2713940 2878784 2735713
14052 2735713 2736161 2833242 2669472 2838798 3103289 3004698 2786487 2770774 2376938 2497325
14042 2497325 2875999 2864013 2636497 2784776 2753600 2812089 2688929 2868297 3011365 2741200
14032 2741200 2624738 2544497 2576913 2736171 2587630 2783175 3041857 2927727 2699635 2974742
14022 2974742 3134002 3157737 2821266 2829739 2837481 2812647 3067386 2982403 2749154 2597613 2708137
14011 2708137 2761638 2764586 2800334 2929166 3018558 3043666 2823643 2804034 2720276 2925820 2948401
14000 2948401 2866046 2882887 2931419 2697484 2606095 2642485 2566517 2564687 2746874 2673612 2918908
13989 2918908 2963852 3150607 3147008 2914265 2951460 2873196 2878983 2663919 2661888 2877262 2650104
13978 2650104 2478797 2655575 2758178 2969049 3113276 2915417 2995416 3208797 3282993 2894766
13968 2894766 2870465 2950990 2986705 3017519 2930145 2820524 3038965 3178539 3009563 2954588
13958 2954588 2926136 3066264 2991337 2906584 2959038 2919517 2916259 2918048 2749288 2759621 2857313
13947 2857313 2851585 2973783 2920234 2867672 2905909 2867456 3114080 3028474 2917830 2842592 2709793
13936 2709793 2752979 2941242 2917911 2981656 2955069 2804583 3240382 3016612 2726673 2870165
13926 2870165 2966754 3071515 2868947 2739037 2859707 3036974 2833284 2877107 2926190 2953832
13916 2953832 3085443 3087470 2996194 2918674 2635726 2796142 2996304 2744513 2971708 2810900
13906 2810900 2927984 2950725 2843753 2768583 2899196 2894259 3044295 3016513 2806768 2858245
13896 2858245 2763268 2766001 2782807 2986209 2797647 2886237 2833297 2632530 2761207 2982871
13886 2982871 2773555 3093651 2986929 2742159 2749982 3013613 3013369 2763313 2732353 2800101 2851344
13875 2851344 2837837 2823769 2787678 2737935 2925257 2834649 2739209 2893404 2724901 2618466
13865 2618466 2662034 2862003 2906052 2841598 2916462 2706372 2688739 2441334 2729302 2818239
13855 2818239 2987887 3044064 3018561 3129124 3132483 3022126 2871708 2833365 2758628 2795221 2865084
13844 2865084 2977110 2870515 3279685 3072509 2848592 2848594 2960372 2909208 2699180 2936609
13834 2936609 3203720 2903008 2671937 2795377 2972263 2901990 2738793 2724044 2785259 2695265
13824 2695265 2760220 2525715 2487928 2315872 2523313 2608335 2674690 2773447 2912131 2769312
13814 2769312 2836931 2940389 2766667 2669160 2850266 2810881 2907169 3003521 3036508 3151006
13804 3151006 3246923 2930806 2790166 2936600 2847957 2807197 3036952 3310271 2996159 2803263
13794 2803263 2848660 2928130 2832718 2923409 2982146 2948644 3119352 2982606 2881302 2897457 2541279
13783 2541279 2825111 2726078 2842792 2999260 3148239 3035845 2783636 2874642 2980202 3281437
13773 3281437 3214121 3156201 3221793 3163543 2804645 2758439 2878555 2874615 2927759 3003166 2870439
13762 2870439 2635028 2956517 2705946 2804614 3001575 3036620 3206751 3008131 2823910 2873314
13752 2873314 2803045 2935397 2974539 3095667 3076262 2781002 2815602 2930623 2987177 3127993
13742 3127993 3148305 2859866 2967758 2936041 3010579 2949285 2968000 2829811 2861101 3009463
13732 3009463 3100669 3105238 3062850 2964582 2894706 3172471 3269410 3243674 3048169 2983887 2840609
13721 2840609 2746839 2738966 2734944 2731816 2788048 3042980 3111118 2985453 2910042 2871113 2890226
13710 2890226 2880098 2947763 2928397 2961538 2961813 2862015 3069255 2987146 2754062 2763023 2900608
13699 2900608 3020349 3238241 3403459 3156395 3052602 3123254 3112103 3023931 3020859 2924253
13689 2924253 3040907 3139556 2808267 2789935 2982417 3053214 3097872 3015949 3053461 2945377
13679 2945377 3140743 3126897 2814546 2695676 2665525 2787908 2818680 2807203 2804937 3050911
13669 3050911 2969932 2872384 3030844 3049438 3006982 3241978 3472301 3305767 3137876 3126659
13659 3126659 3169082 3061593 2924857 2934043 3035015 3018198 3113618 2903580 2971079 2995025 2902252
13648 2902252 2738980 2866205 2902030 3048698 3174369 3057032 3218784 3129817 3033177 3047506
13638 3047506 2997099 2788145 2549711 2555767 2854234 3012476 3057886 3203855 3141277 2835868
13628 2835868 2870423 2767447 3093802 3027718 3005095 3105086 3084088 3418377 3454354 3263326
13618 3263326 3040741 2880941 2822378 2935067 3067925 3027517 3057120 3011867 2922968 2811124
13608 2811124 3084707 3029410 2956375 3212723 3131903 3201966 3176894 3098271 3266986 3136066
13598 3136066 2907726 2997062 2827883 2707024 2795401 3102352 3063401 2893252 2950347 2850561
13588 2850561 2975670 2982392 3000592 3162037 3229881 3233282 2996406 3011019 3117971 2913561 3124766
13577 3124766 3263273 3319765 3401177 3201892 3017268 2745102 2764176 2833509 2890568 3071129
13567 3071129 3003824 3088123 2935635 2840800 2949170 2803378 2605930 3007098 3026700 3024979
13557 3024979 3114124 3030179 3009503 3281336 3186843 2828759 2748878 2778403 3012516 3180427
13547 3180427 3179196 2989169 2981658 3129462 3071076 2877860 3017905 2851602 3106558 3165099
13537 3165099 3025478 3125229 3278139 3263820 3107641 3040667 3216783 3428019 3152683 3041257
13527 3041257 3118309 3047815 3037848 3139754 3052590 3105425 3027380 2970599 2998351 3047837 2836216
13516 2836216 3154757 3145582 2966977 2987917 2977048 3053743 2958787 2832754 2704618 2861355
13506 2861355 2893580 2973977 2963249 3109784 2776931 2843769 2903445 3049980 3025569 3133197
13496 3133197 3102458 3024464 3027797 2896346 2948779 3159518 3275771 3029007 2972737 3038475 3191835
13485 3191835 3182607 3039846 3290654 3366872 3444264 3442052 3183466 3128422 3366752 3222662 3042385
13474 3042385 3155557 3025960 2898194 2960955 2696632 2862819 3159251 2973488 2908711 2924382
13464 2924382 3187595 3136507 3217872 3168341 3353505 3275018 3104913 3056833 3157604 3128581
13454 3128581 3121522 3159059 3106974 3167268 3045155 3207469 3206675 3201054 3105159 2906797 3046361
$$ [...]
##END NTUPLES=NMR SPECTRUM
##END=
