##TITLE=1H_EC-3373(II-3)
 200.13MHz,CDcl3.
 8 sc
 
 20.2.2026
##JCAMPDX= 6.0         $$ Bruker NMR JCAMP-DX V2.0
##DATA TYPE= NMR SPECTRUM
##DATA CLASS= NTUPLES
##ORIGIN= UXNMR, Bruker Analytische Messtechnik GmbH
##OWNER= pz
$$ XWIN-NMR		Version 3.5
$$ Fri Feb 20 13:45:05 2026 Russian Standard Time (UT+4h)  she@DPX200
##.OBSERVE FREQUENCY= 200.1313
##.OBSERVE NUCLEUS= ^1H
##.ACQUISITION MODE= SIMULTANEOUS
##.ACQUISITION SCHEME= undefined
##.AVERAGES= 8
##.DIGITISER RES= 18
##SPECTROMETER/DATA SYSTEM= spect
##.PULSE SEQUENCE= zg30
##.SOLVENT NAME= CDCl3
##.SHIFT REFERENCE= (INTERNAL, CDCl3, 0, 15.4703)
##AUDIT TRAIL= $$ (NUMBER, WHEN, WHO, WHERE, WHAT)
$$ ##TITLE= Audit trail, XWIN-NMR		Version 3.5
$$ ##JCAMPDX= 5.01
$$ ##ORIGIN= Bruker BioSpin GmbH
$$ ##OWNER= she
$$ F:/spectra/data/she/nmr/H-C/1/pdata/1/auditp.txt
$$ ##AUDIT TRAIL=  $$ (NUMBER, WHEN, WHO, WHERE, WHAT)
(   1,<2026-02-20 13:43:45.62 +0400>,<she>,<DPX200>,
      <created by zg, POWCHK disabled, PULCHK disabled
       configuration hash MD5:
       00 E9 B6 7A A2 85 ED C7 34 08 36 98 17 FE 4E 26
       data hash MD5: 16K
       FB 50 ED 7B AD C0 21 9A 86 AB 49 1D EB DD 45 CC>)
(   2,<2026-02-20 13:43:49.26 +0400>,<she>,<DPX200>,
      <Start of raw data processing
       efp BC_mod = 2 LB = 0.25 FT_mod = 6 PKNL = 1 PHC0 = -3702.166 PHC1 = 13.59232 SI = 16K 
       data hash MD5: 16K
       64 BE A5 61 E3 E7 A3 8B B9 14 C1 35 99 A1 AC FB>)
(   3,<2026-02-20 13:44:09.89 +0400>,<she>,<DPX200>,
      <pk PHC0 = 1.223713 PHC1 = -1.192093e-07 
       data hash MD5: 16K
       A9 A9 69 66 D4 FE 5C E1 07 C7 29 9D AF 45 3C C0>)
(   4,<2026-02-20 13:44:19.07 +0400>,<she>,<DPX200>,
      <abs ABSG = 5 
       data hash MD5: 16K
       2C 94 97 C6 BE 4C EC 9C 0F 05 82 D3 E5 7D 19 98>)
$$ ##END=
$$ 
$$ hash MD5
$$ A9 70 B4 9F D1 1D A0 3B 58 D1 7C D7 41 9B D0 E9
##$RELAX= 
##$RELAX= 
##$RELAX= 
##$RELAX= 
##$RELAX= 
##$RELAX= 
$$ Bruker specific parameters
$$ --------------------------
##$DU= <F:/spectra>
##$EXPNO= 1
##$NAME= <H-C>
##$PROCNO= 1
##$TYPE= <nmr>
##$USER= <she>
##$AMP= (0..31)
100 100 100 100 100 100 100 100 100 100 100 100 100 100 100 100 100 100 
100 100 100 100 100 100 100 100 100 100 100 100 100 100 
##$AQSEQ= 0
##$AQ_mod= 1
##$AUNM= <au_zg>
##$AUTOPOS= <>
##$BF1= 200.13
##$BF2= 200.13
##$BF3= 200.13
##$BF4= 200.13
##$BF5= 200.13
##$BF6= 200.13
##$BF7= 200.13
##$BF8= 200.13
##$BYTORDA= 1
##$CFDGTYP= 0
##$CFRGTYP= 5
##$CHEMSTR= <none>
##$CNST= (0..31)
1 1 145 1 1 1 1 1 1 1 1 1 1 1 1 1 1 1 1 1 1 1 1 1 1 1 1 1 1 1 1 1 
##$CPDPRG= <>
##$CPDPRG1= <>
##$CPDPRG2= <>
##$CPDPRG3= <>
##$CPDPRG4= <mlev>
##$CPDPRG5= <mlev>
##$CPDPRG6= <mlev>
##$CPDPRG7= <mlev>
##$CPDPRG8= <mlev>
##$CPDPRGB= <>
##$CPDPRGT= <>
##$D= (0..31)
0 0.7 0 0 0 0 0 0 0 0 0 0.03 0 0 0 0 0 0 0 0 0 0 0 0 0 0 0 0 0 0 0 0 
##$DATE= 1771580624
##$DBL= (0..7)
120 120 120 120 120 120 120 120 
##$DBP= (0..7)
150 150 150 150 150 150 150 150 
##$DBP07= 0
##$DBPNAM0= <>
##$DBPNAM1= <>
##$DBPNAM2= <>
##$DBPNAM3= <>
##$DBPNAM4= <>
$$ [...]
##$SUBNAM3= <"">
##$SUBNAM4= <"">
##$SUBNAM5= <"">
##$SUBNAM6= <"">
##$SUBNAM7= <"">
##$SUBNAM8= <"">
##$SUBNAM9= <"">
##$SW= 18.0517328524113
##$SWIBOX= (0..15)
0 0 2 0 0 0 0 0 0 0 0 0 0 0 0 0 
##$SW_h= 3612.71676300578
##$TD= 16384
##$TD0= 1
##$TE= 0
##$TE2= 300
##$TE3= 300
##$TEG= 300
##$TL= (0..7)
0 120 120 120 120 120 120 120 
##$TP= (0..7)
150 150 150 150 150 150 150 150 
##$TP07= 0
##$TPNAME0= <>
##$TPNAME1= <>
##$TPNAME2= <>
##$TPNAME3= <>
##$TPNAME4= <>
##$TPNAME5= <>
##$TPNAME6= <>
##$TPNAME7= <>
##$TPOAL= (0..7)
0.5 0.5 0.5 0.5 0.5 0.5 0.5 0.5 
##$TPOFFS= (0..7)
0 0 0 0 0 0 0 0 
##$TUNHIN= 0
##$TUNHOUT= 0
##$TUNXOUT= 0
##$USERA1= <user>
##$USERA2= <user>
##$USERA3= <user>
##$USERA4= <user>
##$USERA5= <user>
##$V9= 5
##$VALIST= <valist>
##$VCLIST= <CCCCCCCCCCCCCCC>
##$VD= 0
##$VDLIST= <DDDDDDDDDDDDDDD>
##$VPLIST= <PPPPPPPPPPPPPPP>
##$VTLIST= <TTTTTTTTTTTTTTT>
##$WBST= 1024
##$WBSW= 4
##$XGAIN= (0..3)
0 0 0 0 
##$XL= 0
##$YL= 0
##$YMAX_a= 353368
##$YMIN_a= -598717
##$ZGOPTNS= <>
##$ZL1= 120
##$ZL2= 120
##$ZL3= 120
##$ZL4= 120
##$ABSF1= 15.48577
##$ABSF2= -2.566079
##$ABSG= 5
##$ABSL= 3
##$ALPHA= 0
##$AQORDER= 0
##$ASSFAC= 0
##$ASSFACI= 0
##$ASSFACX= 0
##$ASSWID= 0
##$AUNMP= <proc_1d>
##$AZFE= 0.1
##$AZFW= 0.1
##$BCFW= 0
##$BC_mod= 2
##$BYTORDP= 0
##$COROFFS= 0
##$CY= -3
##$DATMOD= 1
##$DC= 0
##$DFILT= <>
##$DTYPP= 0
##$F1P= 0
##$F2P= 0
##$FCOR= 1
##$FTSIZE= 16384
##$FT_mod= 6
##$GAMMA= 0
##$GB= 0
##$INTBC= 1
##$INTSCL= 3.241238e-09
##$ISEN= 128
##$LB= 0.25
##$LEV0= 0
##$LPBIN= 0
##$MAXI= 10000
##$MC2= 0
##$MEAN= 0
##$ME_mod= 0
##$MI= 1.114404
##$NCOEF= 0
##$NC_proc= -5
##$NLEV= 6
##$NOISF1= 3.799351
##$NOISF2= 2.8
##$NSP= 0
##$NTH_PI= 0
##$NZP= 0
##$OFFSET= 15.47034
##$PC= 1
##$PHC0= -3700.942
##$PHC1= 13.59232
##$PH_mod= 1
##$PKNL= yes
##$PPARMOD= 0
##$PSCAL= 0
##$PSIGN= 0
##$REVERSE= no
##$SF= 200.130010279884
##$SI= 16384
##$SIGF1= 3
##$SIGF2= 2
##$SINO= 0.751879
##$SIOLD= 32768
##$SREGLST= <19F.Aceton>
##$SSB= 0
##$STSI= 16384
##$STSR= 0
##$SW_p= 3612.71676300578
##$SYMM= 0
##$S_DEV= 0
##$TDeff= 16384
##$TDoff= 0
##$TI= <>
##$TILT= no
##$TM1= 0
##$TM2= 0
##$TOPLEV= 0
##$USERP1= <user>
##$USERP2= <user>
##$USERP3= <user>
##$USERP4= <user>
##$USERP5= <user>
##$WDW= 1
##$XDIM= 16384
##$YMAX_p= 367371899
##$YMIN_p= -197990
$$ End of Bruker specific parameters
$$ ---------------------------------
##NTUPLES= NMR SPECTRUM
##VAR_NAME=  FREQUENCY,     SPECTRUM/REAL,   SPECTRUM/IMAG
##SYMBOL=    X,             R,               I
##VAR_TYPE=  INDEPENDENT,   DEPENDENT,       DEPENDENT
##VAR_FORM=  AFFN,          ASDF,            ASDF
##VAR_DIM=   16384,         16384,           16384
##UNITS=     HZ,            ARBITRARY UNITS, ARBITRARY UNITS
##FACTOR=    0.220516191357247, 1,           1
##FIRST=     3096.07925822115, 0,            0
##LAST=      -516.637504784631, 0,           0
##MIN=       -516.637504784631, -197990,     0
##MAX=       3096.07925822115, 367371899,    0
$$ Real data points
##PAGE= N=1
##DATA TABLE= (X++(R..R)), XYDATA
$$ [...]
14722 -7639 -586 17381 55803 29508 33284 34685 40187 -9483 -20947 -34816 -39898 -40070 14732
14709 14732 18465 -4750 58966 41976 25478 225 16972 38213 42503 54218 26180 23706
14697 23706 36444 46225 95845 61295 19492 68479 100514 136174 67001 21825 -23959 -21625
14685 -21625 -25404 36636 -26355 -36333 -43490 -45324 13714 -9545 -18586 -43990 -109113 -38964 -2943
14672 -2943 -48107 -23492 -39008 -20423 -3839 11862 17530 -1755 -28080 -36981 -42908 -34830 13789
14659 13789 37077 74410 73632 22238 -15763 509 31932 -20956 -29874 -44466 -12814 53271
14647 53271 75258 60478 22430 13500 -4238 6121 50351 64390 82294 5717 -16837 19917
14635 19917 26937 44179 20938 -2316 -12436 -31281 -877 312 26460 42337 39552 13531
14623 13531 73660 62860 60234 71638 12140 40330 44043 40183 952 -44316 -16288 15786
14611 15786 15016 -11052 -20832 15315 14013 25121 41684 65326 58146 21163 73940 64927 44056
14598 44056 7636 -18538 -3428 5359 41343 26138 7711 7473 -44261 -55928 -28486 46786
14586 46786 34131 54285 8305 48492 74994 -26064 -30169 -21848 50335 -4280 -22735 -23970
14574 -23970 -32337 13606 44794 59064 58190 -14611 -22784 -22420 -8923 -12611 -30119 -74682 -6450
14561 -6450 30489 20323 34548 20460 -2664 -67992 -33296 -5888 5975 18592 23373 35069
14549 35069 -44359 -2002 40399 97972 63486 30686 41670 72444 44754 43920 69507 85399
14537 85399 59865 12362 72621 43761 36995 78505 33447 26992 12995 18532 68735 103557
14525 103557 55837 19085 72750 33688 49236 29685 39847 2136 12841 28151 2688
14514 2688 -20736 -36783 -12074 -36601 -6943 12034 -37977 -35074 -21907 9552 25250 74890
14502 74890 33113 -47347 -35897 -1050 76641 108375 20515 -489 39935 12493 -13835 -32419
14490 -32419 -6186 -1512 -14534 5129 56182 73178 52012 947 15118 15413 22271 45481
14478 45481 23983 -24103 -44338 -28927 -11580 39487 37025 44645 6020 52306 55304 11511
14466 11511 25441 12218 -6168 27783 27026 19922 -7286 4493 -48697 -97374 -12461 23331
14454 23331 27958 32106 -9611 19469 33553 44741 -15293 -53926 12665 43335 73118 72383
14442 72383 52658 76279 66394 15088 37555 40686 -9302 -7035 43328 54701 85906 63827
14430 63827 130958 150880 84451 44512 68959 119922 63060 28989 11405 -22082 12339 111465
14418 111465 61346 33822 -7380 -23320 -18329 -4807 3287 9520 20096 24425 8428 -9543
14406 -9543 62990 36303 64614 21935 28549 24063 28791 38067 40451 2416 33240 37657 14682
14393 14682 23114 -33840 -36994 -27748 51439 39640 -12037 -5355 832 40784 75228 119921 34784
14380 34784 -28202 20476 55852 51163 79440 51962 54798 70791 7844 20203 5281 -18750
14368 -18750 3991 24231 -23104 5644 29268 -30098 -7099 -18049 -15714 27831 -10069 -7221
14356 -7221 -3230 -23980 -13658 -49628 -29867 -21460 -73 33074 19857 32693 77625 82276
14344 82276 76476 13184 28822 66890 60044 99665 89092 76886 34673 28958 55523 21926
14332 21926 41414 15059 -4473 85158 45701 38396 22832 -14622 -33422 18049 46329 59117
14320 59117 50547 61870 63231 -4187 -56241 -901 38785 25307 -16172 -21193 -10578 997
14308 997 36652 36657 -14049 31058 21704 12790 49484 73214 42792 11254 51776 119282 99499
14295 99499 8096 -9983 15878 37089 26363 30671 56803 38541 44222 41508 7445 87060
14283 87060 105224 34873 8952 28416 32956 31429 -25593 -21255 -7347 59331 61783 -27625
14271 -27625 -13455 -15242 14936 21475 36800 27982 -3722 -22821 26872 129297 101961 84258
14259 84258 -1009 -773 31321 26680 -7652 -17012 15002 54130 31021 91404 108871 86250
14247 86250 41268 9667 42988 87889 -30978 -56800 -6399 8175 77552 65141 59189 59665
14235 59665 35880 24124 26561 4261 9871 -423 -1559 -44271 -48350 -38722 -36912 -26368 -1315
14222 -1315 68252 79981 100367 132514 92876 81506 118364 100670 53193 8486 15359 9008
14210 9008 -8386 34208 60267 52694 17083 83699 116024 108079 50554 45330 3686 26944
14198 26944 41331 120635 52398 -23398 -44966 -35747 -29529 -41944 26347 10131 33860 53370
14186 53370 57922 55316 100222 80655 59624 7605 -3973 20077 20753 22807 116455 87642 36204
14173 36204 -23573 -53247 -67195 -37572 10509 60891 71046 19492 17178 32864 51703 20808
14161 20808 76076 119056 36441 -5654 13493 -13286 -29875 -59631 -57701 -85162 -52363 13427
14149 13427 45100 10424 22990 1618 57786 34675 9133 42273 102943 170386 97789 51511
14137 51511 91404 86327 34896 57805 54113 20454 16448 9630 -17446 -4401 58411 25361
14125 25361 18777 74695 24572 56743 82644 101857 114359 66978 42017 23774 -32901 22686
14113 22686 41296 35292 25208 -25807 -21276 -25909 -14832 40161 86196 6675 -10828 -308
14101 -308 -876 38633 69671 70845 70350 51725 45022 80294 23403 29820 -3470 -8701 31883 54808
14087 54808 80479 27810 -27258 -33796 21632 8558 -2999 61447 54946 33239 -894 -9887
14075 -9887 5793 -60851 -18492 34028 -48445 10615 16793 10917 38502 39823 -11382 29218
14063 29218 -17385 -30113 2888 3927 47272 32669 79602 16770 -30866 40863 -7177 12482
14051 12482 41722 18583 -8251 -37387 -43107 -50903 -65848 2631 14806 28574 50134 -1483
14039 -1483 78310 50251 52595 83699 32559 17386 79607 47603 1995 -9406 -3521 36019
14027 36019 100840 78488 111854 48353 24595 22846 -8220 -24387 -33101 29919 98634 78934
14015 78934 50884 37618 -23593 -391 55387 59389 70140 71520 61238 11113 -22524 -20581
14003 -20581 14153 26959 25129 78317 45325 -18055 59398 95806 73515 44880 -25568 18748
13991 18748 28106 -23214 53516 -18658 -5886 35299 -17505 -46010 -84849 -29760 -39944 -1746
13979 -1746 10975 40554 49556 13311 31148 43750 10299 848 62357 78666 62967 33861
13967 33861 -15161 14415 6897 36706 3006 59 -1275 61522 59200 37032 45474 38688 33689
13954 33689 27028 63914 93022 73391 30348 29408 90303 32803 10167 51808 12505 44254
13942 44254 35903 49583 15114 6329 16289 -15623 -26477 23746 43702 43861 97044 86356 41734
13929 41734 71146 119429 35144 -81718 -44308 -83273 -114487 -62263 2845 -47427 664
13918 664 -5965 39697 41772 40941 32421 -36566 33770 80478 72795 19230 48855 10470 -12970
13905 -12970 -32403 -2612 45146 112825 117263 81954 40191 42681 52635 80512 40956 45108
13893 45108 5977 -27732 7370 44023 68448 51387 -10904 34546 47053 -4390 50291 74722
13881 74722 38852 2543 -36859 53085 76028 12549 25541 4020 14858 -29962 14581 63233
13869 63233 105259 101098 36496 10403 23861 20918 61048 96794 60433 42375 85117 56180
13857 56180 -2753 24446 87206 65009 45047 -70877 -75647 -5589 46585 46634 80338 68824
13845 68824 -6775 -3501 -10915 16495 9907 41381 3145 -33550 -35532 -10012 22420 52135
13833 52135 96642 62212 15775 33052 10135 28489 45175 -44030 -61517 -18364 -6427 -3473
13821 -3473 18808 60491 72352 79361 63897 16860 26222 3103 -11815 17654 -35844 -105148
13809 -105148 -65323 -41775 -22913 42480 19622 33381 22929 -10929 -53949 -15324 1733
13798 1733 -24456 30896 33283 72920 74910 85562 97787 62013 88514 51943 57825 63645 97133
13785 97133 111637 62672 19869 27644 84193 62420 47483 49602 29073 23474 44235 -18312
13773 -18312 -12399 32785 73149 31363 -25173 -6399 -24224 -34083 -24169 -6029 164 -16065
13761 -16065 15671 56603 16552 -77894 -37136 -23759 24918 25584 -11627 33555 36741 15602
13749 15602 15161 -37509 10423 33612 -11852 -20559 29423 55397 51003 15230 -68462 -38505
13737 -38505 43710 20625 -272 68016 25237 -56880 -58676 -3389 -37943 -6808 16265 17719
13725 17719 35530 109052 57277 16282 41506 27230 -58931 -4714 -4090 -38846 -14989 4917
13713 4917 34039 22421 92979 107281 49097 39581 16518 65335 46953 42123 86560 78998
13701 78998 105332 97958 30860 8940 -6672 -61347 -46632 -69410 -25015 33438 65092 28079
13689 28079 -7100 26647 -19631 -38143 -32442 14750 -4749 1867 43885 -19618 -69695 -25967
13677 -25967 -16683 -17263 -39104 27525 16244 60404 79084 9938 -42788 14222 16662 -15927
13665 -15927 21178 -35188 -43302 -33513 18310 -59650 -18060 -49921 -4076 40805 40732 27960 42088
13652 42088 9341 63391 75807 75725 84751 81965 61306 47580 65980 -1837 -63498 -21641 3146
13639 3146 24402 -2885 -49685 -66985 -7094 14868 -52771 -2582 74785 143700 114998 78964
13627 78964 13468 23440 42554 58844 53027 55448 43177 29829 4188 44377 452 -95014
13615 -95014 -8105 6270 32091 62023 66000 3687 -56625 -34925 -10377 35841 76717 53347
13603 53347 27314 10103 -9604 -6888 -27475 -70113 -45951 -11007 -16907 -35661 -21090 23843
13591 23843 44747 24213 33474 100337 142673 55199 20281 71992 31147 35546 42229 62108
13579 62108 34942 436 48931 14776 -22501 -15881 4446 30199 41106 51113 46548 55999
13567 55999 5082 18865 24093 46241 105931 142883 60316 -24553 -28029 -19378 8020 3453
13555 3453 29244 52594 32074 -69738 -54230 -37730 -16414 10457 11109 54518 48887 13659
13543 13659 13539 23706 -17752 -24278 18429 38292 5808 80813 93870 75458 36721 8373
13531 8373 7899 24520 18695 9313 -42853 -9526 36629 18190 2604 47662 54917 23145 15316
13518 15316 45645 45283 53574 116154 77975 27407 796 23755 43802 13298 -7601 -12506
13506 -12506 55521 102851 38367 -33037 27168 63100 -15074 7358 43890 58140 122420 50539
13494 50539 -12331 46254 75088 8852 -44973 22170 42079 61218 25895 62243 52932 34128
13482 34128 7640 -6592 58498 51989 83759 25114 -14421 17682 -7036 66777 47413 53243
13470 53243 31374 -6319 12076 915 -45800 57305 74947 30717 56190 11368 -7532
13459 -7532 -10182 23332 -10276 -24402 -15159 9070 -36334 -25361 49933 41173 49181 98521 103254
13446 103254 52401 40808 34710 14905 -13757 -20969 -31712 -9675 -10525 50735 65688 43763
13434 43763 11403 -18752 3665 24275 39502 55485 72387 37898 -9245 -5328 10090 -10496
13422 -10496 14333 35673 62817 12523 -11730 48582 91532 65677 -9606 6722 54597 77207
13410 77207 46096 75031 79862 -4178 12103 26589 -32988 -48407 -35088 -63049 -69009 -22028
13398 -22028 -45450 -48303 25323 97734 44947 65932 78713 49338 13609 60368 82583 -6008
13386 -6008 2386 2309 20268 -14425 36364 5655 -8119 -5486 48963 61626 37675 10007 3298
13373 3298 -7808 -15839 -41019 34121 55545 -3451 -4487 22266 9757 42982 21489 -62512
13361 -62512 -22340 -75485 -14143 -25000 -14553 -26493 -45891 -45645 -20060 4695 5398 36128
13349 36128 32291 19451 -9784 50549 34150 -1339 36554 11291 -10697 17635 16550 50215
13337 50215 29648 36742 -15043 -39504 -49778 -54953 -69656 -59580 -10880 -197 38554 -20323
13325 -20323 29916 19270 -29725 -40667 -13725 -40944 -59278 -9977 -44390 -21645 -31099 -58266
13313 -58266 -28459 -56938 -80591 -18856 28351 19575 -48859 -69610 -28316 53944 74472 68023
13301 68023 66618 36270 22182 27892 46676 31456 6267 6338 2439 18574 27972 -20121 14730
13288 14730 70684 94604 -8683 -8340 -12863 15838 37390 61808 80214 36021 15396 -43223
13276 -43223 19969 -4127 -22805 14762 36291 54761 -18187 -70009 -13764 -9807 10219 11909
13264 11909 16073 -10505 -27362 39100 1859 -11657 -26125 -3544 44625 33804 -22272 -22919
13252 -22919 -71898 -29566 -14673 -47314 -33470 -47257 -12821 -8035 -15666 -58622 -55777 -74697
13240 -74697 -87763 -60783 -27638 6148 42043 41691 87521 74428 17734 -34752 -13355 5768
13228 5768 -13436 -39578 -23899 -7934 -34849 -14204 13787 50176 38244 26698 23445 -43594
13216 -43594 -70195 -34726 -101887 -35597 89127 51501 38302 52768 33162 -1387 13277
13205 13277 64828 58351 -7387 -3318 16802 37363 28093 -7133 -43089 -14922 -3958 -16234
13193 -16234 -38748 -21381 30059 53154 11723 -15859 -13174 -68199 -10087 -56757 -92196 -65449
13181 -65449 -49589 -37272 9081 49251 38754 37071 18036 49584 63953 -6768 60853 70346
13169 70346 20547 -8239 -21804 -20267 -20318 -70482 -65621 -42558 -32911 -64424 -39003 -60508 -47696
13156 -47696 14870 -17632 -42779 -69154 -90769 -113039 -50159 -63837 -47236 -36451 33406 32642
13144 32642 -25106 74788 62111 38130 49352 31132 18403 17858 37019 8753 -13665 -30248
13132 -30248 -14281 23196 47266 -15251 -5456 121 -25230 -49015 -44373 -40000 21125 32467
13120 32467 27445 37492 50756 -21699 -56335 19842 17507 16415 7459 9841 -31290 -15797 -25611
13107 -25611 -7428 14539 48120 65214 31627 25182 72970 103233 64984 15682 -11653 30512
13095 30512 37880 16818 -24503 28243 -12658 -29683 -38010 -31085 86024 28107 -10093 6371
13083 6371 6167 11829 -2112 2637 -22049 -10045 30528 17296 -49312 -34565 11693 31525 51076
13070 51076 17973 4071 62 19459 60248 57516 116818 24478 -10934 17242 -15331 5717
13058 5717 -61204 -27061 253 36571 -22960 -29270 -7359 2128 -7716 -26571 -34094 35803 17700
13045 17700 -19661 -41074 -12996 3676 47923 101651 95369 103789 50874 -13681 -56116 7330
13033 7330 21218 -2462 31658 21235 3797 14353 25074 61203 67102 53951 -10017 -16171
13021 -16171 -55192 -22725 -94142 -147414 -99078 30377 88819 34762 -17063 -15380 -46514 -74243
13009 -74243 -57962 -29603 25884 38007 29189 -22279 -40539 -6537 31017 38873 71143 59420
12997 59420 -10517 -29450 -7678 49336 65620 61024 64905 35399 -33946 -27912 -28028 -7076 -4026
12984 -4026 15233 21965 -83606 -61674 -54176 -31046 -9275 -80342 -80104 -14184 -52324 -33829
12972 -33829 -38159 1858 26603 56191 98139 66297 -25819 -34566 -3236 16708 22121 41234
12960 41234 4121 -18543 -13566 -95114 -58151 -30971 57838 21265 -8428 25750 20792 -42814
12948 -42814 -63023 -62769 -1032 20543 -23788 20431 -23374 -16955 -29138 9167 42146 35568
12936 35568 13284 -32638 -43158 -24905 -44426 -38489 21392 87229 66434 32313 30781 -883
12924 -883 -26841 -4273 19624 -24405 -77748 -46536 -48675 -53681 -56718 -63060 -52737 -40376 -18506
12911 -18506 65 21051 -33359 -43935 -26196 -60535 -77900 -84065 -19604 45638 60150 9246
12899 9246 27999 46346 53265 115581 44743 16459 38011 -24966 -47158 -64890 -89601 -62589
12887 -62589 -59197 -23632 -13026 -51986 11616 26167 -11678 -19469 22721 12436 43572 47543
12875 47543 32352 33271 25013 44288 48721 72484 61086 49138 -2261 12824 22284 60616 1932
12862 1932 39915 32026 -9498 -33721 32950 54987 86917 48126 -55959 -29160 -1592 -30891
12850 -30891 -11511 5218 -8185 -28831 -94349 -62507 -40972 -18643 -20568 -17196 17996 -4010
12838 -4010 23199 61369 22649 -8139 -10189 -56518 -16130 -5433 -13363 -92469 -72057 8539
12826 8539 36311 122187 38051 -12441 -4796 11218 94333 2257 -44724 43007 62571 88519
12814 88519 9698 -21957 1527 31423 60 41758 -18340 -3874 37197 34787 -15831 -5513
12802 -5513 33944 -44805 -11882 25979 -18628 -27377 40866 65998 -14408 -47618 2832 -12655
12790 -12655 -9018 -23011 -12558 28369 33055 -27549 12265 20 -21569 -13816 -74314 -24231
12778 -24231 -4117 -17652 -30713 42954 86333 9749 6622 -4165 -61352 -10697 8657 -47249
12766 -47249 -43176 -23394 -5607 -15904 -30307 -16987 -34682 -27546 3722 3511 -31081 -9160
12754 -9160 -21850 -36889 -51048 -3738 -33307 -17660 18130 -26512 7651 28929 -8626 1768
12742 1768 24340 -30041 -67260 -17850 34096 38537 -45351 -103982 -37481 -45210 -28973 -35389
12730 -35389 14265 -4384 -3947 -865 -11522 19823 13851 32138 26289 -19728 9799 24156 29682
12717 29682 -21597 -56488 -54706 -54122 -17014 -2967 -30766 -22836 35302 -44991 -49706 -56634 -73339
12704 -73339 -24514 30639 36825 12148 -46721 -65902 12881 44181 24360 3149 -17221 -56812
12692 -56812 -43123 71900 39353 22294 14312 35995 9418 37843 6572 -4155 -30283 -42794
12680 -42794 4311 -88283 -106827 2388 79173 53137 41656 34999 -8677 -13736 -12671 -33850
12668 -33850 -10700 -3197 -18066 -59439 -76686 -45626 -29641 -12129 -22521 -55222 -21989 -16452
12656 -16452 -8502 -25781 -22026 -40051 -17394 -31362 -16417 -49703 -46550 24448 64332 22842
12644 22842 39042 30018 -4099 -29151 6959 -5704 -42649 -68297 -19835 28385 -47562 -49293
12632 -49293 -13075 -37050 -79514 -62598 17329 -16959 -32872 -70118 -69124 -63511 2677 -13845
12620 -13845 -124950 -148577 -100287 -70099 -65023 -26575 21681 -38093 -81472 -71044 -22732 27031
12608 27031 -15273 6886 10783 16530 37640 31495 88928 29790 -21446 11508 -19011 -33194
12596 -33194 -27763 -17631 -23105 32145 33821 42799 17821 -28642 -24753 35819 24028 10100 11476
12583 11476 -603 -46309 -28237 -34848 44242 40067 17917 -4285 37911 -41039 -55172 -61806
12571 -61806 13527 -7515 -4082 -7878 -1050 30731 -41684 -40028 -8325 -8297 3217 -8844 -60463
12558 -60463 -58639 -68905 -34283 7834 -6767 -31451 -26041 -20259 -8474 13 12410 -27548
12546 -27548 -11515 6083 -68976 7912 46454 -52424 -35283 -7927 9884 -15113 -24148 16034
12534 16034 55070 -5903 -23410 -31154 -66760 -64051 -8406 5880 22664 27461 -14557 -13741 31807
12521 31807 -80145 -91449 -63350 -77168 -40913 7847 -26262 16450 11196 75232 150396 121706
12509 121706 29086 -29436 -26364 -36726 23047 3420 37215 23471 22247 88805 72359 21377
12497 21377 -144 -14046 31257 24966 41748 47607 55820 19913 852 5892 -61878 -17659
12485 -17659 3227 8718 -4951 12581 4427 -43536 -41306 -11652 -17817 40664 47623 39175 6787
12472 6787 5644 2927 -24485 6189 -1448 -12996 13448 21585 11483 14102 68598 85296 60302
12459 60302 4156 19064 -21668 -65989 -37438 -28884 -11239 -66549 -41430 -81514 -43067 -24475
12447 -24475 -26312 -27698 -36339 -39552 -72218 -85124 -37224 -30891 -36608 -831 5322 -43353 -19518
12434 -19518 13521 -6093 -5205 -33933 -96421 -116340 -63357 -10580 54462 32163 12180 13724
12422 13724 1369 1326 -62464 -67633 -49631 7456 15400 -29496 -56216 -5525 46994 9279 -20470
12409 -20470 -27847 -12773 15259 -40981 -17292 13375 46463 92420 56908 44072 -21988 -45897
12397 -45897 -26940 -19210 -36470 -9178 2235 8990 4566 -17041 33512 -27833 -21003 28931
12385 28931 -24175 -26738 -7225 40514 38998 36548 38378 -34019 -43777 31570 87114 59164 -24249
12372 -24249 -24244 12869 -7228 13132 -17632 -16683 42006 -36061 -71462 -73045 -5491 12812 -6169
12359 -6169 -39664 -44490 -12327 -24431 -15527 -23618 -13423 -5889 4788 35833 53197 49542 36735
12346 36735 -15091 -3039 39079 65671 76598 31207 32754 -26303 -42499 -40279 -12785 -6378
12334 -6378 -36439 -4161 59497 52370 28002 27595 7572 11697 -5540 -24598 10400 46248 6598
12321 6598 3006 2177 -6588 -196 26972 35256 38691 26458 -22520 -32192 -17434 -42522 -25670
12308 -25670 10381 -25026 14461 -16224 -35309 -31875 -29651 -5481 -4093 17032 -32159 -21290
12296 -21290 2111 -6229 34401 13631 -58937 -32530 -39562 -53415 -56753 15293 16554 -44067
12284 -44067 -62910 35852 37383 -5291 -32214 22364 -13413 -47471 -75275 -80942 -20831 -66288
12272 -66288 -94422 -147063 -66693 5063 -4868 -70759 -54136 -80735 -59974 -84134 -90097 -100983
12260 -100983 -101645 -51406 -73403 -46671 29434 69562 88754 25025 -19257 -28960 -52652 -57073
12248 -57073 -75104 -30929 16722 66911 14253 -24786 -58480 -11366 19705 12030 -23498 -36765
12236 -36765 21051 21225 -15972 -3611 -4817 23509 11157 17305 95121 13963 -3117 -21995
12224 -21995 32108 -4416 -69413 -83564 -60981 -61745 -33441 -410 -52357 -10308 -2817 3379
12212 3379 -6249 -47082 -56803 -54451 416 22123 2858 -17969 -19429 -43553 -112983 -15434 -49190
12199 -49190 -68068 -53153 -23372 -14729 -62176 -73257 -64962 -40099 -81807 -49231 -62079 -27129
12187 -27129 -84637 -55535 -16244 -10442 -13254 -38880 -31069 30186 48991 23517 -11990 -77247
12175 -77247 -45850 -39488 -89929 -53615 23373 44917 23325 -19538 7699 8446 -22095 -55621
12163 -55621 -21325 -10539 -31976 -56626 -502 -3303 -32275 -42634 -54361 -33660 7906 -10102
12151 -10102 23314 22426 51004 -2418 -24861 -43307 -32623 -33774 140 59507 14934 4897
12139 4897 -62183 -17582 24676 -23999 705 4662 -47305 -54497 -108137 -65956 -4941 -19099
12127 -19099 -86647 -69120 -27276 -15952 -73634 9646 74933 31375 11678 10276 -56653 -19406
12115 -19406 -15972 -26119 -14066 -50293 -65194 -5642 47115 -1396 -24543 -24000 46341 -7677
12103 -7677 12050 -3975 -40333 4067 44481 46754 -6733 28498 57051 -7006 -50200 -26301
12091 -26301 -58911 -72292 -121077 -38016 13397 -22362 -50275 -118599 -71526 -20895 40858 86596
12079 86596 31494 -49463 5398 60020 84771 76396 56900 26136 -20834 -64838 -49503 4611
12067 4611 -42227 -41279 -48620 -46854 -48086 -68672 -10093 33536 29768 31076 8760 -19547 2600
12054 2600 23229 35149 -37631 -43009 23642 40226 38975 -11024 -18525 14810 9813 -35899 4053
12041 4053 32838 5546 26178 11286 26352 28470 18485 38780 41007 29121 -28511 17825
12029 17825 36234 -19296 -122935 -142399 -82866 -86073 -51633 -78679 -80093 -51648 49544 8136
12017 8136 -11540 20564 -14629 -52693 -47266 12805 1602 9165 48267 35170 -29673 -41219
12005 -41219 -15328 -9250 29239 16064 12999 2537 32858 11787 -5087 -12017 -10220 -13506 -48477
11992 -48477 -57773 -63029 16457 57245 113 -2603 -30423 -3054 32444 -2701 -14934 -49572
11980 -49572 -34553 2560 17367 -27741 -22955 9387 -29869 -72890 -46219 -41994 -44781 -32350
11968 -32350 -7167 -93403 -91219 -63388 -13773 -32149 -30333 -80322 -81776 -25410 -9272 -854
11956 -854 -9252 -53311 -48700 52215 63180 -20910 -67753 -41018 -84006 -20375 5233 -2532
11944 -2532 23241 -34410 -60682 -42193 -14863 -43685 -26093 31184 -10356 -30204 131 26937
11932 26937 -2483 -42816 -69545 -86339 -65428 -28490 -40629 -45522 -6369 -4552 -30181 -12639
11920 -12639 22755 -24509 -41116 11306 -24888 -57605 -27141 11769 28816 43912 11090 6863
11908 6863 3277 39092 46222 47814 32130 -19447 -31507 -27489 -50800 -76656 -96017 -81442 -61567
11895 -61567 14261 -17943 -34489 49284 13171 27019 -41396 -14843 13343 -36768 31787 49034
11883 49034 40781 42610 -5408 -23932 -9792 -57307 -101156 -47788 -29090 -26971 -25589 -3559
11871 -3559 -20181 -9922 -18148 -11556 40523 -20335 -16091 -8908 -86552 -84140 -62699 -15248 21810
11858 21810 25084 15444 10075 23377 -12780 -14781 -11542 29952 57703 68107 78729 16549 -8610
11845 -8610 -97909 -3740 -18529 -36726 -17442 -26444 -7985 -24977 -31864 -1058 28764 35491
11833 35491 -10328 -11483 -14044 -43313 -36278 -49573 -69754 -119749 -46344 8231 96018 69819
11821 69819 59060 63635 344 -59738 -24917 -17011 -22848 -83407 -25371 -16996 -36 35536
11809 35536 53569 32082 -1433 -17623 -20564 33733 52636 25372 -2392 41230 83374 66766
11797 66766 11651 5419 39876 21320 79932 36625 -15753 -1000 -24596 -38158 -19472 19574
11785 19574 26216 8334 25475 20794 51193 53941 -6866 -11982 18181 10399 -4913 6151 10825
11772 10825 1 -12622 -12973 -17840 35080 -61551 -53189 -58762 -41159 -17327 -50065 -112277 -11241
11759 -11241 8364 -36383 -10737 27910 3449 -7302 14343 -8258 -24278 -6602 -19675 19971
11747 19971 21716 -44216 19702 15769 16823 -33919 8292 21515 6353 5522 -24107 20439 -8540
11734 -8540 2358 -13628 -29015 -38246 -75531 -6860 41708 116751 41928 44669 124131 104376
11722 104376 100197 49812 59115 103238 154603 81867 40402 23936 29557 12930 61883 42895
11710 42895 -17776 10984 3753 20553 -9043 -32246 -6776 45565 43155 40880 66665 80442
11698 80442 53629 15245 62224 20620 47150 95524 67274 127179 165570 97102 112685 131665
11686 131665 141531 146892 98427 141376 134943 110845 71167 69405 96168 161431 100542 125059
11674 125059 105961 110611 99946 59156 41849 85620 87627 101516 136846 138170 209601 171593
11662 171593 149548 164862 201324 174999 206775 148229 165604 180887 208274 206372 211228 170220
11650 170220 187397 256110 252029 194915 262764 269373 185398 241040 278969 312684 344797 279519
11638 279519 207403 210010 235154 254683 286213 293396 277722 332489 296078 330121 370014 333437
11626 333437 250502 289688 281202 330602 316502 329944 339345 342337 360273 393051 394774 347182
11614 347182 324466 354389 307246 296736 321457 352347 359784 377727 355722 341594 346277 288651
11602 288651 303779 301557 299361 286885 283089 287531 257766 281786 274744 238155 238457 252353 258749
11589 258749 195272 225022 280153 301946 281001 242541 184578 236669 264042 213147 176897
11578 176897 163762 102802 189005 243531 269401 268354 182302 165934 208966 133087 143842 105819
11566 105819 90412 62338 139643 223079 175062 167418 181760 189728 135189 99294 115714 155758
11554 155758 153452 106911 104501 114465 76663 71102 82538 114276 80666 106108 122623 144385
11542 144385 109977 72751 62139 46387 22836 16678 36991 108569 131281 116734 98830 77410
11530 77410 42057 17344 9046 16708 43568 5108 70314 17574 25842 42637 -1162 16428
11518 16428 -35603 -10011 -24008 -44154 37963 62491 74814 35822 -1565 -83026 -49113 10736
11506 10736 -3143 -23664 40545 110045 87568 93303 14707 89351 43282 50869 84312 51699
11494 51699 82443 39918 -18327 62787 86594 127690 93214 7149 -13259 39644 42274 4330
11482 4330 -16029 -8537 30557 -17220 14581 38315 84348 47481 -12756 29314 30751 36553
11470 36553 7091 -22709 26111 28170 -30913 5308 52587 37904 3257 22819 44066 94283
11458 94283 38403 17173 6876 -45273 -6414 -47673 35159 76937 45216 -23562 -67893 -26821
11446 -26821 -9601 -12229 -2166 8535 25664 53831 50790 69172 88514 46439 -37202 -82359
11434 -82359 18369 19848 -7673 -30334 -39317 -33870 18820 91615 47171 -13584 -29 30353
11422 30353 26598 -11456 4165 42685 -12902 -507 34127 21227 -8234 -1533 -29797 -22901
11410 -22901 34308 41895 15872 -2175 40169 19561 11421 -34126 -31676 -4378 3878 40434
11398 40434 99524 55336 29554 67199 46065 104820 90089 38530 39949 52324 50045 75913
11386 75913 121673 70186 47908 70559 86745 26171 22133 1129 -38451 67792 83310 63070
11374 63070 134150 128115 120984 106122 84527 43746 74452 49414 72816 51528 33990 34446
11362 34446 5327 58445 -17367 18992 19648 -5076 36813 33852 4955 53556 -1141 -27539
11350 -27539 -45861 -37084 -13698 32452 33095 50875 93795 63154 13597 27781 58698 70789
11338 70789 102593 100562 89909 -7108 -16040 2671 59264 94064 55128 77574 64231 6437
11326 6437 50 17478 20750 96997 70897 -2072 -41492 -77646 -78516 -1653 8568 -38350 -41254
11313 -41254 41440 78323 55676 15610 89772 116222 82313 20181 74975 89903 27109 110506
11301 110506 127754 107244 77142 83619 108331 83131 46814 -16481 -3889 55287 62704 85908
11289 85908 95354 95087 130316 88292 67328 103392 54857 44045 39578 96701 112885 66413
11277 66413 39593 45209 113468 173826 123621 161832 139921 139996 90785 72845 84211 27243
11265 27243 5046 26421 11993 6605 47604 49719 29926 97496 97952 110247 114808 109784 53176
11252 53176 10516 4511 -9389 20260 29977 92858 65545 30332 7013 2139 52641 18818
11240 18818 18169 -17058 24105 51986 24441 19747 -16275 22591 18578 20102 46621 68591 -1894
11227 -1894 -12675 -18413 -36708 -1490 -26401 -16923 -4197 35734 30465 -15068 -48785 -68642
11215 -68642 -5826 -14276 21972 -2681 -14476 -94 -11480 -68608 -51280 -65441 -118272 -124701
11203 -124701 -37422 58542 55438 -639 14271 10468 -29230 -26417 -23378 -83740 -72507 -45734
11191 -45734 -29166 -62054 -59481 -30275 -66474 -96368 -38016 -37976 -43086 -29269 -119534 -73039 -74299
11178 -74299 -78009 -55763 -42923 -103649 -105461 -76461 -53360 -45285 -65052 -60442 -86548 -139626
11166 -139626 -99827 -14615 -8446 -31965 -39203 -48543 42754 1072 -22002 -41976 -12419 -29327
11154 -29327 -50918 -51140 -114468 -128761 -124588 -36889 -27071 -18376 33211 26010 -59583 -74386 -61252
11141 -61252 -34404 5032 14948 -27931 -20047 46915 -13429 -22084 -7304 -20855 -17170 8683
11129 8683 3547 -32712 -31714 -36575 -51000 -19505 -32228 -44611 -73751 -39071 -39352 -50033 -53415
11116 -53415 -108596 -58369 -16789 -60736 -54345 -51101 -50145 -36633 -93253 -105828 -72445 -67703 -91537
11103 -91537 -57892 -85922 -42425 -28165 -29555 -42621 -27327 13197 -39470 -126831 -54333 -47154
11091 -47154 -83205 -68013 -57326 -42011 -56093 -65921 -26371 -14895 -58697 -13458 -15697 -46931
11079 -46931 -76288 -34647 -52304 -61080 -37969 -73402 -14196 -10956 -39977 -49079 -32741 -48686
11067 -48686 -26570 -47507 -88265 -68076 -63910 -85183 -92219 -114137 -87499 -40517 29909 14684
11055 14684 34153 34918 -14680 28938 11873 9818 24482 -58972 -94615 -49383 -73250 -49354
11043 -49354 -60993 -64943 -111393 -88386 -60411 -84028 -123935 -115985 -21350 -68752 -117294 -34226
11031 -34226 25891 -20693 -84467 -129815 -92429 -59126 -64402 3676 -45740 -59291 -43750 -72084
11019 -72084 -89158 -104272 -68941 -41094 -52766 -62870 -102563 -96405 -29450 -68437 -22873 -50379
11007 -50379 -82585 -80334 -96161 -88219 -95393 -107649 -47916 -22639 -27834 -85544 -102145 -36829
10995 -36829 -62941 -130483 -114095 -95034 -125504 -64502 -59292 -29149 -6656 -64455 -4748 -47032
10983 -47032 -64032 1401 -47003 -51762 -49298 10372 -9047 -4026 -3176 -52033 -77021 -141791 -98538
10970 -98538 -44165 -98437 -48180 -93297 -59066 -25437 -69805 -60457 -37070 -42646 -93067 -109524
10958 -109524 -143064 -193756 -132045 -37872 -17121 -66327 947 -49221 -46431 -54988 -19150 -26706
10946 -26706 -63421 -122104 -131350 -90253 -71341 -80151 -115738 -100338 -55891 -6143 -78499 -70145
10934 -70145 -49195 -46276 -104630 -104598 -44611 -87235 -57913 -96463 -117486 -125595 -135421 -76814 -59151
10921 -59151 -67573 -110961 -106097 -147036 -124973 -105207 -31231 -82225 -112673 -54668 -92565 -144559
10909 -144559 -93458 -96033 -98633 -75890 -53676 -85396 -68065 -47077 -65334 -78317 -43216 -92206
10897 -92206 -29248 -58809 -65951 -55656 -59648 -58105 -71876 -78998 -81980 -83856 -105594 -47031 -73816
10884 -73816 -65878 -85836 -105815 -105896 -103994 -94825 -84800 -13468 -8680 -77444 -107615 -136395 -99336
10871 -99336 -88320 -117496 -79398 -76953 -84926 -122055 -81844 -83256 -54366 -51190 -76341 -71618 -51233
10858 -51233 -68505 -109155 -127888 -91066 -102678 -95370 -95146 -120299 -46670 -105962 -42353 -88739
10846 -88739 -113157 -88197 -78791 -58359 -86697 -59353 -164041 -179188 -111093 -85668 -80109 -54846
10834 -54846 -24641 -73722 -89865 -62812 -63226 -71809 29606 1403 -43151 -152924 -93486 -81635
10822 -81635 -105574 -153037 -105848 -114793 -162439 -67017 -54787 -75657 -68881 -103521 -41359 -22902
10810 -22902 -97131 -102474 -65867 -66956 -49575 -11960 -65424 -104493 -99674 -31899 -22019 30475
10798 30475 -8478 -13056 -25308 -38622 -78756 -96606 -102929 -110372 -133487 -63286 -50267 21941
10786 21941 -48349 -119910 -78616 -68327 -73003 -72162 -94614 -120096 -117651 -140459 -94616 -82289
10774 -82289 -107554 -110880 -84570 -64847 -52594 -43794 -78190 -97201 -48112 -105284 -117111 -48604
10762 -48604 -42027 -66516 -61344 -74774 -143705 -137704 -142885 -192549 -133949 -67640 -149971 -140230 -114182
10749 -114182 -119565 -99201 -73298 -89583 -84193 -71084 -106996 -64820 -104388 -116165 -76362 -81768
10737 -81768 -102896 -136891 -168237 -123481 -165551 -158006 -168709 -136739 -189984 -127742 -158054 -109321
10725 -109321 -102961 -70542 -25683 31985 36134 -25907 -81095 -110700 -77806 -149551 -90203 -29424
10713 -29424 -75777 -111137 -80015 -102058 -139560 -92196 -119119 -89659 -4817 -51900 -56455 -16008
10701 -16008 -19201 -42469 -24652 -13639 -76292 -141398 -118245 -95340 -89003 -62181 -73587 -137087
10689 -137087 -123591 -72764 -45451 -35238 -77039 -60587 -66032 -108144 -62072 -72792 -116913 -117954
10677 -117954 -79006 -61833 -44303 -13052 -1440 -68696 -69018 -109761 -101707 -84790 -94852 -73020
10665 -73020 -96240 -73555 -48665 -92906 -78549 -65875 -51029 -57662 -20444 -85363 -113056 -118435
10653 -118435 -82554 -63313 -77815 -79588 -14571 -2051 -54740 -40710 -67636 -172017 -150815
10642 -150815 -130669 -125140 -86301 -126885 -81670 -85468 -87852 -92695 -133257 -134892 -134625 -97901 -122161
10629 -122161 -98041 -154100 -182357 -182328 -131619 -112574 -126161 -120130 -97393 -85814 -110303 -131249
10617 -131249 -87261 -72596 -66181 -74033 -41915 -61047 -33234 -74807 -97071 -36084 -58908 -47924
10605 -47924 -60242 -87069 -110407 -50964 -13862 -22792 -93678 -109061 -111500 -67341 -76722 -89222
10593 -89222 -41963 -50702 -66856 -69199 -54122 -57746 -105770 -79937 -109106 -161425 -170015 -112440
10581 -112440 -100922 -84605 -135154 -162137 -84299 -42584 -37758 -55210 -80560 -13861 -61341 -95739
10569 -95739 -72802 -55065 -94475 -64209 -63655 -103385 -137156 -77801 -88950 -69955 -127999 -161027
10557 -161027 -176134 -165358 -124950 -117223 -68393 -122114 -104257 -104992 -130444 -109024 -128884 -103146
10545 -103146 -68530 -104197 -141843 -139085 -108426 -100688 -80220 -44903 -35139 -60916 -80888 -81372
10533 -81372 -44812 -39470 -116664 -125012 -115031 -88430 -121270 -170358 -137030 -69557 -64985 -116323
10521 -116323 -159509 -167156 -100287 -76069 -41493 -32699 -2486 13134 -47056 -67595 -76787 -101354
10509 -101354 -120856 -77250 -90623 -85706 -84991 -81925 -102193 -112128 -91079 -70505 -68149 -120786 -67747
10496 -67747 -94059 -85454 -71499 -93863 -119112 -144326 -156885 -151844 -77941 -101146 -148753 -101707
10484 -101707 -154321 -111439 -25145 -1056 3777 -54059 -66228 -88792 -175529 -136898 -86645 -103344
10472 -103344 -132533 -133140 -98686 -91977 -150728 -136662 -180138 -129346 -67488 -97578 -131939 -119498
10460 -119498 -132475 -57189 -55161 -170066 -66425 -41872 -58733 -117286 -92879 -96315 -96796 -41317
10448 -41317 -55040 -54458 -68713 -68689 5558 22383 -51433 -11852 -43333 -69298 -66756 -53376 -65371
10435 -65371 -101829 -98260 -62354 -73452 -63422 -102100 -86288 -74463 -29110 -79820 -129793 -112322
10423 -112322 -170111 -148870 -108783 -143974 -136456 -76170 -78952 -61180 -127558 -156751 -146320 -141760
10411 -141760 -85655 -69886 -33029 -5304 3314 10055 -75366 -92644 -94145 -137128 -170075 -97409
10399 -97409 -89427 -133237 -116684 -35433 -12588 -31408 2247 -29685 -28160 -112559 -93527 -61222
10387 -61222 -36868 -52980 -57971 -112906 -80997 -45576 -78013 -88491 -54852 -107485 -90112 -44182
10375 -44182 -39787 -77626 -76218 -24741 -24883 -55246 -41058 19967 -54726 -77352 25808 119224
10363 119224 57249 92140 52307 5609 -1098 43252 -15691 -55273 -60529 -46574 51501 31710
10351 31710 12176 28178 1907 7538 -46098 -40641 -44103 -46466 -63834 20707 11648 12854 28518
10338 28518 38230 55576 59516 20085 -12791 1209 46596 55729 71827 42313 7142 28879
10326 28879 67424 743 85251 87336 9731 32807 43875 -66623 -43679 14079 46379 -1249
10314 -1249 -36960 -10279 -96727 -129370 -64780 -7476 -39335 -12078 -1092 5998 -28791 -85750
10302 -85750 -13938 -23878 -11960 1488 -29277 -18572 -38644 -16833 -11811 51937 10306 32476
10290 32476 -22351 -42857 -44482 -38083 -21113 -29305 -98792 -104370 -60488 -65199 -101942 -86144 -34965
10277 -34965 -27675 -24789 12377 23395 -31396 -86499 -82379 -137694 -172317 -90013 -38048 -68017
10265 -68017 -75661 -57973 -61727 -31257 -7975 -31695 -84081 -117793 -113119 -48764 23825 14121
10253 14121 62345 11379 -9980 16934 -2891 -70485 -78586 -84228 37545 16620 -1564 34839
10241 34839 -12796 -50220 -57161 -42141 -16254 -11265 40243 57846 65021 119996 68491 2356
10229 2356 26087 11312 -17064 -17471 -29565 -44120 -39864 -53506 -29839 20205 -8320 3682
10217 3682 41899 75493 -12416 -81653 -45141 7509 -6565 -1206 43648 68368 -23721 42413
10205 42413 23457 60063 51425 40172 57722 -5286 30346 5590 20594 16909 -3197 -4149
10193 -4149 6368 10628 12429 -18898 39684 72503 60802 82140 51507 -40945 -57024 25423
10181 25423 54930 73735 43452 52042 76346 48130 81917 54218 -4690 5363 22154 -31894
10169 -31894 -56833 -58591 -33404 9907 -27801 -6298 -16646 -1260 3547 10746 -14620 -58345
10157 -58345 -76099 -98276 -56439 20416 55484 62760 1271 -67335 -11108 51695 -6678 -69267
10145 -69267 -104248 -49072 5209 27947 19541 27354 18563 10600 -26862 9255 9560 -65705 48481
10132 48481 85368 46271 -1478 8932 69000 111078 50448 47654 56713 19185 66664 86173
10120 86173 78893 44718 -15830 -1576 62481 80950 105860 41708 -3963 35295 63132 69300
10108 69300 25961 34025 53176 7720 -3615 40642 27920 -33712 -5018 22611 19795 -2571
10096 -2571 -40257 -19050 -6714 17981 -21868 -9966 -10519 24887 34879 57469 94433 43544
10084 43544 72781 91235 72088 32816 25011 44691 30096 -491 26281 64977 50504 25952
10072 25952 -19848 -41615 28999 34999 49311 10225 -28410 28264 48215 2354 23626 963
10060 963 -1605 34984 31469 83273 122569 115856 103771 72900 49486 35839 38641 105526 109084
10047 109084 159851 152490 121754 116107 60342 38564 -15234 40701 91446 23662 63989 80047
10035 80047 62081 31372 58061 87946 8423 39348 122835 124532 88664 161693 187677 156287
10023 156287 131437 168964 169423 166744 142154 133782 127965 152788 159411 194981 207288 179388 200539
10010 200539 309247 289832 259793 282290 306615 387369 429897 406080 353634 377098 404418
9999 404418 381889 423465 426270 329598 350290 300837 235240 199638 270489 288536 335465 330054
9987 330054 369398 289225 332711 405570 327925 294927 329525 361699 361083 343123 410386 493151
9975 493151 595314 635479 706572 727016 674428 700581 746280 708953 678614 624890 645976
9964 645976 653285 660440 560446 489687 525404 578457 572804 492178 506052 444684 392040 436072
9952 436072 471999 460503 513765 486442 430540 364898 441550 466992 475677 453659 412774 391988
9940 391988 385618 318978 341875 334808 336649 349094 386918 406877 361850 340063 316115 321488
9928 321488 288027 357038 376270 359637 347235 359004 339996 266099 263541 268522 318306 303531
9916 303531 259405 297871 276162 243200 236903 287171 255923 235265 273399 303525 263045 204701
9904 204701 185714 235874 312022 297297 233772 244802 300547 279750 257206 244408 224767 246913
9892 246913 299585 244906 207359 241769 201203 219037 267945 246246 232475 221721 221566 207665
9880 207665 237451 239914 221117 242749 290267 253235 270011 305224 317321 242385 267075 301097
9868 301097 335972 319542 268065 295960 320096 337749 319993 300058 352888 397081 408175 399383
9856 399383 347526 243103 271670 262780 318816 272376 303320 350313 304410 289901 302177 328017
9844 328017 352165 370533 330298 307459 376486 432505 433265 407593 382474 413471 393078 468932
9832 468932 459857 397447 442423 494553 455647 428315 471835 468570 437736 494238 508169 479898
9820 479898 487481 464691 436701 453703 448959 476311 470017 535412 533979 569414 494317 533220
9808 533220 588505 631676 605465 621959 725165 742653 802109 797274 787048 753193 710772 752347
9796 752347 721617 747955 759361 768543 838251 843858 779896 770264 719456 792494 825189 845871
9784 845871 847900 786549 825722 881631 890269 844308 850639 864356 868707 903105 906235 876511 962197
9771 962197 973991 930799 909188 925743 923896 974487 1016840 1036719 1008464 1047342 1023265 1015857
9759 1015857 1028621 1053181 1059241 1106902 1080185 1103353 1143577 1190122 1174160 1142372 1144321 1242964
9747 1242964 1351507 1312007 1304010 1298606 1313742 1352027 1329889 1336963 1364567 1343262 1442694 1409447
9735 1409447 1437701 1507053 1545573 1543316 1558228 1560562 1605806 1613391 1623955 1686437 1720159 1737954
9723 1737954 1763590 1795255 1796306 1819568 1838386 1847448 1884297 1907269 1971660 2010883 2068194 2126107
9711 2126107 2229640 2332274 2385193 2402891 2458858 2587669 2719785 2762808 2880809 2951030
9701 2951030 3032636 3104510 3177823 3336947 3369441 3421508 3548152 3665483 3804653 3949776
9691 3949776 4080891 4235875 4423804 4589311 4701649 4796600 4892072 4962982 5060679 5203184
9681 5203184 5197812 5221149 5352468 5528051 5731130 5975626 6151913 6398832 6683131 7052934
9671 7052934 7437906 7827181 8232034 8742659 9263439 9846510 10558216 11363187 12288971 13533416
9661 13533416 15056942 16840457 18702802 20424700 22299708 24607839 27201245 29807020
9653 29807020 32555933 36405804 41471104 46452894 50402603 53858495 57700803 61286949
9645 61286949 62960652 61721458 58906186 55782399 52107385 47136631 41350994 35877724
9637 35877724 31327199 28052684 25894038 24692431 24121688 24110959 24366541 24607248 24809470
9628 24809470 25065307 25496386 26229277 27396646 28637547 29711277 30858287 32493213 34626766
9619 34626766 36839242 39199837 42757734 47847847 53273774 57596204 61294182 65675041
9611 65675041 70109424 72103377 70246441 66216336 61792693 57203533 51468770 44770122
9603 44770122 38177081 32487431 28142171 24877940 22599175 20957932 19680757 18736288
9595 18736288 18035207 17371324 16784033 16258546 15595125 15007478 14443146 13785045 13110999
9586 13110999 12511602 12007874 11500696 11047089 10682661 10413079 10219810 10024328 9742300
9577 9742300 9471505 9233855 8947170 8685856 8411151 8124179 7852711 7598607 7241953 6924509
9567 6924509 6604407 6316904 6091343 5899425 5684985 5457076 5293951 5155579 5075268 4998744
9557 4998744 4936363 4867089 4747186 4656926 4627024 4538277 4542365 4501573 4490946 4466127 4380618
9546 4380618 4307903 4239705 4137498 4091289 3982402 3949202 3853505 3747453 3603435 3506227 3500879
9535 3500879 3446682 3414509 3482439 3483949 3504669 3591356 3673163 3691232 3730070 3781568 3753516 3748891
9523 3748891 3662045 3566178 3483303 3441506 3371488 3237065 3043685 2933388 2840438 2754311 2696096
9512 2696096 2634163 2628161 2588148 2504633 2463141 2433274 2428949 2372551 2349460 2340315 2336419 2359998
9500 2359998 2413024 2476306 2509973 2445484 2561118 2721495 2723439 2853344 2965810 3050816 3051956
9489 3051956 2974286 2976506 2897561 2802687 2686220 2608355 2560808 2379107 2289087 2172304 2105021
9478 2105021 2012999 1968195 1957025 1996591 1981708 1893504 1887068 1875367 1850946 1850979 1766410 1735905
9466 1735905 1791609 1825564 1767134 1769926 1785798 1735922 1739887 1705050 1711153 1687181 1689304 1712167
9454 1712167 1667671 1686604 1671865 1620246 1677003 1668196 1726522 1767835 1855393 1916963 1994802 2114325
9442 2114325 2301274 2511947 2633734 2777893 2889506 2947364 2958220 2929104 2899952 2826231
9432 2826231 2608544 2457580 2322705 2212480 2120360 2053618 1983180 1915840 1789969 1721726
9422 1721726 1700302 1701445 1634361 1516385 1538634 1536674 1479995 1470628 1518939 1542707 1504311 1493491
9410 1493491 1495829 1449262 1516965 1565686 1582469 1580780 1620044 1662397 1762239 2052222 2586808
9399 2586808 3058727 3260050 3033802 2719552 2445613 2141193 1905268 1797984 1683743 1630561
9389 1630561 1624112 1546357 1561214 1541234 1419776 1426553 1422212 1331028 1260317 1281183 1262549 1261558
9377 1261558 1236352 1230355 1200033 1210123 1229316 1250772 1174800 1174714 1178331 1176555 1206663 1181368 1188933
9364 1188933 1218228 1255447 1193654 1193045 1234353 1202058 1186259 1187832 1213481 1200786 1232668 1334743
9352 1334743 1371663 1335196 1303234 1228163 1180158 1192351 1218847 1301254 1328917 1359379 1310905
9341 1310905 1281550 1298113 1363660 1308405 1350798 1388410 1329444 1298385 1308782 1357205 1431661
9330 1431661 1407528 1451037 1468495 1457759 1474347 1444086 1489323 1474007 1442351 1427331 1452068
9319 1452068 1466164 1531946 1539620 1512506 1553095 1541140 1621865 1636143 1597365 1615308 1682966 1655261
9307 1655261 1680496 1688241 1754580 1750460 1759926 1814771 1800589 1794897 1893189 2019497 2111148 2115380
9295 2115380 2073221 2213070 2328232 2385302 2436142 2438125 2507699 2605671 2697986 2827308 3008963
9284 3008963 3233289 3473876 3737702 4014113 4326738 4569032 4848103 5128568 5310415 5391676
9274 5391676 5434309 5412713 5256992 5064177 4809520 4582695 4388540 4141075 3853249 3741901
9264 3741901 3666470 3574086 3605777 3680247 3743124 3838636 3929980 4051279 4171061 4376917 4624328
9253 4624328 5014528 5384662 5815924 6262276 6692848 6991962 7230649 7605453 8037490 8423390
9243 8423390 8691175 8876182 9143219 9312394 9453454 9533496 9463786 9349519 9078643 8691848
9233 8691848 8223147 7706560 7238998 6901243 6536672 6326670 6093688 5975192 5954002 5913741
9223 5913741 5964940 6044531 6216729 6442389 6801375 7307294 7976067 8718574 9209858 9505764
9213 9505764 9562481 9356062 9163105 9075116 9063134 9224234 9340724 9250245 8974051 8591773
9203 8591773 8287064 8110916 7879527 7734696 7635423 7604573 7595453 7623944 7708113 7757789 7852007
9192 7852007 7929755 8073054 8226446 8321975 8487978 8638397 8799159 9022483 9204375 9345591
9182 9345591 9563506 9675806 9849548 9976256 10090705 10156449 10187251 10410908 10462428 10504856
9172 10504856 10485063 10389568 10397951 10419125 10441183 10404810 10475553 10491469 10511056 10578999 10681779
9161 10681779 10779547 10928495 11022291 11113362 11206706 11410686 11620204 11891299 12198524 12450796
9151 12450796 12563535 12574420 12520629 12398010 12289111 12233499 12154808 11953639 11669221 11527721
9141 11527721 11361621 11327128 11319629 11354841 11378117 11438575 11541947 11724053 11932985 12257605
9131 12257605 12564950 12884114 13405385 14056907 14872109 15731024 16604177 17340578 17981043
9122 17981043 18687868 19519384 20479547 21400753 22302613 23146725 23779572 24146144 24205326 24332254
9112 24332254 24598075 24845038 24729909 24074277 23417656 22869503 22515007 22275056 22187847 22357955
9102 22357955 22714404 23215734 23905320 24817444 25875539 27122101 28674275 30614055 33020427
9093 33020427 36268176 40446468 45694358 51465823 56759744 60899437 64493008 68479053
9085 68479053 72932625 76415988 78276243 79446076 81285714 83911874 86176852 86680033
9077 86680033 85807955 85080798 85568734 86768511 87032793 85523456 83358531 81993091 81730829
9068 81730829 81856737 81980493 82791551 85248775 89578466 94809220 99485878 102812623 104661602
9059 104661602 105637871 105919101 105149009 103655421 103313725 105470607 109885773 114734175 118656597
9050 118656597 121313010 122787668 122641192 119350075 111527234 99862869 86720514 74465940
9042 74465940 64132458 56056418 49689854 44662002 40541456 37131928 34270837 32015868
9034 32015868 30172534 28762715 27810502 27224956 26662469 26437003 26346057 26605628 27201365
9025 27201365 28129393 28950849 29421988 29551831 29415590 28896484 27902144 26496984 25139564
9016 25139564 23930101 22989811 22177557 21402829 20716561 20058675 19640598 19316083 19112464
9007 19112464 18860553 18600345 18332830 17948331 17566367 17214455 16779881 16318424 15811706
8998 15811706 15334548 14849366 14376635 14054598 13805925 13480959 13211791 12961895 12839064
8989 12839064 12626909 12516883 12462108 12353536 12345307 12399115 12378567 12428455 12473378 12518831 12528106
8978 12528106 12653562 12723450 12751950 12732754 12778297 12801847 12874200 12891904 12947358 12937989 12850856
8967 12850856 12775854 12962592 13097701 13299929 13327704 13457588 13449548 13613251 13679817 13811563
8957 13811563 13826223 14178987 14447011 14952307 15219775 15681751 15994500 16611214 17008286 17821228
8947 17821228 18630419 19720740 20609517 21817914 22856806 24010436 25128874 26959577
8939 26959577 28845601 31241305 33282474 36091372 39134375 43072523 47089526 52859737
8931 52859737 60590561 73631055 95209475 144276582 229826761 325503536 367371899
8924 367371899 329291801 260375057 192767397 144525472 111551744 88610029 71511845
8917 71511845 59324131 50694061 45317368 42301038 41715466 43063628 46770890 51462233
8909 51462233 54959011 55086109 52437937 48529699 45075087 42696921 41545075 41196193
8901 41196193 41528759 42524805 43770981 44201740 43418347 41916408 40422691 39511306 39470649
8892 39470649 40097548 40916363 41242193 40743152 39587322 38283953 37673113 38184745 39599856
8883 39599856 40778468 40639809 39346186 37900399 37025021 37545055 39783178 44197464 50465295
8874 50465295 57128676 61716428 62705594 60136323 55228808 49671840 45003925 41553430
8866 41553430 39450217 38517735 38542075 38564214 37853691 36121986 34332144 33083380 32616603
8857 32616603 32648018 32866088 32812425 32299106 31496641 30802059 30485088 31081408 31950575 32101161
8847 32101161 30707472 28355722 25850783 23855602 22464824 21813066 21765568 22660349 24628075
8838 24628075 27525272 29975473 30386483 28467403 25356916 22056126 19377538 17210791
8830 17210791 15501078 14009517 12767569 11794010 11036326 10416556 9941112 9487167 9150451
8821 9150451 8835717 8541386 8352515 8246586 8103099 8078980 7995637 7870752 7685023 7481553
8811 7481553 7315349 7119910 6863993 6635367 6319572 6113238 5862515 5649756 5438048 5207982
8801 5207982 5119220 5081179 4932619 4842883 4719527 4624346 4490262 4430628 4411128 4342799 4277661
8790 4277661 4176283 4145306 4113416 3951398 3834924 3687821 3608938 3527146 3437463 3340814 3292465
8779 3292465 3234856 3134957 3138223 3085354 2968880 2880921 2814810 2726024 2670869 2606685 2642454
8768 2642454 2574383 2530864 2550077 2545332 2470490 2450823 2410241 2415683 2411461 2358821 2357158 2398622
8756 2398622 2426444 2399592 2319218 2292782 2223391 2133389 2081636 2162943 2057679 1965374 1936976
8745 1936976 1849476 1776110 1786343 1822814 1814966 1749949 1797819 1820337 1814138 1755940 1746694 1730836
8733 1730836 1780392 1739815 1715978 1721261 1631889 1578883 1529427 1515961 1511639 1505898 1475202 1509432
8721 1509432 1540131 1536714 1489844 1398897 1406987 1386952 1354598 1315344 1302598 1341236 1281424 1295788
8709 1295788 1389408 1434297 1423752 1475166 1515484 1538396 1584191 1571128 1557322 1501506 1413128
8698 1413128 1359811 1402526 1410823 1314500 1208884 1128358 1057838 1079271 1052282 1034274 1053310
8687 1053310 1046813 960306 949018 954330 955566 916943 918612 921956 952657 924620 896818 830470
8675 830470 874748 850729 882207 845337 896374 844224 828728 840999 875834 879358 874839 924462
8663 924462 961430 832995 807256 795495 727349 705279 669142 695813 640698 646620 650571 704495
8651 704495 703932 645947 565337 488792 514929 529297 523935 563643 456406 455028 489517 564657
8639 564657 459176 459657 457449 453265 504050 518576 433324 430949 436438 450598 417620 397236 377995
8626 377995 351875 311954 309517 288266 341937 401336 344795 316047 299193 252556 233431 301763
8614 301763 309905 312715 288399 291268 331222 331846 377793 385683 366514 327066 348845 382480 439396
8601 439396 405112 344430 296045 302143 350254 332881 267167 245775 215698 197581 249786 217665
8589 217665 179546 243501 279270 232299 271900 301370 257333 246633 270340 296397 183969
8578 183969 167757 217364 208215 208531 219828 260627 265696 346746 292616 236662 211109 207456 236843
8565 236843 170454 167846 176720 193403 230695 211617 215144 219380 186476 257629 255192 233081 221080
8552 221080 270658 280608 184898 212371 229271 267705 340422 278118 250238 264779 243636 198428
8540 198428 238258 249498 188290 167815 219304 259257 248561 205241 168152 209377 234661 178971
8528 178971 228809 282549 256206 241179 268289 237403 234749 228128 183492 238029 248051 231802
8516 231802 254998 268805 260360 278185 289507 304654 260105 287454 316196 347499 282639 205210
8504 205210 255229 310813 343299 260489 179812 178128 149619 124077 181209 187137 153849 120115
8492 120115 227094 222910 99218 129728 114992 150346 167489 153451 146557 100682 173209 153813
8480 153813 102925 113560 160017 191248 169327 171051 180547 193187 197480 251959 258169 212540
8468 212540 201131 210037 177532 166217 186247 202358 125921 118288 126017 167234 181366 232516
8456 232516 229371 263397 325325 361327 418351 571739 808056 1327420 1786380 1978394 1821159
8445 1821159 1313816 923951 726439 569068 441383 373113 304871 274823 233810 222553
8435 222553 193055 199764 202054 198361 246435 212684 156154 127898 131565 135292 117672 97111 139566
8422 139566 147458 186334 230935 260056 178637 102007 108637 80829 59607 107810 171624 161879
8410 161879 135252 192920 245816 272595 303218 326094 305319 248025 237219 287498 305846 277889
8398 277889 241428 300217 363475 347923 321238 336234 328371 333181 369852 387776 388299 413431
8386 413431 461770 539807 538657 507390 501443 530960 532621 582842 609625 636211 698390 745518
8374 745518 758281 817189 919877 899610 978484 1074407 1111453 1117350 1225119 1292366 1385914
8363 1385914 1463587 1566249 1654525 1811389 1947597 2052964 2201286 2468561 2572620 2712940
8353 2712940 2862752 3047175 3223916 3381428 3572637 3778228 3934283 4089704 4147171 4273275
8343 4273275 4425430 4522100 4481269 4565427 4629673 4657987 4679337 4634261 4537138 4472277 4386230
8332 4386230 4253241 4177292 4004694 3879126 3716553 3511121 3283753 3083820 2869025 2675101
8322 2675101 2564621 2393552 2175609 2028988 1911078 1795489 1657420 1566034 1475375 1379320
8312 1379320 1268884 1178964 1192836 1139164 1010357 964236 860082 812160 759117 729195 713699
8301 713699 716571 692819 605404 615737 611918 538348 483080 485940 480757 522612 517506 434452 408776
8288 408776 352429 402716 409434 307212 250005 197361 223658 294955 333840 289770 244143 199797
8276 199797 214964 287761 209891 236311 227110 217185 197169 153858 175050 104620 100490 94048
8264 94048 138572 186270 130185 123801 114283 35125 66409 166988 144726 137524 138172 131242 34973
8251 34973 27229 100413 95522 141614 45422 51739 83937 22637 98755 100068 104191 87258 115907
8238 115907 159075 158624 167246 158705 163316 157218 134519 191938 192725 177764 189540 186045 153678
8225 153678 183522 238694 247198 201663 244687 263591 249458 270644 251884 246345 293219 250223
8213 250223 222994 277994 330833 318728 348233 365670 340943 338056 325030 340000 356122 328686
8201 328686 371985 324560 328154 344927 354710 375838 358130 330358 283928 549330 588363 515002
8189 515002 505270 496203 483883 513841 570033 596068 672981 661780 675111 756004 737000 717015
8177 717015 707306 701262 695970 643355 574707 500294 459182 457892 465446 477444 506286 536611 555314
8164 555314 568603 590884 659859 740987 727607 767907 805683 821824 798677 816586 919869
8153 919869 981667 898174 888417 908786 903313 843873 718144 746161 714989 586331 578226 492773
8141 492773 519681 505364 534205 567156 543886 509122 451365 458839 407143 420053 406784 409802
8129 409802 481467 487447 425564 400758 440074 529233 463753 477317 509542 519318 478941 463293
8117 463293 480840 447837 318799 348044 367130 415860 405133 333892 391792 395884 344620 378731
8105 378731 332401 299756 299483 333804 340613 355029 326306 301288 299221 238076 260648 318255
8093 318255 244656 306725 332856 304964 280370 283734 283393 268687 281343 311343 309200 350875
8081 350875 390849 397746 380501 366731 293111 305553 362967 416112 401278 354939 362763 421200
8069 421200 442879 408103 386178 359041 413970 455162 437932 383441 364752 378849 351829 331267
8057 331267 368745 352268 415955 439345 441966 415347 434557 448526 503695 506937 548282 531222
8045 531222 539768 488490 515006 506168 558639 602131 594059 605874 615991 508392 454107 393445
8033 393445 372200 388454 458205 447852 377630 345185 342424 362211 326694 417810 459746 496404
8021 496404 525445 519595 534041 517390 516938 597257 633443 743536 680802 642948 688750 673963
8009 673963 612324 621302 667636 613666 529502 491912 446292 463927 453521 432527 473790 436300
7997 436300 446173 427008 420491 360163 426991 504123 509248 535059 571369 569970 582672 572678 605085
7984 605085 543573 567712 537174 461116 481971 454003 468610 453875 387808 327162 325032 351074
7972 351074 390026 304858 300899 311734 258666 222202 247518 280109 259550 216167 271060 293198
7960 293198 230864 341925 312765 310805 375352 371496 372785 343254 287922 291309 247910 231122
7948 231122 267153 275718 253757 284415 278316 342311 340060 323340 315484 260823 297716 373735
7936 373735 366661 306717 324867 333428 301919 276655 354395 369829 383653 378713 371077 305755
7924 305755 312356 325638 383789 389921 341569 369687 437716 522109 556993 445438 506400 541093
7912 541093 499181 513633 573542 653836 695917 694829 704845 718236 765575 759093 756612 758669
7900 758669 730401 722292 732398 682736 664850 661704 667256 655716 646807 657979 603036 636690
7888 636690 702451 689186 693730 694261 777521 792932 837372 851963 892994 872790 802167 828373
7876 828373 713471 669563 723490 673307 642927 608316 589907 557784 511816 500616 488625
7865 488625 438997 461611 457321 443325 456043 377307 360723 389492 423232 383419 324845 322964
7853 322964 362361 381833 342563 324619 347461 282657 196061 179926 134036 39251 66098 58166
7841 58166 111518 120857 61142 47865 33721 -20680 -25193 -3677 -35987 -16567 35906 49801
7829 49801 15653 -35971 -49587 -53488 -16674 -12005 -38030 -86766 -115317 -95769 -79827 -125739
7817 -125739 -108021 -44701 -14965 -60621 -102542 -132215 -90531 -128923 -119509 -127394 -112470 -133525
7805 -133525 -75520 -53464 -24472 11201 -89126 -81063 -61186 -59305 -90807 -79560 -62248 -30638
7793 -30638 -39924 -149120 -150395 -152747 -172901 -134050 -92877 -126886 -137958 -109813 -103512 -110474 -109133
7780 -109133 -99121 -115758 -87599 -101048 -104989 -41918 11645 -49552 3028 13950 61794 95339
7768 95339 44060 32033 37177 5558 61237 95452 66716 91357 127614 205957 263432 257110
7756 257110 281711 347190 358089 413062 452843 440537 484525 413360 320814 331712 375310 378279
7744 378279 364921 363906 340171 350250 327819 301310 300790 236296 251062 333594 363755 430258
7732 430258 431766 427172 479721 540481 582908 643516 713972 801931 892316 1006177 1100520 1103374
7720 1103374 987952 993171 1018397 882654 757267 706918 615823 554181 540666 502989 425245
7709 425245 390727 319292 259998 265138 278737 355876 348930 380292 370417 346249 297042 336944
7697 336944 367477 381349 458851 463091 487467 487282 516017 566033 543331 416989 360273 343276
7685 343276 356863 314658 265201 305599 253582 202279 183845 114072 76684 109477 160071 142670
7673 142670 133271 131618 106788 156509 104887 43617 67478 63152 -14844 49481 49960 91531 92609
7660 92609 81339 83252 -11845 -16284 12390 -34661 -44344 -32197 -111410 -27064 13601 46821
7648 46821 103875 62770 26242 -24915 -18766 -54617 -52099 -49805 -38484 53374 10313 22023
7636 22023 -11155 -61627 -89255 -168405 -141670 -153262 -115044 -67235 -110836 -117660 -62490 -49512
7624 -49512 -44132 -69868 -20584 -50940 -116451 -82782 -115461 -83275 -30346 -54019 -7640 -322
7612 -322 -17730 -70409 -43405 19820 24452 51397 62491 90844 121965 97062 51081 95536
7600 95536 101275 55737 137251 89778 101554 123324 115397 107508 74267 40731 30226 85129
7588 85129 115736 52412 57139 91405 57022 97748 83791 119923 172240 214759 213123 220985
7576 220985 181551 153411 192301 307861 354541 346668 285832 277987 255267 318842 260661 190284
7564 190284 139985 177940 170391 122530 179814 221693 234759 181853 154140 160581 129562 114860
7552 114860 114907 197364 244504 294716 349538 325165 410300 432279 346800 402804 445072 402101
7540 402101 410128 367283 389823 398001 345255 348789 390755 316961 300142 394628 349426 305274
7528 305274 352259 417704 408710 452916 478225 446336 465962 531838 557961 601282 677163 725184
7516 725184 735168 762830 777850 764720 719099 681737 682737 741313 730535 636830 688099 687207
7504 687207 733629 799926 905808 912353 941154 937615 980109 1088569 1151883 1253289 1369976
7493 1369976 1372971 1396517 1506793 1590151 1690745 1807129 1947032 2114950 2243622 2397453
7483 2397453 2507241 2592601 2639245 2771746 2962565 3041929 3089860 3153890 3194627 3312495 3400175
7472 3400175 3448753 3538686 3501463 3525967 3483151 3469530 3469259 3483791 3372497 3252078 3215809
7461 3215809 3114854 3002750 2871567 2692086 2579804 2449981 2290767 2153829 2018590 1928844
7451 1928844 1847101 1718305 1677149 1625763 1554064 1501461 1460635 1425217 1378785 1337352 1281848
7440 1281848 1217059 1203789 1229028 1129963 1106674 1073444 1040179 1024356 1082459 1058216 1030816
7429 1030816 1013999 1005659 1008336 1006379 1008161 964506 1007020 1025454 939622 952912 1006740 997112
7417 997112 1069935 1109023 1148065 1147264 1157906 1267881 1260559 1389095 1426559 1467238 1473376 1477341
7405 1477341 1537292 1639698 1760151 1823859 1981439 2105440 2184352 2286803 2401821 2541885
7395 2541885 2642342 2748202 2920851 3039873 3155501 3298407 3367545 3447822 3506449 3526113
7385 3526113 3510841 3503698 3525766 3520370 3469961 3435832 3448904 3389911 3336996 3211626 3071369
7374 3071369 2999657 2896768 2749660 2601118 2468027 2360584 2218574 2175559 2057758 1890840
7364 1890840 1790620 1684017 1591220 1479755 1400667 1301789 1269574 1225676 1153034 1144858 1077629
7353 1077629 1003947 920074 902975 888583 829154 795736 798364 694940 675385 747364 655188
7342 655188 593581 622454 606858 588869 552545 532554 472356 463797 492121 516858 487245 477622
7330 477622 462549 478065 427163 454073 436628 451190 431814 411663 446725 407690 367290 360365
7318 360365 349097 358927 395107 412441 387442 363085 387074 422561 405260 368490 413078 472839
7306 472839 407879 322855 361068 365214 343198 343519 356348 313339 233077 260558 295565 279728
7294 279728 302428 307981 345001 337674 364690 333964 372735 334220 284329 287981 271787 229074
7282 229074 303495 368001 312560 321525 358849 350471 363056 406061 458894 493615 556800 534545
7270 534545 474297 488689 533682 563903 524723 478122 463811 435087 416643 465380 511860 477497
7258 477497 515257 475258 459344 442669 413553 418519 443769 451580 491170 539330 534135 528383
7246 528383 576337 575343 619122 587551 606644 622321 550035 571778 627367 621315 572733 632181
7234 632181 633748 699766 691005 652333 640718 666264 594428 567234 605605 678151 655068 646063
7222 646063 663270 602869 603101 668803 614274 634026 597047 588391 631651 628707 598064 555819
7210 555819 590657 615911 640106 674717 688851 698698 724644 695153 693853 771369 738583 671169
7198 671169 673059 707608 746983 770194 769285 734568 746891 833310 889139 887129 826815 868653
7186 868653 935219 957167 1021780 1040617 1072748 1115353 1160619 1098148 1123048 1212229 1211453 1293307
7174 1293307 1432650 1422730 1498985 1574290 1621334 1712248 1766788 1829126 1888277 1858840 1952672
7163 1952672 2012009 1955534 1872036 1857575 1813512 1720022 1618773 1563736 1521011 1493610 1492827 1436770
7151 1436770 1445577 1431284 1377735 1347249 1375769 1333100 1314012 1335263 1342173 1317322 1324974 1313725
7139 1313725 1329599 1284657 1295497 1361953 1426244 1439042 1441742 1443494 1493398 1481521 1478203 1634724
7127 1634724 1623939 1586759 1570751 1582396 1592509 1644889 1672588 1692345 1695265 1692040 1743091 1773995
7115 1773995 1742322 1804700 1853581 1887564 1852753 1922802 2018775 2018835 2089949 2094556 2146023 2202979
7103 2202979 2272930 2305472 2298615 2339140 2361335 2473218 2517359 2657405 2693630 2706001 2785264
7092 2785264 2806410 2950369 3044518 3126259 3226472 3292241 3383021 3498369 3546239 3659661 3779673
7081 3779673 3936297 4113715 4235390 4373638 4555535 4745757 4896798 5006003 5207736 5396713
7071 5396713 5625693 5895315 6113390 6307947 6665137 6990139 7270544 7580361 7976445 8366097
7061 8366097 8773913 9234059 9717481 10353503 10981531 11541782 12187831 12897780 13693020 14509046
7051 14509046 15403887 16354415 17341214 18431980 19699245 20857490 22043983 23470707 24735471
7042 24735471 26074736 27333817 28526209 29570517 30347708 30906672 31250491 31333650 31187886
7033 31187886 30717176 29914853 28960152 27915159 26762238 25431042 24102668 22772775 21536077
7024 21536077 20290097 19086941 17993743 16936112 15962023 15074095 14204287 13381711 12683672
7015 12683672 11990359 11344206 10739114 10221339 9817480 9425540 9012801 8670447 8416931
7006 8416931 8109267 7837164 7636384 7279510 6942393 6602895 6324692 6111430 5849595 5667639
6996 5667639 5541775 5364376 5201070 5005998 4810685 4692946 4570740 4536432 4479035 4401792
6986 4401792 4278363 4210574 4155990 4072564 3912213 3890692 3914354 3941084 3946592 3868702 3864011
6975 3864011 3899031 3881557 3837261 3835373 3763975 3692661 3663049 3644152 3583607 3519928 3501320 3439615
6963 3439615 3409256 3343121 3267605 3197038 3132623 3061936 2971693 2911200 2822980 2664900 2609542
6952 2609542 2634187 2576289 2591288 2480662 2386306 2304400 2241964 2214394 2207663 2180097 2139561
6941 2139561 2070951 1963738 1944035 1931170 1946006 1939801 1864183 1811210 1822225 1847217 1817574
6930 1817574 1754202 1790579 1792578 1774757 1805404 1714941 1742447 1739907 1796036 1797543 1761466 1839933
6918 1839933 1827088 1838976 1872096 1962875 2080974 2072508 2127617 2170631 2233806 2255618 2385525
6907 2385525 2461094 2437896 2471515 2554163 2534934 2510896 2509173 2487209 2505891 2518235 2485776 2498038
6895 2498038 2555066 2522802 2557674 2709790 2788486 2837905 2910066 3094586 3206233 3277192 3408278
6884 3408278 3501889 3699632 3918912 4063782 4223603 4276275 4348989 4425353 4279074 4195316
6874 4195316 4065667 3958301 3803436 3660557 3430163 3255064 3194361 3172914 3131025 3126705
6864 3126705 3120380 3071750 3048116 3090223 3057457 3022422 2924741 2846749 2865590 2896348 2973649 3025108
6852 3025108 3086979 3104352 3060278 3117825 3109272 3121069 3016623 3009949 3002409 2966513 2973555 2908874
6840 2908874 2884843 2801718 2723625 2619674 2528354 2447904 2387252 2290012 2207280 2197393 2141647
6829 2141647 2065746 2020047 1956554 1920858 1842835 1855776 1829805 1777419 1723344 1620672 1639883
6818 1639883 1604596 1577173 1552524 1527653 1547703 1539349 1522066 1510551 1528761 1578818 1587599 1542550
6806 1542550 1534698 1519266 1455493 1484540 1494159 1553771 1545909 1533415 1590787 1619166 1592497 1560945
6794 1560945 1534443 1547819 1500478 1543858 1538807 1462219 1456021 1426139 1462304 1497590 1525598 1545167
6782 1545167 1555507 1598929 1647223 1597928 1570144 1580927 1611903 1594786 1583177 1590941 1572405 1600362
6770 1600362 1617376 1628631 1677236 1685636 1692501 1588973 1567735 1570838 1538756 1511601 1550379 1524358
6758 1524358 1563140 1604951 1565313 1537985 1540339 1582692 1683899 1621339 1645863 1707747 1740078
6747 1740078 1768971 1751819 1788353 1820917 1766976 1743831 1755721 1741803 1789937 1805546 1793265
6736 1793265 1778820 1793658 1786558 1856032 1911907 1910087 1891153 1892806 1937819 1990137 2041450 2163427
6724 2163427 2176757 2180519 2153922 2178647 2270892 2297573 2366469 2397964 2386581 2417855 2505955 2503511
6712 2503511 2538862 2569556 2624412 2676415 2636166 2677403 2784535 2802733 2879765 2940458 2976331
6701 2976331 2996101 2928669 2946622 2940608 3015913 3028521 3031449 3085531 3100360 3126887 3135262 3185250
6689 3185250 3218539 3331150 3411425 3509447 3540644 3632589 3727379 3769308 3835426 3931840 4108696
6678 4108696 4326691 4455581 4575717 4699452 4813572 4935718 4997310 5153422 5268177 5360111
6668 5360111 5422263 5507105 5607595 5631071 5682008 5751291 5875611 5937268 5993735 6070736 6085771
6657 6085771 6138626 6238338 6257606 6289521 6318945 6271351 6252863 6283220 6250865 6294621 6345681
6646 6345681 6319548 6389631 6437510 6447457 6394232 6340784 6301354 6279709 6225599 6160712 6127410 6132775
6634 6132775 6143846 6153339 6090917 5980761 5954057 5883913 5872100 5824503 5800798 5769814 5566275
6623 5566275 5551351 5534543 5448773 5346704 5298680 5198922 5125044 5053374 5001155 4823466 4753438
6612 4753438 4697105 4573294 4482129 4395680 4252460 4082608 3971140 3919730 3832368 3748972 3696295
6601 3696295 3679199 3679195 3591678 3516959 3517603 3446600 3402260 3353542 3327066 3347822 3365631 3304973 3227418
6588 3227418 3186218 3183013 3164828 3241730 3258421 3227328 3198388 3230683 3168537 3124489 3131111 3066091
6576 3066091 3052612 3044582 3061385 3059919 3062364 3057939 3116858 3239680 3314896 3295194 3298280 3319137
6564 3319137 3423357 3528669 3567397 3539677 3547683 3564545 3579713 3603700 3652132 3666178 3653262
6553 3653262 3686199 3750767 3782032 3825121 3888070 3963762 4059132 4126259 4243304 4417422 4550570
6542 4550570 4765176 4941404 5218201 5385751 5566272 5787661 6113080 6531432 6987616 7443777
6532 7443777 8060196 8682688 9387608 9971683 10355176 10588364 10624451 10453592 10227849 9958959
6522 9958959 9716947 9543409 9519130 9552071 9724489 10024812 10511530 11108195 11845829 12576313
6512 12576313 13115259 13554677 13775872 13798794 13831480 13942921 14099686 14371403 14818210 15484970
6502 15484970 16334311 17499860 18941251 20438507 21789276 22879457 23570469 23798751 23667310
6493 23667310 23409644 23313300 23568346 24137855 25037265 26329303 27768891 29187549 30418845
6484 30418845 31390295 32033356 32194857 31979673 31356050 30299821 28896357 27363539 25866819
6475 25866819 24624007 23711688 23239313 23048348 23253262 23550724 23943100 24376845 24907036
6466 24907036 25468263 26003334 26688598 27534607 28680726 30220327 32265187 34862282 37630108
6457 37630108 40374721 42465132 43491199 43284371 41947451 39836175 37328242 34676698
6449 34676698 32025566 29417229 26902736 24624830 22529716 20750854 19381115 18278520
6441 18278520 17489869 16947624 16677619 16461736 16203692 15921182 15820371 15971294 16232618
6432 16232618 16716196 17421416 18282171 19486254 20762379 21887929 22758541 23065604 22602570
6423 22602570 21469129 19913430 18213400 16551269 14943463 13580947 12340876 11277604
6415 11277604 10372989 9617086 9007847 8445978 7936645 7545492 7166890 6851676 6631663
6406 6631663 6481576 6329398 6126938 5981449 5893182 5788361 5711980 5650664 5668998 5681908
6396 5681908 5781391 5837225 5990813 6164625 6109671 5977871 5806799 5624075 5345356 5106219
6386 5106219 5006910 4915121 4835434 4743955 4638770 4535374 4405355 4347694 4244723 4153256 4218281
6375 4218281 4250872 4325717 4345196 4341543 4299515 4318323 4377670 4365105 4377091 4403235 4340869 4306342
6363 4306342 4260576 4237349 4275822 4231535 4233492 4251502 4271445 4305148 4342580 4353364 4381423 4450724
6351 4450724 4521179 4508988 4526079 4534142 4563278 4645153 4680165 4786697 4851082 4999922 5172812
6340 5172812 5310756 5546845 5815051 6038513 6342306 6602115 6968048 7421667 7880967 8284413
6330 8284413 8612805 8831766 9046647 9370751 9731452 10287207 10908360 11804343 12981317
6321 12981317 14272053 15926822 18315435 21942398 27843832 38594470 55128502 72700619
6313 72700619 81079000 76830769 66274329 53899467 42853679 34275395 27801060 22916743
6305 22916743 19251538 16650288 14878534 13678677 12835353 12187342 11705757 11455236 11485177
6296 11485177 11684309 12321049 13237677 14253604 15002250 15186962 14686410 13662763 12529150
6287 12529150 11368173 10305354 9461989 8891346 8512482 8349202 8238355 8124349 7880574
6278 7880574 7612754 7314035 7135820 7040024 7027467 7029071 6992535 6908867 6727865 6434291 6131808
6267 6131808 5946991 5898680 5826405 5770312 5834190 5923589 5870247 5752272 5607582 5425309 5333863
6256 5333863 5375643 5394012 5492916 5665625 6080063 6438544 6711295 6687264 6503387 6299839
6246 6299839 6034776 5849816 5797671 5702997 5553764 5457960 5462752 5472054 5480098 5442883 5452177 5429505
6234 5429505 5293222 5171577 5081002 5023753 4883372 4828203 4785501 4845386 4894953 4981079 5000637
6223 5000637 5059155 5119761 5243416 5284549 5319138 5428178 5509802 5605932 5722804 5806806 6016273
6212 6016273 6294382 6648493 7118128 7500096 7726773 7759203 7468392 7089999 6725251 6413952
6202 6413952 6212942 5999887 5802357 5683504 5589969 5501760 5549558 5775686 6064795 6434981
6192 6434981 6839025 7102518 7317393 7432546 7468835 7410315 7211947 7081769 7037409 7034751
6182 7034751 6881004 6633854 6458149 6246986 6092394 6065209 6076793 6127898 6177967 6144375
6172 6144375 6208118 6387764 6717787 7150233 7411250 7283246 6732944 6134339 5582894 5161682
6162 5161682 4764071 4435685 4169235 3901361 3764237 3656531 3587550 3508929 3482122 3516790
6152 3516790 3557587 3572191 3658118 3714761 3742294 3816420 3901742 4081722 4176664 4329012 4581015
6141 4581015 4811456 5009278 5365186 5728177 5976750 6072346 6016576 5804140 5436947 5106826
6131 5106826 4659476 4348469 4063408 3788219 3616119 3416063 3191877 3079826 3048031 2984118
6121 2984118 2929580 2886614 2925213 2908433 2838565 2884246 2892471 2969495 3018387 3109678 3179733 3207572
6109 3207572 3381939 3595829 3796546 4075066 4432964 4748598 4966669 4987662 4874205 4757010
6099 4757010 4632854 4533331 4379251 4323769 4297925 4391893 4557512 5042561 5803556 6605535
6089 6605535 7175575 7041057 6494896 5681401 4944422 4418389 4099435 3821654 3581715 3580976
6079 3580976 3392806 3180461 3030865 2861674 2815886 2789714 2776868 2724928 2606192 2550053
6069 2550053 2456079 2342391 2320079 2251382 2211833 2189108 2213247 2208183 2142114 2110155 2051592
6058 2051592 1912911 1929179 1876939 1865007 1847126 1851077 1828284 1857292 1920002 1971398 2045537
6047 2045537 1998076 1990025 2023403 2030672 2081712 2004014 1951595 1919317 1786735 1757425 1721460 1801831
6035 1801831 1851765 1875040 1903612 1902617 1863170 1847274 1926379 1913774 2052842 2180435 2391037
6024 2391037 2829440 3527629 4276528 4722419 4794731 4483501 4002665 3444933 3073867 2728697
6014 2728697 2517473 2463741 2452913 2516925 2466584 2400906 2275549 2068305 1898813 1788258
6004 1788258 1693466 1630088 1612986 1488826 1473815 1436495 1349760 1332349 1405519 1435316 1390211
5993 1390211 1378436 1378837 1365265 1344030 1346914 1460517 1564360 1644812 1642170 1604232 1586095 1640192
5981 1640192 1779967 1888845 2010756 2070859 2007275 1980819 1847656 1698199 1618503 1491227
5971 1491227 1400288 1300100 1235410 1169842 1151785 1126024 1079432 1111029 984439 944622 1018705
5960 1018705 1068718 1042950 1027594 1066437 1102188 1170357 1211423 1226049 1241002 1198748 1216838
5949 1216838 1221564 1269629 1302479 1334414 1335939 1315460 1236367 1173032 1124950 981775 960756 954900
5937 954900 924085 902321 931389 910890 907084 881784 885221 919580 944795 916540 911652 829557
5925 829557 873997 841675 801417 853279 878032 908649 899884 807061 753531 798096 813680 754726
5913 754726 736310 748886 783831 725620 728976 848821 772414 703156 781668 799354 884515 883276
5901 883276 809835 811541 855552 931633 957879 908058 931015 904305 842754 833940 881832 879513
5889 879513 868574 916582 970193 1001867 1038569 1047508 1101434 1165450 1063756 1029309 1074957 1041373
5877 1041373 1056193 1039056 1043624 975317 1049667 1085711 1119568 1184548 1252876 1331037 1296111 1358558
5865 1358558 1405271 1408341 1384495 1416439 1393443 1353846 1358326 1438886 1452843 1453885 1469292 1557614
5853 1557614 1597624 1711176 1857784 2015255 2285391 2562178 2982179 3759294 4927600 6201074
5843 6201074 6903428 6693720 5793830 4840817 3950471 3356917 2871013 2490043 2198552 1933575
5833 1933575 1816340 1738212 1695282 1663936 1616905 1630510 1595256 1533466 1506875 1602624 1664730
5822 1664730 1622346 1589935 1603098 1594244 1587342 1622994 1653139 1709498 1830359 1885558 1864214 1860259
5810 1860259 1843079 1842661 1863960 1831048 1822846 1826573 1881096 1947817 2023859 2104132 2140760 2250704
5798 2250704 2377106 2473509 2578313 2817325 3150017 3529228 4047459 4668753 5187260 5362523
5788 5362523 5293144 5114556 4836230 4582150 4429033 4319395 4174158 4018047 3954861 4066146
5778 4066146 4243252 4513911 4846270 5313060 5808471 6224884 6564033 6843045 7024732 7079959
5768 7079959 7001757 6869226 6646458 6503545 6372602 6180073 5958830 5786687 5667015 5555795
5758 5555795 5485044 5546396 5711040 5839659 6037543 6342123 6565332 6818954 7091902 7205873
5748 7205873 7099674 6870204 6692593 6475025 6204181 5885799 5652786 5407462 5184082 5014889
5738 5014889 4927085 4850619 4827345 4917727 5020986 5017750 4872167 4742757 4659474 4577610 4523759
5727 4523759 4495140 4423415 4466699 4543811 4720067 4826123 4860342 4934754 5005178 5121846 5195945
5716 5195945 5273613 5432062 5542438 5559302 5750083 5901545 6048392 6278548 6496987 6795363
5706 6795363 7144535 7617316 8314985 9348421 10986752 13864812 17531795 20333113 20619012
5697 20619012 18873094 16407816 14215789 12547650 11276807 10347969 9530981 9012495 8729481
5688 8729481 8618817 8553248 8578588 8591154 8636134 8782877 8939579 9175450 9444831 9867676
5678 9867676 10330693 10987006 11827520 12824433 14230403 16792384 20866597 26193592 32122516
5669 32122516 39814310 49330923 55886274 54661036 47507260 38991152 31616696 26150533
5661 26150533 22176666 19179559 16788412 15036873 13650846 12714388 11948910 11442399 11051326
5652 11051326 10691913 10429105 10299550 10290863 10448056 10766230 11259864 11860346 12494244 13036650
5642 13036650 13674657 14567033 16177437 19044234 24486315 33696127 44934265 52023024
5634 52023024 50327009 42980889 34471220 27305878 22121011 18309632 15476512 13376493
5626 13376493 11859584 10803383 10221584 9750323 9517177 9380450 9278991 9098681 8838393
5617 8838393 8597744 8369666 8140087 7988113 8032985 8177777 8492761 8945835 9367025 9913257
5607 9913257 10909585 12796569 15892467 19376119 21070784 19883374 17088665 14185572
5599 14185572 11802349 10029492 8630030 7652991 6894957 6293405 5883918 5535812 5275283
5590 5275283 5097570 4938758 4739820 4513381 4379692 4349167 4276980 4227328 4143699 4014491
5580 4014491 3920456 3887557 3851332 3753676 3576211 3441236 3393538 3371954 3313428 3270994 3161456
5569 3161456 3051328 2998611 2955170 2954679 2935124 2879483 2742408 2656236 2600759 2561931 2521255
5558 2521255 2477968 2495170 2404559 2364577 2377079 2387288 2363538 2412080 2450500 2486692 2554440
5547 2554440 2583103 2540355 2464540 2426951 2327439 2211732 2167328 2102903 2081814 2166386 2201324
5536 2201324 2132292 2070683 2085434 2115864 2184554 2172705 2109133 2096261 2033985 2077537 2064267
5525 2064267 2025377 2050071 2100408 2102401 2168760 2254613 2311284 2308752 2451686 2721045 3031765
5514 3031765 3152769 3076506 2914006 2663018 2472700 2407714 2315846 2195821 2190136 2166699 2181672
5503 2181672 2164024 2196248 2159805 2081734 2065209 2086155 2104062 2141676 2167717 2214353 2241124
5492 2241124 2262668 2295565 2378050 2378718 2456724 2477011 2600149 2823821 3041728 3306410 3392296
5481 3392296 3335602 3219420 3044584 2796957 2714112 2673686 2666151 2669322 2689733 2755323 2794517
5470 2794517 2858419 2872234 2930136 2872978 2810205 2810571 2740564 2798763 2794408 2805109 2774430 2735302
5458 2735302 2773931 2773317 2797387 2899219 2962470 2998314 3112357 3234095 3224914 3182117 3097788
5447 3097788 3124118 3184842 3180022 3219254 3384521 3532193 3682581 3856139 4052216 4288733
5437 4288733 4464743 4623299 4780366 4906250 5172054 5487721 5807610 6184382 6798647 7577373
5427 7577373 8945717 11323406 15843984 23301259 31231142 34436297 31394436 25758115
5419 25758115 20143736 15880451 12772530 10634972 8960607 7824335 7091305 6598978
5411 6598978 6217823 5939185 5806812 5751988 5799703 6060854 6525966 6909300 7040667 6945967
5401 6945967 6672880 6199552 5804113 5435658 5160671 5014695 4942109 4906769 4884983 4901606
5391 4901606 4922097 4962786 4913257 4887504 4862489 4829373 4946132 5097982 5321483 5629110 5963043
5380 5963043 6226664 6404871 6585636 7029693 7532995 8236235 9380479 10970226 13004912
5371 13004912 15165794 16445293 16238844 14850047 12878129 11090165 9595322 8447664
5363 8447664 7554538 6769454 6267930 5884736 5546998 5297210 5110141 4958761 4866981 4819464
5353 4819464 4771454 4809715 4843690 4853627 4916367 5002178 5176663 5391241 5706935 6082560 6426368
5342 6426368 6879492 7619112 8762764 10389794 12418230 14035526 14407603 13689352 12290658
5333 12290658 10666497 9283428 8280772 7616099 7036576 6622727 6280236 6038616 5874461
5324 5874461 5786173 5680792 5640709 5657110 5831122 6273197 7148895 8323541 9245497 9342754
5314 9342754 8736795 7963453 7376743 6992919 6737996 6618564 6661244 6930864 7318730 7903364
5304 7903364 8424857 8699525 8625012 8392763 8098842 7920901 7902478 8084950 8500245 9163571
5294 9163571 9990503 10704617 10984985 10690569 10233689 9856016 9620294 9708650 9962133 10216005
5284 10216005 10270802 10066482 9635991 9173921 8773840 8381071 7889145 7343042 6946432 6616482
5274 6616482 6331377 6303111 6456858 6587298 6671725 6539296 6172654 5831060 5622876 5520102
5264 5520102 5454671 5410318 5272362 5122429 5027765 4908205 4754577 4707397 4667735 4649609 4610291
5253 4610291 4635519 4695179 4768360 4873180 4943599 4965524 5015516 5167076 5266726 5398687 5404924
5242 5404924 5443964 5512033 5563119 5581095 5620683 5742886 5863989 5989582 6217900 6466163
5232 6466163 6732522 7111506 7386723 7711777 7920894 7815102 7582996 7420478 7306517 7237433
5222 7237433 7138411 7140538 7161319 7140208 7155310 7160753 7123183 7110723 7083724 7101539 7191319 7286618
5210 7286618 7429063 7563859 7715150 7944639 8127877 8329228 8543707 8711347 8975363 9271455
5200 9271455 9575472 10093519 10736304 11543582 12571861 13986586 16218148 19647984 23915466
5191 23915466 26742215 26371644 23751883 20616968 18135169 16514008 15454772 14963720
5183 14963720 14782754 14672348 14319082 13741529 12978457 12189544 11510456 10938595 10357247
5174 10357247 9932007 9619196 9431333 9307701 9266850 9229826 9211991 9124954 8967569 8701803
5164 8701803 8501219 8338245 8201705 8204103 8229893 8263130 8359232 8479355 8673333 9007417
5154 9007417 9217337 9456588 9634616 9904190 10260131 10685452 11089447 11462445 11824614 12345323
5144 12345323 13121085 14094218 15347658 16722752 17692930 17878163 17533408 17067411 16706511
5135 16706511 16558462 16683633 16632275 16484509 16405291 16547917 16972829 17978868 19508178
5126 19508178 21518801 23592203 25489253 27217333 28690131 29970637 30795753 30957803
5118 30957803 30588196 29689291 28648938 27558835 26603873 26052482 25666544 25427406 25308447
5109 25308447 25450116 26062222 26800871 27333658 27500129 27250606 26652358 25979039 25411877
5100 25411877 24960963 24544130 24066715 23579185 23400128 23491526 23939595 25102799 27415324
5091 27415324 30728077 33639947 35099053 35782792 36669891 38179114 39416020 40087249 41051932
5082 41051932 43607987 48995907 60276854 81657164 110090056 130383877 128567903 112294806
5074 112294806 93280418 76896005 64154692 54284610 46837942 41310231 37428504 34742057
5066 34742057 33425649 33651139 34944140 36128009 36101973 34937049 33221819 31614322 30416489
5057 30416489 29850589 30139624 31561624 34232264 38113342 42446079 44911703 43563343
5049 43563343 39395133 34576884 30375154 27210594 24940085 23491035 22733411 22436957
5041 22436957 22014296 21201699 20221617 19311952 18714309 18515915 18574626 18900188 19237098 19492767
5031 19492767 19447438 19324872 19235438 19293834 19442068 19436146 19021933 18419145 17760043 17226123
5021 17226123 16791375 16511591 16270192 16046372 15704095 15327478 15002587 14782813 14597149
5012 14597149 14538958 14585463 14841463 15264478 15553954 15658195 15725247 15728623 15798495 15911404
5002 15911404 16030904 16107452 16091364 15851596 15471702 15130954 14761595 14451591 14075209 13763263
4992 13763263 13423164 13109958 12808491 12394953 12054471 11720904 11515459 11360152 11280495 11266549
4982 11266549 11450774 11772083 12097401 12458115 12656515 12764629 12884192 13109595 13255657
4973 13255657 13340313 13606157 14119116 14839524 15507844 16103765 16461894 16588445 16384800 15719175
4963 15719175 14836021 13792312 12793042 11993035 11431112 11113150 11240903 11770437 12799011
4954 12799011 14031133 14725549 14736696 14052966 12850936 11790209 11033753 10629082 10302627
4945 10302627 9959376 9541910 9046472 8544494 8136542 7834536 7428299 7178682 6980864
4936 6980864 6872828 6792027 6620882 6491253 6326301 6175180 6031232 5948102 5795010 5796532
4926 5796532 5803080 5765450 5767405 5728527 5654631 5524405 5543747 5563367 5686522 5821291 6024606
4915 6024606 6264784 6476406 6771264 7174675 7529759 7888863 8239491 8450126 8471291 8257474
4905 8257474 7825134 7383071 6873551 6456042 6139788 5851919 5646802 5456686 5295386 5170744
4895 5170744 5089468 4998529 4980660 5035818 5180653 5155157 5206024 5294004 5329960 5421449 5536156
4884 5536156 5742876 5943499 6101360 6255633 6383545 6521715 6658147 6783627 6810977 6697195
4874 6697195 6654563 6622926 6658951 6811054 7006496 7308244 7883274 8937095 10291535 11480374
4864 11480374 12222069 12656056 12522911 11776195 10799280 9870255 9186572 8749822 8509129
4855 8509129 8353293 8363331 8483214 8690962 9117865 9677646 10417192 11249503 12119829 12864886
4845 12864886 13338190 13629113 13818458 13910903 14098636 14167118 14159795 13939050 13604335 13392932
4835 13392932 13273003 13334248 13561249 13901037 14170437 14359761 14478712 14543497 14461861 14374328
4825 14374328 14207197 13941588 13643878 13300447 13021116 12736438 12585148 12398047 12299532 12355374
4815 12355374 12491970 12702046 13082060 13660260 14243877 14978239 15900658 16850811 17918294
4806 17918294 19294289 20897242 22883100 25231489 27793120 30443698 33212603 36346938
4798 36346938 40451082 46184301 54076133 63190285 69768503 70325185 65238395 57286186
4790 57286186 49048078 41869133 36108013 31562098 28086281 25457394 23550145 22380342
4782 22380342 21584743 21211440 21152107 21398971 21900123 22646415 23683914 24821244 26236956
4773 26236956 27873593 30015388 32660900 35535064 38245689 40215061 41052174 40876239
4765 40876239 39928665 38469965 36809749 35218921 33728358 32346506 30937974 29383421
4757 29383421 27835245 26372601 25148045 24148409 23490898 23112444 22891352 22883648 23188155
4748 23188155 23752981 24599342 25756441 27251542 29202013 31674630 34694312 38326373
4740 38326373 42432375 46847875 51086477 54411991 56210233 56288068 54865441 52496098
4732 52496098 49719012 46987873 44408121 41975910 39663526 37166490 34560310 31968586
4724 31968586 29559163 27456086 25677530 24315241 23224684 22350948 21690216 21277190 21065333
4715 21065333 21088453 21413027 21836333 22398861 23216696 24073351 25069669 26103141 26805346
4706 26805346 27225470 27196454 26841570 26152476 25405416 24678692 24121403 23806490 23623059 23554694
4696 23554694 23452814 23181173 22935149 22734903 22579330 22562888 22902137 23556361 24459494 25781130
4686 25781130 27575277 29941250 32791904 36501374 41614522 48995111 60111218 77426394
4678 77426394 104094117 138218099 167083666 174290169 160099432 136085130 110993900
4671 110993900 89423054 72238498 58834132 48287310 40073409 33744622 28930693
4664 28930693 25331402 22631000 20475924 18785941 17333758 16143915 15119167 14239213
4656 14239213 13572234 13051708 12614101 12295671 11965359 11756364 11580059 11458351 11266789
4647 11266789 11097943 10941720 10675339 10193204 9739401 9281564 8842525 8463508 8188452
4638 8188452 7884129 7608542 7357951 7165663 7097908 6927641 6667583 6535783 6496743 6354337
4628 6354337 6187113 6089097 5961865 5826573 5713019 5643934 5517444 5434933 5375225 5304811
4618 5304811 5323879 5292212 5244401 5237732 5348554 5586553 5801092 5749222 5460565 5177754 4832183
4607 4832183 4701340 4593210 4470462 4327558 4226260 4164190 4101325 4055492 3980674 3848137
4597 3848137 3773536 3814610 3772054 3696462 3654306 3562722 3549670 3521736 3500454 3540432 3575178
4586 3575178 3563988 3550994 3563831 3528842 3506224 3532342 3592260 3518387 3492311 3550343 3592951
4575 3592951 3633922 3756437 3830726 3934914 4065938 4271220 4685295 5120063 5438607 5582975
4565 5582975 5454069 5268086 4949935 4611646 4313324 4075711 3883813 3705559 3490489 3435538
4555 3435538 3340099 3308357 3271456 3241858 3267314 3289280 3354937 3431753 3428755 3365607 3275410 3199132
4543 3199132 3112628 3071972 3044878 2948599 2799971 2767702 2775469 2720583 2687680 2752945 2751383 2765119
4531 2765119 2797661 2810550 2753149 2732490 2738736 2657648 2610611 2600901 2569528 2597197 2564969 2545341
4519 2545341 2522863 2470143 2476481 2466628 2522967 2523461 2550650 2497549 2471335 2505400 2486765 2535219
4507 2535219 2545155 2601380 2637127 2634307 2595471 2618123 2662801 2640866 2635632 2582866 2499691 2514193
4495 2514193 2480143 2491656 2500490 2536504 2570838 2514422 2524930 2550640 2570442 2511856 2521469 2486192
4483 2486192 2561261 2616260 2741721 2760832 2789622 2761289 2753852 2745775 2750985 2806158 2777578 2718884
4471 2718884 2738387 2762259 2798136 2786733 2835980 2849048 2800861 2751939 2718880 2689306 2638409
4460 2638409 2703752 2617265 2565751 2655797 2703402 2639970 2602230 2616882 2614908 2620664 2572341 2559567
4448 2559567 2592680 2613892 2632120 2629223 2633090 2669292 2639969 2701526 2847639 2895407 2968922 3094218
4436 3094218 3189503 3372756 3554336 3609866 3524374 3388824 3237909 3164071 3121504 3104853 3013756
4425 3013756 2976291 2973485 2928956 2883433 2827445 2774550 2702448 2709823 2718817 2708700 2670027 2625410
4413 2625410 2586784 2642807 2663244 2687893 2660754 2651331 2684258 2720911 2732824 2701531 2725124 2797149
4401 2797149 2839530 2852302 2910966 2932175 2942607 2934170 2914212 2865425 2816210 2810218 2862902 2920960
4389 2920960 3175717 3475042 3750711 3811275 3633369 3461941 3198893 2960155 2805006 2750431
4379 2750431 2695336 2729013 2684528 2586320 2607627 2572992 2622755 2653022 2603096 2576741 2569377 2635245
4367 2635245 2685981 2725481 2754493 2810379 2870963 2885298 2903830 2973127 2995471 3157348 3212254
4356 3212254 3230155 3203513 3130740 3025007 2916452 2849823 2777601 2652156 2626557 2655230 2602935
4345 2602935 2541648 2562300 2624033 2721847 2744382 2715890 2729028 2708601 2695429 2617124 2604972
4334 2604972 2554143 2578234 2602428 2603542 2609252 2574401 2656809 2740898 2791654 2879115 2800525 2753071
4322 2753071 2717870 2657103 2616697 2496808 2526179 2570559 2530872 2503282 2549558 2458492 2468392
4311 2468392 2470066 2487892 2488345 2460206 2487368 2542508 2591995 2604050 2623859 2637179 2566862 2522998
4299 2522998 2577356 2596960 2628369 2667202 2650246 2602262 2568734 2550744 2636512 2654915 2624609
4288 2624609 2593041 2632284 2732005 2764101 2840871 2959180 3029244 3065205 3012240 2944807 2871576
4277 2871576 2837983 2706410 2718142 2785002 2780885 2769247 2803287 2883171 2913831 2952308 2926786
4266 2926786 2913654 2867429 2818327 2819108 2778831 2764311 2741365 2667900 2711375 2705500 2712985 2693883
4254 2693883 2656375 2661762 2607169 2509132 2512634 2468768 2400458 2422684 2415438 2423500 2404241 2374868
4242 2374868 2382079 2403189 2377800 2373502 2314076 2367798 2310814 2296878 2299696 2303741 2314492 2361128
4230 2361128 2400942 2438868 2431479 2374442 2344191 2446295 2465033 2449604 2489311 2532578 2628256
4219 2628256 2639760 2702727 2787618 2811475 2742233 2646098 2578557 2550153 2518640 2492055 2431985
4208 2431985 2353971 2387188 2311174 2222635 2231478 2192745 2181635 2177576 2159246 2136600 2173644 2281525
4196 2281525 2303265 2220132 2142854 2180198 2236959 2288046 2363132 2408339 2415161 2504841 2611094
4185 2611094 2655266 2670422 2647628 2628339 2513564 2391983 2303235 2238926 2204110 2179908 2147453
4174 2147453 2152174 2176431 2137311 2041470 2087005 2111297 2012216 2002598 2054015 2028641 2058337 2132436
4162 2132436 2104636 2119145 2182115 2148296 2151808 2134495 2181177 2268553 2313089 2281730 2326323 2285747
4150 2285747 2284408 2166678 2147123 2101906 2093415 2142078 2127697 2116627 2116213 2190370 2097165 2080975
4138 2080975 2040784 1994730 1946989 1966349 1940698 1917401 1970164 1928048 1893299 1919881 1895145
4127 1895145 1831552 1802528 1836226 1861994 1866877 1875468 1858772 1892655 1952799 1972928 1967763 1911814
4115 1911814 1905230 1857223 1830440 1848194 1869395 1828127 1804947 1842090 1809010 1810333 1757171 1800772
4103 1800772 1766794 1709951 1729105 1727740 1693189 1723073 1717651 1724116 1751418 1740605 1696650 1781460
4091 1781460 1830604 1759882 1767788 1709158 1663480 1639510 1671603 1655818 1652023 1640697 1661166 1699054
4079 1699054 1685830 1649141 1601689 1583963 1591942 1596108 1633974 1598915 1607450 1541726 1456903 1518265
4067 1518265 1540608 1513324 1508460 1574133 1566887 1525336 1539889 1522394 1516072 1531486 1521655 1510408
4055 1510408 1487761 1471525 1544992 1528967 1511011 1499987 1498964 1507281 1479829 1477996 1467254 1476643
4043 1476643 1449792 1465222 1444811 1477613 1528177 1486538 1470094 1548916 1600962 1614867 1609098 1534298
4031 1534298 1516523 1481008 1469281 1467716 1521046 1487113 1433154 1350269 1289454 1340573 1359301 1348810
4019 1348810 1365310 1305677 1258345 1300267 1283696 1274788 1185473 1214495 1192257 1210405 1298750 1238236
4007 1238236 1291007 1286069 1266893 1263748 1267985 1272357 1176781 1149652 1253751 1260847 1208797 1148823
3995 1148823 1156096 1101829 1171794 1179746 1180056 1181803 1197184 1244919 1175172 1169333 1189363 1119323 1170570
3982 1170570 1173986 1121126 1170676 1199558 1183097 1189598 1211575 1186466 1197143 1178075 1171239 1140586
3970 1140586 1183978 1207132 1233584 1190096 1150858 1101443 1119661 1104020 1122550 1133898 1128556 1109456
3958 1109456 1142857 1170980 1146965 1185280 1227805 1203018 1207079 1139031 1105182 1122928 1147864 1129790
3946 1129790 1140343 1142543 1141564 1138516 1096866 1136623 1172528 1151491 1147842 1135876 1174532 1224165
3934 1224165 1204410 1184012 1146186 1181716 1186635 1198735 1187165 1188173 1203293 1224193 1198694 1186753
3922 1186753 1218508 1237729 1202981 1212120 1265959 1272447 1294926 1236778 1232751 1301627 1288686 1280516
3910 1280516 1260125 1226869 1268781 1261861 1210671 1202979 1278496 1300868 1253963 1225513 1275332 1275224
3898 1275224 1281774 1267479 1260056 1292404 1313858 1256086 1242233 1388938 1331239 1285043 1273476 1279212
3886 1279212 1322842 1314063 1300783 1247309 1263362 1206288 1251536 1323486 1357052 1406095 1372747 1351117
3874 1351117 1301654 1292601 1365062 1347552 1299776 1301460 1286430 1355103 1280941 1262072 1287063 1292469
3862 1292469 1307872 1322494 1301277 1277538 1293553 1280962 1255307 1353471 1384799 1332870 1342429 1289725
3850 1289725 1327088 1325020 1249480 1296624 1393052 1438672 1374955 1366367 1387670 1371741 1294885 1252911
3838 1252911 1238933 1241075 1263259 1276174 1308024 1393414 1351908 1295981 1272476 1303241 1311773 1292963
3826 1292963 1322854 1295522 1203386 1199090 1199467 1217344 1297307 1297280 1323847 1292107 1280469 1251149 1279449
3813 1279449 1219193 1234672 1292576 1299076 1300331 1322101 1355510 1368308 1318872 1254144 1268638 1270296
3801 1270296 1253891 1252939 1332337 1332958 1309896 1323874 1332934 1342479 1319200 1332287 1343545 1317837 1262332
3788 1262332 1267415 1272553 1314850 1346973 1331072 1335709 1391217 1375926 1365340 1344244 1334309 1354583
3776 1354583 1311069 1365411 1383652 1423590 1434223 1418442 1429617 1455873 1446154 1494954 1465708 1470059
3764 1470059 1515728 1533774 1476413 1467479 1470067 1468301 1488417 1427944 1419341 1406699 1523470 1527483
3752 1527483 1469873 1436308 1439549 1423832 1453320 1491157 1488606 1442507 1443439 1492374 1473715 1455748
3740 1455748 1503298 1496964 1536689 1588507 1571730 1608452 1647708 1717877 1768609 1782186 1761359 1766844
3728 1766844 1646730 1620201 1643369 1608029 1512045 1538737 1539568 1500617 1519123 1552814 1584187 1566272
3716 1566272 1547890 1592153 1605820 1546573 1578674 1616983 1587246 1608078 1648713 1658910 1665333 1655911
3704 1655911 1660733 1709372 1853141 1923992 2046411 2008936 1915222 1823435 1767345 1680166 1690068
3693 1690068 1596971 1529236 1585764 1612307 1636739 1622951 1587102 1593458 1620231 1554055 1466616 1522073
3681 1522073 1557724 1551292 1619229 1633778 1617322 1568435 1565435 1558621 1629437 1657529 1692275 1734350
3669 1734350 1742726 1824061 1856116 1819213 1769813 1785774 1778097 1733153 1637593 1629868 1607866 1565227
3657 1565227 1577096 1631397 1655133 1601829 1677978 1671379 1653209 1719727 1830561 1835370 1811258 1824032
3645 1824032 1849924 1900714 1964734 1943024 1911076 1847768 1850641 1886331 1903987 1913557 1965932 2001667
3633 2001667 2024298 2054814 2084840 2089416 2088918 2046333 2043386 2084393 2101666 2085781 2080349 2106557
3621 2106557 2176583 2221199 2212092 2177749 2226989 2337217 2401002 2452690 2517801 2558127 2609585
3610 2609585 2684402 2678749 2745192 2780052 2821107 3004360 3117395 3245028 3339447 3348675 3476873
3599 3476873 3560889 3712168 3880145 4027675 4190509 4502070 4831728 5296196 5925739 6837053
$$ [...]
##END NTUPLES=NMR SPECTRUM
##END=
