##TITLE=1H_EC-3373(II-2)
 200.13MHz,CDcl3.
 8 sc
 
 20.2.2026
##JCAMPDX= 6.0         $$ Bruker NMR JCAMP-DX V2.0
##DATA TYPE= NMR SPECTRUM
##DATA CLASS= NTUPLES
##ORIGIN= UXNMR, Bruker Analytische Messtechnik GmbH
##OWNER= pz
$$ XWIN-NMR		Version 3.5
$$ Fri Feb 20 13:51:12 2026 Russian Standard Time (UT+4h)  she@DPX200
##.OBSERVE FREQUENCY= 200.1313
##.OBSERVE NUCLEUS= ^1H
##.ACQUISITION MODE= SIMULTANEOUS
##.ACQUISITION SCHEME= undefined
##.AVERAGES= 8
##.DIGITISER RES= 18
##SPECTROMETER/DATA SYSTEM= spect
##.PULSE SEQUENCE= zg30
##.SOLVENT NAME= CDCl3
##.SHIFT REFERENCE= (INTERNAL, CDCl3, 0, 15.4781)
##AUDIT TRAIL= $$ (NUMBER, WHEN, WHO, WHERE, WHAT)
$$ ##TITLE= Audit trail, XWIN-NMR		Version 3.5
$$ ##JCAMPDX= 5.01
$$ ##ORIGIN= Bruker BioSpin GmbH
$$ ##OWNER= she
$$ F:/spectra/data/she/nmr/H-C/1/pdata/1/auditp.txt
$$ ##AUDIT TRAIL=  $$ (NUMBER, WHEN, WHO, WHERE, WHAT)
(   1,<2026-02-20 13:49:46.46 +0400>,<she>,<DPX200>,
      <created by zg, POWCHK disabled, PULCHK disabled
       configuration hash MD5:
       00 E9 B6 7A A2 85 ED C7 34 08 36 98 17 FE 4E 26
       data hash MD5: 16K
       BD 25 92 61 56 64 BC 3B 8A BB DD 90 5A FB 0C FB>)
(   2,<2026-02-20 13:49:48.96 +0400>,<she>,<DPX200>,
      <Start of raw data processing
       efp BC_mod = 2 LB = 0.25 FT_mod = 6 PKNL = 1 PHC0 = -3700.942 PHC1 = 13.59232 SI = 16K 
       data hash MD5: 16K
       C8 D9 B9 05 90 09 20 2B 11 C5 A9 4D B7 F0 3D C5>)
(   3,<2026-02-20 13:50:17.79 +0400>,<she>,<DPX200>,
      <pk PHC0 = 1.899155 PHC1 = -3.8 
       data hash MD5: 16K
       67 DB 3F D9 E5 C6 0F B0 7A 92 09 CE 89 5A 18 1C>)
(   4,<2026-02-20 13:50:22.25 +0400>,<she>,<DPX200>,
      <abs ABSG = 5 
       data hash MD5: 16K
       ED C2 1E 9C 86 2A 23 02 E2 CA AD D7 0E 76 C4 7C>)
$$ ##END=
$$ 
$$ hash MD5
$$ 93 19 8C 88 B2 F4 86 E3 95 FA D5 8C 93 E9 72 96
##$RELAX= 
##$RELAX= 
##$RELAX= 
##$RELAX= 
##$RELAX= 
##$RELAX= 
$$ Bruker specific parameters
$$ --------------------------
##$DU= <F:/spectra>
##$EXPNO= 1
##$NAME= <H-C>
##$PROCNO= 1
##$TYPE= <nmr>
##$USER= <she>
##$AMP= (0..31)
100 100 100 100 100 100 100 100 100 100 100 100 100 100 100 100 100 100 
100 100 100 100 100 100 100 100 100 100 100 100 100 100 
##$AQSEQ= 0
##$AQ_mod= 1
##$AUNM= <au_zg>
##$AUTOPOS= <>
##$BF1= 200.13
##$BF2= 200.13
##$BF3= 200.13
##$BF4= 200.13
##$BF5= 200.13
##$BF6= 200.13
##$BF7= 200.13
##$BF8= 200.13
##$BYTORDA= 1
##$CFDGTYP= 0
##$CFRGTYP= 5
##$CHEMSTR= <none>
##$CNST= (0..31)
1 1 145 1 1 1 1 1 1 1 1 1 1 1 1 1 1 1 1 1 1 1 1 1 1 1 1 1 1 1 1 1 
##$CPDPRG= <>
##$CPDPRG1= <>
##$CPDPRG2= <>
##$CPDPRG3= <>
##$CPDPRG4= <mlev>
##$CPDPRG5= <mlev>
##$CPDPRG6= <mlev>
##$CPDPRG7= <mlev>
##$CPDPRG8= <mlev>
##$CPDPRGB= <>
##$CPDPRGT= <>
##$D= (0..31)
0 0.7 0 0 0 0 0 0 0 0 0 0.03 0 0 0 0 0 0 0 0 0 0 0 0 0 0 0 0 0 0 0 0 
##$DATE= 1771580985
##$DBL= (0..7)
120 120 120 120 120 120 120 120 
##$DBP= (0..7)
150 150 150 150 150 150 150 150 
##$DBP07= 0
##$DBPNAM0= <>
##$DBPNAM1= <>
##$DBPNAM2= <>
##$DBPNAM3= <>
##$DBPNAM4= <>
$$ [...]
##$SUBNAM3= <"">
##$SUBNAM4= <"">
##$SUBNAM5= <"">
##$SUBNAM6= <"">
##$SUBNAM7= <"">
##$SUBNAM8= <"">
##$SUBNAM9= <"">
##$SW= 18.0517328524113
##$SWIBOX= (0..15)
0 0 2 0 0 0 0 0 0 0 0 0 0 0 0 0 
##$SW_h= 3612.71676300578
##$TD= 16384
##$TD0= 1
##$TE= 0
##$TE2= 300
##$TE3= 300
##$TEG= 300
##$TL= (0..7)
0 120 120 120 120 120 120 120 
##$TP= (0..7)
150 150 150 150 150 150 150 150 
##$TP07= 0
##$TPNAME0= <>
##$TPNAME1= <>
##$TPNAME2= <>
##$TPNAME3= <>
##$TPNAME4= <>
##$TPNAME5= <>
##$TPNAME6= <>
##$TPNAME7= <>
##$TPOAL= (0..7)
0.5 0.5 0.5 0.5 0.5 0.5 0.5 0.5 
##$TPOFFS= (0..7)
0 0 0 0 0 0 0 0 
##$TUNHIN= 0
##$TUNHOUT= 0
##$TUNXOUT= 0
##$USERA1= <user>
##$USERA2= <user>
##$USERA3= <user>
##$USERA4= <user>
##$USERA5= <user>
##$V9= 5
##$VALIST= <valist>
##$VCLIST= <CCCCCCCCCCCCCCC>
##$VD= 0
##$VDLIST= <DDDDDDDDDDDDDDD>
##$VPLIST= <PPPPPPPPPPPPPPP>
##$VTLIST= <TTTTTTTTTTTTTTT>
##$WBST= 1024
##$WBSW= 4
##$XGAIN= (0..3)
0 0 0 0 
##$XL= 0
##$YL= 0
##$YMAX_a= 152117
##$YMIN_a= -264815
##$ZGOPTNS= <>
##$ZL1= 120
##$ZL2= 120
##$ZL3= 120
##$ZL4= 120
##$ABSF1= 15.47034
##$ABSF2= -2.58151
##$ABSG= 5
##$ABSL= 3
##$ALPHA= 0
##$AQORDER= 0
##$ASSFAC= 0
##$ASSFACI= 0
##$ASSFACX= 0
##$ASSWID= 0
##$AUNMP= <proc_1d>
##$AZFE= 0.1
##$AZFW= 0.1
##$BCFW= 0
##$BC_mod= 2
##$BYTORDP= 0
##$COROFFS= 0
##$CY= -3
##$DATMOD= 1
##$DC= 0
##$DFILT= <>
##$DTYPP= 0
##$F1P= 0
##$F2P= 0
##$FCOR= 1
##$FTSIZE= 16384
##$FT_mod= 6
##$GAMMA= 0
##$GB= 0
##$INTBC= 1
##$INTSCL= 3.241238e-09
##$ISEN= 128
##$LB= 0.25
##$LEV0= 0
##$LPBIN= 0
##$MAXI= 10000
##$MC2= 0
##$MEAN= 0
##$ME_mod= 0
##$MI= 1.114404
##$NCOEF= 0
##$NC_proc= -6
##$NLEV= 6
##$NOISF1= 3.799351
##$NOISF2= 2.8
##$NSP= 0
##$NTH_PI= 0
##$NZP= 0
##$OFFSET= 15.47805
##$PC= 1
##$PHC0= -3699.043
##$PHC1= 9.79232
##$PH_mod= 1
##$PKNL= yes
##$PPARMOD= 0
##$PSCAL= 0
##$PSIGN= 0
##$REVERSE= no
##$SF= 200.130008736761
##$SI= 16384
##$SIGF1= 3
##$SIGF2= 2
##$SINO= 0.751879
##$SIOLD= 32768
##$SREGLST= <19F.Aceton>
##$SSB= 0
##$STSI= 16384
##$STSR= 0
##$SW_p= 3612.71676300578
##$SYMM= 0
##$S_DEV= 0
##$TDeff= 16384
##$TDoff= 0
##$TI= <>
##$TILT= no
##$TM1= 0
##$TM2= 0
##$TOPLEV= 0
##$USERP1= <user>
##$USERP2= <user>
##$USERP3= <user>
##$USERP4= <user>
##$USERP5= <user>
##$WDW= 1
##$XDIM= 16384
##$YMAX_p= 270687918
##$YMIN_p= -675710
$$ End of Bruker specific parameters
$$ ---------------------------------
##NTUPLES= NMR SPECTRUM
##VAR_NAME=  FREQUENCY,     SPECTRUM/REAL,   SPECTRUM/IMAG
##SYMBOL=    X,             R,               I
##VAR_TYPE=  INDEPENDENT,   DEPENDENT,       DEPENDENT
##VAR_FORM=  AFFN,          ASDF,            ASDF
##VAR_DIM=   16384,         16384,           16384
##UNITS=     HZ,            ARBITRARY UNITS, ARBITRARY UNITS
##FACTOR=    0.220516191357247, 1,           1
##FIRST=     3097.6223281449, 0,             0
##LAST=      -515.094434860885, 0,           0
##MIN=       -515.094434860885, -675710,     0
##MAX=       3097.6223281449, 270687918,     0
$$ Real data points
##PAGE= N=1
##DATA TABLE= (X++(R..R)), XYDATA
$$ [...]
$$ plain form
7688 206536 182169 106631 96433 172534 219567 171823 138317 156287 130171 207862 204260 309483
7676 309483 241167 211050 188966 216477 223291 128142 122613 151630 248591 231307 72238 4133
7664 4133 69205 126711 212403 307501 215110 211878 409081 337710 226551 93012 947 20721
7652 20721 27872 144572 105803 60495 44024 27213 62695 40645 127598 70874 66698 27753
7640 27753 -14772 -49361 -181389 -191901 -75383 138662 96521 8499 -25557 -21029 -105202
7629 -105202 -56343 31502 19750 6474 -4498 -73343 -27861 -60558 -194184 -70053 4501
7618 4501 -102078 -63285 16070 7681 4501 -58161 -470 41471 -77113 8907 -10315 -30021
7606 -30021 -33258 -159791 -97317 -67166 -157691 -47192 28833 -97710 -133648 58774 93127
$$ packed form
7688B06536k4367p5538j0198P6101M7033m7744l3506J7970k6116P7691l602J05223
7676C09483o8316l0117k2084K7511O814r5149n529K9017R6961j7284j59069o8105
7664D133O5072N7506Q5692R5098r2391l232J97203p1371j11159j33539r2065J9774
7652B0721P151J16700l8769m5308j6471j6811L5482k2050Q6953n6724m176l8945
7640B7753m2525l4589j32028j0512J16518K14045m2141q8022l4056M528q4173
7629a05202M8859Q7845j1752j3276j0972o8845M5482l2697j33626J24131P4554
7618D501j06579L8793P9355q389l180o2662N7691M1941j18584Q6020j9222j9706
7606c0021l237j26533O2474L0151r0525J10499P6025j26543l5938J92422L4353
$$ plain form
7595 93127 -36291 -45190 -41073 -76865 -132313 -144681 -118797 -33790 -116116 -122843 -49754 52265
7583 52265 -109021 -163677 -159557 -205208 -82973 15364 63972 -73957 -100559 -103742 -69559 -79259
7571 -79259 -116429 -41357 58619 11749 -85573 -115226 -142136 -89837 -93779 -32801 -110582 -41633
7559 -41633 -35826 -165206 -167054 -39027 38257 -130377 -70172 129729 61555 2560 -56181
7548 -56181 -120733 -149485 -106147 -8571 7643 79172 21058 60464 41062 124584 243529 80266
7536 80266 27869 87880 51661 -30440 51472 169445 108123 1743 70939 81978 94843
7525 94843 -33972 -190522 -152785 -127843 -147665 -183864 -38352 38907 58951 -13363 -56254
7514 -56254 35564 116212 79997 -74618 -80628 19748 6057 -5363 114681 175393 149184
$$ packed form
7595I3127j29418q899M117l5792n5448j2368K5884Q5007q2326o727P3089J02019
7583E2265j61286n4656M120m5651J22235R8337M8608j37929k6602l183L4183r700
7571g9259l7170P5072R9976m6870r7322k9653k6910N2299l942O0978p7781O8949
7559d1633N807j29380j848J28027P7284j68634O0205J99901o8174n8995n8741
7548e6181o4552k8752M3338R7576J6214P1529n8114L9406j9402Q3522J18945j63263
7536H0266n2397O0011l6219q2101Q1912J17973o1322j06380O9196J1039J2865
7525I4843j28815j56550L7737K4942j9822l6199J45512P7259K0044p2314m2891
7514e6254R1818Q0648l6215j54615o010J00376j3691j1420J20044O0712k6209
$$ plain form
7503 149184 257830 232621 203973 250495 280908 240774 128359 263164 175559 161640 189996
7492 189996 182391 276246 140544 -7769 41826 109207 84829 187448 306185 233510 164353
7481 164353 361469 350239 338256 388956 337605 379516 461347 587923 563056 643790 710826
7470 710826 620948 573171 668396 646048 585126 568877 616632 587925 616551 587118 621487 726819
7458 726819 647266 570344 576818 589570 614136 656194 707199 714183 570624 448979 522448 573129
7446 573129 497226 500162 406276 357677 517874 531584 530522 677654 693542 621208 553540 484632
7434 484632 587127 678700 631246 725389 763417 918482 908613 1033205 958484 996666 1055731
7423 1055731 1163912 964809 872665 868033 752355 780264 819950 670186 648385 624228 620608
$$ packed form
7503A49184J08646k5209k8648M6522L0413m0134j12415J34805q7605j3919K8356
7492A89996p605R3855j35702j48313M9595O7381k4378J02619J18737p2675o9157
7481A64353J97116j1230j1983N0700n1351M1911Q1831J26576k4867Q0734O7036
7470G10826q9878m7777R5225k2348o0922j6249M7755k8707K8626k9433L4369J05332
7458G26819p9553p6922O474J2752K4566M2058N1005O984j43559j21645P3469N0681
7446E73129p5903K936r3886m8599J60197J3710j062J47132J5888p2334o7668o8908
7434D84632J02495R1573m7454R4143L8028J55065r869J24592p4721L8182N9065
7423A055731J08181j99103r2144m632j15678K7909L9686j49764k1801k4157l620
$$ plain form
7412 620608 612738 585917 530374 483614 625426 642688 728851 661554 650049 646861 636917 695184
7400 695184 810056 757128 828234 850990 794545 864220 950056 873443 823124 850358 834213
7389 834213 625691 587098 641048 690616 619169 586715 549438 555699 415463 519150 577043
7378 577043 447392 535149 586614 498750 515023 599960 678389 678034 734658 711771 759149 772359
7366 772359 881621 897258 889886 762689 822427 910460 880489 984654 896447 1128663 1119590
7355 1119590 1123273 1210784 1114944 1110760 1261528 1360417 1518445 1603801 1530825 1508428 1615448
7344 1615448 1615889 1750345 1675829 1650663 1733893 1844412 1850906 1754596 1714895 1844954 1808705
7333 1808705 1653906 1834914 1816952 1733835 1794200 1927150 1755366 1761241 1831471 1729161 1689121
$$ packed form
7412F20608p870k6821n5543m6760J41812J7262Q6163o7297j1505l188r944N8267
7400F95184J14872n2928P1106K2756n6445O9675Q5836p6613n0319K7234j6145
7389H34213k08522l8593N3950M9568p1447l2454l7277O261j40236J03687N7893
7378E77043j29651Q7757N1465q7864J6273Q4937P8429l55N6624k2887M7378J3210
7366G72359J09262J5637p372j27197N9738Q8033k9971J04165q8207K32216r073
7355A119590L683Q7511r5840m184J50768R8889J58028Q5356p2976k2397J07020
7344A615448M41J34456p4516k5166Q3230J10519O494r6310l9701J30059l6249
7333A808705j54799J81008j7962q3117O0365J32950j71784N875P0230j02310m0040
$$ plain form
7322 1689121 1766536 1646539 1557724 1557089 1391553 1418862 1377912 1380818 1313911 1297138 1314295 1281577
7310 1281577 1353740 1313370 1331765 1300460 1225238 1215755 1390090 1429077 1376728 1484275 1635267
7299 1635267 1611758 1515939 1426205 1394320 1470675 1402475 1312487 1262226 1161336 1091357 1101078
7288 1101078 1098891 1092318 1065560 1003679 1069384 1049087 1086423 1150751 1166234 1126706 1122247 1286161
7276 1286161 1338656 1404269 1382106 1383999 1402185 1572798 1611020 1668103 1661471 1758184 1763539 1856472
7264 1856472 1837082 1756857 1813218 1863822 1928939 1753483 1821879 2036669 2071168 2119163 2052739
7253 2052739 2131990 2138993 2097300 2085755 2107579 2213764 2199402 2227933 2267342 2192862 2145572
7242 2145572 2102544 2105975 2142287 2186585 2214642 2142392 1971336 1886954 1912410 1919920 1864733 1728276
$$ packed form
7322A689121P7415j19997q8815o35j65536K7309m0950K906o6907j6773J7157l2718
7310A281577P2163m0370J8395l1305p5222r483J74335L8987n2349J07547J50992
7299A635267k3509r5819q9734l1885P6355o8200q9988n0261j00890o9979R721
7288A101078k187o573k6758o1881O5705k0297L7336O4328J5483l9528m459J63914
7276A286161N2495O5613k2163J893J8186J70613L8222N7083o632R6713N355R2933
7264A856472j9390q0225N6361N0604O5117j75456O8396K14790L4499M7995o6424
7253B052739P9251P003m1693j1545K1824J06185j4362K8531L9409p4480m7290
7242B145572m3028L431L6312M4298K8057p2250j71056q4382K5456P510n5187j36457
$$ plain form
7230 1728276 1612940 1632736 1736601 1611512 1582986 1407819 1453576 1387864 1311961 1281523 1229375
7219 1229375 1229730 1226639 1258953 1188059 1141418 1312896 1148950 988784 1165666 1141873 1090558
7208 1090558 1075327 937662 911292 1010708 1020116 1034487 1034792 962065 913624 835917 741528 751174
7196 751174 690011 680799 868417 1005773 957122 955192 919865 842612 851315 910284 902458 882413
7184 882413 855354 705101 722676 716161 828615 957633 889456 744782 776844 914359 807182
7173 807182 844012 734336 726494 808873 706514 699596 694917 666546 761719 782375 748771 777571
7161 777571 700133 653299 705183 744189 701718 683987 762114 735885 643893 533203 516562
7150 516562 649398 718949 808885 825335 817246 794559 717879 722325 754594 840127 898606 834373
$$ packed form
7230A728276j15336J9796J03865j25089k8526j75167M5757o5712p5903l0438n2148
7219A229375L55l091L2314p0894m6641J71478j63946j60166J76882k3793n1315
7208A090558j5231j37665k6370R9416R408J4371L05p2727m8441p7707r4389R646
7196G51174o1163r212J87618J37356m8651j930l5327p7253Q703N8969p826k0045
7184H82413k7059j50253J7575o515J12454J29018o8177j44674L2062J37515j07177
7173H07182L6830j09676p842Q2379j02359o918m679k8371R5173K0656l3604K8800
7161G77571p7438m6834N1884L9006m2471j7731P8127k6229r1992j10690j6641
7150E16562J32836O9551Q9936J6450q089k2687p6680M446L2269Q5533N8479o4233
$$ plain form
7138 834373 819514 850003 764061 760571 794001 791110 728628 778499 822051 823162 762203 698083
7126 698083 789661 826103 802764 755028 839190 912401 817009 828652 832550 967714 1066973 942498
7114 942498 935397 1011386 1040491 948062 982961 990282 1080217 1028340 963092 965873 1066373 950600
7102 950600 873888 847645 905653 975197 939713 1076096 1011142 940134 942335 963708 1009162 1089751
7090 1089751 1086293 1058406 1034610 889726 847360 893969 986850 980028 1041383 1058064 1109344 1236042
7078 1236042 1261810 1226092 1120159 1113520 1074420 1185378 1128200 1181638 1171187 1206301 1247238
7067 1247238 1260728 1223122 1185050 1145018 1365874 1345030 1375805 1345320 1320448 1328662 1257708
7056 1257708 1375494 1408438 1316307 1314252 1373469 1321146 1390921 1346441 1292306 1330096 1384261
$$ packed form
7138H34373j4859L0489q5942l490L3430k891o2482M9871M3552J111o0959o4120
7126F98083R1578L6442k3339m7736Q4162P3211r5392J1643L898J35164R9259j24475
7114I42498p101P5989K9105r2429L4899P321Q9935n1877o5248K781J00500j15773
7102I50600p6712k6243N8008O9544l5484J36383o4954p1008K201K1373M5454Q0589
7090A089751l458k7887k3796j44884m2366M6609R2881o822O1355J6681N1280J26698
7078A236042K5768l5718j05933o639l9100J10958n7178N3438j0451L5114M0937
7067A247238J3490l7606l8072m0032K20856k0844L0775l0485k4872Q214p0954
7056A257708J17786L2944r2131k055N9217n2323O9775m4480n4135L7790N4165
$$ plain form
7045 1384261 1274928 1336031 1326462 1298602 1396387 1401887 1520112 1630230 1551858 1434863 1370673
7034 1370673 1398333 1354921 1413699 1516557 1626055 1524525 1520504 1619393 1583704 1447951 1506828
7023 1506828 1460486 1557311 1653194 1713193 1636402 1613035 1712610 1693679 1807907 1799858 1865585
7012 1865585 1860895 1881937 1915928 1892618 1810841 1871192 1879278 1886394 1999472 2024525 2025760 1996413
7000 1996413 2040648 2157144 2150532 2131916 2148270 2165510 2253539 2262747 2346202 2496600 2443581
6989 2443581 2419658 2505567 2645787 2698779 2716577 2796993 2971379 3065600 3227293 3320456 3259623
6978 3259623 3320397 3282976 3336231 3386065 3289254 3335569 3452080 3535610 3620850 3654293 3664680
6967 3664680 3665596 3850914 3865174 3882481 3955675 3808427 3776960 3784294 3821827 3958552 4103075
$$ packed form
7045A384261j09333O1103r569k7860R7785N500J18225J10118p8372j16995o4190
7034A370673K7660m3412N8778J02858J09498j01530m021R8889l5689j35753N8877
7023A506828m6342R6825R5883N9999p6791k3367R9575j8931J14228q049O5727
7012A865585m690K1042L3991k3310q1777O0351Q086P116J13078K5053J235k9347
7000A996413M4235J16496o612j8616J6354J7240Q8029R208Q3455J50398n3019
6989B443581k3923Q5909J40220N2992J7798Q0416J74386R4221J61693R3163o0833
6978C259623O0774l7421N3255M9834r6811M6315J16511Q3530Q5240L3443J0387
6967C664680R16J85318J4260J7307P3194j47248l1467P334L7533J36725J44523
$$ plain form
6956 4103075 4062138 4148753 4224267 4199115 4288552 4372505 4441350 4497960 4545002 4651165 4798502
6945 4798502 5013207 4988756 5115826 5121125 5318104 5603418 5807842 5929124 6104795 6270255
6935 6270255 6367780 6631912 6724158 6980722 7205057 7366069 7549327 7754971 7822435 8044115
6925 8044115 8326981 8623809 8793263 9211308 9490451 9938456 10272430 10594996 10997354 11442792
6915 11442792 12018966 12623874 13130600 13514696 14096367 14634140 15166653 15707817 16312668
6906 16312668 16870330 17538717 18283239 18950786 19531620 20250839 21132809 21965626 22754492
6897 22754492 23670832 24570683 25405496 26343126 27258578 27954020 28475761 28965816 29346033
6888 29346033 29544741 29446009 29342256 29236357 28964595 28612040 28090902 27680742 27169147 26651451
$$ packed form
6956D103075m0937Q6615P5514k5152Q9437Q3953O8845N6610M7042J06163J47337
6945D798502K14705k4451J27070N299J96979K85314K04424J21282J75671J65460
6935F270255R7525K64132R2246K56564K24335J61012J83258K05644O7464K21680
6925H044115K82866K96828J69454M18045K79143M48005L33974L22566M02358M45438
6915A1442792N76174O04908N06726L84096N81671N37773N32513N41164O04851
6906A6312668N57662O68387P44522O67547N80834P19219Q81970Q32817P88866
6897B2754492R16340Q99851Q34813R37630R15452O95442N21741M90055L80217
6888B9346033J98708r8732j03753j05899k71762l52555n21138m10160n11595n17696
$$ plain form
6878 26651451 25896113 25277245 24625305 23782676 23163618 22304191 21505510 20812996 20061031
6869 20061031 19450108 18900267 18274175 17612637 17058255 16372742 15765142 15295084 14806268
6860 14806268 14283965 13783113 13432997 12863264 12446486 11995666 11492838 11181040 10776028
6851 10776028 10524261 10053245 9628652 9434479 9212898 8908254 8574099 8333936 8080744
6842 8080744 7928088 7638738 7214179 6983845 6926028 6613561 6372037 6249409 6196618 6038077
6832 6038077 5821973 5858098 5648499 5388082 5176006 5104236 5020557 5018966 4881649 4680998
6822 4680998 4631546 4592874 4514226 4477171 4465501 4341220 4183243 4047644 3979616 4005501 3816442
6811 3816442 3852060 3873173 3798948 3778526 3620727 3667744 3718121 3530913 3441910 3324035 3235753
$$ packed form
6878B6651451p55338o18868o51940q42629o19058q59427p98681o92514p51965
6869B0061031o10923n49841o26092o61538n54382o85513o07600m70058m88816
6860A4806268n22303n00852l50116n69733m16778m50820n02828l11798m05012
6851A0776028k51767m71016m24593j94173k21581l04644l34155k40163k53192
6842H080744j52656k89350m24559k30334n7817l12467k41524j22628n2791j58541
6832F038077k16104L6125k09599k60417k12076p1770q3679j591j37317k00651
6822D680998m9452l8672p8648l7055j1670j24281j57977j35599o8028K5885j89059
6811C816442L5618K1113p4225k0422j57799M7017N0377j87208q9003j17875q8282
$$ plain form
6800 3235753 3073895 3064244 3002382 2901531 2817129 2809413 2708293 2706868 2790801 2715377 2710058 2740928
6788 2740928 2707512 2549698 2692522 2798795 2867667 2853582 2767401 2714557 2940523 2830185
6778 2830185 2816881 2778744 2716318 2769864 2788803 2688692 2652702 2615744 2594120 2549942 2499965
6767 2499965 2514921 2488790 2503598 2597665 2573830 2530332 2573913 2692224 2603859 2605055 2512693
6756 2512693 2535793 2572837 2582243 2598077 2531169 2523226 2563477 2561593 2650390 2695054 2643540 2536707
6744 2536707 2585373 2695206 2674509 2696332 2651066 2594712 2512952 2596041 2541958 2486036 2557651
6733 2557651 2673609 2732944 2760387 2856495 2831556 2796852 2783280 2751146 2913055 2802360 2802417
6722 2802417 2896029 2932358 2994770 2984232 2951519 3093892 3184019 3355121 3539745 3670026 3552064
$$ packed form
6800C235753j61858r651o1862j00851q4402p716j01120j425Q3933p5424n319L0870
6788B740928l3416j57814J42824J06273O8872j4085q6181n2844K25966j10338
6778B830185j3304l8137o2426N3546J8939j00111l5990l6958k1624m4178m9977
6767B499965J4956k6131J4808R4067k3835m3498M3581J18311q8365J196r2362
6756B512693K3100L7044R406J5834o6908p943M0251j884Q8797M4664n1514j06833
6744B536707M8666J09833k0697K1823m5266n6354q1760Q3089n4083n5922P1615
6733B557651J15958N9335K7443R6108k4939l4704j3572l2134J61909j10695N7
6722B802417R3612L6329O2412j0538l2713J42373R0127J71102J84624J30281j17962
$$ plain form
6711 3552064 3450007 3420339 3434222 3363209 3374679 3288335 3261881 3198956 3186448 3120791 3123846
6700 3123846 3145224 2977680 2893808 2838278 2927779 3134257 3267283 3290165 3358965 3380150 3513732
6689 3513732 3641670 3853896 4058536 4389180 4702889 4750997 5095242 5289939 5193694 5147928
6679 5147928 5061148 4965377 4871738 4869849 4812240 4797075 4755000 4677092 4534248 4443328 4363857
6668 4363857 4311660 4119768 3880435 3761832 3728849 3688479 3763273 3772410 3687158 3751161 3765518
6657 3765518 3817580 3927279 3971942 3959028 4133644 4269314 4101988 4068502 4260397 4267008 4200268
6646 4200268 4199311 4068056 4003529 4086947 4042899 3952962 3962170 3898699 3837921 3751586 3625564 3547252
6634 3547252 3446627 3267389 3264327 3200361 3123766 3138901 3143699 2936434 2864898 2993974 2932924
$$ packed form
6711C552064j02057k9668J3883p1013J1470q6344k6454o2925j2508o5657L055
6700C123846K1378j67544q3872n5530Q9501K06478J33026K2882O8800K1185J33582
6689C513732J27938K12226K04640L30644L13709M8108L44245J94697r6245m5766
6679E147928q6780r5771r3639j889n7609j5165m2075p7908j42844r0920p9471
6668D363857n2197j91892k39333j18603l2983m0370P4794R137q5252O4003J4357
6657C765518N2062J09699M4663j2914J74616J35670j67326l3486J91895O611o6740
6646D200268r57j31255o4527Q3418m4048q9937R208o3471o0778q6335j26022p8312
6634C547252j00625j79238l062o3966p6595J5135M798k07265p1536J29076o1050
$$ plain form
6623 2932924 2995252 2930654 2964235 2921226 2939044 3051486 2985261 2946167 2940503 3044557 3026277
6612 3026277 2959426 2991907 2882348 2807690 2961295 2903754 2788349 2878456 2962585 2995500 3175150
6601 3175150 3216195 3292775 3269331 3134043 3144308 3159009 3189452 3184754 3218751 3271623 3297486
6590 3297486 3449480 3661362 3500381 3571476 3750879 3792507 4059808 4124903 4203853 4477007
6580 4477007 4620020 4895165 5203438 5512723 5827558 6078305 6398021 6716393 7223464 7785382
6570 7785382 8376118 9380522 10454467 11594387 12691664 13429174 13824054 13872089 13412465
6561 13412465 12522130 11642220 10966778 10247096 9604590 9105983 8735431 8527114 8394418
6552 8394418 8358682 8398392 8611542 8887818 9110264 9604434 10065072 10460483 11099242 11794727
$$ packed form
6623B932924O2328o4598L3581m3009J7818J12442o6225l9094n664J04054j8280
6612C026277o6851L2481j09559p4658J53605n7541j15405R0107Q4129L2915J79650
6601C175150M1045P6580k3444j35288J0265J4701L0443m698L3997N2872K5863
6590C297486J51994K11882j60981P1095J79403M1628K67301O5095P8950K73154
6580D477007J43013K75145L08273L09285L14835K50747L19716L18372N07071N61918
6570G785382N90736J004404J073945J139920J097277P37510L94880M8035m59624
6561A3412465q90335q79910o75442p19682o42506m98607l70552k08317j32696
6552H394418l5736L9710K13150K76276K22446M94170M60638L95411O38759O95485
$$ plain form
6542 11794727 12561960 13331338 14569274 16033390 17815437 20099510 22734197 25278625
6534 25278625 27205688 28239104 28379244 27922519 26902801 25594033 24593015 24060861 24107217
6525 24107217 24959783 26617703 28894944 31491732 33516983 34453524 34207594 32654450 30415676
6516 30415676 28119850 25865768 23933149 22445875 21459663 20781679 20329610 20254137 20471171
6507 20471171 21118090 22084012 23278432 24539934 26072850 27663301 29160711 30239167
6499 30239167 30995801 31657784 32787128 35032323 38417792 43301703 49041984 54906546
6491 54906546 59500094 61382026 60122337 56204042 50676618 44622984 38873719 33856149
6483 33856149 29596544 26158513 23539228 21280943 19473333 18085064 17165094 16335578
$$ packed form
6542A1794727P67233P69378J237936J464116J782047K284073K634687K544428
6534B5278625J927063J033416J40140m56725j019718j308768j001018n32154M6356
6525B4107217Q52566J657920K277241K596788K025251R36541k45930j553144k238774
6516C0415676k295826k254082j932619j487274r86212o77984m52069p5473K17034
6507B0471171O46919R65922J194420J261502J532916J590451J497410J078456
6499C0239167P56634O61983J129344K245195L385469M883911N740281N864562
6491E4906546M593548J881932j259689l918295n527424o053634n749265n017570
6483C3856149m259605l438031k619285k258285j807610j388269r19970q29516
$$ plain form
6475 16335578 15853167 15738224 15600224 15920565 16439826 17094500 17987845 19178754 20131167
6466 20131167 21285207 22866748 25004628 27701487 30474392 32215464 32628442 31534431
6458 31534431 29279535 26557913 23632295 20694901 18228243 16195661 14316046 12843751
6450 12843751 11608425 10691758 9694853 9055995 8414064 8058634 7738279 7377808 7064772
6441 7064772 6901766 6699943 6589203 6225059 5981148 5815784 5511340 5365850 5241082 5069605
6431 5069605 4872084 4734400 4716056 4765923 4695659 4581067 4657548 4703695 4653677 4610269 4437905
6420 4437905 4373346 4306331 4162497 4185277 4263517 4264096 4213314 4355054 4421300 4411284 4411793 4461468
6408 4461468 4607175 4831201 4988261 5301361 5609981 5690319 5573071 5349754 5153752 4945632
$$ packed form
6475A6335578m82411j14943j38000L20341N19261O54674Q93345J190909R52413
6466B0131167J154040J581541K137880K696859K772905J741072M12978j094011
6458C1534431k254896k721622k925618k937394k466658k032582j879615j472295
6450A2843751j235326r16667r96905o38858o41931l55430l20355l60471l13036
6441G064772j63006k01823j10740l64144k43911j65364l04444j45490j24768j71477
6431E069605j97521j37684j8344M9867p0264j14592P6481M6147n0018m3408j72364
6420D437905o4559o7015j43834K2780P8240N79n0782J41740O6246j0016N09M9675
6408D461468J45707K24026J57060L13100L08620Q0338j17248k23317j96002k08120
$$ plain form
6398 4945632 5002368 4890646 4856168 4770501 4859760 5144449 5054606 5083224 5153058 5310463 5422585
6387 5422585 5737719 6044562 6176681 6450928 6812508 7167335 7176680 7049790 6899451 6846554
6377 6846554 6780789 6859283 7005450 7192320 7465840 7710987 7909073 8306387 8579919 8992671
6367 8992671 9345172 9794335 10567464 11488920 12532822 13938676 15319455 16761562 18275053
6358 18275053 20011550 22557413 26725302 34761593 51018156 74868931 98165534 105893937
6350 105893937 95623863 77856962 61425075 49734391 41586113 36606867 34076348
6343 34076348 35329208 41725420 52246159 61510389 62212724 54498100 43850112 34937022
6335 34937022 28330338 23621727 20325131 17911311 16294193 14828515 13898748 13406000
$$ packed form
6398D945632N6736j11722l4478q5667Q9259K84689q9843K8618O9834J57405J12122
6387E422585L15134L06843J32119K74247L61580L54827R345j26890j50339n2897
6377F846554o5765P8494J46167J86870K73520K45147J98086L97314K73532M12752
6367H992671L52501M49163P73129R21456J043902J405854J380779J442107J513491
6358A8275053J736497K545863M167889Q036291J6256563K3850775K3296603P728403
6350A05893937j0270074j7766901j6431887j1690684q148278m979246k530519
6343C4076348J252860O396212J0520739R264230P02335p714624j0647988q913090
6335C4937022o606684m708611l296596k413820j617118j465678r29767m92748
$$ plain form
6327 13406000 13556985 14256193 15415737 16621310 17149518 16710874 15501723 13999573 12741045
6318 12741045 11464588 10407454 9474103 8816143 8335459 8212144 7960753 7800999 7570650
6309 7570650 7380436 7335772 7463305 7653843 7966607 8328810 8733380 8767698 8361047 7954194
6299 7954194 7467289 6921851 6664360 6569855 6522635 6302890 6282256 6251659 6046743 5927913
6289 5927913 5851584 5673654 5554391 5717621 5827794 5856830 6005537 6114331 6051619 6298325
6279 6298325 7207527 8709741 10252730 10906516 10077448 8667377 7469072 6557281 5797275
6270 5797275 5337486 4992891 4851238 4768240 4540229 4346268 4227958 4057595 3923451 3843974
6260 3843974 3754154 3756764 3849342 3808265 3886034 3884733 3702998 3828098 3829105 3739533 3693686 3598460
$$ packed form
6327A3406000J50985O99208J159544J205573N28208m38644j209151j502150j258528
6318A2741045j276457j057134r33351o57960m80684j23315k51391j59754k30349
6309G570650j90214m4664J27533J90538L12764L62203M04570L4318m06651m06853
6299G954194m86905n45438k57491r4505m7220k19745k0634l0597k04916j18830
6289E927913p6329j77930j19263J63230J10173K9036J48707J08794o2712K46706
6279F298325R09202J502214J542989O53786q29068j410071j198305r11791p60006
6270E797275m59789l44595j41653q2998k28011j93961j18310j70363j34144p9477
6260C843974q9820K610R2578m1077P7769j301j81735J25100J007q9572m5847r5226
$$ plain form
6248 3598460 3370249 3316107 3211930 3061759 3154638 3035774 2789666 2709175 2775468 2778413 2774371
6237 2774371 2731586 2833392 2853418 2864372 2915833 2806514 2848807 2819218 2857896 2815355 2769191
6226 2769191 2883400 2904995 2950852 2968273 2810283 2797067 2775797 2537471 2567281 2630036 2657082
6215 2657082 2825396 2955705 2825300 2879904 2878865 2839566 2718734 2658158 2675284 2535295 2474514
6204 2474514 2469439 2405914 2405595 2517148 2441415 2458573 2558804 2526515 2549740 2539329 2609706 2814548
6192 2814548 2891047 2994908 3103421 3238213 3298967 3295001 3411667 3382611 3297888 3321762 3209466
6181 3209466 3391728 3507290 3444090 3486509 3623453 3625980 3575179 3738564 3711958 3649375 3676103
6170 3676103 3566228 3352564 3355168 3238639 3213528 3367753 3502911 3528427 3708555 3915181
$$ packed form
6248C598460k28211n4142j04177j50171R2879j18864k46108q0491O6293K945m042
6237B774371m2785J01806K0026J0954N1461j09319M2293k9589L8678m2541m6164
6226B769191J14209K1595M5857J7421j57990j3216k1270k38326K9810O2755K7046
6215B657082J68314J30309j30405N4604j039l9299j20832o0576J7126j39989o0781
6204B474514n075o3525l19J11553p5733J7158J00231l2289K3225j0411P0377K04842
6192B814548P6499J03861J08513J34792O0754l966J16666k9056q4723K3874j12296
6181C209466J82262J15562o3200M2419J36944K527n0801J63385k6606o2583K6728
6170C676103j09875k13664K604j16529k5111J54225J35158K5516J80128K06626
$$ plain form
6160 3915181 4130325 4226263 4146667 3966461 3881168 3644419 3557479 3433195 3208251 3051088
6150 3051088 2811003 2645415 2797973 2867465 2663210 2682298 2862266 2878609 2947254 3084129
6140 3084129 3272049 3346358 3332890 3537025 3483592 3500331 3615047 3666831 3638130 3624642 3621130
6129 3621130 3876130 4177515 4249966 4236855 4463240 4679124 5148540 5915199 6658152 7028288
6119 7028288 6760572 6283042 5487033 4708033 4119782 3842440 3634306 3236438 2928056 2815154
6109 2815154 2652439 2666331 2657397 2766773 3017076 2975549 2828528 2660729 2469853 2231488
6099 2231488 2112597 2136066 2203935 2239370 2122883 2251876 2217548 2121342 2160200 1966991 1811452
6088 1811452 1831695 1899319 1842032 1847115 1785496 1842979 1737957 1660650 1490407 1457254 1431738
$$ packed form
6160C915181K15144R5938p9596j80206q5293k36749q6940j24284k24944j57163
6150C051088k40085j65588J52558O9492k04255J9088J79968J6343O8645J36875
6140C084129J87920P4309j3468K04135n3433J6739J14716N1784k8701j3488l512
6129C621130K55000L01385P2451j3111K26385K15884M69416P66659P42953L70136
6119G028288k67716m77530p96009p79000n88251k77342k08134l97868l08382j12902
6109B815154j62715J3892q934J09376K50303m1527j47021j67799j90876k38365
6099B231488j18891K3469O7869L5435j16487J28993l4328r6206L8858j93209j55539
6088A811452K0243O7624n7287N083o1619N7483j05022p7307j70243l3153k5516
$$ plain form
6077 1431738 1410097 1387901 1426829 1483037 1546963 1471975 1478081 1459001 1454503 1508428 1573502 1466709
6065 1466709 1445362 1449928 1435256 1442983 1718133 1748782 1524758 1422617 1467984 1519885 2022629
6054 2022629 2520082 2807646 3055792 3000716 2720586 2307483 2026064 1768163 1513725 1297623
6044 1297623 1285010 1158109 1080548 1017582 1028885 1041400 1059327 1033999 962000 1029346 1004190
6033 1004190 905555 868566 956256 1058455 1032353 1197983 1199407 1361222 1332384 1207730 1134783
6022 1134783 1262584 1129013 942550 800580 784295 764461 727184 768910 854072 958392
6012 958392 866985 729874 795621 856399 891985 1026285 1012378 1056862 1088408 922206 922036
6001 922036 805222 824485 828344 847212 975296 1006952 1031716 1036914 999997 1069893 1046682 961460
$$ packed form
6077A431738k1641k2196L8928N6208O3926p4988O106j9080m498N3925O5074j06793
6065A466709k1347M566j4672P727K75150L0649k24024j02141M5367N1901N02744
6054B022629M97453K87564K48146n5076k80130m13103k81419k57901k54438k16102
6044A297623j2613j26901p7561o2966J1303J2515J7927k5328p1999O7346k5156
6033A004190r8635l6989Q7690J02199k6102J65630J424J61815k8838j24654p2947
6022A134783J27801j33571j86463j41970j6285j9834l7277M1726Q5162J04320
6012I58392r1407j37111O5747O0778L5586J34300j3907M4484L1546j66202j70
6001I22036j16814J9263L859J8868J28084L1656K4764N198l6917O9896k3211q5222
$$ plain form
5989 961460 962167 843762 852958 831710 872591 878156 977273 876949 770497 898955 871576 912192
5977 912192 784444 750234 761408 676869 721211 760258 722010 783912 753589 758976 768687 781961
5965 781961 827514 650597 601131 623667 760352 836729 841439 793492 715343 664568 710777
5954 710777 727358 798779 720934 652203 676124 812366 764179 737190 634846 748276 652657
5943 652657 674518 764671 745629 786093 621565 828197 847079 837796 784513 655052 717862
5932 717862 826515 790389 740024 645411 745864 774890 670632 761321 908942 864719 771155
5921 771155 702118 783752 625427 696214 687841 680192 736014 717337 873015 957001 973549 835485
5909 835485 875573 926582 946860 1091564 1154705 1197143 1273023 1339677 1350179 1259292 1341307
$$ packed form
5989I61460P07j18405R196k1248M0881N565R9117j00324j06452J28458k7379M0616
5977I12192j27748l4210J1174q4539M4342L9047l8248O1902l0323N387R711J3274
5965G81961M5553j76917m9466K2536J36685P6377M710m7947p8149n0775M6209
5954G10777J6581P1421p7845o8731K3921J36242m8187k6989j02344J13430r5619
5943F52657K1861R0153j9042M0464j64528K06632J8882r283n3283j29461O2810
5932G17862J08653l6126n0365r4613J00453K9026j04258R0689J47621m4223r3564
5921G71155o9037Q1634j58325P0787q373p649N5822j8677J55678Q3986J6548j38064
5909H35485M0088N1009K0278J44704O3141M2438P5880O6654J0502r0887Q2015
$$ plain form
5898 1341307 1113467 1133084 1218281 1237593 1196608 1249209 1304482 1179607 1259201 1285706 1225413
5887 1225413 1391951 1460269 1479290 1488330 1492181 1569295 1598746 1600834 1698886 2019479 2292072
5876 2292072 2411145 2636033 2709765 2981202 3427256 4062263 5143892 7196887 10334663
5867 10334663 13653528 15448925 14603602 12161242 9618728 7502462 5980633 4919877
5859 4919877 4114817 3452605 3012849 2576136 2216723 1988854 1982748 1933977 1855070 1905319
5849 1905319 1799163 1783670 1753437 1916773 2090663 2394199 2712627 2898056 3044812 2954804
5839 2954804 2527574 2269851 2186250 2123185 1924630 1980763 2076407 2116851 2082482 1971412 1992770
5828 1992770 2052001 2164363 2359606 2459529 2542574 2594872 2996292 3367112 3528966 3612197
$$ packed form
5898A341307k27840J9617Q5197J9312m0985N2601N5273j24875P9594K6505o0293
5887A225413J66538O8318J9021R040L851P7114K9451K088R8052L20593K72593
5876B292072J19073K24888P3732K71437M46054O35007J081629K052995L137776
5867A0334663L318865J795397q45323k442360k542514k116266j521829j060756
5859D919877q05060o62212m39756m36713l59413k27869o106m8771p8907N0249
5849A905319j06156j5493l0233J63336J73890L03536L18428J85429J46756r0008
5839B954804m27230k57723q3601o3065j98555N6133R5644M0444l4369j11070K1358
5828A992770N9231J12362J95243R9923Q3045N2298M01420L70820J61854Q3231
$$ plain form
5818 3612197 3434779 3340659 3196312 3132480 3081176 3004470 3066030 3213228 3600133 3623066 3450413
5807 3450413 3199982 3060051 2975884 2956836 2994146 3115528 3538985 3860919 4035519 4071222
5797 4071222 3926424 3913109 3697337 3533107 3243906 3261703 3469078 3533069 3572382 3523520
5787 3523520 3455304 3309685 3240533 3164743 3054396 3211664 3208009 3089614 3013319 2953209 2945324
5776 2945324 2988774 2985638 2911022 3037758 3116911 3456907 3772668 3897383 3906198 3931060 3814036
5765 3814036 3634688 3438676 3371598 3334810 3202733 3160355 3148116 2918831 2980730 2867467
5755 2867467 2992228 2975019 3075666 3230508 3214343 2980731 2877269 2913736 2953237 2994957
5745 2994957 2923815 2829337 2951319 2958045 3174788 3236571 3316971 3521155 3596348 3677570 4004277
$$ packed form
5818C612197j77418r4120j44347o3832n1304p6706O1560J47198L86905K2933j72653
5807C450413k50431j39931q4167j9048L7310J21382M23457L21934J74600L5703
5797D071222j44798j3315k15772j64230k89201J7797K07375O3991L9313m8862
5787C523520o8216j45619o9152p5790j10347J57268l655j18395p6295o0110p885
5776B945324M3450l136p4616J26736P9153L39996L15761J24715Q815K4862j17024
5765C814036j79348j96012o7078l6788j32077m2378j2239k29285O1899j13263
5755B867467J24761j7209J00647J54842j6165k33612j03462L6467L9501M1720
5745B994957p1142r4478J21982O726K16743O1783Q0400K04184P5193Q1222L26707
$$ plain form
5734 4004277 4235221 4310332 4608638 4708499 4897317 4941018 5061530 5164904 5208755 5142572
5724 5142572 5133689 5064988 4743956 4604322 4518345 4446723 4442978 4389900 4441115 4538165 4396831
5713 4396831 4407390 4462335 4449516 4454308 4479625 4424577 4470660 4621910 4803584 4798716 4920541
5702 4920541 5056608 5269123 5543690 5752103 5995884 6324375 6780619 7426798 8051679 8570172
5692 8570172 9134770 9639946 10228380 10770189 11755308 13165310 15729458 21059891 32577258
5683 32577258 49322454 64739218 67564941 58243604 44747488 33730729 25955251 20474666
5675 20474666 16549475 13406432 10908012 8972532 7648437 6598444 6015356 5567517
5667 5567517 5302359 5125519 4964925 4928772 5075346 5206604 5376534 5296564 5226779 5033734
$$ packed form
5734D004277K30944P5111K98306R9861J88818M3701J20512J03374M3851o6183
5724E142572q883o8701l21032j39634q5977p1622l745n3078N1215R7050j41334
5713D396831J0559N4945j2819M792K5317n5048M6083J51250J81674m868J21825
5702D920541J36067K12515K74567K08413K43781L28491M56244O46179O24881N18493
5692H570172N64598N05176N88434N41809R85119J410002K564148N330433J1517367
5683C2577258J6745196J5416764K825723r321337j3496116j1016759p775478n480585
5675B0474666l925191l143043k498420j935480j324095j049993n83088m47839
5667E567517k65158j76840j60594l6153J46574J31258J69930p9970o9785j93045
$$ plain form
5657 5033734 5048238 5228259 5408172 5522179 5796578 5780671 5597512 5171652 4698300 4420360
5647 4420360 4247090 4112166 4063044 4068229 4109437 4190271 4363353 4414238 4402629 4358882 4415744
5636 4415744 4407608 4479916 4667006 4636046 4567175 4534761 4542393 4510246 4329928 4448450 4474699
5625 4474699 4615068 4785630 5219567 5482078 5491828 5213508 4745454 4374905 4150630 3915136
5615 3915136 3670441 3575064 3452725 3218484 3168348 3009204 2867507 2869148 2880312 2930051 2820481
5604 2820481 2776288 2867122 2867563 2845765 2859604 2984486 2982203 2902875 2818051 2889895 2779236 2724693
5592 2724693 2662358 2645734 2568324 2475780 2403668 2344839 2281173 2156716 2141268 2119992 2024649
5581 2024649 1818626 1914682 1935866 1839673 1876282 1715121 1713177 1677331 1623315 1704088 1836462
$$ packed form
5657E033734J4504J80021J79913J14007K74399j5907j83159m25860m73352k77940
5647D420360j73270j34924m9122N185M1208Q0834J73082N0885j1609m3747N6862
5636D415744q136P2308J87090l0960o8871l2414P632l2147j80318J18522K6249
5625D474699J40369J70562M33937K62511R750k78320m68054l70549k24275k35494
5615C915136k44695r5377j22339k34241n0136j59144j41697J641J1164M9739j09570
5604B820481m4193R0834M41k1798J3839J24882k283p9328q4824P1844j10659n4543
5592B724693o2335j6624p7410r2544p2112n8829o3666j24457j5448k1276r5343
5581B024649k06023R6056K1184r6193L6609j61161j944l5846n4016Q0773J32374
$$ plain form
5570 1836462 1962806 1973360 1995137 1922778 2135818 2019147 1831938 1685386 1644060 1579293
5560 1579293 1565292 1566101 1533061 1350870 1434620 1459607 1577991 1490016 1386746 1378861 1357724
5549 1357724 1334585 1377339 1445859 1637664 1698718 1669682 1738844 1714748 1784794 1842336 2073972
5538 2073972 2279808 2747296 3263299 3535792 3290774 2895116 2606339 2337073 2125306 1933032
5528 1933032 2016412 2036172 1899885 1861709 1834941 1735404 1743592 1857201 1842728 1732930 1846820
5517 1846820 1838900 1780969 1826300 2078695 2190199 2243057 2410130 2469014 2519733 2766157 2960062
5506 2960062 3057753 3217545 3663946 3885444 3657462 3284426 3115611 2958369 2767278 2731020
5496 2731020 2508421 2349814 2263252 2258575 2150115 2169826 2246505 2422336 2463874 2434910 2363961
$$ packed form
5570A836462J26344J0554K1777p2359K13040j16671j87209j46552m1326o4767
5560A579293j4001Q09l3040j82191Q3750K4987J18384q7975j03270p885k1137
5549A357724k3139M2754O8520J91805O1054k9036O9162k4096P0046N7542K31636
5538B073972K05836M67488N16003K72493k45018l95658k88777k69266k11767j92274
5528A933032Q3380J9760j36287l8176k6768r9537Q188J13609j4473j09798J13890
5517A846820p920n7931M5331K52395J11504N2858J67073N8884N0719K46424J93905
5506B960062R7691J59792M46401K21498k27982l73036j68815j57242j91091l6258
5496B731020k22599j58607q6562m677j08460J9711P6679J75831M1538k8964p0949
$$ plain form
5485 2363961 2269937 2399429 2405442 2347960 2390225 2482367 2505258 2592103 2752735 2796269 2962459
5474 2962459 3170934 3186326 3273247 3281981 3158767 3114043 3085244 2944062 2976078 3003081 2762716
5463 2762716 2736911 2903098 2871029 2847922 2923991 2938505 3116782 3122267 3125027 3253440 3491796
5452 3491796 3614009 3746183 4016677 4239262 4494153 4807341 5304630 6254504 7494806
5443 7494806 9121882 10610506 11421432 11420083 10864714 10089569 9454527 9433154 10613064 12734848
5433 12734848 15395402 16874785 16018545 13817212 11486664 9665355 8368728 7634863
5425 7634863 7169256 6774823 6533548 6464671 6406296 6519687 6769793 7057801 7367654 7742414
5415 7742414 8259308 9124871 10552432 12807747 16583390 21746524 27286199 30943260 30870020
$$ packed form
5485B363961r4024J29492O013n7482M2265R2142K2891Q6845J60632M3534J66190
5474B962459K08475J5392Q6921Q734j23214m4724k8799j41182L2016K7003k40365
5463B762716k5805J66187l2069k3107P6069J4514J78277N485K760J28413K38356
5452C491796J22213J32174K70494K22585K54891L13188M97289R49874J240302
5443G494806J627076J488624Q10926j349n55369p75145o35042k1373J179910K121784
5433A2734848K660554J479383q56240k201333k330548j821309j296627p33865
5425G634863m65607l94433k41275o8877n8375J13391K50106K88008L09853L74760
5415G742414N16894Q65563J427561K255315L775643N163134N539675L657061p3240
$$ plain form
5406 30870020 27743485 23454094 19600390 16713036 14920732 13697788 13045146 12487430
5398 12487430 11672520 10677970 9705417 8758972 7873889 7292852 6869254 6578044 6401990
5389 6401990 6289412 6205249 6092084 6225522 6621357 7006091 7476377 8013244 8821674 9968739
5379 9968739 11739115 14679042 19088751 24313149 28672607 30044225 28063745 24214028
5371 24214028 19949112 16368268 13650255 11673094 10200713 8875152 8077662 7305402
5363 7305402 6601793 6101778 5806674 5555747 5400256 5268571 5057986 5031821 5056753 5044152
5353 5044152 5087431 5254796 5523805 5653163 5978558 6366145 6908092 7802368 9387144 12065723
5343 12065723 15332695 18327124 19353462 18128718 15572988 13148895 11163185 9704397
$$ packed form
5406C0870020l126535m289391l853704k887354j792304j222944o52642n57716
5398A2487430q14910r94550r72553r46445q85083n81037m23598k91210j76054
5389F401990j12578q4163j13165J33438L95835L84734M70286N36867Q08430J147065
5379I968739J770376K939927M409709N224398M359458J371618j980480l849717
5371B4214028m264916l580844k718013j977161j472381j325561p97490p72260
5363G305402p03609n00015k95104k50927j55491j31685k10585k6165K4932j2601
5353E044152M3279J67365K69009J29358L25395L87587N41947Q94276J584776K678579
5343A2065723L266972K994429J026338j224744k555730k424093j985710j458788
$$ plain form
5335 9704397 8335381 7388272 6570525 5932806 5576654 5209050 5013656 4954374 4877566 4823829
5325 4823829 4708023 4872479 5052673 5355563 5956643 6874772 7918647 8904025 9268973
5316 9268973 8988750 8376712 7936566 7627582 7754914 8059107 8381501 8985104 9539075 9724280
5306 9724280 9428580 8743936 7780779 7293865 6987114 6772573 6457899 6013905 5446586 4971673
5296 4971673 4635540 4371223 4015269 3777964 3744356 3577386 3509639 3311896 3269483 3155543
5286 3155543 2957619 2907006 2805133 2857674 2806655 2807836 2788347 2865080 2904230 3029044 3173558
5275 3173558 3313786 3252563 3343825 3225512 3093825 3169249 3200213 3268298 3407615 3472865 3678345
5264 3678345 3894766 4058734 4163903 4265327 4584516 4603437 4536526 4723776 4926858 5274483
$$ packed form
5335I704397j369016r47109q17747o37719l56152l67604j95394n9282p6808n3737
5325D823829j15806J64456J80194L02890O01080R18129J043875R85378L64948
5316I268973k80223o12038m40146l08984J27332L04193L22394O03603N53971J85205
5306I724280k95700o84644r63157m86914l06751k14541l14674m43994n67319m74913
5296D971673l36133k64317l55954k37305l3608j66970o7747j97743m2413j13940
5286C155543j97924n0613j01873N2541n1019J181j9489P6733L9150J24814J44514
5275C173558J40228o1223R1262j18313j31687P5424L0964O8085J39317O5250K05480
5264C678345K16421J63968J05169J01424L19189J8921o6911J87250K03082L47625
$$ plain form
5254 5274483 5743052 6109665 6344101 6199995 6005935 5696982 5452068 5350471 5236706 5269193
5244 5269193 5392554 5391268 5397389 5372495 5461273 5572427 5798320 5879680 6015734 6350020 6632271
5233 6632271 7070638 7529511 7918309 8375724 8832993 9308027 10043485 10778341 11756478 13228423
5223 13228423 15713886 20006661 28149391 39281066 49187316 51695023 46412468 37939143
5215 37939143 30224950 24590045 20558443 17676903 15593654 14169112 13406035 13257309
5207 13257309 13221777 13067912 12710346 12181448 11458235 10888477 10369723 9807320 9325654 8909397
5197 8909397 8514087 8208049 7983429 7959793 7955172 8014408 8057885 8142802 8389807 8492733 8546236
5186 8546236 8315574 7955830 7720079 7574197 7442216 7136489 7007438 7035269 7207179 7443452
$$ packed form
5254E274483M68569L66613K34436j44106j94060l08953k44914j01597j13765L2487
5244E269193J23361j286O121k4894Q8778J11154K25893Q1360J36054L34286K82251
5233F632271M38367M58873L88798M57415M57269M75034P35458P34856R78137J471945
5223A3228423K485463M292775Q142730J1131675R906250K507707n282555q473325
5215C7939143p714193n634905m031602k881540k083249j424542p63077j48726
5207A3257309l5532j53865l57566n28898p23213n69758n18754n62403m81666m16257
5197H909397l95310l06038k24620k3636m621N9236M3477Q4917K47005J02926N3503
5186H546236k30662l59744k35751j45882j31981l05727j29051K7831J71910K36273
$$ plain form
5176 7443452 7694426 7971928 8296253 8604885 8742146 9088065 9865896 10984030 12099347
5167 12099347 12554024 12354621 11929735 11411904 11284856 11394488 11948879 12763338 13634924
5158 13634924 14682704 15688524 16857778 18170005 19647994 20841452 21988890 22426217
5150 22426217 22913698 23304828 23800833 24109878 23774080 23039673 22402807 21955151 21762417
5141 21762417 21589301 21079582 20334915 19482560 18863707 18591527 18518104 18786032 19425071 19937448
5131 19937448 20247851 20358245 20405272 20553403 20740612 21153150 21511173 21758829 22260254 23217772
5121 23217772 24624223 26714403 29474845 32781639 36041526 39375618 42089167 44645437
5113 44645437 46837316 50539516 58820401 78926033 112439406 149670199 167892100 156203515
$$ packed form
5176G443452K50974K77502L24325L08632J37261L45919P77831J118134J115317
5167A2099347M54677j99403m24886n17831j27048J09632N54391Q14459Q71586
5158A3634924J047780J005820J169254J312227J477989J193458J147438M37327
5150B2426217M87481L91130M96005L09045l35798p34407o36866m47656j92734
5141B1762417j73116n09719p44667q52355o18853k72180p3423K67928O39039N12377
5131A9937448L10403J10394M7027J48131J87209M12538L58023K47656N01425R57518
5121B3217772J406451K090180K760442L306794L259887L334092K713549K556270
5113D4645437K191879L702200Q280885K0105632L3513373L7230793J8221901j1688585
$$ plain form
5105 156203515 128771380 101353939 81503319 67885320 59213396 54467034 54718771 59141237
5097 59141237 65229003 66279979 60912396 52423982 44516193 38624430 34472924 31586985
5089 31586985 30046847 29438324 29346803 28573432 27049904 25376174 24398368 24538259 25927409
5080 25927409 27644337 28386928 27662980 25825058 23629871 21647617 19991839 18545189
5072 18545189 17493701 16720191 16063772 15321142 14626513 14017148 13594020 13257523 12778431
5063 12778431 12318573 12031281 12030316 12359131 12868626 13392122 14040772 14585420 14997430 15269836
5053 15269836 15042357 14412035 13674572 13190666 12801217 12484698 12103451 11623055 11073362
5044 11073362 10646901 10383580 10249071 10549537 11193909 12024198 12833626 13367343 13523735
$$ packed form
5105A56203515k7432135k7417441j9850620j3617999q671924m746362K51737M422466
5097E9141237O087766J050976n367583q488414p907789n891763m151506k885939
5089C1586985j540138o08523r1521p73371j523528j673730r77806J39891J389150
5080B5927409J716928P42591p23948j837922k195187j982254j655778j446650
5072A8545189j051488p73510o56419p42630o94629o09365m23128l36497m79092
5063A2778431m59858k87292r65L28815N09495N23496O48650N44648M12010K72406
5053A5269836k27479o30322p37463m83906l89449l16519l81247m80396n49693
5044A1073362m26461k63321j34509L00466O44372Q30289Q09428N33717J56392
$$ plain form
5035 13523735 13370218 12940362 12193879 11476259 10661609 10076327 9736786 9609597 9703783 9989693
5025 9989693 10151172 10134237 9865248 9258476 8666139 8081149 7634126 7381301 7205224 6910639
5015 6910639 6812964 6683363 6369483 6265377 6162300 6091135 6169081 6350157 6591070 6847162
5005 6847162 7424028 8183117 8603828 8854519 8802154 8645093 8388423 8204220 8034576 8231389
4995 8231389 8488744 9063937 9721060 10267708 10819397 11122786 10908813 10479733 9995307 10076834
4985 10076834 10483265 10808687 11103041 11137851 10584460 10110628 9796668 9937554 9878713 9358539
4975 9358539 8584034 7737648 7084106 6713485 6341285 6113645 5932886 5565348 5138284 4883804
4965 4883804 4634456 4347335 4331848 4206804 4272730 4249905 4222428 3973625 3903236 3904887 3937167
$$ packed form
5035A3523735j53517m29856p46483p17620q14650n85282l39541j27189R4186K85910
5025I989693J61479j6935k68989o06772n92337n84990m47023k52825j76077k94585
5015F910639r7675j29601l13880j04106j03077p1165P7946J81076K40913K56092
5005F847162N76866P59089M20711K50691n2365j57061k56670j84203j69644J96813
4995H231389K57355N75193O57123N46648N51689L03389k13973m29080m84426Q1527
4985A0076834M06431L25422K94354L4810n53391m73832l13960J40886n8841n20174
4975I358539p74505q46386o53542l70621l72200k27640j80759l67538m27064k54480
4965D883804k49348k87121j5487j25044O5926k2825k7477k48803p0389J651L2280
$$ plain form
4954 3937167 3964908 3910737 3778119 3858522 3858063 3873707 3756988 3774544 3871572 3942444 4004825
4943 4004825 4053952 4042227 4239894 4281065 4361305 4598387 4818329 4871901 5014994 5145940
4933 5145940 5170373 5051037 4886308 4857831 4869934 4875311 5021543 5381513 5658277 6020397
4923 6020397 6490591 7004750 7180047 7061665 6760080 6413575 6076019 5811000 5648303 5660853
4913 5660853 5659632 5735127 5848258 5916983 6135767 6358985 6474142 6676371 7155673 8048308
4903 8048308 9328815 10537090 11320456 11673478 11640664 11215889 10365906 9419721 8726987
4894 8726987 8283624 7878516 7576490 7427569 7245275 7283138 7258503 7408259 7468903 7385684
4884 7385684 7508874 7525253 7533541 7643023 7815461 8143653 8508054 8890044 9506804 10101109
$$ packed form
4954C937167K7741n4171j32618Q0403m59J5644j16719J7556R7028P0872O2381
4943D004825M9127j1725J97667M1171Q0240K37082K19942N3572J43093J30946
4933E145940K4433j19336j64729k8477J2103N377J46232L59970K76764L62120
4923F020397M70194N14159J75297j18382l01585l46505l37556k65019j62697J2550
4913E660853j221P5495J13131O8725K18784K23218J15157K02229M79302Q92635
4903H048308J280507J208275P83366L53022l2814m24775q49983r46185o92734
4894H726987m43363m05108l02026j48921j82294L7863k4635J49756O0644q3219
4884G385684J23190J6379Q288J09482J72438L28192L64401L81990O16760N94305
$$ plain form
4874 10101109 10612525 11370791 12201918 13246945 14496078 16076294 18131647 21167967 25643986
4865 25643986 32608149 42165997 52616555 59914240 60080373 54557171 46796894 39344482
4857 39344482 33187262 28286107 24377005 21543252 19372083 17959376 17098097 16662956
4849 16662956 16424216 16079281 15705512 15427472 15227209 15411196 15892388 16513539 17129064
4840 17129064 17435326 17592080 17803099 18075357 18543083 19329395 20301676 21227518 21854849
4831 21854849 22128192 21968670 21324777 20486240 19598557 18656623 17992238 17403369 16849975
4822 16849975 16738453 16677405 16706931 17028461 17771161 18664666 19814313 21357093 23500954
4813 23500954 26152326 29180269 32480556 35809546 38671183 40346846 40880037 40532958
$$ packed form
4874A0101109N11416P58266Q31127J045027J249133J580216K055353L036320M476019
4865B5643986O964163R557848J0450558P297685J66133n523202p760277p452412
4857C9344482o157220m901155l909102k833753k171169j412707q61279m35141
4849A6662956k38740l44935l73769k78040k00263J83987M81192O21151O15525
4840A7129064L06262J56754K11019K72258M67726P86312R72281R25842O27331
4831B1854849K73343j59522o43893q38537q87683r41934o64385n88869n53394
4822A6849975j11522o1048K9526L21530P42700Q93505J149647J542780K143861
4813B3500954K651372L027943L300287L328990K861637J675663N33191l47079
$$ plain form
4805 40532958 39846993 38717619 37500870 36544872 35505234 34185958 32764545 31260018
4797 31260018 29871622 28825219 28078783 27632861 27428943 27609106 28144622 29008108 30174309
4788 30174309 31831102 33823538 36516093 39956425 44432310 50266876 57186963 64787189
4780 64787189 72124523 77885049 81199244 81745707 80243104 77986874 76023596 75165970
4772 75165970 76233633 79772186 86870746 100158693 124532502 165556656 218692689 263315868
4764 263315868 270687918 242869760 202364288 164185064 133640120 110348799 93227178
4757 93227178 80521431 71381629 64874553 61160088 59758680 59936479 60559664 61047090
4749 61047090 60305886 57854800 54140554 49589820 44665115 40021426 35848300 32495652
$$ packed form
4805D0532958o85965j129374j216749r55998j039638j319276j421413j504527
4797C1260018j388396j046403p46436m45922k03918J80163N35516Q63486J166201
4788C0174309J656793J992436K692555L440332M475885N834566O920087P600226
4780F4787189P337334N760526L314195N46463j502603k256230j963278q57626
4772G5165970J067663L538553P098560J3287947K4373809M1024154N3136033M4623179
4764B63315868P372050k7818158m0505472l8179224l0544944k3291321j7121621
4757I3227178j2705747r139802o507076l714465j401408J77799O23185M87426
4749F1047090p41204k451086l714246m550734m924705m643689m173126l352648
$$ plain form
4741 32495652 29882270 27744666 26023690 24407900 22750289 21050173 19231453 17719699
4733 17719699 16344113 15084736 14112440 13284409 12392846 11760570 11198666 10753660 10460790
4724 10460790 10005759 9674942 9384330 9011249 8779983 8603357 8350497 8008729 7855014
4715 7855014 7529323 7321809 7068607 6852556 6678088 6575316 6375975 6248706 6049637 5740952
4705 5740952 5633844 5673020 5501953 5247140 5127887 4969914 4792484 4527205 4557195 4489137
4695 4489137 4319862 4234224 4176702 4116575 4149078 4150042 4193489 4213654 4211805 4248490 4316244 4282150
4683 4282150 4106846 3992013 3942760 4011466 3808405 3631388 3668916 3623715 3567393 3538047 3731291
4672 3731291 3708698 3619568 3511583 3336657 3087998 2976050 2908754 2859408 2742901 2568035
$$ packed form
4741C2495652k613382k137604j720976j615790j657611j700116j818720j511754
4733A7719699j375586j259377r72296q28031q91563o32276n61904m45006k92870
4724A0460790m55031l30817k90612l73081k31266j76626k52860l41768j53715
4715G855014l25691k07514k53202k16051j74468j02772j99341j27269j99069l08685
4705E740952j07108L9176j71067k54813j19253j57973j77430k65279K9990o8058
4695D489137j69275q5638n7522o0127L2503R64M3447K0165j849L6685O7754l4094
4683D282150j75304j14833m9253O8706k03061j77017L7528m5201n6322k9346J93244
4672C731291k2593q9130j07985j74926k48659j11948o7296m9346j16507j74866
$$ plain form
4662 2568035 2707017 2754050 2691759 2566353 2524778 2501824 2435893 2551110 2603384 2514068 2559352
4651 2559352 2680687 2589147 2404178 2323764 2450544 2463224 2317067 2168235 2104967 1969121
4641 1969121 1984807 1946583 1962257 1996023 2007168 1995083 1868290 1915280 1870154 1727340 1715787
4630 1715787 1750057 1762709 1780175 1715726 1746532 1784994 1810605 1680442 1704610 1728134 1754551
4619 1754551 1732653 1711048 1626801 1612905 1587727 1650200 1607207 1548254 1459430 1435812 1507667
4608 1507667 1505885 1449765 1452972 1555962 1553304 1490156 1436276 1471023 1443400 1393419 1409997 1464037
4596 1464037 1317485 1274693 1317003 1391319 1331146 1295149 1273520 1316837 1346651 1450046 1506528
4585 1506528 1440227 1400591 1542519 1550571 1526310 1461891 1605442 1587743 1637952 1572913 1698038
$$ packed form
4662B568035J38982M7033o2291j25406m1575k2954o5931J15217N2274q9316M5284
4651B559352J21335r1540j84969q0414J26780J2680j46157j48832o3268j35846
4641A969121J5686l8224J5674L3766J1145j2085j26793M6990m5126j42814j1553
4630A715787L4270J2652J7466o4449L0806L8462K5611j30163K4168K3524K6417
4619A754551k1898k1605q4247j3896k5178O2473m2993n8953q8824k3618P1855
4608A507667j782n6120L207J02990k658o3148n3880L4747k7623m9981J6578N4040
4596A464037j46552m2792M2310P4316o0173l5997k1629M3317K9814J03395N6482
4585A506528o6301l9636J41928Q052k4261o4419J43551j7699N0209o5039J25125
$$ plain form
4574 1698038 1876448 1908237 2080755 2524393 3018599 3443187 3544503 3381425 3122387 2820222
4564 2820222 2611196 2350928 2247868 2046343 1889324 1815065 1709590 1576393 1530717 1522400
4554 1522400 1509138 1519686 1460726 1425731 1415895 1231317 1357532 1376946 1503923 1439412 1280309
4543 1280309 1374861 1390040 1310019 1436856 1432167 1469424 1385705 1239785 1262268 1306406 1247417
4532 1247417 1217888 1183029 1250288 1276800 1259175 1345107 1336913 1195740 1146083 1253150 1201432
4521 1201432 1200407 1201825 1290865 1285338 1228837 1275149 1242523 1267291 1337772 1331015 1231829 1297436
4509 1297436 1330663 1439135 1531513 1526035 1480412 1442844 1504880 1472403 1289460 1276016 1382479
4498 1382479 1298566 1328735 1422155 1371316 1435172 1455748 1425264 1517129 1567834 1650246 1604157
$$ packed form
4574A698038J78410L1789J72518M43638M94206M24588J01316j63078k59038l02165
4564B820222k09026k60268j03060k01525j57019p4259j05475j33197m5676q317
4554A522400j3262J0548n8960l4995r836j84578J26215J9414J26977o4511j59103
4543A280309R4552J5179q0021J26837m689L7257q3719j45920K2483M4138n8989
4532A247417k9529l4859O7259K6512j7625Q5932q194j41173m9657J07067n1718
4521A201432j025J418Q9040n527n6501M6312l2626K4768P0481o757r9186O5607
4509A297436L3227J08472R2378n478m5623l7568O2036l2477j82943j3444J06463
4498A382479q3913L0169R3420n0839O3856K0576l0484R1865N0705Q2412m6089
$$ plain form
4487 1604157 1516883 1579758 1548691 1406630 1423590 1487301 1478022 1602783 1576835 1556808 1754621
4476 1754621 1638957 1529149 1552984 1482277 1523477 1685115 1606117 1581494 1579488 1663480 1556469
4465 1556469 1543468 1634350 1715144 1781456 1801030 1925878 1953995 1899945 1731772 1791070 1735408
4454 1735408 1799805 1935919 1962468 2177007 2533710 2732008 3002087 3300751 3362960 3295825
4444 3295825 3207179 2886164 2605141 2418774 2198089 1973823 1789025 1776086 1724867 1626215
4434 1626215 1548293 1564084 1521745 1540419 1653154 1624885 1647389 1681530 1662121 1685406 1663327
4423 1663327 1722140 1754471 1800046 1785645 1740264 1673946 1758496 1865124 1953697 2068598 2210752
4412 2210752 2264138 2231475 2267758 2109293 2022572 1968563 1824782 1668469 1670793 1584342 1464136
$$ packed form
4487A604157q7274O2875l1067j42061J6960O3711r279J24761k5948k0027J97813
4476A754621j15664j09808K3835p0707M1200J61638p8998k4623k006Q3992j07011
4465A556469j3001R0882Q0794O6312J9574J24848K8117n4050j68173N9298n5662
4454A735408O4397J36114K6549K14539L56703J98298K70079K98664O2209o7135
4444C295825q8646l21015k81023j86367k20685k24266j84798j2939n1219r8652
4434A626215p7922J5791m2339J8674J12735k8269K2504L4141j9409K3285k2079
4423A663327N8813L2331M5575j4401m5381o6318Q4550J06628Q8573J14901J42154
4412B210752N3386l2663L6283j58465q6721n4009j43781j56313K324q6451j20206
$$ plain form
4401 1464136 1430837 1375544 1475258 1506552 1396598 1338977 1389422 1406846 1448153 1489967 1571865
4390 1571865 1539389 1664616 1811705 1971343 2118939 2197055 2062201 1970345 1920376 2006069
4380 2006069 1910236 1954860 2046651 2047018 1978357 1873242 1752800 1718651 1716510 1659421 1532518
4369 1532518 1402616 1510145 1464246 1508546 1591755 1503214 1385758 1393743 1396049 1457873 1516078
4358 1516078 1563778 1386350 1328469 1388883 1394446 1511547 1505872 1472439 1529236 1483843 1477983 1540948
4346 1540948 1679582 1645962 1644778 1511601 1431601 1469146 1411077 1355711 1330940 1346935 1360178
4335 1360178 1315220 1410497 1350149 1322998 1315201 1457675 1498013 1409848 1442238 1444247 1487729 1588472
4323 1588472 1549097 1542212 1654270 1632092 1543899 1430974 1316404 1347633 1443746 1465377 1575477
$$ packed form
4401A464136l3299n5293R9714L1294j09954n7621N0445J7424M1307M1814Q1898
4390A571865l2476J25227J47089J59638J47596P8116j34854r1856m9969Q5693
4380B006069r5833M4624R1791L67o8661j05115j20442l4149k141n7089j26903
4369A532518j29902J07529m5899M4300Q3209q8541j17456P985K306O1824N8205
4358A516078M7700j77428n7881O0414N563J17101n675l3433N6797m5393n860O2965
4346A540948J38634l3620j184j33177q0000L7545n8069n5366k4771J5995J3243
4335A360178m4958R5277o0348k7151p797J42474M0338q8165L2390K009M3482J00743
4323A588472l9375o885J12058k2178q8193j12925j14570L1229R6113K1631J10100
$$ plain form
4312 1575477 1604015 1728575 1731374 1605462 1588109 1503076 1632093 1676747 1541600 1573708 1593262
4301 1593262 1626667 1562241 1666590 1765062 1832868 1955808 2157614 2483032 2497639 2532689 2570358
4290 2570358 2399062 2258878 2080895 2067089 1884888 1752207 1704960 1657508 1562576 1611639
4280 1611639 1676686 1661577 1709045 1710358 1645154 1501097 1577108 1563515 1509842 1517344 1591225 1668839
4268 1668839 1591139 1610751 1673842 1767544 1686382 1594805 1641901 1724484 1664815 1582225 1577687 1573244
4256 1573244 1605882 1659781 1555581 1419028 1552452 1667396 1783622 1730092 1750240 1858436
4246 1858436 2083342 2184835 2183518 2200793 2087230 2050695 2071488 1825248 1702834 1735689 1740157
4235 1740157 1794632 1947755 1932412 1883887 1732702 1751097 1918578 1871657 1796215 1683149 1721484
$$ packed form
4312A575477K8538J24560K799j25912j7353q5033J29017M4654j35147L2108J9554
4301A593262L3405o4426J04349R8472O7806J22940K01806L25418J4607L5050L7669
4290B570358j71296j40184j77983j3806j82201j32681m7247m7452r4932M9063
4280A611639O5047j5109M7468J313o5204j44057P6011j3593n3673P502P3881P7614
4268A668839p7700J9612O3091R3702q1162r1577M7096Q2583n9669q2590m538m443
4256A573244L2638N3899j04200j36553J33424J14944J16226n3530K0148J08196
4246A858436K24906J01493j317J7275j13563l6535K0793k46240j22414L2855M468
4235A740157N4475J53123j5343m8525j51185J8395J67481m6921p5442j13066L8335
$$ plain form
4224 1721484 1820709 1865888 1859742 1877596 1772260 1718226 1816905 1885275 1918017 2066309 2118930
4213 2118930 2035349 2065665 2099187 2039975 1781356 1802606 1896655 1881269 1946229 1946580 1838328
4202 1838328 1844194 1922439 1941392 2018175 2083227 2005439 1921516 2024722 1940923 1959894 1998022
4191 1998022 2158305 2243621 2166485 2016937 2124457 2267849 2237184 2302306 2413330 2595160
4181 2595160 2608639 2538089 2640253 2889947 2763624 2635147 2645469 2697994 2612190 2400297
4171 2400297 2298361 2161205 2164636 2170396 2184255 2216473 2152095 2096974 2112853 1952257 1916182
4160 1916182 2024932 2128130 2095477 2203063 2063174 2066271 2071687 2107338 2044868 1952521 2035885
4149 2035885 1960125 1994359 1989668 1995360 2088535 2114646 2100691 2030483 1980453 1929256 1890961 1876959
$$ packed form
4224A721484R9225M5179o146J7854j05336n4034R8679O8370L2742J48292N2621
4213B118930q3581L0316L3522n9212k58619K1250R4049j5386O4960L51j08252
4202A838328N866P8245J8953P6783O5052p7788q3923J03206q3799J8971L8128
4191A998022J60283Q5316p7136j49548J07520J43392l0665O5122J11024J81830
4181B595160J3479p0550J02164K49694j26323j28477J0322N2525q5804k11893
4171B400297j01936j37156L431N760J3859L2218o4378n5121J5879j60596l6075
4160A916182J08750J03198l2653J07586j39889L097N416L5651o2470r2347Q3364
4149B035885p5760L4234m691N692R3175K6111j3955p0208n0030n1197l8295j4002
$$ plain form
4137 1876959 1877430 1883556 1906523 2012807 1955743 1977786 2046468 2055608 2128486 2187224 2105077 2172005
4125 2172005 2096421 2006796 2024842 2149555 2125039 2089160 2084938 2116015 2066575 1971915 1956296
4114 1956296 1974499 1948389 2011728 1978282 1981448 2050030 1941270 1935833 1901954 1964182 1984252 1992825
4102 1992825 2076500 2036471 2028100 1993621 2000764 2114384 2102659 1999821 2032095 2034005 1941133 1905221
4090 1905221 1845910 1811727 1763041 1868848 1837451 1886465 1837980 1789585 1882025 1879202 1883544 1847559
4078 1847559 1807979 1816518 1815586 1674591 1566615 1574450 1607973 1679935 1825332 1938015 1799649
4067 1799649 1598608 1663913 1758180 1669480 1623734 1798719 1833646 1854148 1760777 1784759 1650507
4056 1650507 1714533 1795651 1720981 1630304 1636598 1561508 1493865 1544545 1478663 1503019 1620551
$$ packed form
4137A876959M71O126K2967J06284n7064K2043O8682R140P2878N8738q2147O6928
4125B172005p5584q9625J8046J24713k4516l5879m222L1077m9440r4660j5619
4114A956296J8203k6110O3339l3446L166O8582j08760n437l3879O2228K0070Q573
4102A992825Q3675m0029q371l4479P143J13620j1725j02838L2274J910r2872l5912
4090A905221n9311l4183m8686J05807l1397M9014m8485m8395R2440k823M342l5985
4078A847559l9580Q539r32j40995j07976P835L3523P1962J45397J12683j38366
4067A799649k01041O5305R4267q8700m5746J74985L4927K0502r3371K3982j34252
4056A650507O4026Q1118p4670r0677O294p5090o7643N0680o5882K4356J17532
$$ plain form
4045 1620551 1737998 1698409 1589095 1498419 1405014 1486264 1560693 1590491 1574171 1542924 1573911
4034 1573911 1569128 1526848 1621079 1654336 1670984 1599231 1451481 1413782 1535884 1582285 1414571
4023 1414571 1506638 1488504 1452376 1465839 1592929 1507880 1606962 1497473 1499616 1473389 1565353
4012 1565353 1549700 1400521 1429503 1452125 1437453 1292842 1404259 1457470 1282460 1222404 1298427
4001 1298427 1348751 1414817 1372583 1370062 1384010 1382067 1412264 1358578 1322808 1322625 1399154 1463422
3989 1463422 1426946 1325253 1224850 1414137 1450150 1459132 1451270 1309680 1279905 1225502 1243706
3978 1243706 1343167 1171875 1211331 1369421 1211844 1311466 1359293 1268175 1248921 1361575 1256609
3967 1256609 1246138 1272704 1229185 1242473 1145590 1301355 1374886 1323564 1254195 1358916 1416556
$$ packed form
4045A620551J17447l9589j09314r0676r3405Q1250P4429K9798j6320l1247L0987
4034A573911m783m2280R4231L3257J6648p1753j47750l7699J22102M6401j67714
4023A414571R2067j8134l6128J3463J27090q5049R9082j09489K143k6227R1964
4012A565353j5653j49179K8982K2622j4672j44611J11417N3211j75010o0056P6023
4001A298427N0324O6066m2234k521J3948j943L0197n3686l5770j83P6529O4268
3989A463422l6476j01693j00403J89287L6013Q982p862j41590k9775n4403J8204
3978A243706R9461j71292L9456J58090j57577R9622M7827r1118j9254J12654j04966
3967A256609j0471K6566m3519J3288r6883J55765P3531n1322o9369J04721N7640
$$ plain form
3956 1416556 1435999 1371422 1212603 1248914 1235832 1221213 1208405 1196397 1420669 1392585 1398660
3945 1398660 1354796 1363641 1357348 1270167 1237720 1166262 1264160 1283745 1429983 1390536 1340137 1418066
3933 1418066 1373183 1297846 1128646 1231618 1371307 1347597 1296394 1320883 1350855 1307869 1257729
3922 1257729 1388699 1449565 1413490 1424460 1442236 1421925 1378108 1427243 1333037 1435976 1534090
3911 1534090 1643801 1585300 1601306 1632630 1488165 1468574 1367165 1325148 1255162 1218432 1167683
3900 1167683 1170383 1268839 1267926 1310028 1359407 1315305 1288843 1273839 1402391 1285699 1178773
3889 1178773 1288205 1235380 1331359 1358752 1433623 1454093 1456111 1494350 1487351 1443287 1547138
3878 1547138 1488566 1471564 1423812 1409377 1389017 1427128 1591495 1509446 1501181 1504166 1477143 1434819
$$ packed form
3956A416556J9443o4577j58819L6311j3082j4619j2808j2008K24272k8084O075
3945A398660m3864Q845o293q7181l2447p1458R7898J9585J46238l9447n0399P7929
3933A418066m4883p5337j69200J02972J39689k3710n1203K4489K9972m2986n0140
3922A257729J30970O0866l6075J0970J7776k0311m3817M9135r4206J02939R8114
3911A534090J09711n8501J6006L1324j44465j9591j01409m2017o9986l6730n0749
3900A167683K700R8456r13M2102M9379m4102k6462j5004J28552j16692j06926
3889A178773J09432n2825R5979K7393P4871K0470K018L8239o999m4064J03851
3878A547138n8572j7002m7752j4435k0360L8111J64367q2049q265K985k7023m2324
$$ plain form
3866 1434819 1450924 1491154 1442423 1428946 1427531 1423878 1488771 1552103 1485726 1513324 1577136 1458273
3854 1458273 1431892 1379760 1476765 1491609 1401280 1423729 1531967 1603198 1658583 1698883 1577140
3843 1577140 1548346 1627279 1589415 1686685 1752311 1774245 1675528 1555582 1524400 1521367 1534367
3832 1534367 1560599 1548642 1347742 1509047 1649938 1640610 1758699 1681524 1656999 1599394 1638033
3821 1638033 1651344 1734562 1708368 1575200 1564010 1557401 1640520 1672847 1799675 1763531 1712966
3810 1712966 1774619 1680001 1665630 1632122 1454685 1435008 1481851 1592821 1528010 1550615 1485230
3799 1485230 1593151 1697848 1564793 1563957 1666238 1703384 1783982 1793879 1661071 1747274 1746930
3788 1746930 1822132 1800303 1788445 1728054 1664948 1707386 1708794 1706420 1907853 1900741 1864479 1856897
$$ packed form
3866A434819J6105M0230m8731j3477j415l653O4893O3332o6377K7598O3812j18863
3854A458273k6381n2132R7005J4844r0329K2449J08238P1231N5385M0300j21743
3843A577140k8794P8933l7864R7270O5626K1934r8717j19946l1182l033J3000
3832A534367K6232j1957k00900J61305J40891r328J18089p7175k4525n7605L8639
3821A638033J3311Q3218k6194j33168j1190o609Q3119L2327J26828l6144n0565
3810A712966O1653r4618j4371l3508j77437j9677M6843J10970o4811K2605o5385
3799A485230J07921J04697j33055q36J02281L7146Q0598R897j32808Q6203l44
3788A746930P5202k1829j1858o0391o3106M2438J408k374K01433p112l6262p582
$$ plain form
3776 1856897 1890718 1889764 1836731 1811074 1732093 1837579 1744737 1746659 1833524 1716928 1657102 1627375
3764 1627375 1662775 1697163 1692532 1686725 1910464 1877402 1761196 1822756 1732826 1453914 1633278
3753 1633278 1775083 1664427 1727011 1754861 1832694 1768943 1757133 1821329 1731435 1804712 1794909
3742 1794909 1752551 1739610 1659519 1680783 1745493 1826971 1713492 1650528 1608503 1629892 1599873
3731 1599873 1645161 1628191 1586591 1607993 1523470 1564814 1656862 1600989 1589661 1634809 1629252 1638258
3719 1638258 1748874 1802022 1706964 1520405 1618403 1625232 1690893 1714881 1718576 1632657 1621923
3708 1621923 1624942 1769706 1782134 1697404 1737788 1702128 1724438 1740925 1757988 1777101 1815404
3697 1815404 1794498 1771659 1643105 1735238 1823185 1619451 1580460 1668731 1650811 1628594 1709078
$$ packed form
3776A856897L3821r54n3033k5657p8981J05486r2842J922Q6865j16596n9826k9727
3764A627375L5400L4388m631n807K23739l3062j16206O1560q9930k78912J79364
3753A633278J41805j10656O2584K7850P7833o3751j1810O4196q9894P3277r803
3742A794909m2358j2941q0091K1264O4710Q1478j13479o2964m2025K1389l0019
3731A599873M5288j6970m1600K1402q4523M1344R2048n5873j1328M5148n557R006
3719A638258J10616N3148r5058j86559R7998O829O5661K3988L695q5919j0734
3708A621923L019J44764J2428q4730M0384l5660K2310J6487J7063J9113L8303
3697A815404k0906k2839j28554R2133Q7947k03734l8991Q8271j7920k2217Q0484
$$ plain form
3686 1709078 1825631 1848913 1747925 1757781 1828719 2047516 2043843 2076308 2027889 2035477 2060640
3675 2060640 2068199 2094785 2049689 2073437 2103207 2288473 2272880 2332680 2278648 2266274 2177976
3664 2177976 2235312 2243925 2292885 2400610 2415670 2604806 2641146 2716226 2864491 2735110 2722739
3653 2722739 2720915 2794717 2814639 2796905 2837835 2936522 3140827 3268179 3356172 3311742 3320481
3642 3320481 3469871 3549171 3738643 3926315 3965776 4209257 4450725 4681141 4921552 5225595
3632 5225595 5669481 6136178 6563171 7334859 8328710 9584828 11321237 13835369 17402576
3623 17402576 21387872 24811585 26304401 25532698 23130162 20057575 17117186 14955182
3615 14955182 13043880 11461661 10339123 9480387 9015085 8483712 8186662 7978415 7842216
$$ packed form
3686A709078J16553K3282j00988R856P0938K18797l673L2465m8419P588K5163
3675B060640P559K6586m5096K3748K9770J85266j5593N9800n4032j2374q8298
3664B177976N7336Q613M8960J07725J5060J89136L6340P5080J48265j29381j2371
3653B722739j824P3802J9922j7734M0930R8687K04305J27352Q7993m4430Q739
3642C320481J49390P9300J89472J87672L9461K43481K41468K30416K40411L04043
3632E225595M43886M66697M26993P71688R93851J256118J736409K514132L567207
3623A7402576L985296L423713J492816p71703k402536l072587k940389k162004
3615A4955182j911302j582219j122538q58736m65302n31373k97050k08247j36199
$$ plain form
3606 7842216 7817466 7818610 8040751 8173456 8378750 8741079 9168499 9711007 10449791 11296234
3596 11296234 12338958 13705562 15751649 18778499 23202196 29905038 38384777 45983595
3588 45983595 49874911 48616566 43624088 37221877 31122870 26047723 21997195 18855451
3580 18855451 16344804 14433313 12992567 11861733 11023762 10418744 9747336 9209633 9055455
3571 9055455 8898576 8673173 8589819 8497848 8443205 8651517 8978384 9324399 9750342 10292526
3561 10292526 11128316 12508532 14525558 17256771 20693218 24105133 26296215 26409125
3553 26409125 24519136 21526849 18725376 16263470 14282266 12631673 11300615 10335141
3545 10335141 9475211 8948064 8472845 7965321 7772207 7624769 7423528 7405948 7302253 7114467
$$ packed form
3606G842216k4750J144K22141J32705K05294L62329M27420N42508P38784Q46443
3596A1296234J042724J366604K046087L026850M423697O702842Q479739P598818
3588D5983595L891316j258345m992478o402211o099007n075147m050528l141744
3580A8855451k510647j911491j440746j130834q37971o05018o71408n37703j54178
3571I055455j56879k25403q3354r1971n4643K08312L26867L46015M25943N42184
3561A0292526Q35790J380216K017026K731213L436447L411915K191082J12910
3553B6409125j889989k992287k801473k461906j981204j650593j331058r65474
3545A0335141q59930n27147m75219n07524j93114j47438k01241j7580j03695j87786
$$ plain form
3535 7114467 7095441 7134637 7086247 7076320 7181863 7284484 7494998 7597612 7882307 8119570
3525 8119570 8568767 8641230 8562234 8611685 8800977 8920931 9140864 9582957 10223414 11208832
3515 11208832 12328869 13745201 14979920 15670890 15375891 14736831 13782842 13056780 12418089
3506 12418089 11928764 11674601 11496612 11490393 11420304 11467341 11685952 11915799 12286249 12718494
3496 12718494 13225212 13920594 14817645 15735936 16462984 16821629 17191097 17800545 18526525
3487 18526525 19522104 20766179 22438880 24453278 27142620 30880954 35271645 39551730
3479 39551730 42366586 43567960 43611412 43445339 43354556 43263962 43047826 42553208 41520531
3470 41520531 40265768 38733948 36874449 34643501 32034830 29445092 27004455 24943921
$$ packed form
3535G114467j9026L9196m8390r927J05543J02621K10514J02614K84695K37263
3525H119570M49197P2463p8996M9451J89292J19954K19933M42093O40457R85418
3515A1208832J120037J416332J234719O90970k94999o39060r53989p26062o38691
3506A2418089m89325k54163j77989o219p0089M7037K18611K29847L70450M32245
3496A2718494N06718O95382Q97051R18291P27048L58645L69468O09448P25980
3487A8526525R95579J244075J672701K014398K689342L738334M390691M280085
3479C9551730K814856J201374M3452j66073r0783r0594k16136m94618j032677
3470D1520531j254763j531820j859499k230948k608671k589738k440637k060534
$$ plain form
3462 24943921 23080693 21456410 19991957 18694597 17387533 16402884 15928291 15822066 15609142
3453 15609142 15311096 14924601 14809837 14804015 15010224 15681783 16210875 16458748 16160599 15188726
3443 15188726 14089221 12874655 11871513 11047918 10536604 10469937 10516598 10130951 9590204
3434 9590204 9138211 8504980 7939109 7739262 7518142 7269229 7034343 6989850 7008918 7292737
3424 7292737 7929011 8756492 9313470 9275616 8789272 8106705 7366655 6811670 6503006 6042746
3414 6042746 5795896 5537819 5416069 5253919 5074205 5096655 5058161 4986649 5007292 5032184
3404 5032184 5030012 5024491 4806201 4522058 4430433 4270977 4166500 4192188 4213002 4257762 4329163
3393 4329163 4399575 4559283 4994545 5261208 5202954 4797986 4372700 4115995 3888922 3676391
$$ packed form
3462B4943921j863228j624283j464453j297360j307064r84649m74593j06225k12924
3453A5609142k98046l86495j14764n822K06209O71559N29092K47873k98149r71873
3443A5188726j099505j214566j003142q23595n11314o6667M6661l85647n40747
3434I590204m51993o33231n65871j99847k21120k48913k34886m4493J9068K83819
3424G292737O36274Q27481N56978l7854m86344o82567p40050n54985l08664m60260
3414F042746k46850k58077j21750j62150j79714K2450l8494p1512K0643K4892
3404E032184k172n521k18290k84143r1625j59456j04477K5688K0814M4760P1401
3393D329163P0412J59708M35262K66663n8254m04968m25286k56705k27073k12531
$$ plain form
3383 3676391 3457993 3438572 3327243 3197449 3278071 3257339 3197162 3216166 3154472 3056335 2961934
3372 2961934 2948269 2947424 2973994 2866111 2802159 2659598 2699118 2773771 2646043 2602120 2548649
3361 2548649 2471869 2440496 2467662 2322097 2281205 2256648 2233919 2315027 2237311 2315934 2200133
3350 2200133 2224711 2281981 2257008 2299086 2349269 2208102 2157742 2273831 2131135 2256827 2296103
3339 2296103 2163657 2257282 2221274 2250877 2230593 2138956 2080194 2201489 2017862 1974886 1968257
3328 1968257 2009847 1989399 1995659 1998745 1865201 1759425 1777833 1750484 1676006 1697138 1784960
3317 1784960 1842391 1842439 1872740 1795855 1815609 1912740 1918462 1868593 1832937 1757286 1681574 1766512
3305 1766512 1848912 1749783 1704887 1772121 1864188 1761736 1839543 1890690 1822625 1745435 1628949
$$ packed form
3383C676391k18398j9421j11329j29794Q0622k0732o0177J9004o1694r8137r4401
3372B961934j3665q45K6570j07883o3952j42561L9520P4653j27728m3923n3471
3361B548649p6780l1373K7166j45565m0892k4557k2729Q1108p7716P8623j15801
3350B200133K4578N7270k4973M2078N0183j41167n0360J16089j42696J25692L9276
3339B296103j32446R3625l6008K9603k0284r1637n8762J21295j83627m2976o629
3328A968257M1590k0448O260L086j33544j05776J8408k7349p4478K1132Q7822
3317A784960N7431M8L0301p6885J9754R7131N722m9869l5656p5651p5712Q4938
3305A766512Q2400r9129m4896O7234R2067j02452P7807N1147o8065p7190j16486
$$ plain form
3294 1628949 1662078 1661577 1585905 1545209 1452212 1560386 1434230 1446422 1509413 1630207 1571340
3283 1571340 1621616 1706455 1699097 1667829 1519108 1447087 1371208 1383213 1417006 1395645 1462878
3272 1462878 1459317 1445605 1276428 1403202 1334555 1164558 1192634 1352842 1353463 1280055 1292257
3261 1292257 1361301 1358424 1333212 1310709 1321171 1356202 1231130 1218202 1320001 1357282 1272226
3250 1272226 1360656 1290979 1255683 1288280 1191496 1175549 1282001 1239045 1065041 1091954 1209201
3239 1209201 1270991 1384532 1338452 1374028 1303203 1231065 1202250 1321555 1519997 1530266 1405076
3228 1405076 1414156 1355012 1335001 1346687 1326836 1423320 1349577 1457487 1473199 1568385 1499926
3217 1499926 1498754 1552378 1528889 1517555 1550872 1623633 1701342 1589353 1686042 1734154 1698221
$$ packed form
3294A628949L3129n01p5672m0696r2997J08174j26156J2192O2991J20794n8867
3283A571340N0276Q4839p358l1268j48721p2021p5879J2005L3793k1361O7233
3272A462878l561j3712j69177J26774o8647j69997K8076J60208O21p3408J2202
3261A292257O9044k877k5212k2503J0462L5031j25072j2928J01799L7281q5056
3250A272226Q8430o9677l5296L2597r6784j5947J06452m2956j74004K6913J17247
3239A209201O1790J13541m6080L5576p0825p2138k8815J19305J98442J0269j25190
3228A405076R080n9144k0011J1686j9851R6484p3743J07910J5712R5186o8459
3217A499926j172N3624k3489j1334L3317P2761P7709j11989R6689M8112l5933
$$ plain form
3206 1698221 1660904 1570533 1716854 1745110 1755611 1834131 1886534 1954799 2089697 1990337 2065321
3195 2065321 1907536 1860646 1951443 2013195 2094526 2173185 2186492 2042378 2035821 2160374 2259064
3184 2259064 2174704 2167411 2299194 2301009 2418497 2435394 2552464 2535368 2577355 2720824 2755472
3173 2755472 2852624 2980532 3044365 3057342 3216630 3469514 3663686 3787539 3911278 4180738
3163 4180738 4180460 4227699 4312453 4320980 4416008 4421388 4184410 4137302 4231135 4316862 4351414 4322714
3151 4322714 4402645 4425286 4629245 4709000 4754222 4911677 5081811 5279575 5494854 5634548
3141 5634548 5768898 6096585 6526392 7094274 7658660 8230509 8770565 9153333 9057359 8632310
3131 8632310 8268265 7766396 7146868 6655907 6344746 6003903 5687082 5603575 5538370 5392646
$$ packed form
3206A698221l7317r0371J46321K8256J0501P8520N2403O8265J34898r9360P4984
3195B065321j57785m6890R0797O1752Q1331P8659J3307j44114o557J24553R8690
3184B259064q4360p293J31783J815J17488J6897J17070j7096M1987J43469L4648
3173B755472R7152J27908O3833J2977J59288K52884J94172J23853J23739K69460
3163D180738k78M7239Q4754Q527R5028N380k36978m7108R3833Q5727L4552k8700
3151D322714P9931K2641K03959P9755M5222J57455J70134J97764K15279J39694
3141E634548J34350L27687M29807N67882N64386N71849N40056L82768r5974m25049
3131H632310l64045n01869o19528m90961l11161l40843l16821q3507o5205j45724
$$ plain form
3121 5392646 5442202 5523391 5632592 5690700 5841203 6023798 6236400 6374218 6454182 6696601
3111 6696601 6958196 7054174 7277212 7507701 7391937 7366686 7348404 7233021 7011032 6745437
3101 6745437 6523373 6290113 6135606 5743604 5310808 5014330 4857367 4764882 4816028 4781553
3091 4781553 4667628 4666403 4686490 4637539 4659491 4584557 4634927 4558486 4445828 4299269 4234277
3080 4234277 4178267 3979564 3876362 3538631 3375890 3240725 3000915 2894269 2683576 2548053
3070 2548053 2577563 2486020 2529644 2499343 2408379 2246635 2216350 2183732 2099380 1931557 1926127
3059 1926127 1951432 1954127 1903862 1819663 1742927 1741842 1654351 1527662 1478999 1480975 1559258 1473099
3047 1473099 1399307 1391546 1245981 1111066 1288127 1200464 1128236 1227676 1193820 1176606 1219182
$$ packed form
3121E392646M9556Q1189J09201N8108J50503J82595K12602J37818P9964K42419
3111F696601K61595R5978K23038K30489j15764k5251j8282j15383k21989k65595
3101F745437k22064k33260j54507l92002m32796k96478j56963r2485N1146l4475
3091D781553j13925j225K0087m8951K1952p4934N0370p6441j12658j46559o4992
3080D234277n6010j98703j03202l37731j62741j35165k39810j06646k10693j35523
3070B548053K9510r1543M3624l0301r0964j61744l0285l2618q4352j67823n430
3059A926127K5305K695n0265q4199p6736j085q7491j26689m8663J976P8283q6159
3047A473099p3792p761j45565j34915J77061q7663p2228R9440l3856j7214M2576
$$ plain form
3036 1219182 1102481 1006618 986319 1051790 1108188 1019352 986675 951828 809616 889317 895546
3025 895546 1104652 1009126 777365 791077 790682 747053 732643 778042 711398 743877 860260
3014 860260 771064 737740 773659 642804 719350 706142 659385 802118 674361 583607 558835
3003 558835 474263 554576 591196 642730 531180 485394 325193 295309 442200 457690 378858
2992 378858 378627 421554 373914 436099 425527 450488 373424 312856 258345 297789 335894 412639
2980 412639 401395 450802 247419 76261 208563 207986 145722 67420 107466 68668 117934
2969 117934 315848 371334 261671 377755 290751 207622 103584 92139 43979 48401 51525
2958 51525 103736 170899 237471 250921 185278 209922 196309 125353 96232 192497 42434 52687
$$ packed form
3036A219182j16701r5863k0299O5471N6398q8836l2677l4847j42212P9701O229
3025H95546K09106r5526k31761J3712l95m3629j4410M5399o6644L2479J16383
3014H60260q9196l3324L5919j30855P6546j3208m6757J42733j27757r0754k4772
3003E58835q4572Q0313L6620N1534j11550m5786j60201k9884J46891J5490p8832
2992C78858k31M2927m7640O2185j0572K4961p7064o0568n4511L9444L8105P6745
2980D12639j1244M9407k03383j71158J32302n77o2264p8302M0046l8798M9266
2969A17934J97914N5486j09663J16084q7004q3129j04038j1445m8160M422L124
2958E1525N2211O7163O6572J3450o5643K4644j3613p0956k9121R6265j50063J0253
$$ plain form
2946 52687 104649 56668 207978 275740 -3117 -245 109425 -11939 48521 215015 98250
2935 98250 92268 186188 201922 142131 133429 153484 72257 145553 187894 259766 193554 79241
2923 79241 150982 189963 184594 108305 56888 115354 27751 152402 217419 177038 185649 4600
2911 4600 -16600 6702 142742 181609 31402 134717 39639 115181 118584 66510 44058 -98214
2899 -98214 -70258 12896 -26407 58428 36743 78609 141143 79397 -1979 24932 30843 109602
2887 109602 188532 104523 113448 233931 153869 -6446 -56181 -39268 50817 85482 162118
2876 162118 167687 129786 114385 111436 40371 55473 20092 110490 87362 -5317 -1502 -115066
2864 -115066 -149751 -132635 -122350 -118428 -194103 -107916 -62795 -138711 -104131 -78254 -136570 -41431
$$ packed form
2946E2687N1962m7981J51310O7762k78857K872J09670j21364O0460J66494j16765
2935I8250n982R3920J5734n9791q702K0055q1227P3296M2341P1872o6212j14313
2923G9241P1741L8981n369p6289n1417N8466q7603J24651O5017m0381Q611j81049
2911D600k1200K3302J36040L8867j50207J03315r5078P5542L403n2074k2452j42272
2899i8214K7956Q3154l9303Q4835k1685M1866O2534o1746q1376K6911N911P8759
2887A09602P8930q4009Q925J20483q0062j60315m9735J6913R0085L4665P6636
2876A62118N569l7901j5401k949p1065J5102l5381R0398k3128r2679L815j13564
2864a15066l4685J7116J0285L922p5675Q6187M5121p5916L4580K5877n8316R5139
$$ plain form
2852 -41431 22315 155157 200835 125626 -31456 -72234 -2929 -115545 -101608 -36094 -117989
2841 -117989 -232535 -128474 -37508 -90841 12023 -72299 29912 76119 -19497 -153181 -89648
2830 -89648 -15397 -79284 330 119467 -15819 -56743 106698 165351 85916 -36114 75753
2819 75753 57449 -36343 57231 23540 57418 41515 -78552 -126694 -203656 -151101 -31965
2808 -31965 -24364 -4904 386 -40106 -624 7911 74872 60895 28398 -81384 -61035 -74359
2796 -74359 -81552 -966 -18909 -46980 -16417 4667 -101579 -126887 -146731 -50519 92578 -7726
2784 -7726 -60126 -71573 20703 77593 34912 27559 -45188 -107268 -27325 88798 160715 13970
2772 13970 33349 26845 115025 87638 -14319 -80974 -121547 2551 -55290 -94896 -75922 -49638
$$ packed form
2852d1431O3746J32842M5678p5209j57082m0778O9305j12616J3937O5514q1895
2841a17989j14546J04061R0966n3333J02864q4322J02211M6207r5616j33684O3533
2830h9648P4251o3887P9614J19137j35286m0924J63441N8653p9435j22030J11867
2819G5753j8304r3792R3574l3691L3878j5903j20067m8142p6962N2555J19136
2808c1965P601J9460N290m0492L9482Q535O6961j3977l2497j09782K0349j3324
2796g4359p193Q0586j7943k8071L0563K1084j06246k5308j9844R6212J43097j00304
2784g726n2400j1447R2276N6890m2681p353p2747o2080P9943J16123P1917j46745
2772A3970J9379o504Q8180k7387j01957o6655m0573J24098n7841l9606J8974K6284
$$ plain form
2760 -49638 7689 -38029 -32071 -213036 -217512 -2399 -137450 -134494 -21656 -48673 -34602 -92081
2748 -92081 -61798 -35989 -146277 -171479 -56614 32153 1818 -73638 -34674 24329 -2306
2737 -2306 -87736 -179704 -202179 -143525 57049 -14221 -130628 -177152 -109211 -145561 -191514 -123547
2725 -123547 -5305 79448 -29685 8968 57674 57289 2873 -120018 -16827 -201885 -192797
2714 -192797 -134429 -123403 -152589 -86403 -96683 -114796 -103084 1229 12334 9397 -89389 -158760
2702 -158760 -72410 -102769 -3724 71873 1703 -53325 36952 41377 36018 20250 16126 -5878
2690 -5878 -19257 -4778 39744 1013 12114 -28471 -49375 -56926 -78990 64439 149437 123853
2678 123853 47299 101177 148411 59533 -44552 -129582 15175 16917 87298 45596 47282 47663
$$ packed form
2760d9638N7327m5718N958j80965m476K15113j35051K956J12838k7017J4071n7479
2748i2081L0283K5809j10288k5202J14865Q8767l0335p5456L8964N9003k6635
2737b306q5430r1968k2475N8654K00574p1270j16407m6524O7941l6350m5953O7967
2725a23547J18242Q4753j09133L8653M8706l85n4416j22891J03191j85058R088
2714a92797N8368J1026k9186O6186j0280j8113J1712J04313J1105k937r8786o9371
2702a58760Q6350l0359R9045P5597p0170n5028R0277M425n359j5768m124k2004
2690e878j3379J4479M4522l8731J1101m0585k0904p551k2064J43429Q4998k5584
2678A23853p6554N3878M7234q8878j04085q5030J44757J742P0381m1702J686L81
$$ plain form
2666 47663 24705 71566 -15149 -12650 62614 8291 -27785 69121 -54617 -119195 -62770 -126626
2654 -126626 -3912 29140 128322 98645 -69720 -73597 104303 106955 109188 93581 41661 48187
2642 48187 8946 -56001 -33856 -105451 -143161 29591 79704 -2416 -40397 64572 65113 104272
2630 104272 83683 152689 88443 -30657 136961 72630 -1477 22946 18891 17793 10565 26926
2618 26926 139314 57649 18427 14662 129678 170376 99941 223870 162970 199299 249087
2607 249087 286416 332326 576510 891605 1013599 1044697 953513 710633 489875 456830 350457
2596 350457 242318 256013 196067 41092 84674 28194 -82277 -58244 7786 29650 51011
2585 51011 34252 169721 293874 251377 199160 148580 129247 -4268 41389 -44715 -5099
$$ packed form
2666D7663k2958M6861q6715K499P5264n4323l6076R6906j23738o4578N6425o3856
2654a26626J22714L3052R9182k9677j68365l877J77900K652K233j5607n1920O526
2642D8187l9241o4947K2145p1595l7710J72752N0113q2120l7981J04969N41L9159
2630A04272k0589O9006o4246j19100J67618o4331p4107K4423m055j098p228J6361
2618B6926J12388q1665l9222l765J15016M0698p0435J23929o0900L6329M9788
2607B49087L7329M5910K44184L15095J21994L1098r1184k42880k20758l3045j06373
2596C50457j08139J3695n9946j54975M3582n6480j10471K4033O6030K1864K1361
2585E1011j6759J35469J24153m2497n2217n0580j9333j33515M5657q6104L9616
$$ plain form
2574 -5099 90643 -56757 -155308 -173762 -89011 -44271 -83224 -34874 80319 111567 95818 95543
2562 95543 55112 53412 74969 42323 86576 155983 33163 103909 119246 78404 28544 702
2550 702 -73839 -114549 -2786 71196 101603 121904 82880 24452 86984 80409 50862 120442
2538 120442 -19473 -58158 35130 -72792 -42670 24646 10337 -44077 -100710 -45673 72618
2527 72618 139825 23798 75371 200148 191945 81419 74782 -24342 42131 93273 112562 -94900
2515 -94900 -77707 -42356 12795 -8453 68202 39582 -31479 87726 176328 84157 27931 201498
2503 201498 157306 67474 130284 140649 162772 144974 53187 78783 157532 184256 311029
2492 311029 370201 316287 204283 102840 117964 220793 246951 205209 240953 260215 296248
$$ packed form
2574e099R5742j47400r8551j8454Q4751M4740l8953M8350J15193L1248j5749k75
2562I5543m0431j700K1557l2646M4253O9407j22820P0746J5337m0842m9860k7842
2550G02p4541m0710J11763P3982L0407K0301l9024n8428O2532o575k9547O9580
2538A20442j39915l8685R3288j07922L0122O7316j4309n4414n6633N5037J18291
2527G2618O7207j16027N1573J24777q203j10526o637r9124O6473N1142J9289k07462
2515i4900J7193L5351N5151k1248P6655k8620p1061J19205Q8602r2171n6226J73567
2503B01498m4192q9832O2810J0365K2123j7798r1787K5596P8749K6724J26773
2492C11029N9172n3914j12004j01443J5124J02829K6158m1742L5744J9262L6033
$$ plain form
2481 296248 158942 257079 179393 96307 196150 199317 180217 315844 206791 139479 205446
2470 205446 174077 99807 174506 276909 346770 277655 203371 240850 255768 308646 341760
2459 341760 361576 379209 355318 390737 335627 324075 388438 416600 318613 243380 274386 447178
2447 447178 416361 440375 458865 501282 555282 505106 496341 488533 486701 557429 535059 582575
2435 582575 643375 732416 664642 648546 651852 591750 660821 703099 819918 877946 743640
2424 743640 757461 756851 996569 992650 960496 912467 848193 698326 713952 719044 756685 893780
2412 893780 920871 841433 948957 1039508 1069661 910282 899431 1065359 1065256 1132853 1327158
2401 1327158 1290979 1228756 1370793 1444915 1400614 1401509 1507953 1519318 1489177 1516405 1481899
$$ packed form
2481B96248j37306R8137p7686q3086R9843L167j9100J35627j09053o7312O5967
2470B05446l1369p4270P4699J02403O9861o9115p4284L7479J4918N2878L3114
2459C41760J9816J7633k3891L5419n5110j1552O4363K8162r7987p5233L1006J72792
2447D47178l0817K4014J8490M2417N4000n0176q765p808j832P0728k2370M7516
2435E82575O0800Q9041o7774j6096L306o0102O9071M2278J16819N8028j34306
2424G43640J3821o10K39718l919l2154m8029o4274j49867J5626N092L7641J37095
2412H93780K7091p9438J07524R0551L0153j59379j0851J65928j03O7597J94305
2401A327158l6179o2223J42037P4122m4301Q95J06444J1365l0141K7228l4506
$$ plain form
2390 1481899 1581716 1634802 1701403 1754439 1897502 2093718 2229537 2177485 2113707 2254177 2393360
2379 2393360 2448180 2532514 2677474 2715111 2798748 2951568 3134551 3252565 3425689 3573730
2369 3573730 3636804 3806195 3970828 4147007 4405547 4603938 4784754 4926061 5320065 5818122
2359 5818122 6401167 6916478 7470251 8312683 9261983 10697174 12931915 15246430 17003419
2350 17003419 17557951 17589428 17792733 18928184 20221668 22341063 24847077 28662132 33669806
2341 33669806 42012735 57169894 92278546 149060485 211399623 239455819 218754894
2334 218754894 170850160 125573172 94939944 72723745 56924791 44367221 34803586
2327 34803586 27095448 21865963 18262657 16765479 16010902 16136415 15843693 14732333 12796250
$$ packed form
2390A481899R9817N3086O6601N3036J43063J96216J35819n2052o3778J40470J39183
2379B393360N4820Q4334J44960L7637Q3637J52820J82983J18014J73124J48041
2369C573730O3074J69391J64633J76179K58540J98391J80816J41307L94004M98057
2359E818122N83045N15311N53773Q42432R49300J435191K234741K314515J756989
2350A7003419N54532L1477K03305J135451J293484K119395K506014L815055N007674
2341C3669806Q342929J5157159L5108652N6781939O2339138K8056196k0700925
2334B18754894m7904734m5276988l0633228k2216199j5798954j2557570r563635
2327C4803586p708138n229485l603306j497178p54577J25513k92722j111360j936083
$$ plain form
2318 12796250 11172581 9701019 8673057 7870887 7232309 6575703 6323499 5938026 5776416
2309 5776416 5409856 5091416 4671103 4320827 4182657 3962529 3680608 3673222 3533782 3389252
2299 3389252 3366648 3369808 3077253 2975263 2892571 2814111 2676170 2505453 2402147 2359625 2299618
2288 2299618 2399034 2212684 2073141 2018838 2041848 2028665 2093708 1977341 1945174 1920793 1898780
2277 1898780 1771064 1616917 1555145 1456591 1272974 1210600 1270474 1192658 1305702 1277748 1216061
2266 1216061 1169025 1157476 1009833 1027796 907374 963057 981960 891316 967136 931974 884460
2255 884460 910640 937191 858312 898548 945198 811913 708242 692161 643427 679348 669875
2244 669875 671250 643746 590541 574145 555048 489575 343616 315139 463194 525244 454648
$$ packed form
2318A2796250j623669j471562j027962q02170o38578o56606k52204l85473j61610
2309E776416l66560l18440m20313l50276j38170k20128k81921p386j39440j44530
2299C389252k2604L160k92555j01990q2692p8460j37941j70717j03306m2522o0007
2288B299618R9416j86350j39543n4303K3010j3183O5043j16367l2167k4381k2013
2277A898780j27716j54147o1772r8554j83617o2374N9874p7816J13044k7954o1687
2266A216061m7036j1549j47643J7963j20422N5683J8903r0644P5820l5162m7514
2255H84460K6180K6551p8879M0236M6650j33285j03671j6081m8734L5921r473
2244F69875J375k7504n3205j6396j9097o5473j45959k8477J48055O2050p0596
$$ plain form
2233 454648 482160 461485 509801 472652 429261 480272 437455 322629 351054 481538 445550
2222 445550 385226 359864 363697 369567 287954 365625 371008 297190 400458 279492 237060 128870
2210 128870 151451 204695 175599 235243 205152 231243 160154 270836 231159 151945 241670
2199 241670 145710 125778 79126 131880 258861 270832 317193 244771 225860 179211 66592
2188 66592 146447 225495 142210 194919 131004 105453 30190 109534 70348 124519 192232 141262
2176 141262 242735 239537 213376 202344 100109 25683 -23471 1061 -33534 13420 -107779
2165 -107779 20283 102646 65554 43548 187146 183113 185345 47739 -33580 -57136 148917
2154 148917 160675 10305 136131 184221 81836 156562 105354 -57848 -12928 -38886 -66403
$$ packed form
2233D54648K7512k0675M8316l7149m3391N1011m2817j14826K8425J30484l5988
2222D45550o0324k5362L833N870q1613P7671N383p3818J03268j20966m2432j08190
2210A28870K2581N3244k9096N9644l0091K6091p1089J10682l9677p9214Q9725
2199B41670r5960j9932m6652N2754J26981J1971M6361p2422j8911m6649j12619
2188F6592P9855P9048q3285N2709o3915k5551p5263P9344l9186N4171O7713n0970
2176A41262J01473l198k6161j1032j02235p4426m9154K4532l4595M6954j21199
2165a07779J28062Q2363l7092k2006J43598m033K232j37606q1319k3556K06053
2154A48917J1758j50370J25826M8090j02385P4726n1208j63202M4920k5958k7517
$$ plain form
2143 -66403 -64247 -32269 67382 5605 -22510 9855 -24867 57706 42945 33323 -51394 -60985
2131 -60985 43179 8416 -13072 61101 103683 1361 -85201 -100667 -110699 -43162 -39518 -82724
2119 -82724 -18953 40320 -7970 -4210 44407 -6391 -167545 -58353 -145122 -73583 16950 51218
2107 51218 80530 -26999 -131323 -105536 -9606 -75587 242 50596 -45508 -5819 -16019
2096 -16019 9770 -70098 -85726 -60190 -101158 8953 22112 31583 68002 -69458 -179022
2085 -179022 -193303 -85804 -92969 -25597 43167 116284 57194 89637 104249 144036 193020 55484
2073 55484 1438 204830 294309 486207 746951 827593 965613 973641 740605 671209 590583
2062 590583 536698 411582 286192 135200 96412 14254 21671 5470 4006 56419 -24062
$$ packed form
2143f6403K156L1978R9651o1777k8115L2365l4722Q2573j4761r622q4717r591
2131f0985J04164l4763k1488P4173M2582j02322q6562j5466j0032O7537L644m3206
2119h2724O3771N9273m8290L760M8617n0798j61154J09192q6769P1539R0533L4268
2107E1218K9312j07529j04324K5787R5930o5981P5829N0354r6104L9689j0200
2096a6019K5789p9868j5628K5536m0968J10111J3159R471L6419j37460j09564
2085a79022j4281J07499p165O7372O8764P3117n9090L2443J4612L9787M8984j37536
2073E5484n4046K03392Q9479J91898K60744Q0642J38020Q028k33036o9396q0626
2062E90583n3885j25116j25390j50992l8788q2158P417j6201j464N2413q0481
$$ plain form
2051 -24062 -53395 -123951 -12497 -7024 24182 77654 36083 -19238 -59717 -31841 -17382 29814
2039 29814 -46187 -23689 8182 -122183 4640 35334 2477 -49148 -140832 -213608 -219927 -220416
2027 -220416 -198482 -172474 -99100 -88446 -104941 -140382 -48519 64559 -146235 -93595 -22220
2016 -22220 -11503 -28985 -11873 44104 -116663 -70484 -20965 -34673 -125801 -175466 -60442
2005 -60442 -1327 -31749 -131318 -71478 -125877 -189948 -149827 -41049 109098 98751 -37369
1994 -37369 -11964 -109831 -3330 -64591 -139736 -48959 -128682 -10410 -93442 -11976 -10470 -85405
1982 -85405 -129268 -34452 23369 -73066 -184837 -70869 -35280 -18766 -53655 16443 68481
1971 68481 6424 -40819 -71274 -160894 -90664 -54643 -137379 -38513 -88470 -305488 -211207 -152701
$$ packed form
2051b4062k9333p0556J11454N473L1206N3472m1571n5321m0479K7876J4459M7196
2039B9814p6001K2498L1871j30365J26823L0694l2857n1625r1684p2776o319m89
2027b20416K1934K6008P3374J0654j6495l5441R1863J13078k10794N2640P1375
2016b2220J0717j7482J7112N5977j60767M6179M9519j3708r1128m9665J15024
2005f0442N9115l0422r9569N9840n4399o4071M0121J08778J50147j0347j36120
1994c7369K5405r7867J06501o1261p5145R0777p9723J18272q3032Q1466J506p4935
1982h5405m3863R4816N7821r6435j11771J13968L5589J6514l4889P0098N2038
1971F8481o2057m7243l0455q9620P0230L6021q2736R8866m9957k17018R4281N8506
$$ plain form
1959 -152701 -83272 -49097 -108341 33745 74858 -36312 -94759 -107910 -22883 -86246 -34721
1948 -34721 47531 31555 -204975 -202214 -181852 -80010 -80165 -154651 -168295 -182920 -103931 -129969
1936 -129969 -160664 -140583 -3565 -90404 -52704 -105858 -231552 -228249 -86433 -75541 -60574
1925 -60574 -54610 37390 -56998 -56714 -29194 -60800 10955 -27609 -53532 40195 54244 18961
1913 18961 -55465 26927 28392 16039 -62190 -59532 -56963 -80766 -27818 31429 99539 -15282
1901 -15282 -153008 -242130 -125677 -70487 -46624 -126972 -238255 -161652 -212042 -177330 -78876
1890 -78876 -117400 29130 -23061 -97770 -102828 -93018 -115260 -209118 -171829 -120732 -62305 -65471
1878 -65471 -173528 -179410 -72037 -201189 -249794 -266143 -144468 -47778 36156 13695 -50410
$$ packed form
1959a52701O9429L4175n9244J42086M1113j11170n8447j3151Q5027o3363N1525
1948c4721Q2252j5976k36530K761K0362J01842j55p4486j3644j4625P8989k6038
1936a29969l0695K0081J37018q6839L7700n3154j25694L303J41816J0892J4967
1925f0574N964R2000r4388K84K7520l1606P1755l8564k5923R3727J4049l5283
1913A8961p4426Q2392J465j2353p8229K658K569k3803N2948N9247O8110j14821
1901a5282j37726q9122J16453N5190K3863q0348j11283P6603n0390L4712R8454
1890g8876l8524J46530n2191p4709n058R810k2242r3858L7289N1097N8427l166
1878f5471j08057n882J07373j29152m8605j6349J21675R6690Q3934k2461o4105
$$ plain form
1867 -50410 -52263 -113842 -164735 -163991 -96725 -41559 -164316 -149100 -210870 -122888 167611 -7316
1855 -7316 -191676 -101569 -189835 -131342 -90067 -75176 -69771 -178378 -207418 -83060 -89312 -151765
1843 -151765 -16036 -3876 32949 56405 -164628 -176132 -86222 -143323 -65866 -100772 -94652
1832 -94652 -111607 -100816 -91841 -155810 -73955 -102548 -204307 -106556 -152074 -135146 -119807 -139138
1820 -139138 -56690 -40356 -223060 -115317 -123374 -210445 -160542 -64646 -102284 -111760 -71852 -106973
1808 -106973 -90972 7974 -83733 -154782 -163499 -100580 -50842 -141168 -254658 -249670 -225960 -56602
1796 -56602 -143499 -132631 -123950 -98439 -59722 -85876 -85135 -23708 38611 -15132 -42019 -134166
1784 -134166 -44070 23740 -73735 -107993 9406 20010 -123828 -70616 -28702 -100256 3926
$$ packed form
1867e0410j853o1579n0893P44O7266N5166j22757J5216o1770Q7982K90499j74927
1855g316j84360R0107q8266N8493M1275J4891N405j08607k9040J24358o252o2453
1843a51765J35729J2160L6825K3456k21033j1504Q9910n7101P7457l4906O120
1832i4652j6955J0791Q975o3969Q1855k8593j01759R7751m5518J6928J5339j9331
1820a39138Q2448J6334j82704J07743q057q7071M9903R5896l7638r476L9908l5121
1808a06973J6001R8946r1707p1049q717O2919M9738r0326j13490M988K3710J69358
1796e6602q6897J0868Q681K5511L8717k6154P41O1427O2319n3743k6887r2147
1784a34166R0096O7810r7475l4258J17399J0604j43838N3212M1914p1554J04182
$$ plain form
1773 3926 -57989 -27292 76983 71112 -35595 -135159 -167584 -37477 -105550 -86445 -89525 -26414
1761 -26414 -123066 -179130 -8767 113511 65760 -82898 -145447 -65952 -49819 -44637 -48550 -54919
1749 -54919 -178237 -133497 -113720 -79397 -186254 -163651 -38595 -121717 -88591 -66967 -73361
1738 -73361 -98556 -132441 -90503 -150124 7061 -46839 -72852 -55143 -31861 -19810 -208991
1727 -208991 -166249 -129219 -236550 -152254 -71416 -47187 -9515 -142764 11486 -19957 -177953
1716 -177953 -24105 118080 -51514 -132517 -138943 -106975 4906 153956 -46266 -99707 -80800
1705 -80800 -107699 -87331 7838 -98723 -109554 55537 96867 25052 -22207 34035 -5031
1694 -5031 250 -64787 -115649 -8114 -136626 -165126 161 -21259 76426 79416 4181 -248
$$ packed form
1773C926o1915L0697J04275n871j06707r9564l2425J30107o8073J9105l080O3111
1761b6414r6652n6064J70363J22278m7751j48658o2549P9495J6133N182l913o369
1749e4919j23318M4740J9777L4323j06857K2603J25056q3122L3126K1624o394
1738g3361k5195l3885M1938n9621J57185n3900k6013J7709K3282J2051j89181
1727b08991M2742L7030j07331Q4296Q0838K4229L7672j33249J54250l1443j57996
1716a77953J53848J42185j69594q1003o426L1968J11881J49050k00222n3441J8907
1705h0800k6899K0368R5169j06561j0831J65091M1330p1815m7259N6242l9066
1694e031N281o5037n0862J07535j28512k8500J65287k1420R7685K990p5235m429
$$ plain form
1682 -248 -6077 42199 26615 -102426 -69099 -68000 -44246 -59199 -51146 -64072 -55886 51517 -166191
1669 -166191 -181921 -121884 -161890 -115262 -22679 -52210 -41503 -160692 -163896 -55009 -85800
1658 -85800 -7366 -3198 -18955 -17504 -96362 -100178 -86500 -104262 -48303 -21048 -50471 -71657
$$ packed form
1682b48n829M8276j5584j29041L3327J099K3754j4953Q053j2926Q186J07403k17708
1669a66191j5730O0037m0006M6628R2583k9531J0707j19189l204J08887l0791
1658h5800P8434M168j5757J451p8858l816J3678j7762N5959K7255k9423k1186
$$ [...]
##END NTUPLES=NMR SPECTRUM
##END=
